##TITLE=31Pdec_DE-78H
 D2O, 64 sc
 28.1.2025
##JCAMPDX= 6.0         $$ Bruker NMR JCAMP-DX V2.0
##DATA TYPE= NMR SPECTRUM
##DATA CLASS= NTUPLES
##ORIGIN= UXNMR, Bruker Analytische Messtechnik GmbH
##OWNER= root
$$ XWIN-NMR		Version 3.5
$$ Tue Jan 28 14:23:52 2025 Russian Standard Time (UT+4h)  she@DPX200
##.OBSERVE FREQUENCY= 81.013821
##.OBSERVE NUCLEUS= ^31P
##.ACQUISITION MODE= SIMULTANEOUS
##.ACQUISITION SCHEME= undefined
##.AVERAGES= 64
##.DIGITISER RES= 17
##SPECTROMETER/DATA SYSTEM= spect
##.PULSE SEQUENCE= zgpg30
##.SOLVENT NAME= CDCl3
##.SHIFT REFERENCE= (INTERNAL, CDCl3, 0, 198.062)
##AUDIT TRAIL= $$ (NUMBER, WHEN, WHO, WHERE, WHAT)
$$ ##TITLE= Audit trail, XWIN-NMR		Version 3.5
$$ ##JCAMPDX= 5.01
$$ ##ORIGIN= Bruker BioSpin GmbH
$$ ##OWNER= she
$$ F:/spectra/data/she/nmr/P31/2/pdata/1/auditp.txt
$$ ##AUDIT TRAIL=  $$ (NUMBER, WHEN, WHO, WHERE, WHAT)
(   1,<2025-01-28 14:22:32.26 +0400>,<she>,<DPX200>,
      <created by zg, POWCHK disabled, PULCHK disabled
       configuration hash MD5:
       00 E9 B6 7A A2 85 ED C7 34 08 36 98 17 FE 4E 26
       data hash MD5: 32K
       BA 2A 37 48 13 00 4B 67 37 CE 7C 57 12 C4 3A 58>)
(   2,<2025-01-28 14:22:34.37 +0400>,<she>,<DPX200>,
      <Start of raw data processing
       efp BC_mod = 2 LB = 1.5 FT_mod = 6 PKNL = 1 PHC0 = 2020.445 PHC1 = 257.8871 SI = 64K 
       data hash MD5: 64K
       DE B7 8D 16 6C 44 3A 1E 95 AF 5C AF 48 EA F2 3B>)
(   3,<2025-01-28 14:23:21.17 +0400>,<she>,<DPX200>,
      <pk PHC0 = -971.2178 PHC1 = 1490.803 
       data hash MD5: 64K
       82 6B 39 C5 81 8C 47 B0 E3 78 AE 18 37 DD B6 2B>)
(   4,<2025-01-28 14:23:28.89 +0400>,<she>,<DPX200>,
      <abs ABSG = 5 
       data hash MD5: 64K
       A6 E9 75 99 2A 53 9F 07 51 0C 66 BD BB 83 3D 37>)
$$ ##END=
$$ 
$$ hash MD5
$$ 0F EE 0C AD 50 59 62 87 10 73 4E 5F 28 5F 74 8E
##$RELAX= 
##$RELAX= 
##$RELAX= 
##$RELAX= 
##$RELAX= 
##$RELAX= 
##$RELAX= 
##$RELAX= 
$$ Bruker specific parameters
$$ --------------------------
##$DU= <F:/spectra>
##$EXPNO= 2
##$NAME= <P31>
##$PROCNO= 1
##$TYPE= <nmr>
##$USER= <she>
##$AMP= (0..31)
100 100 100 100 100 100 100 100 100 100 100 100 100 100 100 100 100 100 
100 100 100 100 100 100 100 100 100 100 100 100 100 100 
##$AQSEQ= 0
##$AQ_mod= 1
##$AUNM= <au_zg>
##$AUTOPOS= <>
##$BF1= 81.014009
##$BF2= 200.13
##$BF3= 200.13
##$BF4= 200.13
##$BF5= 200.13
##$BF6= 200.13
##$BF7= 200.13
##$BF8= 200.13
##$BYTORDA= 1
##$CFDGTYP= 0
##$CFRGTYP= 5
##$CHEMSTR= <none>
##$CNST= (0..31)
1 1 145 1 1 1 1 1 1 1 1 1 1 1 1 1 1 1 1 1 1 1 1 1 1 1 1 1 1 1 1 1 
##$CPDPRG= <waltz16>
##$CPDPRG1= <>
##$CPDPRG2= <waltz16>
##$CPDPRG3= <>
##$CPDPRG4= <mlev>
##$CPDPRG5= <mlev>
##$CPDPRG6= <mlev>
##$CPDPRG7= <mlev>
##$CPDPRG8= <mlev>
##$CPDPRGB= <>
##$CPDPRGT= <>
##$D= (0..31)
0 1 0 0 0 0 0 0 0 0.06 0 0.03 2e-05 3e-06 0 0 0.0002 0 0 0 0 0 0 0 0 0 
0 0 0 0 0 0 
##$DATE= 1738059751
##$DBL= (0..7)
120 120 120 11 120 120 24 19 
##$DBP= (0..7)
150 150 150 150 150 150 150 150 
##$DBP07= 0
##$DBPNAM0= <>
##$DBPNAM1= <>
$$ [...]
##$SUBNAM3= <"">
##$SUBNAM4= <"">
##$SUBNAM5= <"">
##$SUBNAM6= <"">
##$SUBNAM7= <"">
##$SUBNAM8= <"">
##$SUBNAM9= <"">
##$SW= 400.765351723535
##$SWIBOX= (0..15)
0 1 3 0 0 0 0 0 0 0 0 0 0 0 0 0 
##$SW_h= 32467.5324675325
##$TD= 32768
##$TD0= 1
##$TE= 0
##$TE2= 300
##$TE3= 300
##$TEG= 300
##$TL= (0..7)
0 120 53 12 22 120 120 120 
##$TP= (0..7)
150 150 150 150 150 150 150 150 
##$TP07= 0
##$TPNAME0= <>
##$TPNAME1= <>
##$TPNAME2= <>
##$TPNAME3= <>
##$TPNAME4= <>
##$TPNAME5= <>
##$TPNAME6= <>
##$TPNAME7= <>
##$TPOAL= (0..7)
0.5 0.5 0.5 0.5 0.5 0.5 0.5 0.5 
##$TPOFFS= (0..7)
0 0 0 0 0 0 0 0 
##$TUNHIN= 0
##$TUNHOUT= 0
##$TUNXOUT= 0
##$USERA1= <user>
##$USERA2= <user>
##$USERA3= <user>
##$USERA4= <user>
##$USERA5= <user>
##$V9= 5
##$VALIST= <valist>
##$VCLIST= <CCCCCCCCCCCCCCC>
##$VD= 0
##$VDLIST= <DDDDDDDDDDDDDDD>
##$VPLIST= <PPPPPPPPPPPPPPP>
##$VTLIST= <TTTTTTTTTTTTTTT>
##$WBST= 1024
##$WBSW= 4
##$XGAIN= (0..3)
0 0 0 0 
##$XL= 0
##$YL= 0
##$YMAX_a= 2917
##$YMIN_a= -13081
##$ZGOPTNS= <>
##$ZL1= 120
##$ZL2= 120
##$ZL3= 120
##$ZL4= 120
##$ABSF1= 198.0616
##$ABSF2= -202.7028
##$ABSG= 5
##$ABSL= 3
##$ALPHA= 0
##$AQORDER= 0
##$ASSFAC= 0
##$ASSFACI= 0
##$ASSFACX= 0
##$ASSWID= 0
##$AUNMP= <proc_1d>
##$AZFE= 0.1
##$AZFW= 0.5
##$BCFW= 0
##$BC_mod= 2
##$BYTORDP= 0
##$COROFFS= 0
##$CY= -3
##$DATMOD= 1
##$DC= 0
##$DFILT= <>
##$DTYPP= 0
##$F1P= 0
##$F2P= 0
##$FCOR= 1
##$FTSIZE= 65536
##$FT_mod= 6
##$GAMMA= 0
##$GB= 0
##$INTBC= 1
##$INTSCL= 9.790993e-09
##$ISEN= 30
##$LB= 1.5
##$LEV0= 0
##$LPBIN= 0
##$MAXI= 10000
##$MC2= 0
##$MEAN= 0
##$ME_mod= 0
##$MI= 50
##$NCOEF= 0
##$NC_proc= -9
##$NLEV= 6
##$NOISF1= 182.463
##$NOISF2= 159.3651
##$NSP= 0
##$NTH_PI= 0
##$NZP= 0
##$OFFSET= 198.0616
##$PC= 4
##$PHC0= 1049.227
##$PHC1= 1748.69
##$PH_mod= 1
##$PKNL= yes
##$PPARMOD= 0
##$PSCAL= 0
##$PSIGN= 0
##$REVERSE= no
##$SF= 81.0140089999434
##$SI= 65536
##$SIGF1= 159.3651
##$SIGF2= -187.1042
##$SINO= 113.3802
##$SIOLD= 16384
##$SREGLST= <1H.CDCl3>
##$SSB= 0
##$STSI= 65536
##$STSR= 0
##$SW_p= 32467.5324675325
##$SYMM= 0
##$S_DEV= 0
##$TDeff= 32768
##$TDoff= 0
##$TI= <>
##$TILT= no
##$TM1= 0
##$TM2= 0
##$TOPLEV= 0
##$USERP1= <user>
##$USERP2= <user>
##$USERP3= <user>
##$USERP4= <user>
##$USERP5= <user>
##$WDW= 1
##$XDIM= 65536
##$YMAX_p= 115887297
##$YMIN_p= -393159772
$$ End of Bruker specific parameters
$$ ---------------------------------
##NTUPLES= NMR SPECTRUM
##VAR_NAME=  FREQUENCY,     SPECTRUM/REAL,   SPECTRUM/IMAG
##SYMBOL=    X,             R,               I
##VAR_TYPE=  INDEPENDENT,   DEPENDENT,       DEPENDENT
##VAR_FORM=  AFFN,          ASDF,            ASDF
##VAR_DIM=   65536,         65536,           65536
##UNITS=     HZ,            ARBITRARY UNITS, ARBITRARY UNITS
##FACTOR=    0.49542278885378, 1,            1
##FIRST=     16045.7642231865, 0,            0
##LAST=      -16421.768244346, 0,            0
##MIN=       -16421.768244346, -393159772,   0
##MAX=       16045.7642231865, 115887297,    0
$$ Real data points
##PAGE= N=1
##DATA TABLE= (X++(R..R)), XYDATA
$$ [...]
7384a5594848k000227K225111J84201l932164n131345l433094m83405L934820
7376b4230951Q770357R913265N646396M12483p65300J174957J903726J04405k317254
7367F12084m011149m498425k817881M83224J879889q45569m288098l085935K971536
7358a3600324Q643996R283776M661716j967095o038591m465305Q70043L764611
7350A152827N98829m869317o299112k531140K471483N424289N773907L628315
7342E350081j79616k793441j973364L84897O76711j103441j698282M56987L698032
7333B818564N763221N151016J183111m220954o489997l553156P35500J867607
7325C254912R65039J496127K588570J362116m36668J033135M006607L384978L9648
$$ y = [-15594848, -17595075, -15369964, -15185763, -19117927, -24249272, -27682366, -28165771, -24230951, -15460594, -5547329, 99067, 511550, -253750, 921207, 2824933, 2929338, 612084, -3399065, -7897490, -10715371, -10232147, -8352258, -9197827, -13485925, -16571860, -13600324, -4956328, 4327448, 8989164, 7022069, 983478, -3481827, -2611784, 1152827, 1751656, -3117661, -9416773, -11947913, -9476430, -4052141, 1721766, 5350081, 5170465, 2377024, 403660, 788557, 1465268, 361827, -1336455, -879468, 2818564, 8581785, 13732801, 14915912, 10694958, 4204961, 651805, 1387305, 3254912, 4219951, 5716078, 8304648, 9666764, 9230096, 10263231, 14269838, 17654816, 17694464]
7316A7694464k47894K466937J307376n609139j0854753q826451l751012k166460
7308i986932l857270m944027m274625k039666K627216P909450Q388980K878760
7300c298114j892854p08431K194467O23557l196109l021015O92915K494698J636813
7291d474073J872056L108649J498870k361424l093196O77390L954236L152739
7283D335247L28967j700263k904906l300501j983083m12865j489461l838479k496837
7274a3462181K694578N172808J256910l758797l369828Q29693K750565J419283
7266f466969J175630L701131N415269L292434q78039l344042k907565j371664
7258a383815r36513j889255k209863L10602M775099O897865L619023k557661n785497
$$ y = [17694464, 17446570, 19913507, 21220883, 15611744, 4756991, -4069460, -7820472, -9986932, -13844202, -18788229, -23062854, -25102520, -22475304, -14565854, -6176874, -3298114, -5190968, -5899399, -3704932, -3081375, -6277484, -9298499, -8605584, -6110886, -4474073, -2602017, 506632, 2005502, -355922, -3449118, -2771728, 1182508, 4335247, 4664214, 2963951, 59045, -3241456, -5224539, -5637404, -7126865, -10965344, -13462181, -10767603, -5594795, -4337885, -8096682, -11466510, -10636817, -7886252, -6466969, -5291339, -1590208, 3825061, 7117495, 6239456, 2895414, -12151, -1383815, -2320328, -4209583, -6419446, -6108844, -1333745, 5564120, 9183143, 6625482, 839985]
7249H39985l415401J540848M676591M776805L241835J106876j304910l016654
7241H445975l184548k859409l481562l788343j443419J686717K29846o146347
7233a0541090r412444l541791N127221N202435l167285p607606j182299Q035061
7225a7087798R659889N244206K557333K064160j153726n563342m274677K147125
7217f406830M503359p63041n456144k519215K912721K131683l185902l909321
7209a2692690K175400P187816N024376l50722j474558K155263M382305J488891
7201G896081l145565m329191j996237k67248r26401j436735m3527R30198o39995
7192c958620k237929l74678L373161M589861L218640L356828N728254N817931
$$ y = [839985, -2575416, -1034568, 3642023, 8418828, 11660663, 12767539, 11462629, 8445975, 5261427, 2402018, -1079544, -4867887, -6311306, -4624589, -4394743, -10541090, -19953534, -23495325, -18368104, -13165669, -16332954, -23940560, -25122859, -17087798, -7427909, -2183703, 373630, 2437790, 1284064, -4279278, -8553955, -6406830, -1903471, -2666512, -8122656, -10641871, -7729150, -5597467, -8783369, -12692690, -10517290, -3329474, 1694902, 1344180, -130378, 2024885, 6407190, 7896081, 4750516, 421325, -1574912, -1842160, -2768561, -4205296, -4248823, -3318625, -3958620, -6196549, -6571227, -3198066, 1391795, 4610435, 7967263, 13695517, 19513448]
7184A9513448J162388m357529o074337m369340k146637j82583J642918J696023
7176F884351q13799k846735j303629J626240J053056l218672n931915l577464
7168h128567J024655K813172Q98398j091671l07849J526395N61719l483111n964037
7159a2150896l098226K296807L782543j3989l072791J61158P304929J0807032
7151F016567O787734r64161n318569l019238K072838K996262k108942o969981
7143e07490m940698J502229L720460o06314m140056j372698K942550J759905l050037
7134d692149m256843r77883O86187k025382m700160l429785m35728L21541j087945
7125b0598147j688294L48397M640744R286635J1246256Q263592J826013l451030
$$ y = [19513448, 20675836, 16318307, 10243970, 5874630, 3727993, 3545410, 5188328, 6884351, 6070552, 3223817, 1920188, 3546428, 4599484, 1380812, -4551103, -8128567, -7103912, -4290740, -3392342, -4484013, -4791862, -3265467, -2703748, -6186859, -12150896, -15249122, -12952315, -9169772, -9183761, -12256552, -12095394, -4790465, 6016567, 12804301, 11840140, 6521571, 3502333, 5575171, 8571433, 6462491, -507490, -5448188, -3945959, -225499, -831813, -4971869, -6344567, -3402017, -1642112, -4692149, -8948992, -9926875, -9240688, -11266070, -15966230, -19396015, -19831743, -19510202, -20598147, -22286441, -21938044, -17297300, -8010665, 3235591, 11499183, 13325196, 9874166]
7117I874166m436043k262474k42467m67684k462973l682905j738543K256197L711649
7108E48923L49968l556849k385200K575397M849474K494996L80441J560489K513453
7099I331092J10479k256358l75361L194743L157847M42560N89208M013850M495530
7090B2703590j386845q886939j1573529q797313l872872J263681N807106P525701
7082B782580N147096J830433J623259L061807J117273m313575p300045m939395
7074i90567j972230k830721m080602j37307P081156J0644062Q730297N499628
7066B1943716K811649j567264p041283r068002o922257n418363o186490m502798
7058a5951092J503594N961565M612175J789032J854620R83282m504838q457953
$$ y = [9874166, 5438123, 3175649, 2933182, 2465498, 2525, -3680380, -5418923, -3162726, 548923, 898891, -2657958, -5043158, -2467761, 2381713, 4876709, 5257150, 6817639, 9331092, 9441571, 7185213, 6809852, 10004595, 13162442, 13605002, 14194210, 18208060, 22703590, 21316745, 12429806, 856277, -7941036, -11813908, -10550227, -4743121, 2782580, 7929676, 9760109, 11383368, 14445175, 15562448, 11248873, 3948828, -990567, -2962797, -5793518, -9874120, -10011427, -2930271, 7713791, 16444088, 21943716, 24755365, 23188101, 16146818, 7078816, 156559, -5261804, -11448294, -15951092, -14447498, -8485933, -3873758, -2084726, -230106, 753176, -3751662, -12209615]
7050a2209615l729798M506442N802490J260035P26204M987622M630581k431276
7042C542685o514898l097418o59139n051069q108863r31707J0846838J5124074
7034E150503J0068157L223426j056649l967473n653467n073131m333844n762473
7026g404951o607374l223841J671600K342376j457452n247225o571594n061970
7018c1560431R37956J0642352J6563611J2093939J808378l590324j429361J633932
7010G100052J363395L52695N48394J7753j326554n34761J852645J086742l802445
7001F657916p661573o994347m242399k447370j296422j25871O05022K000635N328896
6992h175513P540233M604458o28100j584804Q47824l80749m980179m305779K864695
$$ y = [-12209615, -15939413, -11432971, -5630481, -4370446, -3644242, 1343380, 5973961, 3542685, -2972213, -6069631, -6728770, -11779839, -19888702, -20820409, -9973571, 5150503, 15218660, 18442086, 17385437, 13417964, 7764497, 2691366, -1642478, -7404951, -14012325, -17236166, -15564566, -13222190, -14679642, -19926867, -26498461, -31560431, -30622475, -19980123, -3416512, 8677427, 10485805, 6895481, 5466120, 7100052, 8463447, 8816142, 9364536, 9382289, 8055735, 7520974, 9373619, 10460361, 6657916, -1003657, -7998004, -12240403, -14687773, -15984195, -16110066, -15505044, -13504409, -8175513, -635280, 3969178, 3341078, 1756274, 2604098, 2223349, -2756830, -7062609, -4197914]
6983d197914N685455j296635p595985k715509P314079J0159537N899763L316091
6975A6568882L332176o00626q304964j1611613p126354j4152M998043P309751
6967D551143N647767r19990o927271m798085L731322Q965868O828305K449785
6959A9528844m51905l909299p331757n125674K942800Q056317M564980j598921
6951A6675385k475419N69204J249776j343279l310493k908353j280075P75416
6943G952162K313207J627265l05158L56996L672200M006985j105422n716055m414639
6934H387541j005822j542936l772679j774094K645017K537236k113287m526563
6926a165587l096145l457170o855908o074854K487750J0467704P952506k312782
$$ y = [-4197914, 1487541, 190906, -7405079, -10120588, -2806509, 7353028, 13252791, 16568882, 19901058, 19300432, 10995468, -616145, -7742499, -7756651, -2758608, 4551143, 10198910, 9278920, 2351649, -2446436, 1284886, 10250754, 17079059, 19528844, 19076939, 15167640, 7835883, 2710209, 5653009, 13709326, 18274306, 16675385, 14199966, 14769170, 16018946, 14675667, 11365174, 8456821, 7176746, 7952162, 10265369, 11892634, 11587476, 11944472, 15616672, 19623657, 18518235, 12802180, 8387541, 7381719, 5838783, 2066104, 292010, 2937027, 5474263, 3360976, -1165587, -4261732, -7718902, -14574810, -20649664, -18161914, -7694210, 258296, -2054486]
6918b054486q065512l272131N218062P403441K051651l638650m180612k000660
6910h538897k403091n154729m909111L63570N927901O892683L968854j8074m753515
6901h624409r368184r232339j991449O179068P167771J898463k200935k892084
6893a9064098m046535n710859l083989K997730M658334N5499j705391N095659
6885b0803650J2120514R132520L13699j847039M486622Q454764L398161l964413
6877A1291178m313412J428618M686361R08219n685713q096652m631544k56440
6869d669385j82940l205620l560139N81709M123521K333653k750191o236420o731375
6860b0297187m606059J747031J1511543J6612030R779957l275261q602028k360289
$$ y = [-2054486, -10119998, -13392129, -8174067, -770626, 1281025, -2357625, -6538237, -8538897, -10941988, -16096717, -21005828, -20642258, -14714357, -7821674, -3852820, -3870894, -8624409, -17992593, -27224932, -29216381, -23037313, -15869542, -13971079, -16172014, -19064098, -23110633, -28821492, -31905481, -28907751, -24249417, -24193918, -25899309, -20803650, -8683136, 449384, 763083, -1083956, 3402666, 11857430, 15255591, 11291178, 6977766, 8406384, 13092745, 14000964, 8315251, 218599, -4412945, -4669385, -4852325, -8057945, -11618084, -11036375, -6912854, -4579201, -7329392, -13565812, -20297187, -24903246, -23156215, -11644672, 4967358, 14747315, 11472054, 2870026, 509737]
6852E09737M178453J396777n162579m199929M530329J0648160P617603m14514
6844A9104037n658613m767651M16374N432896N640118j41876p322694r659537
6836C043054o294847k092709q39821j466457j749539j869040k123993n99296L313835
6827a0678813N312573O33921q190818j2447116p554591J171017N424886L896766
6819b2432175K058065L521562N657438M262047n86539m719268m123521J696302
6811a4666089Q765632J0676776M115355o536928j2387315r062197n24410O728856
6803a2890320R967446R333444N017142j095074m355456k516295K59327q85514
6795B834700l805477k687361K312602M998174K833810M53518J781652M101458
$$ y = [509737, 4688190, 6084967, 922388, -3277541, 1252788, 11900948, 19518551, 19104037, 13445424, 8677773, 9094147, 14527043, 20167161, 20025285, 12702591, 3043054, -3251793, -5344502, -6184323, -7650780, -9400319, -11269359, -13393352, -13992648, -10678813, -5366240, -4732319, -12923137, -25370253, -32924844, -31753827, -26328941, -22432175, -20374110, -16852548, -11195110, -6933063, -7519602, -12238870, -16362391, -14666089, -5900457, 4776319, 8891674, 2354746, -10032569, -19094766, -19619176, -12890320, -2922874, 6410570, 11427712, 10332638, 5977182, 3460887, 3720214, 2834700, -970777, -3658138, -1345536, 3652638, 6486448, 6939966, 8721618, 12823076]
6787A2823076K750424k280596p129200q471743n274606R11856N891076O075672
6779E295959K991318J294327J738357O28884k698068l669604m27763J931541o10906
6770F474045l959446k427795J885647K642072o41374k763120j668946m95442r04175
6761a858534m94271K019284M077804L445426J282730o00694k464122m862291o403455
6752e858123n059484q79495L291201L672219r12697o562336p013243m10206Q112030
6743a1620134J2030794R705471L832163k182964n068909k657711K445108L608868
6735A0092686j260983n472177k856714K411816J884804m236044q080887o436500
6727a3953999l597939k004849J173737O362489Q628526N563743J453010K77513
$$ y = [12823076, 15573500, 13292904, 6163704, -2308039, -7582645, -6670789, -779713, 5295959, 8287277, 9581604, 11319961, 11948845, 9250777, 5581173, 5153410, 7084951, 6474045, 2514599, 86804, 1972451, 4614523, 3973149, 1210029, -458917, -954359, -1858534, -2352805, -333521, 3744283, 7189709, 8472439, 7871745, 5407623, 545332, -5858123, -10917607, -11797102, -8505901, -4833682, -5746379, -12308715, -19321958, -19732164, -11620134, 410660, 10116131, 13948294, 11765330, 6696421, 4038710, 6483818, 10092686, 8831703, 3359526, 502812, 2914628, 4799432, 563388, -7517499, -13953999, -17551938, -19556787, -18383050, -12020561, -3392035, 2171708, 3624718, 3902231]
6719C902231L47541r72675k609356k925115k529115j321589K086191N595519M093570
6710E667202k334630o568414m166530R31595L713193M570777M598226J702341
6702H113760l287535l861391K218158O992076L929546j066344O85157N853512
6694A9576939M805572k007283n377833l256491l006416p129204q610224l520901
6686h525841K131716K680399J277433K754344M971448L203615j729741n177457
6678A585916n225136l194551j86622L126068M952744L434282j381440p143858
6670d032597r607727n000895M662646J0563475O670358j134084k371454K564035
6662B313757L309616l119876o734687r86924N616850K589137n728999o785957
$$ y = [3902231, 4249772, 3277097, 667741, -2257374, -4786489, -6108078, -4021887, 1573632, 5667202, 3332572, -3235842, -7402372, -6470777, -2757584, 1813193, 6411419, 8113760, 4826225, 964834, 3182992, 10175068, 14104614, 13038270, 13723427, 19576939, 24382511, 22375228, 16997395, 13740904, 10734488, 3605284, -5004940, -8525841, -6394125, -3713726, -2436293, 318051, 5289499, 8493114, 6763373, 1585916, -3639220, -6833771, -7020393, -3894325, 1058419, 4492701, 3111261, -4032597, -13640324, -18641219, -13978573, -3415098, 3255260, 2121176, -250278, 2313757, 5623373, 2503497, -4231190, -5218114, 398736, 2987873, -2741126, -9527083]
6654i527083J233052P713859N577087n41471l097298j162266J089025M05244l006947
6645a316798n961459m856752k20434K463429l15360m269964k948536K508003M974813
6636i943058K107470q51406M2769J972116J356433O6424J666527M759796M396881
6627E573952r26560o872730q132275m165245M46000J185699j290802k359147J86987
6618a6354121L416061M357645M620190O565982P733869M245558j616456l211249
6610I757479P94184M380392L235960L07154k43676M14195j049664m181371n949868
6601G464785n398430l669415j463886N25022P25477q34144j253164J037154K991226
6592A24625J262357k268349l179285j075814Q24068J488326K635095L828564K195632
$$ y = [-9527083, -8294031, -580172, 4996915, 4455444, 1358146, 195880, 1284905, 1690149, -1316798, -7278257, -12135009, -12355443, -9892014, -10207374, -14477338, -17425874, -14917871, -9943058, -7835588, -8686994, -8644225, -6672109, -5315676, -5249252, -3582725, 1177071, 5573952, 4647392, -2225338, -10357613, -14522858, -14076858, -12891159, -14181961, -16541108, -16354121, -12938060, -8580415, -3960225, 2605757, 10339626, 14585184, 12968728, 9757479, 10551663, 14932055, 18168015, 18475169, 18231493, 18645688, 17596024, 13414653, 7464785, 2066355, -1603060, -3066946, -2541924, -1816447, -2650591, -3903755, -2866601, 124625, 1386982, -881367, -4060652, -5136466, -4312398, -2824072, -188977, 3639587, 5835219]
6583E835219j970647m161361k245108R9797o07561j810542R77206O401006Q076722
6574A0594731L017450m335168p486126m960878p54527Q73851l34440j296629L06072
6565d375664L124545L849199J622557p50337q99992m52089k206085m876097m150429
6556i114392N75918M320038L388220O95695P19291J894042o94544n953467o502936
6547a0672135K81966O645615M219280m325182q779825m838778J536565L360783
6539a2571711J172975L75537L404887P150152O922421J603624m660555o071280
6531b673950j564565L387446L272371p08604l521394m131940n310428o308995
6523a7560059k637212N008829Q576348L660128l035842k675837L783344Q631136
$$ y = [5835219, 3864572, -296789, -2541897, -2442100, -3049661, -4860203, -3882997, 2518009, 10594731, 13612181, 9277013, 1790887, -3169991, -3924518, -3050667, -3385107, -4681736, -4375664, -1251119, 2598080, 4220637, 3470300, 2570308, 2118219, -87866, -4963963, -9114392, -8538474, -4218436, -830216, -134521, 584770, 2478812, 1784268, -4169199, -10672135, -10390169, -3744554, 474726, -3850456, -12630281, -17469059, -15932494, -12571711, -11398736, -11023199, -7618312, -468160, 6454261, 8057885, 3397330, -2673950, -4238515, -851069, 2421302, 1712698, -1808696, -5940636, -11251064, -17560059, -20197271, -15188442, -6612094, -2951966, -5987808, -8663645, -4880301, 3750835]
6515C750835Q475287N369611k3044q102230j4278264j1922268k595029M132456
6507a5192646L149489n31337q82339J074503J712178J181135R96564K59578j257228
6498i490103o93674K702504M222034N36801l949883l112343J722493M393604L090902
6489e77665Q90460q30125l080295m495296k344623J805784L288656J447731J55331
6480c740042R49186J074748r77996l174527m031961m226898l528267r33880J894027
6471a6695610K495784K695955N616086P920943L113961o358754r635795l335301
6463a4182731K614956M61033l305447P29164R226507J1614932O217173P38031
6455A4113618m64433r8962n29920j315517l170380o456588o849873n66551P186935
$$ y = [3750835, 12226122, 17595733, 17572689, 9470459, -4807805, -16730073, -19325102, -15192646, -12043157, -12574494, -13456833, -12382330, -10670152, -9489017, -8492453, -8232875, -9490103, -10183777, -7481273, -3259239, -2722438, -6672321, -9784664, -8062171, -3668567, -577665, 312795, -517330, -3597625, -8092921, -10437544, -8631760, -5343104, -3895373, -3740042, -2790856, -1716108, -2694104, -5868631, -9900592, -14127490, -17655757, -18589637, -16695610, -14199826, -11503871, -5887785, 2033158, 5147119, -1211635, -10847430, -14182731, -11567775, -11106742, -14412189, -13683025, -4456518, 7158414, 13375587, 14113618, 13649185, 13550223, 13020303, 11704786, 8534406, 2077818, -4772055, -5338606, 1848329]
6446A848329P660956J907385n76757L139212N598356J861120l622388o198770
6438A1617443p649584r248862p012404L16668N945422M113732j247516k802088
6430e967189L16333M182365O544141O508264L014992j272705k90401N717246P289184
6421B6042230o59958r108455p511991m4820J393698m039403o479854k489562P36415
6412b161700j080360l393998k965839l022901m403910j582018O977472J3008684
6404A375430R591392J492450k442592j986389l417674q204621j1006760p843207
6396b2441971o83064N978854R244998Q557781N024312K05420n056544r353285
6388h523499q841019q17340R780467J2779521N022724m385119n516541k61388
$$ y = [1848329, 9509285, 11416670, 10839913, 13979125, 19577481, 21438601, 17816213, 11617443, 3967859, -5281003, -12293407, -11976739, -6031317, -1917585, -3165101, -5967189, -5650856, -1468491, 5075650, 11583914, 14598906, 13326201, 13035800, 18753046, 26042230, 25382272, 16273817, 8761826, 8717006, 10110704, 6071301, -408553, -2898115, -2161700, -3242060, -6636058, -9601897, -12624798, -17028708, -18610726, -11633254, 1375430, 10966822, 12459272, 10016680, 8030291, 4612617, -3592004, -14598764, -22441971, -23125035, -17146181, -7901183, 656598, 5680910, 5886330, 829786, -8523499, -17364518, -18181858, -8401391, 4378130, 9400854, 5015735, -500806, -762194]
6380g62194K095705j179505l857805j562769K194218K761768J479981K358609
6372C528008M977102N030960J116837k822991l036318j347483k225639n388233
6364a67757n360901j8963M566886K126183l844843m436280J197455M240650k02841
6355a900411n607266m398437Q86114L167506K452230L988270P585331P243439
6347A3416776J332339m347227n194879l426341k946328l759925m152397m230352
6339a3308334m263201k695148J094169M345397M255197K341049K676697O202034
6331F47860Q972168O562372o61115p228738p882773l247079R22473Q93265n25330
6322a546897J130485M348923L105956l798302r324155o536972K604534R858361
$$ y = [-762194, 1333511, 154006, -3703799, -5266568, -3072350, -310582, 1169399, 3528008, 8505110, 13536070, 14652907, 11829916, 8793598, 7446115, 5220476, -167757, -5528658, -5547621, -980735, 1145448, -2699395, -7135675, -5938220, -1697570, -1900411, -7507677, -11906114, -11020000, -7852494, -5400264, -1411994, 6173337, 13416776, 14749115, 10401888, 5207009, 1780668, -1165660, -4925585, -9077982, -13308334, -17571535, -20266683, -19172514, -14827117, -10571920, -8230871, -5554174, 647860, 9620028, 16182400, 15521285, 8292547, 409774, -2837305, -1914832, -1021567, -1546897, -416412, 3932511, 7038467, 3240165, -6083990, -12620962, -10016428, -158067]
6314a58067J0328991O241485J953096j001041k784894k325061J430076O085264
6306A9769849O798623J995208l899269n420943k589353q7905o10341k162560k466545
6297A1326764k660451m578204o780820o097021k158046J866347K867813Q94740
6289e318878j047093J36201M036420O101103K568290l839543o131088j903808
6281e398396L355252L566479o95726m539801n001644k223854K234203N076728
6273c626759K655472l701320p188868m340184m68510j438079m286938k677342
6265b5072528J928508K758276o54088k254839m67268l17781l315279l923911R77352
6256c0341558O583368P695213N615107M022927L301134K288382J179464P5725
$$ y = [-158067, 10170924, 16412409, 18365505, 17364464, 14579570, 12254509, 13684585, 19769849, 26568472, 28563680, 24664411, 19243468, 16654115, 16566210, 15955869, 13793309, 11326764, 8666313, 4088109, -2692711, -8789732, -10947778, -9081431, -6213618, -5318878, -6365971, -6229770, -2193350, 3907753, 6476043, 2636500, -3494588, -5398396, -2043144, 1523335, 827609, -3712192, -8713836, -10937690, -8703487, -3626759, -971287, -4672607, -11861475, -16201659, -16670169, -18108248, -22395186, -25072528, -23144020, -20385744, -21039832, -23294671, -23761939, -24079720, -27394999, -31318910, -30341558, -23758190, -16062977, -10447870, -6424943, -3123809, -835427, 344037, 419762]
6248D19762j289931j145173K113862M889080J964603m321835o299833l390583
6240g060048k837222n770237l862125N105850J0177871L911919m586648l833256
6232h753896J967595J369466m920805o757103k070630K139253L691505O448745
6224f885870Q788304M536146l868687o268364j031012J922811k438856o573702
6216a1819230l621655K441433N329511N474388M681084O96244o306282r671509
6208a2796016n698666n02835o37628k972413j098356L459589M182789K24588k950035
6199a8788983j689127K329398N075692L408235j901853m388722J925179J2236061
6191a794120J3826989L292297o967908n546257K599984N595933J968003j637640
$$ y = [419762, -870169, -2015342, 98520, 4987600, 6952203, 2630368, -3669465, -7060048, -9897270, -15667507, -19529632, -14423782, -4245911, -333992, -4920640, -8753896, -6786301, -5416835, -10337640, -17094743, -19165373, -17026120, -13334615, -6885870, 1902434, 6438580, 2569893, -3698471, -4729483, -2806672, -5245528, -11819230, -15440885, -12999452, -7669941, -2195553, 2485531, 3181775, -3124507, -12796016, -18494682, -18997517, -19635145, -22607558, -23705914, -20246325, -16063536, -15838948, -18788983, -20478110, -18148712, -13073020, -9664785, -11566638, -15955360, -14030181, -1794120, 12032869, 15325166, 8357258, 2811001, 5410985, 11006918, 12974921, 11337281]
6183A1337281l855573p683369j0061197n203946L056443M738591j81784j175614
6175i029168N598243J1105396P897653K55154m509305n545305m576227j330650
6167a34209J918465l54823p169195q543904L38684R773897Q348665r84107o487490
6158c294017m618174j887711k471193l501762k284310k5911K273741N004758O406856
6149d397723L790741j097384l403661k282763j258684j244673N79168L759032
6141e555947L061335l100212q334766o323962R19217O751595Q405001P553458
6133C375719N077240K20777n766532r313904q416399m402519K09480L463996L844495
6124a1707647J131269j902874j084141M151086Q772660P390911J116329l267312
$$ y = [11337281, 7481708, -201661, -10262858, -15466804, -12410361, -7671770, -7853554, -9029168, -3430925, 7674471, 15572124, 15827278, 11317973, 5772668, 1196441, -134209, 1784256, 1429433, -5739762, -14283666, -13944982, -4171085, 4177580, 3193473, -3294017, -7912191, -9799902, -12271095, -15772857, -18057167, -18083078, -15809337, -10804579, -4397723, -606982, -1704366, -5108027, -7390790, -8649474, -9894147, -9314979, -5555947, -2494612, -5594824, -13929590, -20253552, -19334335, -12582740, -4177739, 3375719, 8452959, 8673736, 2907204, -6406700, -14823099, -19225618, -19016138, -15552142, -11707647, -10576378, -12479252, -13563393, -9412307, -639647, 6751264, 7867593, 4600281]
6116D600281j858959J154646n48670o036921q104944l886662P66802L03116k016482
6107a5627793J57218N402916O479345K189710m84019K150022M211583l27868p580717
6098c429603q877666k685046M372680O759646N028015K228151K18289m3448J501507
6089E072525K921603K189479M55796M55702J647343N98555l070147n002594k195480
6080C072782K442217M071723K086548l88983j466467j974259k592614k332766
6072B918181n10081J538069J860400M54175n95064Q3147Q71215r29103m664990
6063A025949n837757j783411L844564N172599J834967r64070k14073J093831o50691
6054C521908m187078n733101l993704k58237L898019O227221L931451k058203
$$ y = [4600281, 2741322, 3895968, 3347298, -2689623, -10794567, -14681229, -13914427, -13611311, -15627793, -15470575, -10067659, -3588314, -1398604, -1882623, 267399, 4478982, 4151114, -3429603, -12307269, -14992315, -10619635, -3859989, 1168026, 3396177, 3614466, 3571018, 5072525, 7994128, 10183607, 10639403, 11095105, 12742448, 13341003, 10270856, 5268262, 3072782, 5514999, 9586722, 11673270, 11284287, 9817820, 7843561, 5250947, 2918181, 2408100, 3946169, 5806569, 6260744, 5665680, 5748827, 6620042, 5690939, 1025949, -4811808, -6595219, -2750655, 2421944, 4256911, 3292841, 3078768, 4172599, 3521908, -665170, -6398271, -10391975, -10650212, -6752193, -524972, 3406479, 1348276]
6046A348276n274044r41359O284936P104969k0717o765507o370300j637666J153410
6037e118002J223194J793137L214734K965268R10283m95746q15241j731527k402408
6028d56308L14058N608411P607797L460718j615544j604306J162334k27843n773770
6019H475547p582129j774939M925006M496615j125003l714176j066714J052215
6011C686422p41947j984696J725769O520747N076046k702256r053822q365931
6003e839668l368908M2853O04404J456163L999662N496669L215579j591394n387554
5994a372194o523828n780237l727076l45100K567705J956516j707089l120605
5986a8051908J329711P879372R946718O776921K988598N74958k718013o528187
$$ y = [1348276, -3925768, -4867127, 1417809, 8522778, 8502061, 1736554, -4633746, -6271412, -5118002, -3894808, -2101671, 1113063, 4078331, 4988614, 4492868, 3677627, 1946100, -456308, -142250, 5466161, 13073958, 16534676, 14919132, 13314826, 14477160, 14249317, 8475547, 893418, -881521, 4043485, 8540100, 7415097, 3700921, 2634207, 3686422, 2944475, 959779, 2685548, 9206295, 14282341, 11580085, 2526263, -5839668, -9208576, -9165723, -8561319, -7105156, -3105494, 2391175, 5606754, 4015360, -1372194, -7896022, -13676259, -17403335, -17748435, -15180730, -13224214, -14931303, -18051908, -16722197, -8842825, 1103893, 7880814, 10869412, 11444370, 8726357, 2198170]
5978B198170o181166p68694L252518J214474k132006q5410M907309M887285r63928
5969F328552n104446l186681M31778N80917j563871k447126k578696m921693r181558
5960b1642824j1126239p200443J401756Q809034R087248K414193m211481m660923
5952b7129679o38382K133842K496250L506881N075137L842598O43118N74825L788090
5943e707320L879322j186962m283898l85856M573757L127091j346115k82406N764393
5934D152006P823729K435983l652946l652141J135238M877845L909630j301059
5926A5728285o974374q516965n483849k856834l586588k697518M922524J3376447
5918C911128J1323277j160954j0696003q261760j97470K721455m50579l272869
$$ y = [2198170, -3982996, -4751690, -1499172, -284698, -2416704, -2502114, 2405195, 7292480, 6328552, 1224106, -1962575, -1530797, -949880, -2513751, -4960877, -7539573, -12461266, -21642824, -32769063, -39969506, -38567750, -29758716, -20671468, -18257275, -22468756, -27129679, -27768061, -25634219, -23137969, -19631088, -14555951, -10713353, -10070235, -9495410, -5707320, -1827998, -3014960, -7298858, -7684714, -3110957, 16134, -1329981, -1612387, 4152006, 11975735, 14411718, 10758772, 7106631, 8241869, 13119714, 17029344, 15728285, 8753911, 236946, -5246903, -8103737, -11690325, -14387843, -9465319, 3911128, 15234405, 14073451, 3377448, -4884312, -5081782, -2360327, -2810906, -6083775]
5910f083775k592206k04187K102822L104566P66928m294527o741263l070972K369609
5901a4643005L157645Q0746r44471J842750M787168N421370M380870J798358k045004
5892C836427l314610J167402O309764L209266o993287j1711125l381619R540331
5884a337451J3610016P094283o88775k744781k6417L978863O779419N327555k028573
5875B9964139j0724701j3049066q083444l419809m521460p390058n273009J771371
5867b0726037Q418965J1658081J1770197Q407915J582590m596234n168081j580074
5859I767322l56019l802658p349150p305865n463745l664682J12511O173635R103273
5850b785378N064074q77950j180027L057983M226982K808m165303m272324k317961
$$ y = [-6083775, -8675981, -8880168, -6777346, -3672780, -2905852, -7200379, -13941642, -17012614, -14643005, -11485360, -11404614, -12349085, -10506335, -5719167, -297797, 4083073, 5881431, 3836427, 521817, 1689219, 7998983, 11208249, 4214962, -7496163, -10877782, -1337451, 12272565, 19366848, 18678073, 15933292, 15906875, 19885738, 26665157, 31992712, 29964139, 19239438, 6190372, -1893072, -5312881, -9834341, -17224399, -22497408, -20726037, -12307072, -648991, 11121206, 19529121, 21111711, 16515477, 11347396, 9767322, 9411303, 5608645, -1740505, -9046370, -14510115, -18174797, -18062286, -11888651, -2785378, 2278696, 1400746, 220719, 3278702, 7505684, 7508492, 3343189, -929135, -3247096]
5841c247096m75227K323566N462811M826380j98134l383031j26424N128935N344391
5832A5656171J336692m55613J262531J057858l470546o671062k737197N315016
5824A1293850Q748999L975875l384963o130478m369752m033289p375483r045177
5816a0320418l871452M629326P963287L685772k265248m487661m065746l968441
5808a2700581l794495k303261p50686J65436K745155P209690Q013242J150939
5800b64561p446626p797517M03558O762494M101667k669319m304202Q70368O529725
5791c814413P119540L336355m40099j578081j336867k180034l866556l826244
5783f586399j828226j437381m387587o220118j781599O395776J0220704O446655
$$ y = [-3247096, -3722323, -1398757, 4064054, 8890434, 8692300, 5309269, 5182845, 10311780, 15656171, 16992863, 16537250, 17799781, 18857639, 15387093, 8716031, 5978834, 11293850, 20042849, 24018724, 20633761, 14503283, 10133531, 6100242, -1275241, -10320418, -14191870, -9562544, -1599257, 2086515, -178733, -4666394, -8732140, -12700581, -16495076, -18798337, -19549023, -19383587, -16638432, -9428742, -1415500, -264561, -7711187, -15508704, -15105146, -8342652, -4240985, -6910304, -11214506, -10344138, -3814413, 3305127, 6641482, 6201383, 4623302, 3286435, 1106401, -2760155, -6586399, -8414625, -9852006, -14239593, -20459711, -22241310, -15845534, -5624830, 821825]
5775H21825P6515l190954k910856r42126K264357N669620O226639K929999p61269
5766A0183750j649651j158118j930036k983485k003521j47717k76279j659601
5758a624658p50141K941076N534666M046376J21501k493782k279381p63938j59263
5749D572456r66554j740573j186790m9990K66131N55058K769981N682490N002283
5740A4904492k57260m962716m547547j442886o16490j303739J132050O220379
5732I126283P802850L461170j518609k159131n69108j113397l175481l370005
5724H484572j848372j204393j032610Q43908K509707n53572p089554r184946k888629
5715a1963889N106884N984221P15965k107302J163283N069351M185008M84698
$$ y = [821825, 898340, -2292614, -5203470, -6145596, -3881239, 1788381, 8015020, 10945019, 10183750, 8534099, 7375981, 5445945, 2462460, 458939, 311222, 34943, -1624658, -2374799, 566277, 6100943, 10147319, 10268820, 7775038, 5495657, 4731719, 4572456, 3605902, 1865329, 678539, 628549, 894680, 1449738, 4219719, 9902209, 14904492, 14647232, 9684516, 5136969, 3694083, 3077593, 1773854, 2905904, 9126283, 16929133, 20390303, 18871694, 16712563, 16143455, 15030058, 11854577, 8484572, 6636200, 5431807, 4399197, 5243105, 7752812, 7199240, 109686, -9075260, -11963889, -6857005, -872784, -156819, -2264121, -1100838, 3968513, 8153521, 8638219]
5707H638219j387116j501104k710531m274135k924371N53213J394900j413997
5699c624922k528832J831860P269626O757243P74182k893750M03897O139471O747213
5690B0875988Q94861n886248q223025n881992k313126q19722k518081n861201
5682i732546p235462l898417K328254N893849L737334p41303j994266P59319L700575
5673g182663M402712L951177L266682J554250o32235r47727N35524R10063J70696
5664F028479K284904P246893P779833l24396r403291r100008j230313L182271
5656F464372K08570l242375k454345j480935l463528l825094J145210O281692
5648c66433M899559j013072m468769l428043j064224N89871J514121J041364l95227
$$ y = [8638219, 7251103, 5749999, 3039468, -1234667, -4159038, -3605825, -2210925, -3624922, -6153754, -4321894, 2947732, 9704975, 10479157, 7585407, 7989304, 14128775, 20875988, 21770849, 15884601, 7661576, 1779584, -533542, -1353264, -3871345, -9732546, -16968008, -20866425, -18538171, -12644322, -8906988, -9648291, -11642557, -10883238, -7182663, -2779951, 1171226, 4437908, 5992158, 5359923, 4412196, 4947720, 5857783, 6028479, 8313383, 15560276, 23340109, 23015713, 13612422, 4512414, 3282101, 6464372, 6672942, 3430567, 976222, -504713, -3968241, -7793335, -6648125, -366433, 4533126, 3520054, -948715, -4376758, -5440982, -4851111, -3336990, -2295626, -2690853]
5639b690853L36308L976979N603790J892003k193175n84373L587082K800420k288789
5630A0439392l935683J0519L437414K412253j26008j306344j931163j509795K305570
5621I796155P005842N891392j386846o516877m460366l23243l1807j607728j139033
5612G227489l28403j440791j048427L433784O244551J221424o259376m914287
5604D135964N811100J3561861Q628455n203750j6827822j9167422j2819723l297383
5596b5178720L284277M938634N236120P628765R367022N223788l425876q736997
5588a662987o648999j943172q80963l020955l410015l0219M301587O295770N805844
5579a194109M928475M743291L796827M81462l457676m017321n83014K235391Q09629
$$ y = [-2690853, -2354545, 1622434, 7226224, 9118227, 6925052, 6340679, 9927761, 12728181, 10439392, 6503709, 6514228, 9951642, 12363895, 12237887, 10931543, 9000380, 7490585, 9796155, 16801997, 22693389, 21306543, 14789666, 10329300, 10006057, 9974250, 8366522, 7227489, 6899086, 5458295, 4409868, 7843652, 14088203, 15309627, 9050251, 4135964, 9947064, 23508925, 32137380, 26933630, 10105808, -9061614, -21881337, -25178720, -21894443, -16955809, -11719689, -4090924, 5276098, 10499886, 7074010, -1662987, -8311986, -10255158, -11136121, -14157076, -17567091, -17597310, -13295723, -6999953, -1194109, 3734366, 8477657, 12274484, 12755946, 9298270, 5280949, 4697935, 6933326, 7742955]
5570G742955k076808j513839K009958L899105K989830K627665M161761M401556
5562B4242183R02253m171662p074496o436529l156993Q36266K816478R29795l357403
5553E529892o419781o329321l890092p61034J135796m4670l130769l293237J608373
5544a5594843O289875M802994k97043k016451k5457M15581o76608J950989P398541
5535B247578Q037352K825367K23722L623959N041394n95131o049448m858065l072372
5526G424356p433213j1462614o236909K535447K777873l563689l691465M757769
5518a4892445J0710035P903518J901055k281956n675392o372262P61299J1438735
5510C492587J2778124K422074o050690l478230J857092j07596m936731m016092
$$ y = [7742955, 5666147, 4152308, 6162266, 10061371, 13051201, 15678866, 19840627, 24242183, 25144436, 20972774, 13898278, 7461749, 4304756, 5141022, 7957500, 8887295, 5529892, -889889, -7219210, -11109302, -11870336, -10734540, -10779210, -13909979, -17203216, -15594843, -9304968, -4501974, -4799017, -6815468, -6840925, -6425344, -7101952, -5150963, 2247578, 10284930, 13110297, 13334019, 16957978, 21999372, 21404241, 15354793, 10496728, 7424356, -8857, -11471471, -17708380, -15172933, -12395060, -15958749, -19650214, -14892445, -4182410, 3721108, 5622163, 3340207, -2335185, -8707447, -7946148, 3492587, 16270711, 18692785, 12642095, 9163865, 11020957, 10913361, 5976630, 1960538]
5502A960538n39563k213227n834702k937282M269643O236368K460104J404805
5494D806684N047209N995088R15402m400259n528499n169863n720680m876199
5486h931117j934654q41935l361762n641534m780270k859268j557802J074733
5478b8833609N094620N997784J901690j819660P8008M885421O503367M472595
5470a719784L136064L920588L813852J112894j678612j493083J381198L803700
5462A2276817K894871j461906o271927p669274m205891J930901O753249P292400
5454A1539240L572210j121949k876146j380472l34698k130854m102643k580157
5446E84531J397647L850666L522834J874405o35891l451461l067456K468943P338113
$$ y = [1960538, 1420975, -792252, -6626954, -9564236, -5294593, 941775, 3401879, 4806684, 9853893, 15848981, 16764383, 12364124, 6835625, 1665762, -4054918, -8931117, -10865771, -11707706, -15069468, -20711002, -25491272, -28350540, -29908342, -28833609, -23738989, -17741205, -15839515, -17659175, -17581167, -12695746, -6192379, -1719784, 1416280, 5336868, 9150720, 10263614, 8585002, 7091919, 8473117, 12276817, 15171688, 13709782, 7437855, -231419, -4437310, -2506409, 4246840, 11539240, 15111450, 13989501, 11113355, 9732883, 9398185, 7267331, 3164688, 584531, 1982178, 5832844, 9355678, 11230083, 10594192, 7142731, 4075275, 6544218, 13882331]
5437A3882331L680205o097912j0686319n407622J548858J653974k884754n132660
5429i443899l482733q4799M619381R424764R592090L277083l453772m489583k447251
5420C511281k946899m660762l156781p15769k594638n793698k328080O335104
5412a2350242R212186K781810k393515K633130J1333951J1018989P48207q094594
5404A4889922p316335j045904J680631j208098l411591K80347O077782N569654
5396A5516408k221347p794407l564644M770919N454128k950259j0152986r146424
5388a0088612m167587j244990Q21305M900898P884383N757206J940427K894463
5380H697493P450678P801076R27636p264212j0244338q119964m899488k698563
$$ y = [13882331, 17562536, 11464624, 778305, -4629317, -3080459, -1426485, -4311239, -9443899, -12926632, -13011431, -8392050, 1032714, 10624804, 13901887, 10448115, 5958532, 3511281, 564382, -4096380, -7253161, -7968930, -10563568, -16357266, -18685346, -12350242, -3138056, -356246, -2749761, -116631, 11217320, 22236309, 22984516, 14889922, 7573587, 6527683, 8208314, 7000216, 3588625, 3868972, 9946754, 15516408, 13295061, 5500654, 1936010, 6706929, 12161057, 9210798, -942188, -10088612, -14256199, -15501189, -14679884, -9778986, -1894603, 3862603, 5803030, 8697493, 16148171, 23949247, 24876883, 17612671, 7368333, -751631, -5651119, -8349682]
5372h349682j100639M29820J886627L146142L651420K736637J013396Q5056J34291
5363C633068o12091k744866l479133J13619N882676P217694O26799q723705j1827659
5354i913598o373795N49068J886650l64830O89757N586923P019788P07069p421703
5345g634671q476949j942137M492261N088107J770858n81407o13408q8174N79169
5336g406351K909482O242931O108534n41697r412260j1837410n138700L032509
5328a6042962L681290k290136n817708j757257N358768Q262338N297725N1428
5320c256514l725499m407856k459318m95551j185034l180233j795265L977118
5312a6528152Q179815N147213k265152o067018l708594o41841j803987m773723
$$ y = [-8349682, -9450321, -9020501, -7133874, -3987732, -336312, 2400325, 3413721, 3498777, 3633068, 3020977, 276111, -3203022, -3089403, 2793273, 10010967, 10637766, 1914061, -9913598, -16287393, -15738325, -13851675, -14216505, -13526748, -7939825, -920037, -212968, -7634671, -16111620, -18053757, -13561496, -8473389, -6702531, -7283938, -7897346, -7985520, -7406351, -4496869, 1746062, 7854596, 7312899, -2099361, -13936771, -19075471, -16042962, -12361672, -14651808, -20469516, -22226773, -16868005, -8605667, -3307942, -3256514, -6982013, -11389869, -13849187, -14344738, -15529772, -18710005, -20505270, -16528152, -8348337, -3201124, -5466276, -11533294, -15241888, -15883729, -17687716, -22461439]
5304b2461439l717620K317806Q057691Q688410N578069L867114N221935N489607
5296A3041573Q32086o046303q869824n996969j834437K7644P24941J822374J658785
5287d640130j064781l655950l008544j82737K026965L528409N162562N074164
5279C239958J575797k079939r81194L992367O938478N117793J551537r30604l126168
5270A5298025n505550n637495k184491K083640L890544L230682J322274k057462
5262A0440167o223140p393796k809099M432822Q443630P658958N122049K165042
5254B1836633l295097j0582500j3212741o375017M936670J0399607O718663N52366
5246A0978584j882414k520828n355937p887334n104552P52346K246296j413874
$$ y = [-22461439, -26179059, -23861253, -15803562, -7115152, -1537083, 2330031, 7551966, 13041573, 13873659, 7827356, -1042468, -7039437, -8873874, -8846230, -8121289, -6298915, -4640130, -5704911, -9360861, -12369405, -12552142, -10525177, -6996768, -1834206, 3239958, 4815755, 2735816, 1754622, 5746989, 12685467, 17803260, 19354797, 18424193, 15298025, 9792475, 4154980, 1970489, 4054129, 7944673, 11175355, 12497629, 10440167, 4217027, -3176769, -5985868, -1553046, 6890584, 14549542, 19671591, 21836633, 18541536, 7959036, -5253705, -11628722, -6692052, 3707555, 10426218, 10978584, 9096170, 6575342, 1219405, -6667929, -11772481, -11020135, -8773839, -10187713]
5238a0187713k480526K985669Q236473N918430q44327l378500O26616O277818
5230G153940R451813R145492M143272n420013j3705578j3368155n129468K515012
5222e213685M126366K343479J014175m29762k948946l770789m94897M255037O178462
5213E059440M698031J719925k309215p202925r870884o962373n66178K621356
5205a2812823q73510o685369p543732j811213M603299N148222K31149l484157
5197b3228134j179823M657375P843369N784298J429826o89163J656200P300089
5189C574037J2101515J1291428L967814m991413r473776q096104m076376o55911
5181C641214R90320Q93931L48605J509470M013970L854628q28883n109088l200798
$$ y = [-10187713, -12668239, -9682570, -1446097, 4472333, 3628006, 249506, 876122, 7153940, 16605753, 25751245, 29894517, 24474504, 10768926, -2599229, -7728697, -5213685, -1087319, 1256160, 2270335, 1840573, -1108373, -4879162, -5374059, -1119022, 5059440, 9757471, 11477396, 9168181, 1965256, -7905628, -14868001, -15434179, -12812823, -13686333, -20371702, -27915434, -29726647, -25123348, -19975126, -19743977, -23228134, -24407957, -19750582, -11907213, -6122915, -4693089, -5382252, -3726052, 3574037, 15675552, 26966980, 30934794, 25943381, 16469605, 8373501, 4297125, 3641214, 4631534, 5525465, 5874070, 7383540, 11397510, 15252138, 14423255, 9314167, 6113369]
5172F113369K840458N960065M181071J351998j198724n900805j1199725j0964598
5164h816891m301892J591711J909522N34810J798859L075405J146204l18052L533123
5155A52799R956474J2203455Q728946L035741k496358o801847p221269k738090
5147A4819851J979822J676146k108554m070573l256814k324754j137210J987595
5139G565509M191869Q66316n514173o722348k89216O678019P113988K030275l125416
5130A2794823n382671n191445m208545m213880n524008n645440k369872J899930
5122a7841108K718136L00757r88646o514j53714k202061j829218K946531P343980
5113i711857O795234L966759M099660O411432N365524o25768o396910o506067
$$ y = [6113369, 8953827, 14913892, 19094963, 20446961, 19248237, 13347432, 2147707, -8816891, -13118783, -11527072, -9617550, -9082740, -7283881, -4208476, -3062272, -3380324, 152799, 10109273, 22312728, 31041674, 34077415, 31581057, 24779210, 17557941, 14819851, 16799673, 18475819, 16367265, 12296692, 9039878, 6715124, 5577914, 7565509, 11757378, 12623694, 7109521, 387173, 97957, 6775976, 13889964, 15920239, 12794823, 7412152, 2220707, -1987838, -6201718, -11725726, -17371166, -19741038, -17841108, -15122972, -14822215, -15810861, -15817375, -15971089, -18173150, -20002368, -17055837, -9711857, -2916623, 1050136, 5149796, 11561228, 16926752, 16300984, 9904074, 3398007]
5105C398007j629666K561782J681374k898647n738359l413479J852613N362911
5097A176536N316805L122416j979l429115n095329l176143K61919J390675M58783
5088B4568Q58028K202216L54756m151000m605817J383438O497156M200552j149784
5079E614113j623469J674823J965318m01073J098192N618256L526507p768104
5071I704563j6358665j1258479J454629O502659q9073p248773n171555K834070
5063a9630624P191028M514988q04157l797432l476339j657466l75263j41230O74913
5054a7501582L730396P071340N908427q77857p310604o736050l70656M313627
5046a1772959L310400J42082m56112J124951J523937Q741j031817J6258K091204
$$ y = [3398007, 1768341, 4330123, 6011497, 3112850, -2625509, -6038988, -4186375, 1176536, 6493341, 9615757, 9613778, 6184663, 1089334, -2086809, -1824890, -434215, 24568, 882596, 3084812, 3439568, -711432, -5317249, -3933811, 2563345, 6763897, 5614113, 3990644, 5665467, 7630785, 7229712, 8327904, 13946160, 17472667, 9704563, -6654102, -17912581, -16457952, -9955293, -10044366, -17293139, -22464694, -19630624, -12439596, -7924608, -8728765, -12526197, -16002536, -17660002, -18035265, -18176495, -17501582, -13771186, -6699846, -791419, -1669276, -8979880, -15715930, -16086586, -11772959, -8462559, -8320477, -8776589, -7651638, -6127701, -6118960, -7150777, -7134519, -5043315]
5037e043315L332137L280680K762473K084545N3592m210368q455508q421266l222804
5028a7839834K654676N068894N259791N698189M218876j739039p456890n722095
5020i857432R91926K471620l191880n596660J295147Q490578N694367k698644
5012b400978n183810n09236L429128L765478M103666M081011m34881o716139o386847
5003f252608P78674M826346M58758n700499o381482l111842O5197L516174O945265
4994d856017N364806k819306r930300q575055k340075J20042k252884l337765
4986b8626554r1255M551922P346385P276108L955731q70018j919687L424099Q750197
4977C796928N286021n001084j0109220l893455N177006N331772k955610q363641
$$ y = [-5043315, -1711178, 1569502, 4331975, 6416520, 6470112, 2259744, -6195764, -14617030, -17839834, -15185158, -10116264, -4856473, 841716, 5060592, 3321553, -4135337, -9857432, -8865506, -6393886, -9585766, -15182426, -13887279, -5396701, 297666, -2400978, -7584788, -8094024, -4664896, -899418, 3204248, 7285259, 6850378, 134239, -6252608, -5473934, -647588, -188830, -5889329, -12270811, -15382653, -15317456, -11801282, -4856017, 508789, -2310517, -12240817, -20815872, -23155947, -23035905, -25288789, -28626554, -28717809, -24165887, -16819502, -9543394, -5587663, -6457681, -8377368, -4953269, 3796928, 9082949, 4081865, -6027355, -9920810, -4743804, 587968, -2367642, -10731283]
4969a0731283l991284M555282P760408M383528J017599J383072J568229k385164
4961C560387o946661n656102J218262O791372O658075K845283j370993n100251
4953A999372o996127m369438J917475O133187M693602Q99449o69840p40398k030238
4944H37044k682024J152811P438702R082670L758668k130050k138013J156362
4936A6476170J91998n749923q343820k221200N589336M182223n146840r324394
4928d346450j900091P083095N149293n144645j0779800o471302L92362J615522
4920a4402016k883955p904608q236424j512641Q453697J2590746O768802j383278
4912h509677k531372J297908K274852P97310K392097M298753o29712q259460p113992
$$ y = [-10731283, -14722567, -10167285, -2406877, 1976651, 2994250, 4377322, 5945551, 3560387, -3386274, -9042376, -7824114, -1032742, 5625333, 8470616, 7099623, 1999372, -4996755, -9366193, -7448718, -1315531, 3378071, 4277520, 3607680, 2867282, 837044, -1844980, -692169, 6746533, 15829203, 19587871, 17457821, 15319808, 16476170, 16668168, 10918245, 2574425, 353225, 5942561, 10124784, 4977944, -4346450, -6246541, 836554, 5985847, 841202, -9938598, -16409900, -16017538, -14402016, -17285971, -25190579, -33427003, -34939644, -26485947, -13895201, -7126399, -8509677, -11041049, -9743141, -7468289, -6670979, -4278882, 19871, -609841, -8869301, -15983293]
4903a5983293J600378M426137j794242n192769n71815K432867j075088k134420
4895a8292245L430935N733139N5292k998153K258737M900240j561900n891966
4887a2365921j075360R87523o911459j0885616k401208K274405q009652j5147638
4879e3534926n436931J28702j5465944k6234147j0669485q938681o4684068j24902796
4871c09738276q3421496O1110534J74054464J51584197M9113868j0963223q86639
4864C0853429J4004854j512221j4809226k681474R465159N10106j0828039m993561
4856B0009027N404495L502857k733282j52062N450899L541225k041647l785261
4848B9196251m084953n519211k972641L459294L023793p363852j4227063q053505
$$ y = [-15983293, -14382915, -9956778, -11751020, -16943789, -17515604, -15082737, -16157825, -18292245, -14861310, -9128171, -9072879, -12071032, -9812295, -4912055, -6473955, -12365921, -13441281, -12453758, -19365217, -30250833, -32652041, -30377636, -38387288, -53534926, -58971857, -58843155, -74309099, -100543246, -111212731, -120151412, -184835480, -309738276, -393159772, -332049238, -157994774, -6410577, 42703291, 31740068, 30853429, 44858283, 43346062, 28536836, 25855362, 35320521, 35830627, 25002588, 20009027, 25413522, 28916379, 26183097, 26031035, 31481934, 35023159, 32981512, 29196251, 25111298, 19592087, 16619446, 20078740, 23102533, 15738681, 1511618, -6541887]
4840f541887J526178K614758n62104J199334M891497L162359n25814J325174N707936
4831A2797431M534175j068783l919194l477940m064707m438583l57387N119728
4823E124740M513910j911081n934574l094588K782710O473670O404134L159959
4815A7518880j482945m284981l637106k016819j843744j190287K205921N406599
4807A0675518L949279r29221l998990l561043k291795j775111j161279n20874
4799C86484q08010r45077O20744J928419k90769m479054n182350r89450L007517
4790f751546K456400n09721j388277n5638J47997j508045j924671O44537L528873
4781e360091L495353J244697n78847k071893m849745o764367l099329N265222
$$ y = [-6541887, -5015709, -2400951, -2963055, -1763721, 3127776, 6290135, 5764321, 7089495, 12797431, 17331606, 16262823, 12343629, 8865689, 4800982, 362399, 5012, 5124740, 9638650, 7727569, 1792995, -1301593, 1481117, 7954787, 14358921, 17518880, 16035935, 11750954, 8113848, 6097029, 4253285, 3062998, 5268919, 10675518, 14624797, 13695576, 9696586, 6135543, 3843748, 2068637, 907358, 386484, -421526, -1366603, -745859, 1182560, 891791, -3587263, -8769613, -9759063, -6751546, -4295146, -4804867, -6193144, -6248782, -6100785, -7608830, -9533501, -8888964, -5360091, -1864738, -620041, -1198888, -3270781, -8120526, -14884893, -17984222, -12719000]
4773a2719000J0195413O719877P10722O99410N300052N732810m74265n977592
4765A0187427m986120j303295j808948o639275r625585o146079K069870Q814852
4757i437153R179845M599584J636265M109585Q174298P925071L359610j326637
4749B8220468m492593o461678n046903Q50988N180187J271578o310080o640493
4741F571474K01235K277672m632458r044186j942483Q286851Q575758K48680n231782
4732E310761l528984K56805K420642L410268K253791k160185n726845l723974
4724a487721N89584M08774k951566j961030L892175O346289J405239m605073n017655
4715c380984j667144j61205j843828l888284l391581Q84123P276459J0647041
$$ y = [-12719000, -2523587, 4196290, 4907012, 5606422, 10906474, 16639284, 16165019, 10187427, 5201307, 3898012, 2089064, -4550211, -14175796, -20321875, -18252005, -9437153, -257308, 4342276, 5978541, 10088126, 18262424, 26187495, 29547105, 28220468, 23727875, 17266197, 12219294, 13070282, 18250469, 19522047, 13211967, 6571474, 6772709, 9050381, 4417923, -4626263, -6568746, 1718105, 10293863, 10542543, 5310761, 1781777, 2038582, 4459224, 7869492, 10123283, 7963098, 2236253, -1487721, -898137, -489363, -3440929, -5401959, -1509784, 4836505, 6241744, 1636671, -3380984, -5048128, -5209333, -7053161, -10941445, -14333026, -13448903, -6172444, 4474597]
4707D474597P164038L25411k525902k38282J188099j420495m098473l635142k791506
4698a557655l650762k288666M097506R755603P111876j756025p201664m629417
4690a19204R89804L259369J482183j470915l557267l548140k57107N188681Q348031
4681A0315435N718562o95356n368210n578200l584052k210966q33488K240492
4673D217N044060L203942l255642p567630l598742N730096J0685492N739188m247437
4664A1737544r862294p000582P19327P563453J0874487J0763294P522269J474864
4656C3792362n420295j0000654j0624366q365702m995654j062861L111882N970311
4648B405023N980572L600824M05085k817975n288647n003449j322662K063524
$$ y = [4474597, 11638635, 11964046, 9438144, 9199862, 10387961, 8967466, 4868993, 1233851, -1557655, -5208417, -7497083, -3399577, 6356026, 13467902, 11711877, 4510213, -119204, 870600, 4129969, 5612152, 4141237, 583970, -2964170, -3221277, 1967404, 10315435, 16033997, 15338641, 9970431, 4392231, 808179, -1402787, -2236275, 4217, 5048277, 8252219, 4996577, -2571053, -6169795, -439699, 10245793, 15984981, 11737544, 1875250, -5125332, -4406005, 3157448, 14031935, 24795229, 32317498, 33792362, 28372067, 18371413, 7747047, -618655, -5614309, -6677170, -3565288, 2405023, 8385595, 11986419, 12391504, 9573529, 4284882, -718567, -2041229, 22295]
4640B2295O06987m514958p221059m572381K40173M066813P881361J2019542J2410772
4631B0939545O280427j734830m371762r26594K837943K674545m93634l878545
4623B1327095n587797m613149j892340r71870m016680p649680o473567m44426
4615a0322414M933481N617850K653602j016516l551605l825925j728145N69198
4607f670474N99064j146154k726913m317486o237764n007712K566081J1585438
4599a1355920J2567119M594024k213726q54589K963608R40030m279450l738586
4591a377490L048126P003302L171860k626790l338421n03983l85615m305446p562195
4582f876652o296397j415711L959124P648638Q479536N897005J017453l377296
$$ y = [22295, 629282, -3885676, -11106735, -15679116, -15438943, -11372130, -3490769, 8528773, 20939545, 27219972, 25485142, 21113380, 20186786, 23024729, 25699274, 25205640, 21327095, 15739298, 11126149, 9233809, 8261939, 4245259, -3404421, -9877988, -10322414, -5388933, 228917, 2882519, 1866003, -1685602, -5511527, -7239672, -6670474, -6071410, -7217564, -9944477, -14261963, -20499727, -25507439, -22941358, -11355920, 1211199, 5805223, 3591497, 2736908, 5700516, 6640546, 2361096, -1377490, 1670636, 8673938, 11845798, 9219008, 5880587, 5376604, 4990989, 685543, -6876652, -13173049, -14588760, -10629636, -2980998, 5498538, 11395543, 12412996, 9035700]
4574I035700n363250n619834n500971m352565o98870M164174O169109L126650
4566I60143k238286n198120l846715R5220L906754N605937M155371J64354l725564
4557a20906m833811k922539K33313K940512L792015J098413m896244r323073n789454
4548a9821774N795585J6578796J6707176N824675o117744r033747k654481M388056
4540A1666542M633521o63910m537080l047569J135147L262136J801100j498479
4532A2751408m266126m679646j992709K149405M300287K937290M61804j12422
4524A1549291Q57483P97312j193520l696467n349372n814110m904094k627954
4516a0381431J2012J579904J612988J022152J372132L368724N092327L077982
$$ y = [9035700, 3672450, -1947384, -7448355, -11800920, -12499790, -8335616, -2166507, 960143, -1278143, -6476263, -10322978, -10227758, -6321004, -715067, 3440304, 3604658, -120906, -4954717, -7877256, -7643943, -4703431, -911416, 186997, -4709247, -14032320, -19821774, -14026189, 2552607, 19259783, 25084458, 18966714, 9932967, 7278486, 11666542, 16300063, 15636153, 11099073, 8051504, 9186651, 12448787, 14249887, 12751408, 8485282, 3805636, 1812927, 3962332, 8262619, 11199909, 11661713, 11549291, 12406774, 13204086, 12010566, 8314099, 2964727, -2849383, -7753477, -10381431, -10369419, -8789515, -7176527, -6154375, -4782243, -1413519, 3678808, 6756790]
4508F756790k389891m887509N24649Q287630P672942k034250r490768p234954
4500b795361j170357Q73018J063871L956069N028016j909966j1087130j1130160
4492a7172000k770048K180548q48676m042469j593079K640681M728772O762667
4484a0113604R161553P082551l11195n935214n378598l056126k720947p85731
4476a2057311M677759P296683K782576j935218P65863N999692L943642l964382
4468G509304p142581j974381M262234N232074K530417J4500j435809j839751n58332
4459F597675J325205J110568j752154m803783n792837m575020k391143j081243
4451a1362732j634083k064531P36294N548786P041127L559157j07226p40989j733671
$$ y = [6756790, 4366899, -520610, 4039, 8291669, 15964611, 13930361, 4439593, -2795361, -3965718, -3092700, -2028829, 1927240, 6955256, 5045290, -6041840, -17172000, -19942048, -17761500, -18610176, -22652645, -24245724, -21605043, -16876271, -10113604, -952051, 6130500, 5819305, -115909, -5494507, -8550633, -11271580, -12057311, -7379552, -82869, 2699707, 764489, 1530352, 7530044, 11473686, 7509304, 366723, -1607658, 2654576, 7886650, 10417067, 10431567, 8995758, 7156007, 6597675, 7922880, 9033448, 7281294, 2477511, -3315326, -7890346, -10281489, -11362732, -12996815, -15061346, -14325052, -8776266, -1735139, 1824018, 1716792, 975803, -757868]
4442g57868n635076p757093l492816L290229O256486O103264O306077M445206
4434H758409k583525q649204m958575N047571Q691926K153826n249105o149435
4426b938112l785906k797384j514310K078405N056996N032025M032979K945062
4418H109755r09647o408309o167891K819863J2041305J1236948J249752q216791
4410A3754985j0149972m908931L035211Q190314O678806J94215m696491m224950
4402G873187j677285j435749k557552j703522J084743L253062L441309J377448
4394I655641k453984m464832j46406P765588Q887912j595204j4245362j6443338
4386a3039985q036011J225554N941552P893639P216843J452299n842645n862572
$$ y = [-757868, -6392944, -14150037, -17642853, -14352624, -8096138, -1992874, 4313203, 8758409, 6174884, -2474320, -7432895, -2385324, 6306602, 8460428, 3211323, -2938112, -6724018, -9521402, -11035712, -8957307, -3900311, 1131714, 5164693, 8109755, 7200108, 791799, -5376092, -2556229, 9485076, 20722024, 21971776, 13754985, 3605013, -1303918, 1731293, 9921607, 16600413, 16794628, 12098137, 7873187, 6195902, 4760153, 2202601, 499079, 1583822, 4836884, 8278193, 9655641, 7201657, 2736825, 2590419, 10356007, 19243919, 17648715, 3403353, -13039985, -21075996, -19850442, -13908890, -6015251, 1201592, 2653891, -3188754, -9051326]
4378i051326K392333Q254964L738899m920842o302604L95111N597892L121770
4370C226197l033047n754983l424362J13802R82558j008235k707424j119398K711411
4361a0013481M205774J198222k135925m03208M797669O166702J050408m273171
4353E92990l568377L00054K21736l865991m982597l11690M209712K921391j481732
4344e964504k921650q61504O59720K29803L2089R90280K052408L658062O663991
4335D538695P763339J847155r247856j5784567j1441858j610833L822483L094834
4327a7018608K853902P011957J1077699R329824L234585r41577o97899P96008
4319A5645891R52774J216878K511909J694556l416441q557820p875346k509479
$$ y = [-9051326, -6658993, 1595971, 5334870, 414028, -5888576, -5493465, 104427, 3226197, 193150, -5561833, -8986195, -8872393, -7889835, -8898070, -11605494, -12724892, -10013481, -5807707, -4609485, -6745410, -7148618, -2350949, 3815753, 4866161, 592990, -2975387, -2675333, -2453597, -6319588, -11302185, -11613875, -7404163, -4482772, -5964504, -8886154, -9747658, -9087938, -8858135, -8826046, -7835766, -5783358, -2125296, 4538695, 12302034, 14149189, 4901333, -10883234, -22325092, -23935925, -20113442, -17018608, -14164706, -7152749, 3924950, 13254774, 16489359, 15547782, 14849883, 15645891, 16598665, 17815543, 20327452, 22022008, 18605567, 10047747, 2172401, -337078]
4311c37078J598098L189522N441287O501978L15622j0207150j1999501p65279
4303f262501R222402M569935o729871p697770J047947L644822m178224q591796
4295a4975056j094389Q242489Q057036K292225L50181J989873K227358K147977
4287I237694M153148L756312l030285r925322q694531k430996J29259p69203J520526
4278f053398O004725N129058r17593l280207R48345M518875K916334Q06092J770395
4269A1842626J511532l155110o799071l626953K695810M216991k30068m996222
4261A459535n851382l244326M90884K906383K174146n01127j084721J735734L701416
4252A786542J064627l121211l107625R91497L589900K007971k63528N80175L521064
$$ y = [-337078, 1261020, 4450542, 9891829, 16393807, 16709429, 6502279, -5497222, -6262501, 2959901, 7529836, 799965, -6897805, -5849858, -2205036, -6383260, -14975056, -16069445, -7826956, 230080, 2522305, 2872486, 4862359, 7089717, 9237694, 13390842, 17147154, 14116869, 4191547, -4502984, -6933980, -6804721, -7573924, -6053398, -48673, 5080385, 4162792, 882585, 1830930, 6349805, 9266139, 10072231, 11842626, 13354158, 10199048, 3399977, -226976, 2468834, 6685825, 6455757, 1459535, -4391847, -7636173, -7145289, -4238906, -2064760, -2565887, -3650608, -1914874, 1786542, 2851169, -270042, -3377667, -2386170, 1203730, 3211701, 2948173, 3528348, 7049412]
4243G049412N187995M690088L785773L595317L065121N30013m060616q449028
4235A5394075r532130o106499m17296L577133L860581J981463Q48208J330901
4227A0936436J455406j171540o435875j1183972j1551349o223487K032526Q105630
4219a4036225Q561819M540541M82667l60916J059879J351414r59004l496930k621972
4210e478727K339469P730461Q897793N200686R17206J16213J569706R20561k664357
4201A9549011n406256n122224m511235o021033p235141m917359o23200J921242
4193a2366195K648505L769040M534666K523087j024151k316323q54496O03035
4185b482832J044051J285354L93446k343160l379559M74619M803387K893107k558953
$$ y = [7049412, 12237407, 16927495, 20713268, 24308585, 27373706, 27903719, 23843103, 15394075, 5861945, -244554, -661850, 2915283, 6775864, 8757327, 9605535, 10936436, 12391842, 11220302, 4784427, -6399545, -17950894, -24174381, -22141855, -14036225, -5474406, -933865, -451198, -812114, 247765, 1599179, 640175, -2856755, -5478727, -3139258, 4591203, 13488996, 18689682, 19606888, 19723101, 21292807, 22213368, 19549011, 14142755, 9020531, 4509296, -1511737, -8746878, -13664237, -14287437, -12366195, -9717690, -5948650, -1413984, 1109103, 84952, -2231371, -3085867, -2482832, -1438781, -153427, 240019, -2103141, -5482700, -5008081, -204694, 2688413, 129460]
4176A29460k444950L673499O124024J038563l457990j336167K100113J427554
4168G254106J130195O045652J0750334Q209887K000412j09027Q96102j052256
4160C5125405m879248m276765N55603K626216j080694n952245o528545j982048
4152A3607679L722645M166479l139983j0524403p303116L951574Q342530P30431
4144A3553836n800088j712653L148704j931933q478853m083791M887482N568908
4136E151612K324221N797623Q970057J128291l243047J6798878M3879891L5079771
4128A15887297j3040676n0367995m0685407q755216K986982n962404q249686J161182
4120g025923M665302o46377r3701P867604Q207521k276208q586413l103997L788021
$$ y = [129460, -2315490, 1358009, 7482033, 8520596, 5062606, 3726439, 5826552, 7254106, 8384301, 14429953, 25180287, 33390174, 35390586, 35281559, 36177661, 35125405, 30246157, 25969392, 26524995, 29151211, 28070517, 22118272, 15589727, 13607679, 17330324, 21496803, 18356820, 7832417, 529301, 4480875, 12823405, 13553836, 7753748, 6041095, 9189799, 7257866, -1220987, -5304778, -417296, 5151612, 7475833, 13273456, 22243513, 23371804, 20128757, 36927635, 80807526, 115887297, 102846621, 52478626, 11793219, 3038003, 6024985, 62581, -8187105, -7025923, -2360621, -3006998, -3100699, 4766905, 12974426, 10698218, 2111805, -992192, 2795829]
4111B795829L008150j491341m620535p621524r337198m594722M380369P996369
4103i484603M423574K249949M861320N106056l03785l856228n78408K821426j027845
4094D211456q736456j2056500q322372j74234Q646404J3230660R673759J140445
4086G613162l894851k212767J080743J727676J555687K236174J161858k949849
4078F317833o432725n849585j775177M176299J0327704J2100393N425419n367704
4070A8922457j0547558p873602m797578n705307n742624r30290M343002N104685
4062g226815L524351L268786K782766j0356k178027q67166J006593k67536k777697
4053b745101k566291J56261K543469L037823O12744n041237r585772o524065K397346
$$ y = [2795829, 5803979, 4312638, -307897, -7929421, -17266619, -21861341, -17480972, -9484603, -5061029, -2811080, 2050240, 7156296, 6852511, 2996283, 2417875, 5239301, 4211456, -4525000, -16581500, -24903872, -25078106, -16431702, -3201042, 6472717, 7613162, 3718311, 1505544, 2586287, 4313963, 5869650, 8105824, 9267682, 6317833, -114892, -5964477, -7739654, -3563355, 6764349, 18864742, 24290161, 18922457, 8374899, 501297, -4296281, -10001588, -15744212, -16674502, -12331500, -7226815, -3702464, -433678, 2349088, 2338732, 160705, -706461, 300132, 32596, -2745101, -5311392, -5155131, -2611662, 426161, 1038905, -4002332, -13588104, -20112169, -17714823]
4044a7714823O203536m47312q245690n948295M005005J0609877R943221O696868
4036E102387L713239k82023l912559l326974M05903J719530p07598k315682q73731
4027d77508L8444k322010n275140n434124l738293k891182k753090j078224K750902
4018b1180225O747997Q345706O431162K099969j929373l063935n71408L934706
4010H14599P381558P399918M765872K800762K737920J356542l741177q417740
4002A5098254o692592m08127K214290j466309m968297l424673n35205o97229j249511
3993b129399J561744M856662M304422K250312L199224N087844L195905q9827J687875
3984B3924762P355858Q298374J180875p138595r144187m832328J207230M931487
$$ y = [-17714823, -11511287, -11958599, -20204289, -26152584, -22147579, -11537702, -1594481, 5102387, 8815626, 8533603, 4621044, 1294070, 1699973, 3419503, 2711905, 396223, -477508, -439064, -2761074, -8036214, -13470338, -17208631, -20099813, -22852903, -23931127, -21180225, -14432228, -6086522, 344640, 2444609, 515236, -2548699, -3120107, 814599, 8196157, 15596075, 20361947, 23162709, 25900629, 27257171, 23515994, 15098254, 8405662, 7997535, 10211825, 8745516, 3777219, 352546, -182659, -879888, -2129399, -567655, 4289007, 8593429, 10843741, 14042965, 19130809, 22326714, 22236887, 23924762, 31280620, 39578994, 40759869, 33621274, 24477087, 19644759, 20851989, 25783476]
3976B5783476L290670m570124j3746806j5976935q766743J154453N759125M043735
3968c029149N72609j084557r89608r27341j827297k271881M50203O265371J0354641
3959G512991Q277733K268845j335222n36492O97914q11439l795055o057663o599998
3950c78386l428423M871568J3430389J3287948K980620p681427r958382o843301
3942F280606n551520m858975J180696R834396J0838172K201800n201030l209584
3934A1514561K041809R45571m078251l509481K496363L521158m245520j1232215
3926b546005q810879j506325J597276N01524R48809K572436M69975l709200k883460
3917a3365849K781359M382858j995282r140195r976415o487851k703721K764297
$$ y = [25783476, 29074146, 24504022, 10757216, -5219719, -13986462, -12832009, -7072884, -3029149, -2456540, -3541097, -4530705, -5458046, -7285343, -9557224, -9107021, -2841650, 7512991, 15790724, 18059569, 16724347, 16187855, 16885769, 16074330, 12279275, 6221612, -378386, -3806809, 1064759, 14495148, 27783096, 30763716, 23082289, 13123907, 6280606, 729086, -4129889, -2949193, 6885203, 17723375, 19925175, 14724145, 11514561, 13556370, 14501941, 10423690, 6914209, 9410572, 12931730, 8686210, -2546005, -11356884, -12863209, -11265933, -10764409, -9815600, -7243164, -6773189, -10482389, -13365849, -10584490, -6201632, -8196914, -17337109, -27313524, -33801375, -36505096, -33740799]
3909c3740799J0539756J4226709Q711858m25189m139489k536003j983819l264233
3901a2611209j832080K286785M296182L559134L830944M806422K351051k441713
3893D245516l560318o56402j459k768686k156853M041779P756677L299641l007883
3884G192012l177052n0613p05937l197009k06098O925164Q322430K53199q909073
3875F447023r716221k446755N603134Q779288O347868Q13440m015018n140811
3867F671948k751623J45081R90783l15850k331339l370633k272591J94764J071859
3858a967601j335244l989980k047631M195572Q301448N267318k209243p129925
3850i15286o210409k162097Q88979J405934j8706k129160k820517R2946N762160
$$ y = [-33740799, -23201043, -8974334, -262476, -687665, -4827154, -7363157, -9346976, -12611209, -14443289, -12156504, -7860322, -4301188, -470244, 4336178, 6687229, 4245516, 685198, 28796, 27337, -2741349, -4898202, -856423, 6900254, 10199895, 7192012, 4014960, 3964347, 3258410, 61401, -144697, 6780467, 15102897, 15356096, 6447023, -3269198, -5715953, -112819, 8666469, 15014337, 15827777, 11812759, 6671948, 3920325, 4065406, 5056189, 4740339, 2409000, -961633, -3234224, -3039460, -1967601, -3302845, -7292825, -9340456, -5144884, 3156564, 8423882, 6214639, -915286, -7125695, -9287792, -8398813, -6992879, -7011585, -9140745, -11961262, -11868316, -6106156]
3841f106156R421382P216983J366569k161460j161399N14881r31182l796532l724623
3832F38463o3894L273763K719454j081862m172483l189378J066667L816780J625404
3823D632914k495505k317253K504302M836003K14190n807417n128397J309010
3815b252153N233569K683929k152134m414957m023127k844593j608463j109087
3807a0487016k236534l405984j664929K597839N673690N947735N322232M583999
3799F331032J985730k067035l453548J73417N768642Q712155P295277K343158
3791B7088828m029770q165747p295550l568639j858693k734056k237081M78365
3783b322343J173421j717703l536659j058105J980370J304431r45850n52477J655550
$$ y = [-6106156, 3315226, 10532209, 11898778, 9737318, 8575919, 9090800, 8159618, 4363086, 638463, 574569, 3848332, 6567786, 5485924, 1313441, -1875937, -809270, 3007510, 4632914, 2137409, -179844, 2324458, 7160461, 7374651, 1567234, -3561163, -2252153, 2981416, 5665345, 3513211, -901746, -4924873, -7769466, -9377929, -10487016, -12723550, -16129534, -17794463, -15196624, -9522934, -3575199, 1747033, 6331032, 8316762, 6249727, 2796179, 2969596, 8738238, 17450393, 24745670, 27088828, 23059058, 14893311, 7597761, 4029122, 2170429, -563627, -2800708, -2322343, -1148922, -2866625, -6403284, -7461389, -5481019, -4176588, -5122438, -5674915, -4019365]
3774d019365K066426M31184r32980j389464j406369l80094J566342K573754K584243
3765A093677L906753N617356K964288l818078o607969r39838N948109N701487
3757A3865785J374606O97410K295529p25769o988413q300144l729956q12377k168108
3748d491437j904206K611345N724293L739884J166674K415885M802562M186094
3740A8251094J259036j580368l803445m169095q54952K826102j31493r261231
3732B535648j3909499o906976N101676J0644419P488919J947170j105118j172866
3724D623373J312806N156593P245364N960004L529890J634601j507427n879621
3716B2075583o585679j453354L191779J068610l962833l908182Q35125L488066
$$ y = [-4019365, -1952939, -1521755, -2454735, -3844199, -5250568, -5630662, -4064320, -1490566, 1093677, 5000430, 10617786, 13582074, 9763996, 3156027, 2216189, 8164298, 13865785, 15240391, 15937801, 18233330, 17507561, 10519148, 2219004, -1510952, -2323329, -4491437, -6395643, -3784298, 1939995, 5679879, 6846553, 9262438, 14065000, 18251094, 19510130, 17929762, 14126317, 9957222, 9102270, 11928372, 11796879, 2535648, -11373851, -18280827, -13179151, -2534732, 4954187, 6901357, 5796239, 4623373, 5936179, 11092772, 18338136, 24298140, 27828030, 29462631, 27955204, 22075583, 15489904, 14036550, 17228329, 18296939, 14334106, 10425924, 11261049, 14749115]
3708A4749115K782310L225292M493018Q93865p211350j1288134p323570k163959
3700a843413k657296n770240m985797n47213K812725L793969L825682J851310
3692c520273l472302q232834o601465L35680M779290K327348k622879l225186
3684b0232621J480979O521679P009796K493586l295579n751072l285094J345307
3676a3713019L987573L083495R683l326864n217481l605987J799005O786751N904619
3667d292225r1003l754239m65634N025565N410763J397359J49818M208351P943422
3658A5532177O153869P48345l702687o386522q487669q700994n257757m27061
3650a0528299J642107P40294K91321J833938L606711M186019L658060J423821
$$ y = [14749115, 17531425, 20756717, 25249735, 26143600, 18932250, 7644116, 320546, -1843413, -4500709, -10270949, -15256746, -15803959, -12991234, -9197265, -5371583, -3520273, -6992575, -15225409, -21826874, -21491194, -16711904, -14384556, -17007435, -20232621, -18751642, -12229963, -5220167, -2726581, -6022160, -11773232, -15058326, -13713019, -9725446, -6641951, -6632268, -9959132, -15176613, -18782600, -16983595, -10196844, -4292225, -4383228, -8137467, -8603101, -3577536, 1833227, 3230586, 3380404, 7588755, 15532177, 21686046, 22434391, 18731704, 12345182, 3857513, -4843481, -10101238, -10528299, -8886192, -8145898, -7854577, -6020639, -2413928, 1772091, 5430151, 6853972]
3642F853972l049135p205835p461756m700101l134207l065500k64527N727595
3634a6299494Q829081N502307Q88680P87126K484591J57242m414168m619165o87252
3625g371052L55052k915729k926351M354323J1178357Q293386j685725q095441
3617A186820o741113l548581m039277n762572l512736K410631O620558N419445
3609g966825M56595l696750l777630P8156M961900P532737O481923L291555P35358
3600H097019M78628J643375J483423j894339o903566r288580o545704r01159L380267
3591a0450636M871309N140459M574985J309190m502373q434128o606538j143369
3583a5241101K139511R30392j278701k3246N125526J0400350J0991657M873480
$$ y = [6853972, 3804837, -3400998, -10862754, -15562855, -18697062, -21762562, -22027089, -16299494, -7470413, -1968106, -1079426, -292300, 2192291, 2349533, -2064635, -6683800, -7371052, -7016000, -9931729, -12858080, -8503757, 2674600, 10967986, 9282261, 1186820, -5554293, -9102874, -13142151, -18904723, -22417459, -20006828, -13386270, -7966825, -7510230, -11206980, -14984610, -14906454, -9944554, -2411817, 4070106, 7361661, 8097019, 8575647, 10219022, 11702445, 9808106, 2904540, -6384040, -12929744, -13830903, -10450636, -5579327, -438868, 4136117, 5445307, 942934, -7491194, -14097732, -15241101, -13101590, -12171198, -13449899, -13473145, -8347619, 2052731, 13044388, 17917868]
3575A7917868m459863r761875p150659r01915J882312N77703O07221L750583M840822
3566G302197N56897m202825l407661P38242J174956l601707q169150q133641m165432
3557b1908124J490294P299192J0805207R643068N512672L157859M052547M665746
3549B4718461K203939j593579l953755m821174n078539m166396j958876n85019
3541D765062j739147l659570l030982P98225M833861N263396J093593m211153
3533D113285n466958j837997J162975j303175n789098m569249L106117R379938
3525a204162Q631131M227565J762209Q34548k283522p563048j1145006j0078145
3517a6818430m103915M628304J1018982R776582K161920l516462j961459K213292
$$ y = [17917868, 13458005, 3696130, -3454529, -4356444, -2474132, -1896429, -1289208, 2461375, 7302197, 7859094, 3656269, 248608, 986850, 2161806, -1439901, -9609051, -17742692, -21908124, -20417830, -13118638, -2313431, 7329637, 12842309, 16000168, 20052715, 24718461, 26922400, 25328821, 21375066, 16553892, 11475353, 7308957, 5350081, 4765062, 3025915, -633655, -3664637, -2866412, 1967449, 7230845, 8324438, 4113285, -1353673, -3191670, -2028695, -3331870, -9120968, -13690217, -10584100, -1204162, 7426969, 11654534, 13416743, 14251291, 11967769, 4404721, -6740285, -16818430, -20922345, -16294041, -5275059, 4501523, 6663443, 3146981, 1185522, 3398814]
3509C398814K072438j146397j192256K520817M564215K613760j81967j977063
3501A0672361m441136o968271n312771J197107O503993N602921J555575O64979
3493I474758L193320L332734j957885p805435p020681L37080N586683J390263
3485F530837q346023j2317371o089040K283696L723293K58752K22935M951651
3477h781270P705924M731400l16838l851450o859214r367346p125053J710432
3469b2153415J1167638J3486234P885093k23044o100719q231841o499746k008749
3461a2678549K278211L973048L753306L277876K110748o07761k975505k342236
3453c210862J20990O09698j153359o91790M403516R383227P454673r86698p871897
$$ y = [3398814, 5471252, 4324855, 3132599, 5653416, 10217631, 12831391, 12649424, 10672361, 6231225, -737046, -6049817, -4852710, 1651283, 7254204, 8809779, 9474758, 12668078, 16000812, 14042927, 6237492, -783189, -446109, 5140574, 6530837, -1815186, -14132557, -20221597, -17937901, -14214608, -13955856, -13732921, -8781270, -1075346, 3656054, 3339216, -512234, -7371448, -16738794, -23863847, -22153415, -10985777, 2500457, 10385550, 10162506, 4061787, -4170054, -10669800, -12678549, -10400338, -6427290, -2673984, 603892, 2714640, 2106879, -868626, -3210862, -3089872, -2480174, -3633533, -4325323, 78193, 9461420, 16916093, 15929395, 8057498]
3444H057498p097037j560143J625264L51790j749128k274814k644064l242138
3436h532772j377095L475327P041808O229599L643761K405037Q38453k812716
3428A0911402m842470j840937J623643r33320o515156o325812J0691L737681J442297
3419b731981M201L891147P403629N050981J087758J600256L811537J232751n224677
3410A6125602r175864q697249p014066n358470k042153K355935M871979M828526
3402d105760L889248K313430m27595k472206j531030R52717J775138Q56977O7376
3393A318295j036164l489459m664737j373580L713192M731662J650117N40935
3385A390261L817174O029990J792365o602328j2260341j1292987n087688K426475
$$ y = [8057498, 960461, -599682, 1025582, 1377372, -371756, -2646570, -5290634, -8532772, -9909867, -6434540, 607268, 6836867, 10480628, 12885665, 13724118, 10911402, 6068932, 4227995, 5851638, 4918318, -1596838, -7922650, -7911959, -4174278, -2731981, -2727780, 1163367, 8566996, 13617977, 14705735, 16305991, 20117528, 21350279, 16125602, 6949738, -1747511, -8761577, -14120047, -16162200, -13806265, -8934286, -4105760, -216512, 2096918, 1669323, -802883, -2333913, -1381196, 393942, 1250919, 1318295, 282131, -3207328, -7872065, -9245645, -5532453, -800791, 849326, 1390261, 5207435, 11237425, 13029790, 6427462, -5832879, -17125866, -22213554, -19787079]
3377a9787079P491771Q142849N134000J043911j834931k514114j441948p68191
3369d533732k717935n848834n136456J434583Q607797R791504N317551O82904
3361G597382j543476l053009m365291l835393k014887j527305k088790p57402
3353a1588171K339921L811607L226210L844455N857016M903734l76191n044369
3345F974212n091568k684886r19119J300142M927214O391061K933934j549515
3337A2281475j870169J43471r99289m522775l769781K967440Q298405N206665
3329A7735442l392006q191737m981285P25567J099596m140747p746446m968714
3321a3860330l18318j033329n794024n659907K735146J0913869R402122M25555
$$ y = [-19787079, -12295308, -4152459, 981541, 2025452, 190521, -2323593, -3765541, -4533732, -7251667, -13100501, -18236957, -16802374, -8194577, 1596927, 6914478, 7597382, 6053906, 3000897, -1364394, -5199787, -7214674, -8741979, -10830769, -11588171, -9248250, -5436643, -2210433, 1634022, 7491038, 12394772, 12018581, 6974212, 1882644, -802242, -1721361, -421219, 4505995, 10897056, 13830990, 12281475, 10411306, 10554777, 9555488, 5032713, 1262932, 4230372, 12528777, 17735442, 14343436, 6151699, 1170414, 1895981, 2995577, -1145170, -8891616, -13860330, -14178648, -15211977, -21006001, -26665908, -23930762, -13016893, -3614771, -3189216]
3313c189216n693373m290053l65167N80959n38927m06730Q24944J031023M48830
3304a1597710Q51184J841344J416232j39413j77247J876272L090032J766706P78093
3295b94507K963140N238090K188609m618728o770437q71257N242771K946209m663112
3286A360778p110659j196696N798497P281871M657179K025762N4316j900325k571861
3277H398862j107596Q97768K219362L508726M127678J556931l736955p084227
3269H780549n968445l386176k015965J97933M797264P867260N425047J19786k701345
3260A3115908k596138k421954k038760M16007L054668K348630l22841l24322K281405
3251A3512603K219299k949465r221625j1531176q777305l063772K298676L895089
$$ y = [-3189216, -8882589, -13172642, -13537809, -12956850, -13495777, -13902507, -13077563, -12046540, -11597710, -10746526, -8905182, -7488950, -7628363, -7805610, -5929338, -2839306, -1072600, -294507, 2668633, 7906723, 10095332, 5476604, -1293833, -2165090, 3077681, 6023890, 1360778, -5749881, -6946577, -1148080, 6133791, 10790970, 12816732, 12871048, 10970723, 8398862, 7291266, 8189034, 10408396, 13917122, 18044800, 19601731, 15864776, 8780549, 2812104, -574072, -2590037, -2392104, 2405160, 10272420, 15697467, 15817253, 13115908, 10519770, 8097816, 6059056, 6475063, 9529731, 11878361, 11555520, 11231198, 13512603, 15731902, 12782437, 3560812, -7970364, -16747669, -19811441, -17512765, -13617676]
3243a3617676J130530j849501p55161K793264L866977K098518J767843M055798
3235e09408N042222K687407J41988k74921j319275n691970j0516622j0592542
3227b1033121m793734L484791J0078672J2032004Q348256J547277l260878l378376
3219C024891j374788j032945k007287r62335K847715N768081M033613j568364
3211H728581o275434o342845k629925J322695L714330M967261M447088N61222
3203H492973m659450n592642q47433L161455J121462k642143r21903M240532M521610
3194F874461p62409l204933P01459L507495j086363q019034q719850l338199J347682
3185a2699691K225987J674258J642983J879598K763005M769332N652580K500596
$$ y = [-13617676, -12487146, -14336647, -15091808, -12298544, -8431567, -6333049, -4565206, -509408, 4532814, 7220221, 7362209, 7087288, 5768013, 76043, -10440579, -21033121, -25826855, -22342064, -12263392, -231388, 8116868, 9664145, 6403267, 3024891, 1650103, 617158, -1390129, -2352464, 495251, 6263332, 10296945, 8728581, 2453147, -3889698, -6519623, -5196928, -1482598, 3484663, 7931751, 8492973, 3833523, -1759119, -2606552, 554903, 1676365, -965778, -1887681, 2352851, 6874461, 6112052, 2907119, 3608578, 7116073, 6029710, -1989324, -10709174, -14047373, -12699691, -10473704, -8799446, -7156463, -5276865, -2513860, 2255472, 7908052, 10408648]
3177A0408648l340320o733020m483872J443770O223288O216901J543082m037164
3169G241313o504376n356799k830811l4122L085438M359019Q74757n001000o378723
3160a0545304j099040M847189O184574N123840N041359L222841l536155j0332454
3152a093150r041759j92875P101949O813372J710360k501548l217725o50208L486540
3143B414956N896799M108716j64723k851900k565861j078351K49793J076518J68278
3134G254225l098868n859093m359730O26158M354811L774024k11113m872926o831231
3125i223743l128663M477845Q197028K563608o986040r629952k881729M907713
3117a1703933N868228P62234m724411o307730k715725L977694Q560337P604683
$$ y = [10408648, 7068328, 335308, -4148564, -2704794, 3518494, 9735395, 11278477, 7241313, 736937, -4619862, -7450673, -7484795, -4399357, -40338, 834419, -4166581, -10545304, -11644344, -6797155, -612581, 4511259, 9552618, 12775459, 9239304, -1093150, -10134909, -10327784, -3225835, 3587537, 5297897, 2796349, -421376, -1071584, 2414956, 8311755, 12420471, 12255748, 9403848, 6837987, 5759636, 6009429, 7085947, 7254225, 4155357, -1703736, -6063466, -5437308, -1082497, 2691527, 2480414, -2392512, -9223743, -12352406, -7874561, 322467, 2886075, -4099965, -13729917, -16611646, -11703933, -5835705, -5073471, -9797882, -16105612, -18821337, -14843643, -6283306, 1321377]
3109A321377M376980M190689N732270L381704k256643m094186o4443L334301J665742
3100A7587791j224137j224100m14159r29013J6875L189597K618569m916117j1686942
3091C018364q693019P40119N729485L449059J108918L283323N813995L646019
3083A8096263j885003n764928n004181l72212M267533M181423j346822o672260
3075E499813n853391m99073K349012k52940m031791m091741m16621L977367O510984
3066C191619N456309M04385n766407p883528l587394L612631P673146N948394
3058I049155J356929j012563O21634K809945J129746m171433q697216r708225
3050h622028q332323n739399j338072L633946N322353L011167J452318L832327
$$ y = [1321377, 5698357, 9889046, 15621316, 19003020, 16746377, 12652191, 12587748, 15922049, 17587791, 16363654, 15139554, 14725395, 13796382, 13813257, 17002854, 19621423, 14705306, 3018364, -5674655, -4934536, 794949, 4244008, 5352926, 8636249, 14450244, 18096263, 16211260, 10446332, 5442151, 5069939, 9337472, 13518895, 12172073, 5499813, -353578, -852651, 1496361, 1243421, -2788370, -6880111, -7296732, -3319365, 3191619, 8647928, 9052313, 3285906, -4597622, -8185016, -4572385, 3100761, 9049155, 10406084, 9393521, 10015155, 12825100, 13954846, 9783413, 1086197, -8622028, -16954351, -22693750, -24031822, -20397876, -15075523, -12064356, -10612038, -6779711]
3042f779711O533675N230637K026384J052482P74749k540590o445584n146074
3034e294032L64418K832020j32399k765761o30291L183592M010304K426933J848594
3025E843378L009795L881542L034492J274160R43073L363536N725446K823482
3017B9898904n166312r877396m807941M616356P551246K134566m214630p102933
3009A3031860q442758p930275k268527N010002M319429m711313r466212k526969
3001a2984763O273477M775993l025859m356701K415100P292986N342651K063520
2993G796404J923590J937817r59832m289062m984690m039722l215339j684563
2985g515397J319049L835982L427481J38735l584870m358998j14631O529574Q656380
$$ y = [-6779711, -246036, 4984601, 7010985, 8063467, 8838216, 6297626, -147958, -5294032, -4929614, -2097594, -2229993, -4995754, -5626045, -2442453, 1567851, 3994784, 5843378, 8853173, 12734715, 15769207, 17043367, 17986440, 21349976, 27075422, 29898904, 24732592, 14855196, 10047255, 14663611, 22214857, 24349423, 20134793, 13031860, 4589102, -3341173, -5609700, -599698, 3719731, -991582, -10457794, -12984763, -6711286, -1935293, -4961152, -9317853, -6902753, 390233, 5732884, 7796404, 9719994, 11657811, 10697979, 6408917, 1424227, -2615495, -5830834, -7515397, -6196348, -2360366, 1067115, 1205850, -2379020, -6738018, -6852649, -323075, 8333305]
2976H333305K664272n602029o892204l00142N870887N218074J67628l336265l195405
2967B928121j042048J198635J861454m55109m704954p074820n044906m92389K766939
2958a0059077L276271K495693K181757K481160K210752M78712j844711k707190
2950a486633j426978L16818R13123P85763O66200r0725j457621j340909Q23207
2941b297755J498593j839242n099239k443546M250232P008774L310040n15311
2933C872546M49781K400553j11828m861444n348204p55784L227117K847189O40092
2924B360018O02717K683373L730413J880923j573533l853120l223945k24538K955712
2915E338020M240183L167076J078140r3499L79432J350065J477926J326173K275628
$$ y = [8333305, 10997577, 5395548, -1496656, -1796798, 4074089, 9292163, 9459791, 6123526, 2928121, 1886073, 3084708, 4946162, 4491053, -213901, -7288721, -12333627, -12826016, -10059077, -6782806, -4287113, -2105356, 375804, 2586556, 3065268, 1220557, -1486633, -2913611, -2596793, -1683670, -897907, -231707, -322432, -1780053, -3120962, -2297755, -799162, -2638404, -7737643, -10181189, -5930957, 1077817, 4387857, 3872546, 4322327, 6722880, 6611052, 1749608, -3598596, -4354380, -1127263, 1719926, 2360018, 2962735, 5646108, 9376521, 11257444, 9683911, 5830791, 2606846, 2382308, 5338020, 9578203, 12745279, 13823419, 13729920, 14109352, 15459417, 16937343, 18263516, 20539144]
2906B0539144L203370P69855n496325j0933839j1179485p867778n709098n527884
2898b2202040m197479o94643K211885K688286K264509K563320K978206K714645
2890a1673311K252478J874881J386668J681440L566162M912954K853988o57146
2882F198114j31479M947615P648045K656155o015431j0053060o804178n78783
2874b133002L796988M767684K542214k195781p402863r839979p416889j307169
2866a9188797M287525N239032J665309j621839o06146K985368M717040L916788
2858A394280L130841K391309l08074k877951k91172O326825Q695996K945622m202736
2849A7204940n404867k938327l134632n506414m427727J274082O948556Q630949
$$ y = [20539144, 23742514, 24512369, 19016044, 8082205, -3097280, -10965058, -16674156, -22202040, -26399519, -27094162, -24882277, -22193991, -19929482, -17366162, -14387956, -11673311, -9420833, -7545952, -6159284, -4477844, -911682, 4001272, 6855260, 6198114, 6066635, 11014250, 18662295, 21318450, 15303019, 5249959, -1554219, -2133002, 1663986, 6431670, 8973884, 6778103, -624760, -10464739, -17881628, -19188797, -14901272, -9662240, -7996931, -9618770, -10224916, -7239548, -2522508, 1394280, 4525121, 6916430, 6608356, 3730405, 3439233, 9766058, 18462054, 21407676, 17204940, 11800073, 8861746, 5727114, 220700, -4207027, -2932945, 4015611, 12646560]
2841A2646560N673669r74549p960254r492932l818805K441129K206038k072726
2833a351870k668879J333750L592392J054308k744491m954320o454765o780729
2825a8974604l336834K587842N728813M886114M779059P504190Q346984L340520
2817A4862084m327221q947568q984288o080486j467848L482945O379262O076121
2809I93001L474032o07077m924337n682045n51010N034839K830686n484614q724825
2800a3641350k418891M291128L217576l88075K037907P370588O498873L69502
2792G337258j244911M163759P670734K393073p340851j2953176j1468495n889627
2784a7332236o30350J209145l22287j545028N65406L683646L282218k40423k226306
$$ y = [12646560, 18320229, 17345680, 9385426, -107506, -3926311, -1485182, 720856, -1351870, -4020749, -2686999, 905393, 1959701, -784790, -5739110, -12193875, -18974604, -22311438, -19723596, -13994783, -9108669, -4329610, 3174580, 11521564, 14862084, 10534863, 1587295, -7396993, -13477479, -14945327, -11462382, -5083120, 993001, 4467033, 3859956, -1064381, -6746426, -7297436, -2262597, 568089, -4916525, -13641350, -16060241, -11769113, -8551537, -8939612, -6901705, 468883, 6967756, 7337258, 6092347, 10256106, 17926840, 20319913, 12979062, 25886, -11442609, -17332236, -17962586, -16753441, -17075728, -18620756, -18055350, -14371704, -11089486, -11329909, -13556215]
2775a3556215j202008l08238q48287o7647L027130M814158K503336j581280l548530
2766a0767581k570877j78702K055018K767130J723022J253049L379090N322514
2758B982663K570302k944409l729378J985182O210077K554546m126177n245425
2750B57381j233375M28641k273546l099285J866240P283490N549524k605325q178916
2741b005171m360635N075775R374790L098190p061847j0204801m536484J633280
2733h986903K059056l10347n61709K70441o79694j428491J012266L953580L221461
2724a450340J156121K745116N795428L613363l155206o673575m795987l992569
2716f757649o687445n943654J753231P951710M685504k061477j401978N041209
$$ y = [-13556215, -14758223, -15066461, -15914748, -15982395, -12955265, -8141107, -5637771, -7219051, -10767581, -13338458, -13517160, -11462142, -8695012, -6971990, -5718941, -2339851, 2982663, 5552965, 2608556, -1120822, 864360, 7074437, 9628983, 5502806, 257381, -975994, -547353, -2820899, -5920184, -4053944, 3229546, 8779070, 6173745, -2005171, -6365806, -1290031, 8084759, 11182949, 4121102, -6083699, -10620183, -8986903, -6927847, -7238194, -7799903, -7529462, -8209156, -9637647, -8625381, -4671801, -1450340, -294219, 2450897, 8246325, 11859688, 8704482, 2030907, -2765080, -6757649, -13445094, -19388748, -17635517, -9683807, -4998303, -7059780, -8461758, -3420549]
2708c420549O087068p75365n755582k495697L108715L538709M83136l37192J125006
2699A558249P45442k497204o154262q587864r046148n805940J139381P201198
2691b1447148P572871L661965J145604K309254M338235M755743M101103K778833
2683I216460k43697m011743m763626r66624L690988M815596K468442n86882l282391
2674F336523n656178n946217k533871J994718L212606J543196J947199N586984
2666F484960O819663J806530m264806l839458J737495L968929k63458m517245
2658G932610k816913K122799M148021K393774K82314p66058j635610j767000j82946
2649I710991J071975m91711k636615j053543L004664L383890j726692o679625
$$ y = [-3420549, 2666519, 1891154, -3864428, -6360125, -3251410, 287299, 770435, 433243, 1558249, 2303691, -193513, -6347775, -14935639, -23981787, -29787727, -28648346, -21447148, -13874277, -10212312, -9066708, -6757454, -2419219, 2336524, 6437627, 9216460, 8972763, 4961020, 197394, -769230, 2921758, 7737354, 10205796, 9618914, 6336523, 680345, -5265872, -7799743, -5805025, -2592419, -1049223, 897976, 6484960, 13304623, 15111153, 10846347, 7006889, 8744384, 12713313, 12449855, 7932610, 5115697, 7238496, 11386517, 13780291, 14062605, 13296547, 11660937, 9893937, 9710991, 10782966, 10291255, 7654640, 6601097, 9605761, 12989651, 11262959, 4583334]
2641D583334o444146k841218j72039P97513J327116J231061M75723P78172K103417
2632A838933J155320k653809l615559K434433R750304Q925010K43324o309468
2624A1768488m903104p80821q47854l409949j960261M265384Q728065O095535
2616A8955483j364723o878740o735141l263459o46389L55730J701533L105459
2608E229753J543069k918975m808224l71370N902901O625264J589045k813252
2600I978211l393039l338313m949058n378523k129090K224571M152040M262374
2592A429173M883590N486794M037936J035169q51126j73371K082077L498715J589411
2583B3018368l689355p965824o037390J093124N972796L439337l502410q477455
$$ y = [4583334, -1860812, -4702030, -4874069, -4076556, -2749440, -1518379, -1042656, -264484, 1838933, 2994253, 340444, -3275115, -840682, 8909622, 17834632, 18077956, 11768488, 6865384, 6084563, 5236709, 1826760, -133501, 4131883, 12859948, 18955483, 17590760, 10712020, 3976879, 713420, 67031, 422761, 2124294, 5229753, 6772822, 3853847, -954377, -1325747, 4577154, 11202418, 12791463, 9978211, 6585172, 3246859, -1702199, -7080722, -9209812, -6985241, -2833201, 1429173, 6312763, 11799557, 15837493, 16872662, 16021536, 15848165, 17930242, 21428957, 23018368, 19329013, 11363189, 5325799, 6418923, 12391719, 15831056, 12328646, 3851191]
2575C851191q807828n397156K50436N275804N616418J397790j185019J706396
2567B708032M684233R50659n861310n821000J881952O552536J492187o057076
2559E30213n471320K536036Q183629O410021J559367j108446k115779l846414
2551F677307m767352j850955L181477M758464J348866j518049J157818O064598
2543A5052174N764158l86628m932050l250701l77115l106113r355751j0977650
2535a1569676n494143P61315J752148q45128j308400K304224O519485P161780
2527g18395L725193o81155k776956k142765o11182P90697K563146M187106L559390
2518G895079N20484j750913j243550l39089j407930j973173J240101N461791M671714
$$ y = [3851191, -4956637, -10353793, -10103357, -4827553, 788865, 2186655, 1001636, 2708032, 7392265, 8342924, 2481614, -3339386, -1457434, 5095102, 6587289, 530213, -4941107, -2405071, 5778558, 12188579, 13747946, 12639500, 10523721, 6677307, 1909955, 59000, 3240477, 7998941, 9347807, 7829758, 8987576, 15052174, 20816332, 20429704, 15497654, 12246953, 11869838, 8763725, -592026, -11569676, -17063819, -16302504, -14550356, -15395484, -16703884, -14399660, -7880175, -718395, 3006798, 2325643, -451313, -2594078, -3205260, -2414563, 148583, 4335689, 7895079, 8415563, 6664650, 5421100, 5082011, 3674081, 1700908, 2941009, 8402800, 13074514]
2509A3074514j275163n964082n539971l173419k850533l719349l236499j824190
2501a4508692j153898o88673R40426L078806M217284M585524N440728O828996
2493H740501P591610O747539M156472R05475j027266j285318k656027p031239
2485A6141747j0469333p016210J810179O923045L637070j719357j500711J760827
2477I567257p0100p390354j1467294o617515K567564Q218531Q573941P312216
2469A0694246O779425N649403K283002k604495o975467r455680r701375p850157
2461a1181098m562431j325319L64054O41778J279954L071514L985446J721770
2453f004332k069390k605206J825086O642189O306948J753112n16218K799028
$$ y = [13074514, 11799351, 5835269, 295298, -2878121, -5728654, -9448003, -12684502, -14508692, -15662590, -16351263, -15410837, -12332031, -8114747, -3529223, 1911505, 8740501, 16332111, 23079650, 27236122, 28141597, 27114331, 25829013, 23172986, 16141747, 5672414, -1343796, 466383, 7389428, 11026498, 9307141, 7806430, 9567257, 9497157, 2106803, -9360491, -15978006, -13410442, -5191911, 3382030, 10694246, 17473671, 23123074, 25406076, 22801581, 15826114, 6370434, -3330941, -11181098, -15743529, -17068848, -16704794, -16063016, -14783062, -11711548, -7726102, -6004332, -8073722, -10678928, -8853842, -2211653, 4095295, 5848407, 5332189, 8131217]
2445H131217O891943N095380j612961n165472j223010M428012L469706l693993
2437A6320822r171178q873185o366591m677371j425382M299378P024854L031257
2429A62604j847074j91897M942108M629642j455758m807813k133476K57877j990882
2420b434669m640685l276127k23793J150628J848073K659729J207589j871234
2412e580489r71534M882980P663047J977700n690980o746834l060369j313682
2404h840161o72457L684340Q839471P115549p96949o022470m516713n82119K431252
2395F39743N404456O858570K882540m304483o803855k890160M8465k307107m570152
2386e041983j721343K105274R84827k906641l554183j009749m63057l773976p314534
$$ y = [8131217, 15023160, 20118540, 18505579, 13340107, 12117097, 16545109, 20014815, 16320822, 7149644, -1723541, -8090132, -12767503, -14192885, -9893507, -2868653, 162604, -1684470, -1876367, 3065741, 7695383, 6239625, 1431812, -701664, -443787, -2434669, -7075354, -10351481, -10575274, -9424646, -7576573, -4916844, -3709255, -5580489, -6552023, -1669043, 5994004, 7971704, 2280724, -4466110, -7526479, -8840161, -9512618, -5828278, 3011193, 10126742, 9329793, 3307323, -1209390, -1791509, 639743, 6044199, 12902769, 15785309, 11480826, 4676971, 1786811, 1835276, -471831, -5041983, -6763326, -4658052, -3673225, -6579866, -10134049, -11143798, -11606855, -15380831, -22695365]
2377b2695365p022403k050803M995171Q958187N939650j148233m091646M31531
$$ y = [-22695365, -29717768, -31768571, -26773400, -17815213, -11875563, -13023796, -17115442, -16683911]
$$ [...]
##END NTUPLES=NMR SPECTRUM
##END=
