##TITLE=31Pdec_DE-785-R3-C3X
 CDCl3, 24 sc
 17.2.2025
##JCAMPDX= 6.0         $$ Bruker NMR JCAMP-DX V2.0
##DATA TYPE= NMR SPECTRUM
##DATA CLASS= NTUPLES
##ORIGIN= UXNMR, Bruker Analytische Messtechnik GmbH
##OWNER= root
$$ XWIN-NMR		Version 3.5
$$ Mon Feb 17 16:53:48 2025 Russian Standard Time (UT+4h)  she@DPX200
##.OBSERVE FREQUENCY= 81.013821
##.OBSERVE NUCLEUS= ^31P
##.ACQUISITION MODE= SIMULTANEOUS
##.ACQUISITION SCHEME= undefined
##.AVERAGES= 24
##.DIGITISER RES= 17
##SPECTROMETER/DATA SYSTEM= spect
##.PULSE SEQUENCE= zgpg30
##.SOLVENT NAME= CDCl3
##.SHIFT REFERENCE= (INTERNAL, CDCl3, 0, 198.062)
##AUDIT TRAIL= $$ (NUMBER, WHEN, WHO, WHERE, WHAT)
$$ ##TITLE= Audit trail, XWIN-NMR		Version 3.5
$$ ##JCAMPDX= 5.01
$$ ##ORIGIN= Bruker BioSpin GmbH
$$ ##OWNER= she
$$ F:/spectra/data/she/nmr/P31/2/pdata/1/auditp.txt
$$ ##AUDIT TRAIL=  $$ (NUMBER, WHEN, WHO, WHERE, WHAT)
(   1,<2025-02-17 16:52:34.78 +0400>,<she>,<DPX200>,
      <created by zg, POWCHK disabled, PULCHK disabled
       configuration hash MD5:
       00 E9 B6 7A A2 85 ED C7 34 08 36 98 17 FE 4E 26
       data hash MD5: 32K
       85 5A 1E 25 9B F4 7D 54 F0 4D 97 02 F0 8A 15 1A>)
(   2,<2025-02-17 16:52:40.14 +0400>,<she>,<DPX200>,
      <Start of raw data processing
       efp BC_mod = 2 LB = 1.5 FT_mod = 6 PKNL = 1 PHC0 = 1723.319 PHC1 = 150.6954 SI = 64K 
       data hash MD5: 64K
       8A 09 01 D7 E1 48 16 E0 9A 15 EE 7E CC 11 8E 07>)
(   3,<2025-02-17 16:53:12.03 +0400>,<she>,<DPX200>,
      <pk PHC0 = -7.224808 PHC1 = 56.99902 
       data hash MD5: 64K
       8D 95 A9 DA 84 99 23 22 5A 4D DC 04 6B DD 0E E2>)
$$ ##END=
$$ 
$$ hash MD5
$$ 1F 66 52 E4 0F 3C 94 A8 38 29 59 44 27 3B EE 0A
##$RELAX= 
##$RELAX= 
##$RELAX= 
##$RELAX= 
##$RELAX= 
##$RELAX= 
##$RELAX= 
##$RELAX= 
$$ Bruker specific parameters
$$ --------------------------
##$DU= <F:/spectra>
##$EXPNO= 2
##$NAME= <P31>
##$PROCNO= 1
##$TYPE= <nmr>
##$USER= <she>
##$AMP= (0..31)
100 100 100 100 100 100 100 100 100 100 100 100 100 100 100 100 100 100 
100 100 100 100 100 100 100 100 100 100 100 100 100 100 
##$AQSEQ= 0
##$AQ_mod= 1
##$AUNM= <au_zg>
##$AUTOPOS= <>
##$BF1= 81.014009
##$BF2= 200.13
##$BF3= 200.13
##$BF4= 200.13
##$BF5= 200.13
##$BF6= 200.13
##$BF7= 200.13
##$BF8= 200.13
##$BYTORDA= 1
##$CFDGTYP= 0
##$CFRGTYP= 5
##$CHEMSTR= <none>
##$CNST= (0..31)
1 1 145 1 1 1 1 1 1 1 1 1 1 1 1 1 1 1 1 1 1 1 1 1 1 1 1 1 1 1 1 1 
##$CPDPRG= <waltz16>
##$CPDPRG1= <>
##$CPDPRG2= <waltz16>
##$CPDPRG3= <>
##$CPDPRG4= <mlev>
##$CPDPRG5= <mlev>
##$CPDPRG6= <mlev>
##$CPDPRG7= <mlev>
##$CPDPRG8= <mlev>
##$CPDPRGB= <>
##$CPDPRGT= <>
##$D= (0..31)
0 1 0 0 0 0 0 0 0 0.06 0 0.03 2e-05 3e-06 0 0 0.0002 0 0 0 0 0 0 0 0 0 
0 0 0 0 0 0 
##$DATE= 1739796754
##$DBL= (0..7)
120 120 120 11 120 120 24 19 
##$DBP= (0..7)
150 150 150 150 150 150 150 150 
##$DBP07= 0
##$DBPNAM0= <>
##$DBPNAM1= <>
##$DBPNAM2= <>
##$DBPNAM3= <>
##$DBPNAM4= <>
##$DBPNAM5= <>
##$DBPNAM6= <>
##$DBPNAM7= <>
##$DBPOAL= (0..7)
0.5 0.5 0.5 0.5 0.5 0.5 0.5 0.5 
$$ [...]
##$SUBNAM3= <"">
##$SUBNAM4= <"">
##$SUBNAM5= <"">
##$SUBNAM6= <"">
##$SUBNAM7= <"">
##$SUBNAM8= <"">
##$SUBNAM9= <"">
##$SW= 400.765351723535
##$SWIBOX= (0..15)
0 1 3 0 0 0 0 0 0 0 0 0 0 0 0 0 
##$SW_h= 32467.5324675325
##$TD= 32768
##$TD0= 1
##$TE= 0
##$TE2= 300
##$TE3= 300
##$TEG= 300
##$TL= (0..7)
0 120 53 12 22 120 120 120 
##$TP= (0..7)
150 150 150 150 150 150 150 150 
##$TP07= 0
##$TPNAME0= <>
##$TPNAME1= <>
##$TPNAME2= <>
##$TPNAME3= <>
##$TPNAME4= <>
##$TPNAME5= <>
##$TPNAME6= <>
##$TPNAME7= <>
##$TPOAL= (0..7)
0.5 0.5 0.5 0.5 0.5 0.5 0.5 0.5 
##$TPOFFS= (0..7)
0 0 0 0 0 0 0 0 
##$TUNHIN= 0
##$TUNHOUT= 0
##$TUNXOUT= 0
##$USERA1= <user>
##$USERA2= <user>
##$USERA3= <user>
##$USERA4= <user>
##$USERA5= <user>
##$V9= 5
##$VALIST= <valist>
##$VCLIST= <CCCCCCCCCCCCCCC>
##$VD= 0
##$VDLIST= <DDDDDDDDDDDDDDD>
##$VPLIST= <PPPPPPPPPPPPPPP>
##$VTLIST= <TTTTTTTTTTTTTTT>
##$WBST= 1024
##$WBSW= 4
##$XGAIN= (0..3)
0 0 0 0 
##$XL= 0
##$YL= 0
##$YMAX_a= 1866
##$YMIN_a= -13479
##$ZGOPTNS= <>
##$ZL1= 120
##$ZL2= 120
##$ZL3= 120
##$ZL4= 120
##$ABSF1= 0
##$ABSF2= 0
##$ABSG= 0
##$ABSL= 0
##$ALPHA= 0
##$AQORDER= 0
##$ASSFAC= 0
##$ASSFACI= 0
##$ASSFACX= 0
##$ASSWID= 0
##$AUNMP= <proc_1d>
##$AZFE= 0.1
##$AZFW= 0.5
##$BCFW= 0
##$BC_mod= 2
##$BYTORDP= 0
##$COROFFS= 0
##$CY= -3
##$DATMOD= 1
##$DC= 0
##$DFILT= <>
##$DTYPP= 0
##$F1P= 0
##$F2P= 0
##$FCOR= 1
##$FTSIZE= 65536
##$FT_mod= 6
##$GAMMA= 0
##$GB= 0
##$INTBC= 1
##$INTSCL= 9.790993e-09
##$ISEN= 30
##$LB= 1.5
##$LEV0= 0
##$LPBIN= 0
##$MAXI= 10000
##$MC2= 0
##$MEAN= 0
##$ME_mod= 0
##$MI= 50
##$NCOEF= 0
##$NC_proc= -10
##$NLEV= 6
##$NOISF1= 182.463
##$NOISF2= 159.3651
##$NSP= 0
##$NTH_PI= 0
##$NZP= 0
##$OFFSET= 198.0616
##$PC= 4
##$PHC0= 1716.094
##$PHC1= 207.6944
##$PH_mod= 1
##$PKNL= yes
##$PPARMOD= 0
##$PSCAL= 0
##$PSIGN= 0
##$REVERSE= no
##$SF= 81.0140089999434
##$SI= 65536
##$SIGF1= 159.3651
##$SIGF2= -187.1042
##$SINO= 113.3802
##$SIOLD= 16384
##$SREGLST= <1H.CDCl3>
##$SSB= 0
##$STSI= 65536
##$STSR= 0
##$SW_p= 32467.5324675325
##$SYMM= 0
##$S_DEV= 0
##$TDeff= 32768
##$TDoff= 0
##$TI= <>
##$TILT= no
##$TM1= 0
##$TM2= 0
##$TOPLEV= 0
##$USERP1= <user>
##$USERP2= <user>
##$USERP3= <user>
##$USERP4= <user>
##$USERP5= <user>
##$WDW= 1
##$XDIM= 65536
##$YMAX_p= 228022580
##$YMIN_p= -269867787
$$ End of Bruker specific parameters
$$ ---------------------------------
##NTUPLES= NMR SPECTRUM
##VAR_NAME=  FREQUENCY,     SPECTRUM/REAL,   SPECTRUM/IMAG
##SYMBOL=    X,             R,               I
##VAR_TYPE=  INDEPENDENT,   DEPENDENT,       DEPENDENT
##VAR_FORM=  AFFN,          ASDF,            ASDF
##VAR_DIM=   65536,         65536,           65536
##UNITS=     HZ,            ARBITRARY UNITS, ARBITRARY UNITS
##FACTOR=    0.49542278885378, 1,            1
##FIRST=     16045.7642231865, 0,            0
##LAST=      -16421.768244346, 0,            0
##MIN=       -16421.768244346, -269867787,   0
##MAX=       16045.7642231865, 228022580,    0
$$ Real data points
##PAGE= N=1
##DATA TABLE= (X++(R..R)), XYDATA
$$ [...]
$$ plain form
6622 492144 10273565 15066962 18772379 22751356 25360247 25604750 24122796 19896058 10207011
6613 10207011 -3348183 -12624051 -11032755 -1362698 8827900 16943055 24961270 31460566
6605 31460566 31253825 23473151 13720768 6643793 1664999 -2382812 -3739713 -1216161
6597 -1216161 3262032 7896202 12724225 16140959 14295622 6729014 -1435925 -5798528
6589 -5798528 -7336353 -7899933 -5387867 2232313 11034430 13940897 8476448 -1041017
6581 -1041017 -7686530 -6301842 4014962 18929261 31515283 37651227 37934455 34655905
6573 34655905 30152863 28018855 30704457 34412654 32026625 23663675 18261639 20933007
6565 20933007 25092169 22502832 15156236 10259199 8561389 6104744 4178675 8301403
$$ packed form
6622D92144R781421M793397L705417L978977K608891K44503j481954m226738r689047
6613A0207011j3555194r275868J591296R670057J0190598Q115155Q018215O499296
6605C1460566k06741p780674r752383p076975m978794m047811j356901K523552
6597a216161M478193M634170M828023L416734j845337p566608q164939m362603
6589e798528j537825n63580K512066P620180Q802117K906467n464449r517465
6581a041017o645513J384688J0316804J4914299J2586022O135944K83228l278550
6573C4655905m503042k134008K685602L708197k386029q362950n402036K671368
6565B0933007M159162k589337p346596m897037j697810k456645j926069M122728
$$ plain form
6557 8301403 18225571 27042807 30311514 29407623 26346215 22193529 20229711 23413016
6549 23413016 28419748 29158107 26352105 26182666 29029637 28065610 20903718 14144037 13063280
6540 13063280 14566266 14379503 13933363 15330385 16200639 15043455 15760658 20946895 25787438
6531 25787438 24748555 19847403 16139093 13457695 9621594 7832223 12463944 19597359
6523 19597359 20493343 14498020 10358029 12922127 15624206 9809596 -3195719 -13398029
6515 -13398029 -13338981 -5061324 3296751 6048336 4691264 4069809 4784687 2407053 -4679797
6506 -4679797 -10824213 -10348009 -6133146 -5629842 -9920458 -12773634 -10559770 -7089314 -7057991
6497 -7057991 -10000641 -13399719 -17453352 -23213245 -28702880 -30286982 -26648039 -19329718
$$ packed form
6557H301403R924168Q817236L268707r03891l061408m152686j963818L183305
6549B3413016N006732P38359k806002j69439K846971r64027p161892o759681j080757
6540A3063280J502986j86763m46140J397022Q70254j157184P17203N186237M840543
6531B5787438j038883m901152l708310k681398l836101j789371M631721P133415
6523A9597359Q95984n995323m139991K564098K702079n814610j3005315j0202310
6515a3398029N9048Q277657Q358075K751585j357072o21455P14878k377634p086850
6506d679797o144416M76204M214863N03304m290616k853176K213864L470456L1323
6497g057991k942650l399078m053633n759893n489635j584102L638943P318321
$$ plain form
6489 -19329718 -10817363 -3876605 -1000314 -2074815 -3529659 -2019072 1328422 2014588
6481 2014588 -2324786 -8455083 -9882297 -2795518 9738236 19685821 21316381 16768647
6473 16768647 13198758 14206783 15719456 11268405 71315 -11469880 -15953595 -11879044
6465 -11879044 -4513593 -214727 41329 1000002 6685960 14807104 19199822 17284785
6457 17284785 12893621 11213693 12754593 13401589 9482573 1947946 -4106787 -4127235 901665
6448 901665 4557275 1601495 -5564049 -8924231 -3814655 5896032 12373454 11843389 6783934
6439 6783934 1615587 -1593548 -3080652 -2806984 476865 7078781 14161811 17563204
6431 17563204 16552979 14974551 15924799 16969295 13497361 5883364 -383130 -1949350
$$ packed form
6489a9329718Q512355O940758K876291j074501j454844J510587L347494O86166
6481B014588m339374o130297j427214P086779J2533754R947585J630560m547734
6473A6768647l569889J008025J512673m451051j1197090j1541195m483715M074551
6465a1879044P365451M298866K56056R58673N685958Q121144M392718j915037
6457A7284785m391164j679928J540900O46996l919016p534627o054733k0448N028900
6448I01665L655610k955780p165544l360182N109576R710687O477422n30065n059455
6439F783934n168347l209135j487104K73668L283849O601916P083030L401393
6431A7563204j010225j578428R50248J044496l471934p613997o266494j566220
$$ plain form
6423 -1949350 -1143592 -1025554 -799635 1163811 2855115 938227 -3989945 -7972806 -8852192
6414 -8852192 -7806791 -6308986 -4851545 -4695245 -7348620 -11339739 -12719804 -10490928
6406 -10490928 -8737440 -10948885 -14490996 -13898007 -8257733 -1527274 4181015 11130254
6398 11130254 19995669 25288727 20716520 7740695 -4876737 -9997748 -7712784 -2206291
6390 -2206291 3375115 7719835 10183160 11202080 12358865 14530845 17441765 21732953
6382 21732953 28616398 35821439 37443984 31293247 23662101 22404282 27047091 30559287
6374 30559287 29636485 27461254 26273201 23623092 18013999 12498816 9310742 5696300
6366 5696300 -724580 -6291963 -5879019 -546981 4307797 6705102 8914310 11577253
$$ packed form
6423a949350Q05758J18038K25919J963446J691304j916888m928172l982861q79386
6414h852192J045401J497805J457441J56300k653375l991119j380065K228876
6406a0490928J753488k211445l542111N92989N640274O730459N708289O949239
6398A1130254Q865415N293058m572207j2975825j2617432n121011K284964N506493
6390b206291N581406M344720K463325J018920J156785K171980K910920M291188
6382B1732953O883445P205041J622545o150737p631146j257819M642809L512196
6374C0559287r22802k175231j188053k650109n609093n515183l188074l614442
6366E696300o420880n567383M12944N332038M854778K397305K209208K662943
$$ plain form
6358 11577253 12550060 12003051 13218292 16283027 15676700 7811956 -1822476 -3379479 5887627
6349 5887627 18220284 24246889 22927896 20807190 22499644 24810872 21818697 13957570
6341 13957570 8588590 10726803 16373893 17874664 14063868 11136369 13351355 16979981
6333 16979981 15778033 9666536 4352685 3209778 3549657 2173518 1013987 3710943
6325 3710943 8297001 8289285 2325572 -1822867 3429152 14998392 22909245 23378385 22328707
6316 22328707 24930579 27670855 24418165 15826940 7553820 1659809 -4542231 -11635968
6308 -11635968 -15530379 -13147962 -6761626 -549098 4609889 10662578 18054155 23829065
6300 23829065 24170659 18618078 11952457 10911726 17464968 25908837 28554575 23878413
$$ packed form
6358A1577253R72807n47009J215241L064735o06327p864744r634432j557003R267106
6349E887627J2332657O026605j318993k120706J692454K311228k992175p861127
6341A3957570n368980K138213N647090J500771l810796k927499K214986L628626
6333A6979981j201948o111497n313851j142907L39879j376139j159531K696956
6325C710943M586058p716n963713m148439N252019J1569240P910853M69140j049678
6316B2328707K601872K740276l252690q591225q273120n894011o202040p093737
6308a1635968l894411K382417O386336O212528N158987O052689P391577N774910
6300B3829065L41594n552581o665621j040731O553242Q443869K645738m676162
$$ plain form
6292 23878413 16748544 10991365 5158748 -3244622 -12510515 -18136493 -17856599 -13248175
6284 -13248175 -7490559 -3235608 -1539862 -981906 1434852 6772028 12209873 14304444
6276 14304444 13318116 11881411 9699339 2934486 -9541317 -21784400 -25647227 -19548422
6268 -19548422 -9978465 -4085648 -3105638 -3972633 -4663857 -5078503 -3910987 1383685 10191277
6259 10191277 17009769 16656555 10552276 6040665 9249974 19103569 28040555 28614946
6251 28614946 20531214 11458179 9350308 13547741 15752277 10850107 3654084 2212474
6243 2212474 7235823 12527638 14492148 15931993 19824411 24310368 26166344 25614184
6235 25614184 24928220 24958196 25804710 28521106 32701545 33971245 27909949 16487350 7191202
$$ packed form
6292B3878413p129869n757179n832617q403370r265893n625978K79894M608424
6284a3248175N757616M254951J695746N57956K416758N337176N437845K094571
6276A4304444r86328j436705k182072o764853j2475803j2243083l862827O098805
6268a9548422R569957N892817R80010q66995o91224m14646J167516N294672Q807592
6259A0191277O818492l53214o104279m511611L209309R853595Q936986N74391
6251B8614946q083732r073035k107871M197433K204536m902170p196023j441610
6243B212474N023349N291815J964510J439845L892418M485957J855976n52160
6235B5614184o85964K9976Q46514K716396M180439J269700o061296j1422599r296148
$$ plain form
6226 7191202 4859329 6972960 8149600 6746378 4873247 3606468 1363012 -2721789
6218 -2721789 -6388661 -6745905 -3789259 231840 4025173 7605920 9545417 6589875
6210 6589875 -2304388 -12896025 -18449251 -15542544 -6643435 2181073 5514380 2058259
6202 2058259 -4531770 -8795362 -8376424 -5153803 -1398531 2955827 8090706 12252642
6194 12252642 14615193 17812408 23862397 28956917 26656225 16378592 5123529 180493
6186 180493 2762779 8636379 11902525 8391666 -910632 -9232457 -10095289 -4502536 912745
6177 912745 2405509 1613207 34325 -3152332 -6567215 -5916600 -422998 5196733 7934466
6168 7934466 10408678 14464009 16682276 14681989 12247162 12611921 11892177 6006358 -394704
$$ packed form
6226G191202k331873K113631J176640j403222j873131j266779k243456m084801
6218b721789l666872l57244K956646M021099L793333L580747J939497k955542
6210F589875q894263j0591637n553226K906707Q899109Q824508L333307l456121
6202B058259o590029m263592M18938L222621L755272M354358N134879M161936
6194A2252642K362551L197215O049989N094520k300692j0277633j1255063m943036
6186A80493K582286N873600L266146l510859r302298q321825q62832N592753N415281
6177I12745J492764p92302j578882l186657l414883O50615N493602N619731K737733
6168G934466K474212M055331K218267k000287k434827L64759p19744n885819o401062
$$ plain form
6159 -394704 4822 5328694 7436573 4956914 4307338 8026648 11350394 11697270 12611199
6150 12611199 15552239 16164769 12732944 10806211 14328137 18607855 17811977 13897963
6142 13897963 11852605 10887542 7569724 4134000 5599442 10053476 9632008 1701458
6134 1701458 -7469800 -11528084 -10997729 -9700887 -9081682 -8446865 -7131997 -4242098 707758
6125 707758 5277317 5615483 2308240 959921 4270021 7204226 3850856 -3873811 -9046877
6116 -9046877 -9358430 -8619773 -9208765 -8562356 -4370227 1569487 6830913 11666515 16266094
6107 16266094 18423307 17302568 16567413 19955298 25920209 30354251 32398726 33305862
6099 33305862 31653635 24956751 14774548 4621382 -6167082 -19778329 -31479107
$$ packed form
6159c94704L99526N323872K107879k479659o49576L719310L323746L46876R13929
6150A2611199K941040O12530l431825j926733L521926M279718p95878l914014
6142A3897963k045358r65063l317818l435724J465442M454034m21468p930550
6134A701458r171258m058284N30355J296842O19205O34817J314868K889899M949856
6125G07758M569559L38166l307243j348319L310100K934205l353370p724667n173066
6116i046877l11553P38657n88992O46409M192129N939714N261426M835602M599579
6107A6266094K157213j120739p35155L387885N964911M434042K044475R07136
6099C3305862j652227o696884j0182203j0153166j0788464j3611247j1700778
$$ plain form
6092 -31479107 -32332694 -22665383 -14312780 -14810724 -17142013 -11788234 -2169156 674779
6084 674779 -5606487 -12981182 -15280606 -13145303 -8188981 -1780052 202106 -8656543
6076 -8656543 -23912457 -31470862 -24225228 -10594244 -2488699 -1437881 -1535717 92651
6068 92651 2434287 6161654 13033319 20978445 25037755 23047915 17267472 11236079 7449119
6059 7449119 6703471 7451930 7198630 5983789 6258681 8253966 9140036 8661637 11119553
6050 11119553 18492064 25838671 27637539 24839965 21211254 16838147 10936032 7227857
6042 7227857 9185048 12145466 8119981 -2014765 -8841309 -7664971 -3899193 -3069308
6034 -3069308 -2723487 1469237 7110397 8067896 3323172 -1832925 -2252670 2735162 10499102
$$ packed form
6092c1479107q53587R667311Q352603m97944k331289N353779R619078K843935
6084F74779o281266p374695k299424K135303M956322O408929J982158q858649
6076h656543j5255914p558405P245634J3630984Q105545J050818r7836J628368
6068I2651K341636L727367O871665P945126M059310j989840n780443o031393l786960
6059G449119p45648P48459k53300j214841K74892J995285Q86070m78399K457916
6050A1119553P372511P346607J798868k797574l628711m373107n902115l708175
6042G227857J957191K960418m025485j0134746o826544J176338L765778Q29885
6034c069308L45821M192724N641160R57499m744724n156097m19745M987832P763940
$$ plain form
6025 10499102 17717182 22128446 23885185 25303563 27957023 30024048 27673976 19685814
6017 19685814 10395230 7019310 12682577 22140808 26440713 22658806 16666620 14719941
6009 14719941 15401814 13201469 7486568 3012113 2424393 3464114 4214359 6252838 10612343
6000 10612343 14337778 13731731 9025642 3997585 2330315 5210284 10886623 15934737
5992 15934737 18423695 19862312 22276636 24064185 21670903 15218731 9122690 6646591
5984 6646591 7016946 8471116 10714242 13204701 14020910 11741850 6371955 -1412688 -8821548
5975 -8821548 -9709916 -283417 13108617 17942709 9985183 -1543308 -6568132 -6458495
5967 -6458495 -8890222 -15117974 -18880668 -15747923 -7600147 1213497 7130899 7593977
$$ packed form
6025A0499102P218080M411264J756739J418378K653460K067025k350072p988162
6017A9685814r290584l375920N663267R458231M299905l781907n992186j946679
6009A4719941O81873k200345n714901m474455n87720J039721P50245K038479M359505
6000A0612343L725435o06047m706089n028057j667270K879969N676339N048114
5992A5934737K488958J438617K414324J787549k393282o452172o096041k476099
5984F646591L70355J454170K243126K490459Q16209k279060n369895p784643p408860
5975h821548q88368R426499J3392034M834092p957526j1528491n024824J09637
5967f458495k431727o227752l762694L132745Q147776Q813644N917402M63078
$$ plain form
5959 7593977 3007180 -1574474 -1084406 3138351 5603833 5194906 6609773 12224657 17335398
5950 17335398 16449509 11265716 8920935 13349599 21086274 25725595 24766148 21256186
5942 21256186 19469680 20226386 20958692 19269229 14860334 8555362 1795195 -2715118
5934 -2715118 -2768182 -305350 -495539 -5074584 -9007182 -6538322 1050694 6588717 5118973
5925 5118973 -1348325 -6404571 -4764848 3669984 13343733 17515322 14631431 9125184
5917 9125184 5257124 2892737 803007 327170 2554522 5226196 6516922 8940987
5909 8940987 14716793 19971751 19591722 16339920 18560665 28734769 40323326 46602814
5901 46602814 46849898 42861233 35643128 27848383 23772382 23628969 22330527 17008391
$$ packed form
5959G593977m586797m581654M90068M222757K465482m08927J414867N614884N110741
5950A7335398q85889n183793k344781M428664P736675M639321r59447l509962
5942B1256186j786506P56706P32306j689463m408895o304972o760167m510313
5934b715118n3064K462832j90189m579045l932598K468860P589016N538023j469744
5925E118973o467298n056246J639723Q434832R673749M171589k883891n506247
5917I125184l868060k364387k089730m75837K227352K671674J290726K424065
5909H940987N775806N254958l80029l251802K220745J0174104J1588557O279488
5901D6602814K47084l988665p218105p794745m076001j43413j298442n322136
$$ plain form
5893 17008391 11315895 8856775 6910069 1506131 -4601069 -4703627 2338395 10306138
5885 10306138 13549058 12918866 12714513 14015599 12619294 3685477 -11506583 -24355699
5877 -24355699 -26567975 -18936239 -9837989 -4817215 -1503474 3883035 9805144 12716886
5869 12716886 13254783 14304762 15247320 13346384 9838410 9412875 13317778 17522998 18675016
5860 18675016 17739472 16218878 12789293 6570237 913263 187766 3598633 5409046
5852 5409046 1916712 -3850358 -5541364 -619182 6962051 10882441 8409659 2329292
5844 2329292 -2121855 -1920222 1288535 2745734 -810788 -7559148 -12346433 -12354066 -9490548
5835 -9490548 -6431959 -2999739 1036733 2393932 -1685856 -7046614 -6263221 475220
$$ packed form
5893A7008391n692496k459120j946706n403938o107200j02558P042022P967743
5885A0306138L242920o30192k04353J301086j396305q933817j5192060j2849116
5877b4355699k212276P631736R098250N020774L313741N386509N922109K911742
5869A2716886N37897J049979R42558j900936l507974m25535L904903M205220J152018
5860A8675016r35544j520594l429585o219056n656974p25497L410867J810413
5852E409046l492334n767070j691006M922182P581233L920390k472782o080367
5844B329292m451147K01633L208757J457199l556522o748360m787285p633K863518
5835i490548L058589L432220M036472J357199m079788n360758P83393O738441
$$ plain form
5827 475220 4354628 653114 -3497782 784678 10779446 15833768 12341512 7544518
5819 7544518 7706459 9472277 6494684 -44842 -2485374 3283514 12987193 19582033
5811 19582033 20924648 20340390 20878528 21188728 17903285 10870859 4167025 1745024 3700217
5802 3700217 7508810 11322710 14593338 16504532 15733217 12050591 7288423 4220169
5794 4220169 4146308 5296448 4423872 1006776 -1355760 163526 2725207 1588520 -1763750
5785 -1763750 -537033 6915317 13199237 12051687 7584832 8230983 14853546 20684451
5777 20684451 21046533 17265532 12049287 6957468 4296734 5694588 8099939 6623343
5769 6623343 2409491 2175835 8068375 13443084 11874737 5856898 2718357 5245355
$$ packed form
5827D75220L879408l701514m150896M282460R994768N054322l492256m796994
5819G544518J61941J765818k977593o539526k440532N768888R703679O594840
5811A9582033J342615n84258N38138L10200l285443p032426o703834k422001J955193
5802C700217L808593L813900L270628J911194p71315l682626m762168l068254
5794D220169p3861J150140q72576l417096k362536J519286K561681j136687l352270
5785a763750J226717P452350O283920j147550m466855O46151O622563N830905
5777B0684451L62082l781001n216245n091819k660734J397854K405351j476596
5769F623343m213852k33656N892540N374709j568347o017839l138541K526998
$$ plain form
5761 5245355 10342566 14598572 17075980 17693014 16320499 13406275 9508033 4684722
5753 4684722 -387488 -3984869 -5503758 -6565149 -8358806 -9678442 -9644917 -10408533 -14060646
5744 -14060646 -18034930 -17306909 -11456450 -6150210 -6039086 -8640632 -7777474 -2054775 3004824
5735 3004824 2100783 -2862891 -5280557 -2431210 1545900 1928859 -578122 -2340874 -2481370
5726 -2481370 -2385457 -1271144 3027885 8921880 11514555 9651103 8334743 11614639 16419934
5717 16419934 16783679 12064350 7331870 6191809 6339929 3026445 -4596451 -11630298
5709 -11630298 -12197951 -6194623 -354144 -1084336 -6879796 -10255845 -7212840 -1870608
5701 -1870608 -846359 -5860373 -13339470 -18652081 -18710069 -12749206 -3445204 3570923 3608417
$$ packed form
5761E245355N097211M256006K477408O17034j372515k914224l898242m823311
5753D684722n072210l597381j518889j061391j793657j319636L3525p63616l652113
5744a4060646l974284P28021N850459N306240J11124k601546Q63158N722699N059599
5735C004824r04041m963674k417666K849347L977110L82959k506981j762752j40496
5726b481370R5913J114313M299029N893995K592675j863452j316360L279896M805295
5717A6419934L63745m719329m732480j140061J48120l313484p622896p033847
5709a1630298n67653O003328N840479p30192n795460l376049L043005N342232
5701a870608J024249n014014p479097n312611n7988N960863R304002P016127L7494
$$ plain form
5692 3608417 -3293448 -12668531 -18958694 -18966952 -14078487 -9268807 -7761152 -6731650 -1191665
5683 -1191665 7960046 13889221 12824670 8642984 6482338 6277111 5585569 4589215 4408985
5674 4408985 3908193 2170607 1045987 1248188 -677735 -6754036 -12183376 -11312621 -6718072
5665 -6718072 -6273983 -12459769 -20372506 -25337651 -26594174 -24256134 -19051152 -14993350
5657 -14993350 -15733901 -17698402 -13554679 -3603551 3455615 3294378 2020148 5611842
5649 5611842 10269794 8996639 2358790 -4018266 -8928015 -15276111 -22148225 -24538319
5641 -24538319 -21453759 -18147933 -18469164 -19799331 -18182979 -14726403 -13289018 -13822930
5633 -13822930 -12069853 -6100104 158213 1764607 -863321 -3138810 -3061930 -3300610 -5607866
$$ packed form
5692C608417o901865r375083o290163q258M888465M809680J507655J029502N539985
5683a191665R151711N929175j064551m181686k160646k05227o91542r96354j80230
5674D408985n00792j737586j124620K02201j925923o076301n429340Q70755M594549
5665f718072M44089o185786p912737m965145j256523K338040N204982M057802
5657a4993350p40551j964501M143723R951128P059166j61237j274230L591694
5649E611842M657952j273155o637849o377056m909749o348096o872114k390094
5641b4538319L084560L305826l21231j330167J616352L456576J437385n33912
5633a3822930J753077N969749O258317J606394k627928k275489P6880k38680k307256
$$ plain form
5624 -5607866 -6611106 -1878022 7892619 17612465 23308636 24278745 21506721 17247775
5616 17247775 14785824 14924025 13797954 7936794 196272 -3754721 -3523913 -3176834 -3312014
5607 -3312014 -630190 4254972 5886122 2846679 667310 2846587 5395262 3943085
5599 3943085 150100 -2994023 -6026585 -8365606 -5125016 5307335 15992577 20327801
5591 20327801 20998105 22829631 22271899 13635529 2097554 -538764 7684651 16695942
5583 16695942 19094097 17507638 16013154 13793596 10357401 8726827 9722666 10148647
5575 10148647 9828797 12993244 19043125 20117995 13288465 7406980 10414136 16117606
5567 16117606 12599480 -42922 -9687391 -8542246 -959263 5379504 8187581 8309732
$$ packed form
5624e607866j003240M733084R770641R719846N696171R70109k772024m258946
5616A7247775k461951J38201j126071n861160p740522l950993K30808L47079j35180
5607c312014K681824M885162J631150l039443k179369K179277K548675j452177
5599C943085l792985l144123l032562k339021L240590J0432351J0685242M335224
5591B0327801O70304J831526n57732q636370j1537975k636318Q223415R011291
5583A6695942K398155j586459j494484k219558l436195j630574R95839M25981
5575A0148647l19850L164447O049881J074870o829530n881485L007156N703470
5567A6117606l518126j2642402r644469J145145P582983O338767K808077J22151
$$ plain form
5559 8309732 5254494 -901614 -6561190 -7398045 -3391861 668023 -348246 -6918788
5551 -6918788 -13821167 -14867395 -9529969 -3388520 -754783 755086 5680116 12972614
5543 12972614 16724769 13743830 6538654 -1009246 -7111306 -10829739 -11114939 -8392047
5535 -8392047 -4482083 -110146 4949380 8824654 8155573 3340896 -80593 2028136
5527 2028136 6656084 7438783 3051745 -1266646 -697657 3180108 4612216 544623 -6327772
5518 -6327772 -11241047 -12390321 -11071535 -8132698 -3167618 2382201 4830765 3500982
5510 3500982 3771637 11005539 22482572 29260543 25909880 14976801 2317151 -7460683
5502 -7460683 -10655703 -5347442 4592026 10784477 9295824 5279387 5593499 10122299
$$ packed form
5559H309732l055238o156108n659576q36855M006184M059884j016269o570542
5551f918788o902379j046228N337426O141449K633737J509869M925030P292498
5543A2972614L752155k980939p205176p547900o102060l718433k85200K722892
5535h392047L909964M371937N059526L875274o69081m814677l421489K108729
5527B028136M627948P82699m387038m318391N68989L877765J432108m067593o872395
5518f327772m913275j149274J318786K938837M965080N549819K448564j329783
5510C500982K70655P233902J1477033O777971l350663j0933079j2659650r777834
5502g460683l195020N308261R939468O192451j488653m016437L14112M528800
$$ plain form
5494 10122299 14147606 15913532 16803390 16534731 14116753 12372417 15189002 20017736
5486 20017736 19222702 10419075 46490 -5492192 -7149950 -8842190 -10637803 -10607126
5478 -10607126 -10018739 -11960206 -16455211 -20654334 -22538187 -21493872 -17101713 -10618630
5470 -10618630 -5786336 -4591567 -4063426 -1245821 678573 -3437942 -11240597 -13576456
5462 -13576456 -5814893 6476071 14894073 17038216 16114960 15673380 17176559 19771829
5454 19771829 20328951 16349925 10303453 7751623 9496253 9566173 3642954 -4460012 -8253007
5445 -8253007 -6936692 -4002822 -448177 5310448 12119652 15892681 15059592 12711576
5437 12711576 13052275 17917902 25793981 31805323 30369400 21067078 10382404 4505608
$$ packed form
5494A0122299M025307J765926Q89858k68659k417978j744336K816585M828734
5486B0017736p95034q803627j0372585n538682j657758j692240j795613L0677
5478a0607126N88387j941467m495005m199123j883853J044315M392159O483083
5470a0618630M832294J194769N28141K817605J924394m116515p802655k335859
5462a3576456P761563J2290964Q418002K144143r23256m41580J503179K595270
5454A9771829N57122l979026o046472k551830J744630O9920n923219q102966l792995
5445h253007J316315K933870L554645N758625O809204L773029q33089k348016
5437A2711576L40699M865627P876079O011342j435923r302322j0684674n876796
$$ plain form
5429 4505608 2572786 785896 305062 5316000 14989236 23735283 28813089 31400990
5421 31400990 30612833 23636482 12456856 3212810 -2388043 -7638563 -11510630 -7735322
5413 -7735322 3401475 11562558 10331842 6467313 8391086 13366506 14786205 15091941
5405 15091941 20385890 26937550 25413706 16719764 11330607 12332646 11173444 3367738
5397 3367738 -2586953 2317523 14531128 23791429 26029867 24114133 20127318 13423747
5389 13423747 4555777 -3554137 -7767833 -6222536 160371 6492264 7883675 6183426
5381 6183426 8190226 14768812 17214092 8817939 -4622129 -11531460 -8753540 -3312783
5373 -3312783 -1966940 -4660381 -7551983 -7356115 -2538625 5494961 11812832 11960286 7356274
$$ packed form
5429D505608j932822j786890m80834N010938R673236Q746047N077806K587901
5421C1400990p88157o976351j1179626r244046n600853n250520l872067L775308
5413g735322J1136797Q161083j230716l864529J923773M975420J419699L05736
5405A5091941N293949O551660j523844q693942n389157J002039j159202p805706
5397C367738n954691M904476J2213605R260301K238438j915734l986815o703571
5389A3423747q867970q109914m213696J545297O382907O331893J391411j700249
5381F183426K006800O578586K445280q396153j3440068o909331K777920N440757
5373c312783J345843k693441k891602J95868M817490Q033586O317871J47454m604012
$$ plain form
5364 7356274 4422095 7876111 16097749 22474219 20459575 9390768 -3025640 -6650219
5356 -6650219 192112 8416411 9414885 5020707 2356972 2693298 1458569 -3148082 -8391394
5347 -8391394 -12847926 -17349510 -20302356 -18789526 -14960399 -14711687 -18728045 -21394674
5339 -21394674 -20509589 -21262090 -27315352 -34111794 -35311184 -30923443 -24689671 -17647461
5331 -17647461 -8754393 1554388 12354283 23320380 31328375 30373257 19633924 7703330
5323 7703330 3327364 5031031 5280179 1583287 -2863296 -6541523 -9844757 -9374633 -407487
5314 -407487 14014713 23672897 22774042 15222002 7093567 280121 -4344646 -4307364 -134450
5305 -134450 2826539 1767328 1376519 6780182 15084014 19044245 16671919 12020612 7917936
$$ packed form
5364G356274k934179L454016Q221638O376470k014644j1068807j2416408l624579
5356f650219O842331Q224299R98474m394178k663735L36326j234729m606651n243312
5347h391394m456532m501584k952846J512830L829127K48712m016358k666629
5339b1394674Q85085p52501o053262o796442j199390M387741O233772P042210
5331a7647461Q893068J0308781J0799895J0966097Q007995r55118j0739333j1930594
5323G703330m375966J703667K49148l696892m446583l678227l303234M70124Q967146
5314d07487J4422200R658184q98855p552040q128435o813446m624767L7282M172914
5305a34450K960989j059211l90809N403663Q303832L960231k372326m651307m102676
$$ plain form
5296 7917936 3156194 -3032799 -7995663 -8352243 -3510634 3750297 8750596 7912076 2335033
5287 2335033 -2632774 -3446093 -2451620 -3350810 -4677577 -2156435 3321016 5449351 1622300
5278 1622300 -2296639 662003 9206759 15101433 12812553 5280394 169189 1981566
5270 1981566 8242895 12994705 13738362 13974813 17805090 23351422 24571390 19689968 14044453
5261 14044453 12564968 12694098 8365904 -603053 -7045433 -4464481 6365190 19124770
5253 19124770 27690159 29617702 26505531 22221227 19173941 15507014 7636371 -3822040
5245 -3822040 -12942936 -14655633 -9916242 -3100787 3315030 8725690 11190148 8594501
5237 8594501 2970360 -317185 1022305 3549540 3314397 1047143 106079 1428049 3148835
$$ packed form
5296G917936m761742o188993m962864l56580M841609P260931N000299q38520n577043
5287B335033m967807q13319R94473q99190j326767K521142N477451K128335l827051
5278A622300l918939K958642Q544756N894674k288880p532159n111205J812377
5270A981566O261329M751810P43657K36451L830277N546332J219968m881422n645515
5261A4044453j479485J29130m328194q968957o442380K580952J0829671J2759580
5253A9124770Q565389J927543l112171m284304l047286l666927p870643j1458411
5245c822040r120896j712697M739391O815455O415817N410660K464458k595647
5237H594501n624141l287545J339490K527235k35143k267254r41064J321970J720786
$$ plain form
5228 3148835 4067509 4899797 6382944 8200185 9942443 11709099 13502885 14812152 14794022
5219 14794022 12693821 8917852 5912795 6244016 8739937 8430742 2130857 -7473393
5211 -7473393 -15212896 -18996085 -19333577 -15513018 -6797013 3037674 7383359 4647691
5203 4647691 707336 1433066 5629791 7596545 4277864 -2530317 -9122047 -12349481
5195 -12349481 -10388465 -3732515 4692927 11960432 17395701 21471822 23490865 22029211
5187 22029211 17446517 12748623 11736574 16288502 24690854 32450983 35690630 33965397
5179 33965397 29128891 22422142 14726908 8736039 7244630 8753930 8438117 4885178
5171 4885178 2404515 4755181 10076401 14543577 17627396 20455035 21967124 20646779
$$ packed form
5228C148835R18674Q32288J483147J817241J742258J766656J793786J309267j8130
5219A4794022k100201l775969l005057L31221K495921l09195o299885r604250
5211g473393p739503l783189l37492L820559Q716005R834687M345685k735668
5203D647691l940355P25730M196725J966754l318681o808181o591730l227434
5195a2349481J961016O655950Q425442P267505N435269M076121K019043j461654
5187B2029211m582694m697894j012049M551928Q402352P760129L239647j725233
5179C3965397m836506o706749p695234n990869j491409J509300l15813l552939
5171D885178k480663K350666N321220M467176L083819K827639J512089j320345
$$ plain form
5163 20646779 17951946 16233188 15026242 13068666 12105587 14583878 19003944 21659482
5155 21659482 21742356 20715534 18202509 13159597 7721265 4575725 1568190 -5037635
5147 -5037635 -12355429 -12969198 -6386152 -1255073 -3301788 -7589890 -7048676 -3039258 -1602893
5138 -1602893 -2891583 -954683 6734950 14866697 16480979 10677669 3066548 -356937
5130 -356937 578953 262571 -5522944 -13069717 -13968169 -5225359 6701537 12949131 10620414
5121 10620414 3266783 -3701666 -6501018 -4966178 -3064820 -4988355 -9371689 -10214245
5113 -10214245 -4634959 3822530 10790462 15449197 17329050 14120420 6504057 564287
5105 564287 701720 3812059 5175978 6360466 11619810 19458278 24078492 23488006 20236420
$$ packed form
5163B0646779k694833j718758j206946j957576r63079K478291M420066K655538
5155B1659482Q2874j026822k513025n042912n438332l145540l007535o605825
5147e037635p317794o13769O583046N131079k046715m288102N41214M009418J436365
5138a602893j288690J936900P689633Q131747J614282n803310p611121l423485
5130c56937R35890l16382n785515p546773q98452Q742810J1926896O247594k328717
5121A0620414p353631o968449k799352J534840J901358j923535m383334q42556
5113a0214245N579286Q457489O967932M658735J879853l208630p616363n939770
5105E64287J37433L110339J363919J184488N259344P838468M620214n90486l251586
$$ plain form
5096 20236420 15439964 8165202 249703 -4002057 -3095299 1322287 8613310 18338403
5088 18338403 26144539 26940436 22779776 21352032 25079602 27470447 22627232 13349498
5080 13349498 6829944 6052205 8182264 8748316 5430244 -116630 -3247377 -1229364
5072 -1229364 3226672 6298493 9443704 16448129 25060198 28343148 25113705 21780323
5064 21780323 21552411 19259715 10930419 1690083 -1555505 -86837 112439 -2107453
5056 -2107453 -3224221 -2027227 -513861 479387 1337782 705382 -2848212 -7240537 -8868699
5047 -8868699 -6794568 -1550949 7599632 19636082 28564949 28998238 23569961 19086259
5039 19086259 16322783 9961794 -1345569 -11496468 -15096491 -13361580 -9545320 -3622476
$$ packed form
5096B0236420m796456p274762p915499m251760R06758M417586P291023R725093
5088A8338403P806136P95897m160660j427744L727570K390845m843215r277734
5080A3349498o519554p77739K130059N66052l318072n546874l130747K018013
5072a229364M456036L071821L145211P004425Q612069L282950l229443l333382
5064B1780323k27912k292696q329296r240336l245588J468668J99276k219892
5056b107453j116768J196994J513366R93248Q58395o32400l553594m392325j628162
5047h868699K074131N243619R150581J2036450Q928867M33289n428277m483702
5039A9086259k763476o360989j1307363j0150899l600023J734911L816260N922844
$$ plain form
5031 -3622476 5010148 13181393 16238239 13305632 7829661 3671057 1826018 143567
5023 143567 -4025218 -9812646 -12087289 -6734314 4001566 13823328 18810733 18251082
5015 18251082 10864946 -3912897 -20382660 -28509057 -24239386 -13580830 -4109123 2771609
5007 2771609 8067734 9155867 3207197 -6226927 -11674755 -9833499 -3286009 4269991
4999 4269991 10331597 12677542 10991107 8939731 10368811 13871693 15338103 14948908
4991 14948908 16056861 17128373 11719064 -919315 -11455360 -11424461 -4246174 87846
4983 87846 -1543451 -3314667 -847498 2444670 949888 -5365820 -10943463 -10119474 -1583779
4974 -1583779 10114873 16395763 10978392 -3047321 -14110068 -12753081 -932965 10929968
$$ packed form
5031c622476Q632624Q171245L056846k932607n475971m158604j845039j682451
5023A43567m168785n787428k274643N352975J0735880R821762M987405n59651
5015A8251082p386136j4777843j6469763q126397M269671J0658556R471707O880732
5007B771609N296125J088133n948670r434124n447828J841256O547490P556000
4999D269991O061606K345945j686435k051376J429080L502882J466410l89195
4991A4948908J107953J071512n409309j2638379j0536045L0899P178287M334020
4983H7846j631297j771216K467169L292168j494782o315708n577643Q23989Q535695
4974a583779J1698652O280890n417371j4025713j1062747J356987J1820116J1862933
$$ plain form
4966 10929968 15361036 14011818 12642573 12974116 11758287 6872825 1476114 702491
4958 702491 5530643 11922069 15905125 17501700 19053462 21794317 25446463 29106936
4950 29106936 30308062 25163651 12968355 -78808 -5553502 -1682110 5542901 10287523
4942 10287523 12093801 12331078 9999952 3956928 -3731545 -9636218 -12109648 -10608435
4934 -10608435 -4897645 2261025 4780009 -243041 -7449047 -8637274 -2345665 5262404
4926 5262404 8139885 5923382 2643306 2623836 6797716 11092164 10288937 5396247 3954250
4917 3954250 9988884 17592442 19019358 15334750 13259991 14921659 17564284 20316533
4909 20316533 23094617 21145730 10317116 -2813490 -6099707 1846641 10208701 12591643
$$ packed form
4966A0929968M431068j349218j369245L31543j215829m885462n396711p73623
4958G02491M828152O391426L983056J596575J551762K740855L652146L660473
4950B9106936J201126n144411j2195296j3047163n474694L871392P225011M744622
4942A0287523J806278K37277k331126o043024p688473n904673k473430J501213
4934a0608435N710790P158670K518984n023050p206006j188227O291609P608069
4926E262404K877481k216503l280076j9470M173880M294448q03227m892690j441997
4917C954250O034634P603558J426916l684608k074759J661668K642625K752249
4909B0316533K778084j948887j0828614j3130606l286217P946348Q362060K382942
$$ plain form
4901 12591643 14768274 22218401 29880899 29941300 22012536 10279036 -2360157 -12282109
4893 -12282109 -14311081 -8251564 -394163 5236965 10382112 14716728 13961757 9818945
4885 9818945 11044758 18894588 22721990 16977770 10598730 11358846 14090070 14215660 18023155
4876 18023155 27464706 33079315 39713101 77636233 157380704 228022580 220658053 134133614
4868 134133614 40919725 549577 2201703 5492725 907153 3308147 12759293 15335427
4860 15335427 10423207 8834014 10294502 6275051 -33934 1589687 7569936 5430581
4852 5430581 -2620250 -1732234 9765223 16644898 11814060 6635455 11053262 19651163
4844 19651163 24195277 25958827 27716873 25334513 16206675 7411054 7158713 13977259
$$ packed form
4901A2591643K176631P450127P662498O0401p928764j1733500j2639193r921952
4893a2282109k028972O059517P857401N631128N145147M334616p54971m142812
4885I818945J225813P849830L827402n744220o379040P60116K731224J25590L807495
4876A8023155R441551N614609O633786L7923132P9744471P0641876p364527q6524439
4868A34133614r3213889m0370148J652126L291022m585572K400994R451146K576134
4860A5335427m912220j589193J460488m019451o308985J623621N980249k139355
4852E430581q050831Q88016J1497457O879675m830838n178605M417807Q597901
4844A9651163M544114J763550J758046k382360r127838q795621k52341O818546
$$ plain form
4836 13977259 20411880 22107557 18522538 10272866 504380 -5829498 -7797210 -9130673
4828 -9130673 -10761911 -8659697 -1900254 3845409 5066450 6411285 12781402 20682023
4820 20682023 23268360 20214870 16743338 15135439 12526440 6411862 -1528798 -7267877
4812 -7267877 -8152200 -4782405 398905 6521300 14423152 21596693 20794182 9190607
4804 9190607 -3755210 -5532290 2794048 7808669 2604713 -5160126 -7233246 -6738425
4796 -6738425 -9734987 -13122531 -9711984 -331826 7650252 11087596 12935966 15176341
4788 15176341 16454147 15939509 14229553 11089384 6450918 2437415 827234 482527
4780 482527 697338 3999414 11243791 17255963 16862411 12551267 10316707 10561119 9948683
$$ packed form
4836A3977259O434621J695677l585019q249672r768486o333878j967712j333463
4828i130673j631238K102214O759443N745663J221041J344835O370117P900621
4820B0682023K586337l053490l471532j607899k608999o114578p940660n739079
4812g267877q84323L369795N181310O122395P901852P173541q02511j1603575
4804I190607j2945817j777080Q326338N014621n203956p764839k073120M94821
4796f738425k996562l387544L410547R380158P982078L437344J848370K240375
4788A5176341J277806n14638j709956l140169m638466m013503j610181l44707
4780D82527K14811L302076P244377O012172l93552m311144k234560K44412o12436
$$ plain form
4771 9948683 10192410 16701066 28278484 36033131 34566183 28055112 23200855 21832213
4763 21832213 22716952 25034362 26801301 24504836 17952577 12073447 10766728 12096643
4755 12096643 12623903 13362574 17589193 24600376 29288438 27413237 19250199 9018586
4747 9018586 2266783 2181016 6505729 9499782 8597080 7264612 9310912 12831188 13186766
4738 13186766 10360304 9067459 11672359 15189864 16452591 16370757 16588778 15031642 8799451
4729 8799451 457710 -2803241 2544617 11846288 17834044 18463850 16746535 14613827
4721 14613827 10961592 6138266 4324097 8577724 15488485 18233551 14999662 11437620
4713 11437620 13250594 18233753 18430041 10428015 837721 -960223 5596850 11656285
$$ packed form
4771I948683K43727O508656J1577418P754647j466948o511071m854257j368642
4763B1832213Q84739K317410J766939k296465o552259n879130j306719J329915
4755A2096643N27260P38671M226619P011183M688062j875201q163038j0231613
4747I018586o751803q5767M324713K994053r02702j332468K046300L520276L55578
4738A3186766k826462j292845K604900L517505J262727q1834K18021j557136o232191
4729H799451q341741l260951N347858R301671N987756O29806j717315k132708
4721A4613827l652235m823326j814169M253627O910761K745066l233889l562042
4713A1437620J812974M983159J96288q002026r590294j797944O557073O059435
$$ plain form
4705 11656285 10970639 8355490 12293934 21930368 27471138 23485442 15448230 10625299
4697 10625299 8188239 3005286 -4906324 -10772050 -12921442 -13914140 -13800118 -8469335
4689 -8469335 2826662 12845564 13219427 4302113 -4932333 -6614370 -1682574 2430691
4681 2430691 621932 -4484657 -6374597 -2981726 894182 197676 -3740591 -5390693
4673 -5390693 -2171404 3536696 8578874 11828031 12867586 11367178 8697424 7298378
4665 7298378 7307770 6385591 3974519 2769390 4044495 4328077 -300745 -8363928 -14703113
4656 -14703113 -17193100 -18226447 -19142051 -16715684 -7625794 5239878 13933057 13403871
4648 13403871 6418322 -510452 -4309753 -6073118 -5574724 692264 13704178 27104536
$$ packed form
4705A1656285o85646k615149L938444R636434N540770l985696q037212m822931
4697A0625299k437060n182953p911610n865726k149392r92698J14022N330783
4689h469335J1295997J0018902L73863q917314r234446j682037M931796M113265
4681B430691j808759n106589j889940L392871L875908o96506l938267j650102
4673e390693L219289N708100N042178L249157J039555j500408k669754j399046
4665G298378R392r22179k411072j205129J275105K83582m628822q063183o339185
4656a4703113k489987j033347r15604K426367R089890J2865672Q693179n29186
4648A3403871o985549o928774l799301j763365M98394O266988J3011914J3400358
$$ plain form
4640 27104536 32269093 27567003 19154011 12815693 9004339 6630127 6888605 9963057
4632 9963057 11263701 5813178 -4351403 -11421202 -11178222 -7708408 -7163821 -9550231
4624 -9550231 -9529598 -4345569 2122392 4145301 1097461 -2107426 -821114 5010512 12391111
4615 12391111 18801935 22648359 22078967 16372189 8356588 2642985 705115 151230
4607 151230 -207710 2297027 9278417 16322572 17041785 11425447 5967061 4714968 4179661
4598 4179661 -643586 -8455410 -13410433 -12909529 -9560108 -5719230 -486244 6304517
4590 6304517 10870012 9648909 4890004 2502593 4705659 8026824 8958349 8372173 8887870
4581 8887870 10655044 12192504 13536130 15539731 16888689 15099216 10910983 8719269
$$ packed form
4640B7104536N164557m702090q412992o338318l811354k374212K58478L074452
4632I963057J300644n450523j0164581p069799K42980L469814N44587k386410
4624i550231K0633N184029O467961K022909l047840l204887J286312N831626P380599
4615A2391111O410824L846424n69392n706778q015601n713603j937870n53885
4607A51230l58940K504737O981390P044155P19213n616338n458386j252093n35307
4598D179661m823247p811824m955023N00904L349421L840878N232986O790761
4590F304517M565495j221103m758905k387411K203066L321165R31525n86176N15697
4581H887870J767174J537460J343626K003601J348958j789473m188233k191714
$$ plain form
4573 8719269 11121123 15181712 16251265 14197292 13267575 15975881 19878057 21663592
4565 21663592 22283049 25371776 31145201 34883270 32655149 26151115 19623329 13896302
4557 13896302 6891411 -567997 -4086980 -2526593 -1391831 -5760284 -12472046 -14014171
4549 -14014171 -9100283 -4154896 -3501366 -3294290 1765109 9510743 12637133 8538083
4541 8538083 2610092 1415504 5579629 10336264 10985098 6858006 1368310 -1025133
4533 -1025133 1211495 5456770 8288954 9170216 9083304 6957315 1383514 -4084174 -2679161
4524 -2679161 5702048 11113363 5141501 -7129841 -12887489 -7850683 216045 4376625
4516 4376625 6819005 11180477 14263471 11721112 6850266 6096621 8429272 6929409
$$ packed form
4573H719269K401854M060589J069553k053973r29717K708306L902176J785535
4565B1663592O19457L088727N773425L738069k228121o504034o527786n727027
4557A3896302p004891p459408l518983J560387J134762m368453o711762j542125
4549a4014171M913888M945387O53530K07076N059399P745634L126390m099050
4541H538083n927991j194588M164125M756635O48834m127092n489696k393443
4533a025133K236628M245275K832184Q81262q6912k125989n573801n467688J405013
4524b679161Q381209N411315n971862j2271342n757648N036806Q066728M160580
4516D376625K442380M361472L082994k542359m870846p53645K332651j499863
$$ plain form
4508 6929409 192488 -5515738 -6480020 -6661922 -9865500 -13136142 -12437715 -10278152 -12144702
4499 -12144702 -17620331 -20394678 -16916738 -10784458 -7326874 -6607483 -3971993 3185578
4491 3185578 11344705 14908278 13309217 11218369 11060372 9195695 2463080 -5255567
4483 -5255567 -8134819 -7378798 -8482482 -11028469 -9303390 -3461226 -1096899 -5028021
4475 -5028021 -8365956 -6160036 -3108707 -3255743 -673030 10217283 21752903 21958812
4467 21958812 12759977 7538578 11728708 17341780 17453559 14736854 12781144 9710915
4459 9710915 5483378 6115488 13608631 18879622 12972229 762928 -4884722 -499851
4451 -499851 4421131 1459287 -5983587 -8665148 -3807467 2551220 4245626 2424302
$$ packed form
4508F929409o736921n708226r64282j81902l203578l270642O98427K159563j866550
4499a2144702n475629k774347L477940O132280L457584P19391K635490P157571
4491C185578Q159127L563573j599061k090848j57997j864677o732615p718647
4483e255567k879252P56021j103684k545987J725079N842164K364327l931122
4475e028021l337935K205920L051329j47036K582713J0890313J1535620K05909
4467B1958812r198835n221399M190130N613072J11779k716705j955710l070229
4459I710915m227537O32110P493143N270991n907393j2209301n647650M384871
4451d99851M920982k961844p442874k681561M857681O358687J694406j821324
$$ plain form
4443 2424302 2796278 7334848 11904398 12585875 10909206 10430515 11089188 10665641 9519704
4434 9519704 9071319 6910378 -954464 -12693376 -20585378 -19382796 -10737818 775302
4426 775302 11101746 15830963 11858867 2005674 -6741286 -11210054 -13636774 -14636075
4418 -14636075 -11186277 -3822760 1244342 1031962 213474 2049184 1685537 -5106747 -12493759
4409 -12493759 -12021963 -5561121 -2280199 -4991619 -8171572 -8875800 -10774136 -15507791
4401 -15507791 -17492458 -11173067 950032 10894531 13367201 9541124 4886965 4580876
4393 4580876 9285885 14626820 16042262 13815905 11557882 10623017 8921658 5236312
4385 5236312 1888594 2213380 6866629 12907912 15676092 12446207 5644681 1345577
$$ packed form
4443B424302L71976M538570M569550O81477j676669m78691O58673m23547j145937
4434I519704m48385k160941p864842j1738912p892002J202582Q644978J1513120
4426G75302J0326444M729217l972096r853193q746960m468768k426720r99301
4418a4636075L449798P363517N067102k12380q18488J835710l63647o792284p387012
4409a2493759M71796O460842L280922k711420l179953p04228j898336m733655
4401a5507791j984667O319391J2123099R944499K472670l826077m654159l06089
4393D580876M705009N340935J415442k226357k258023r34865j701359l685346
4385E236312l347718L24786M653249O041283K768180l229885o801526m299104
$$ plain form
4377 1345577 2878890 7058527 8402439 5576053 1738619 301845 2614154 7797859
4369 7797859 12042074 10156530 1482878 -7167562 -8233891 -2144308 4046587 5465442
4361 5465442 2924112 -1199954 -5621199 -8310113 -6395701 649749 10333997 19936650
4353 19936650 27345006 29619400 24501966 13925815 2997404 -4779415 -8568926 -7550581
4345 -7550581 -1933239 3102475 49342 -11614941 -22689018 -24074967 -16782398 -9183784
4337 -9183784 -6542455 -6962636 -6937655 -6896616 -9334473 -13284273 -13721001 -7755730 332717
4328 332717 3137565 -787293 -5116937 -4290160 -341411 1552048 1155021 2433024 6378769
4319 6378769 9361600 8659138 5745763 3495951 3140358 4483538 6546030 7568498 6478265
$$ packed form
4377A345577J533313M179637J343912k826386l837434j436774K312309N183705
4369G797859M244215j885544q673652q650440j066329O089583O190895J418855
4361E465442k541330m124066m421245k688914J914412P045450R684248R602653
4353A9936650P408356K274394n117434j0576151j0928411p776819l789511J018345
4345g550581N617342N035714l053133j1664283j1074077j385949P292569P598614
4337i183784K641329m20181K4981M1039k437857l949800m36728N965271Q088447
4328C32717K804848l924858m329644Q26777L948749J893459l97027J278003L945745
4319F378769K982831p02462k913375k249812l55593J343180K062492J022468j090233
$$ plain form
4310 6478265 4419560 3104000 2290337 830671 -831125 -1384564 -612901 1469698 5376148
4301 5376148 9370720 8724224 1743725 -5938111 -7888938 -5567388 -5194281 -8094083 -10667827
4292 -10667827 -12559658 -17093772 -23192637 -24574044 -18970761 -11513096 -6701127 -3238617
4284 -3238617 773146 3783278 4851186 5735151 5760621 787054 -8823936 -15420852 -14224948
4275 -14224948 -10617864 -11369989 -13674383 -10318082 -2508062 679602 -4795150 -12649793
4267 -12649793 -15330916 -13231541 -12684488 -17943278 -27276623 -35419431 -38165053 -34703177
4259 -34703177 -26501874 -15510744 -4566841 2302566 3231320 1533394 1666221 2547284
4251 2547284 -443434 -6739181 -10088339 -8638907 -8751165 -14633694 -20248455 -17513682
$$ packed form
4310F478265k058705j315560q13663j459666j661796n53439P71663K082599L906450
4301E376148L994572o46496o980499p681836j950827K321550L73107k899802k573744
4292a0667827j891831m534114o098865j381407N603283P457665M811969L462510
4284c238617M011763L010132J067908Q83965K5470m973567r610990o596916J195904
4275a4224948L607084p52125k304394L356301P810020L187664n474752p854643
4267a2649793k681123K099375N47053n258790r333345q142808k745622L461876
4259c4703177Q201303J0991130J0943903O869407R28754j697926J32827Q81063
4251B547284k990718o295747l349158J449432j12258n882529n614761K734773
$$ plain form
4243 -17513682 -8190405 -936664 663976 397257 1367572 2448922 2751562 3666662 5455415
4234 5455415 6505687 6993488 9155511 12935437 15291654 14977594 14025633 12758920 7462351
4225 7462351 -3629413 -14885009 -18363337 -13930053 -10212158 -14062240 -22204687 -26171344
4217 -26171344 -23587373 -20340988 -21347410 -23658198 -21267274 -13526860 -5451267 -1898540
4209 -1898540 -4737634 -13325096 -23450480 -27737202 -22380818 -12889354 -8346970 -10755628
4201 -10755628 -15287925 -19946092 -27602149 -37347084 -41379900 -34237672 -19921668 -6328856
4193 -6328856 3155502 9360882 12718245 12760471 9959020 5517296 813729 -2420849 -3753536
4184 -3753536 -5493447 -9346220 -13001428 -14452730 -17457997 -25980739 -34822342 -34346406
$$ packed form
4243a7513682R323277P253741J600640k66719R70315J081350L02640R15100J788753
4234E455415J050272M87801K162023L779926K356217l14060r51961j266713n296569
4225G462351j1091764j1255596l478328M433284L717895l850082q142447l966657
4217b6171344K583971L246385j006422k310788K390924P740414Q075593L552727
4209a898540k839094q587462j0125384m286722N356384R491464M542384k408658
4201a0755628m532297m658167p656057r744935m032816P142228J4316004J3592812
4193f328856R484358O205380L357363M2226k801451m441724m703567l234578j332687
4184c753536j739911l852773l655208j451302l005267q522742q841603M75936
$$ plain form
4176 -34346406 -24568760 -15718757 -14067816 -16432869 -19600702 -24418754 -28153796 -24296511
4168 -24296511 -14248990 -8361674 -10597104 -13155680 -11551593 -13047590 -22907225 -33574559
4160 -33574559 -35962155 -31762716 -26967035 -23090298 -21742201 -26646911 -33943074 -33041566
4152 -33041566 -24598594 -22921982 -31858542 -35836109 -26652810 -19767961 -28001960 -38811738
4144 -38811738 -37668489 -34411713 -42253784 -49652746 -42014383 -34192809 -48059958 -72495601
4136 -72495601 -82941784 -87622441 -111325323 -144002458 -157163861 -166219744 -212225171
4129 -212225171 -269867787 -244147260 -97136106 78065333 160986928 141532518 101161936
4122 101161936 89980855 87474150 71484260 58410553 63431440 71450649 67220609 59720096
$$ packed form
4176c4346406R777646Q850003J650941k365053l167833m818052l735042L857285
4168b4296511J0047521N887316k235430k558576J604087j495997r859635j0667334
4160c3574559k387596M199439M795681L876737J348097m904710p296163R01508
4152c3041566Q442972J676612q936560l977567R183299O884849q233999j0809778
4144c8811738J143249L256776p842071p398962P638363P821574j3867149k4435643
4136g2495601j0446183m680657k3702882l2677135j3161403r055883m6005427
4129b12225171n7642616K5720527J47011154J75201439Q2921595j9454410m0370582
4122A01161936j1181081k506705j5989890j3073707N020887Q019209m230040p500513
$$ plain form
4114 59720096 59393714 58454744 49279074 39977915 37804317 35975591 29186399 25253050
4106 25253050 29773743 34280590 30814765 25258868 25754145 29276758 29538894 28369543
4098 28369543 29997360 32020375 30098033 25367004 21414935 19758448 21999411 29703036
4090 29703036 39111130 42930360 39590746 33800606 27539559 19340169 12602626 13679555
4082 13679555 20078309 21617344 15408075 8567085 4466681 -718208 -5082228 583889
4074 583889 15760073 25837670 22567328 15825084 16122037 18002729 11750050 601502
4066 601502 -6120080 -8435083 -11603705 -13295456 -7690912 1829113 5778999 1830577
4058 1830577 -4524337 -9532805 -12318849 -9824746 -418956 9514999 11824296 8072430
$$ packed form
4114E9720096l26382r38970r175670r301159k173598j828726o789192l933349
4106B5253050M520693M506847l465825n555897M95277L522613K62136j169351
4098B8369543J627817K023015j922342m731029l952069j656487K240963P703625
4090B9703036R408094L819230l339614n790140o261047q199390o737543J076929
4082A3679555O398754J539035o209269o840990m100404n184889m364020N666117
4074E83889J5176184J0077597l270342o742244K96953J880692o252679j1148548
4066F01502o721582k315003l168622j691751N604544R520025L949886l948422
4058A830577o354914n008468k786044K494103R405790R933955K309297l751866
$$ plain form
4050 8072430 6464866 8997083 10488661 9437539 10480195 15104642 18286090 16740747
4042 16740747 14011564 14654737 18179406 21070238 21272069 19026105 15965403 14285015
4034 14285015 14681340 15019673 12887533 8791500 5051259 2967528 3082990 6149805 11167543
4025 11167543 14501416 13870205 11343529 9706914 8222731 5103520 1736601 841453
4017 841453 2436242 5049402 8784496 13545225 16350402 14541928 10338268 8550093
4009 8550093 10790004 14833735 18283580 20208902 20871327 22152789 26058528 30872473
4001 30872473 32119933 29513817 28293193 30301199 29221392 19968511 7689362 605592
3993 605592 -1798853 -5364190 -9170138 -6229817 4341145 14540383 17849600 15225132
$$ packed form
4050H072430j607564K532217J491578j051122J042656M624447L181448j545343
4042A6740747k729183O43173L524669K890832K01831k245964l060702j680388
4034A4285015L96325L38333k132140m096033l740241k083731J15462L066815N017738
4025A1167543L333873o31211k526676j636615j484183l119211l366919q95148
4017H41453J594789K613160L735094M760729K805177j808474m203660j788175
4009H550093K239911M043731L449845J925322O62425J281462L905739M813945
4001C0872473J247460k606116j220624K008006j079807r252881j2279149p083770
3993F05592k404445l565337l805948K940321J0570962J0199238L309217k624468
$$ plain form
3985 15225132 10016309 4279148 1618246 6211531 15826154 21659112 18469546 10291402
3977 10291402 3514202 -825976 -4635955 -7107992 -5797965 -1109070 3578452 5129182
3969 5129182 2509307 -2786035 -7004752 -6804587 -2639644 2160439 5619830 7906827
3961 7906827 8259759 4926157 -980490 -5093939 -4746424 -1711921 810217 1193189 -1094257
3952 -1094257 -5519648 -8970464 -7494791 -981314 6598805 12470957 17427868 21926944
3944 21926944 23327882 18904350 9191988 -2710685 -12619354 -15760344 -9648356 2215207
3936 2215207 12983789 19995977 26107036 32789206 36835217 35891780 32288111 28674724
3928 28674724 24880009 22152238 24408020 30114417 28940750 14430244 -3729584 -9227648
$$ packed form
3985A5225132n208823n737161k660902M593285R614623N832958l189566q178144
3977A0291402o777200m340178l809979k472037J310027M688895M687522J550730
3969E129182k619875n295342m218717K00165M164943M800083L459391K286997
3961G906827L52932l333602n906647m113449L47515L034503K522138L82972k287446
3952a094257m425391l450816J475673O513477P580119N872152M956911M499076
3944B1926944J400938m423532r712362j1902673r908669l140990O111988J1863563
3936B215207J0768582P012188O111059O682170M046011r43437l603669l613387
3928B8674724l794715k727771K255782N706397j173667j4510506j8159828n498064
$$ plain form
3920 -9227648 259066 11041802 12546614 8889548 8056456 8947800 6728356 5028059
3912 5028059 12773499 29421704 41814876 38836713 24260750 11519298 8642033 11870965
3904 11870965 12574190 6748504 -2579555 -9568082 -10745549 -7228890 -3012617 -927904
3896 -927904 -176666 1751132 5274432 8281655 9463944 10090091 11484063 12523166 11400216
3887 11400216 8689698 6459026 4680464 786584 -6473454 -14085313 -16692241 -11356737
3879 -11356737 -495138 9517822 13064653 9562093 3370914 -598326 -914188 523000
3871 523000 1508830 1970853 4336006 11619102 23586092 34482289 36832735 28706007
3863 28706007 15305416 2610765 -7468212 -14206294 -14987421 -9376588 -2865622 -941076
$$ packed form
3920i227648R486714J0782736J504812l657066q33092Q91344k219444j700297
3912E028059P745440J6648205J2393172k978163j4575963j2741452k877265L228932
3904A1870965P03225n825686r328059o988527j177467L516659M216273K084713
3896i27904P51238J927798L523300L007223J182289O26147J393972J039103j122950
3887A1400216k710518k230672j778562l893880p260038p611859k606928N335504
3879a1356737J0861599J0012960L546831l502560o191179l969240l15862J437188
3871E23000R85830M62023K365153P283096J1966990J0896197K350446q126728
3863B8706007j3400591j2694651j0078977o738082p81127N610833O510966J924546
$$ plain form
3855 -941076 -1237524 2563742 10093523 14127545 11441513 7282538 7256136 10607322 13835544
3846 13835544 15369092 13890945 7775006 65547 -1253802 7134406 18062362 22393406
3838 22393406 19541618 14738883 10260411 5822044 4144031 8240816 14687230 17223373
3830 17223373 16533768 18760446 24021557 24783214 17898741 10301422 8580546 9570285 6633235
3821 6633235 95836 -4671871 -6101301 -7196173 -9332389 -10827630 -10885305 -10256973 -8352461
3812 -8352461 -3812029 2197787 6946895 10302185 14482464 19731896 23655240 24978130
3804 24978130 24627066 22837811 18678226 13175060 9669127 9936118 12524599 15565774
3796 15565774 18377304 19649121 17330253 11639916 5401698 305047 -4256467 -7849490
$$ packed form
3855i41076k96448L801266P529781M034022k686032m158975k6402L351186L228222
3846A3835544J533548j478147o115939p709459j319349Q388208J0927956M331044
3838B2393406k851788m802735m478472m438367j678013M096785O446414K536143
3830A7223373o89605K226678N261111P61657o884473p597319j720876R89739k937050
3821F633235o537399m767707j429430j094872k136216j495241n7675O28332J904512
3812h352461M540432O009816M749108L355290M180279N249432L923344J322890
3804B4978130l51064j789255m159585n503166l505933K66991K588481L041175
3796A5565774K811530J271817k318868n690337o238218n096651m561514l593023
$$ plain form
3788 -7849490 -8397214 -6545704 -6397715 -9064935 -9298130 -2175710 9898691 20584010
3780 20584010 27017495 29667097 27752300 20378690 10875183 4579814 2573109 2110032
3772 2110032 2542312 5597071 9818030 10347432 5570780 -638461 -4580944 -6162013 -5345396
3763 -5345396 -127873 9371567 18794120 24318451 26454868 26924170 25361666 21994120
3755 21994120 20323937 23438000 29416042 33454576 33470882 31433765 30109752 30015966 28851667
3746 28851667 23721632 15475784 10123227 12660175 19745743 22823786 19011695 14023130
3738 14023130 13235623 15464018 17678750 19940351 22252174 21986186 18471905 15250649
3730 15250649 13955203 11401463 7018663 6719495 13298071 19147994 16241182 8150348
$$ packed form
3788g849490n47724J851510J47989k667220k33195P122420J2074401J0685319
3780B0584010O433485K649602j914797p373610r503507o295369k006705m63077
3772B110032M32280L054759M220959N29402m776652o209241l942483j581069Q16617
3763e345396N217523R499440R422553N524331K136417M69302j562504l367546
3755B1994120j670183L114063N978042M038534J6306k037117j324013r3786j164299
3746B8851667n130035q245848n352557K536948P085568L078043l812091m988565
3738A4023130p87507K228395K214732K261601K311823k65988l514281l221256
3730A5250649j295446k553740m382800k99168O578576N849923k906812q090834
$$ plain form
3722 8150348 3438545 1619415 -3978485 -12111265 -13802347 -6800138 496032 1448068
3714 1448068 -1180882 -2146296 -413262 3409443 9036409 13404056 12318243 7539482
3706 7539482 5672827 7888721 7883449 2864527 -852680 2635500 10158605 14917468 15010378
3697 15010378 11928800 5866126 -2040313 -6721752 -3884478 4324590 11909133 15249562
3689 15249562 14706369 13182070 14877104 21485892 27782517 25778268 15541165 6461396
3681 6461396 4851402 6352457 4774390 2102127 3503607 7313653 7341175 2613218 -1756286
3672 -1756286 -2215918 54393 2868838 5587373 8419936 12210959 17924169 24292347
3664 24292347 28090949 28594487 28556331 28586990 24741773 14903028 3330275 -4937037 -10023264
$$ packed form
3722H150348m711803j819130n597900q132780j691082P002209P296170R52036
3714A448068k628950r65414J733034L822705N626966M367647j085813m778761
3706G539482j866655K215894n272n018922l717207L488180P523105M758863R2910
3697A5010378l081578o062674p906439m681439K837274Q209068P584543L340429
3689A5249562n43193j524299J695034O608788O296625k004249j0237103r079769
3681F461396j609994J501055j578067k672263J401480L810046K7522m727957m369504
3672a756286m59632K270311K814445K718535K832563L791023N713210O368178
3664B4292347L798602N03538l8156L0659l845217r838745j1572753q267312n086227
$$ plain form
3655 -10023264 -13542234 -13743219 -9627530 -5687372 -6373946 -8967547 -8000759 -4077455 -2129229
3646 -2129229 -2985325 -2692137 1160060 7531033 14654733 20145823 20954429 17987366 17535280
3637 17535280 22710492 27264124 24395468 17681265 15090027 15286567 9427984 -4585771
3629 -4585771 -18917865 -26777211 -28010671 -23720636 -14359572 -4297564 461063 1043322
3621 1043322 4217420 10527305 12539829 7462125 2592876 4054854 8172549 9271078
3613 9271078 9021514 11816632 16073309 16485206 11858482 5767352 1532885 -259251 -1610140
3604 -1610140 -6365099 -16201550 -25890668 -27175754 -19406814 -11237869 -9203261 -10073442
3596 -10073442 -7884280 -2949689 658759 1929155 2343170 2235569 2220363 4867224 10759534
$$ packed form
3655a0023264l518970k00985M115689L940158o86574k593601R66788L923304J948226
3646b129229q56096K93188L852197O370973P123700N491090Q08606k967063m52086
3637A7535280N175212M553632k868656o714203k591238J96540n858583j4013755
3629d585771j4332094p859346j233460M290035R361064J0062008M758627N82259
3621A043322L174098O309885K012524n077704m869249J461978M117695J098529
3613I271078k49564K795118M256677M11897m626724o091130m234467j792136j350889
3604a610140m754959r836451r689118j285086P768940Q168945K034608q70181
3596a0073442K189162M934591L608448J270396M14015j07601j5206K646861N892310
$$ plain form
3587 10759534 16147757 18342754 19672076 21936064 21209785 13631222 3025447 -3159278
3579 -3159278 -3293261 -1389984 602464 4490812 10640044 16492916 20430430 22900403
3571 22900403 23679761 21788106 18340312 16393297 17702888 21621681 26362214 29252667
3563 29252667 27323685 20542049 13330787 10119889 10381380 10392224 8351948 5129737 1726500
3554 1726500 -838801 -597629 2972231 6476290 5679065 684526 -4233334 -5227804 -1486388
3545 -1486388 5306001 12063150 16400658 19389312 24035503 29368858 29540322 21857386
3537 21857386 12288580 8943276 12877303 19359942 24890207 27761363 24911078 15267683
3529 15267683 5083371 3009377 9416572 16229600 17550668 14749046 10764199 5925757
$$ packed form
3587A0759534N388223K194997J329322K263988p26279p578563j0605775o184725
3579c159278j33983J903277J992448L888348O149232N852872L937514K469973
3571B2900403P79358j891655l447794j947015J309591L918793M740533K890453
3563B9252667j928982o781636p211262l210898K61491J0844k040276l222211l403237
3554A726500k565301K41172L569860L504059p97225m994539m917860r94470L741416
3545a486388O792389O757149M337508K988654M646191N333355J71464p682936
3537B1857386r568806l345304L934027O482639N530265K871156k850285r643395
3529A5267683j0184312k073994O407195O813028J321068k801622l984847m838442
$$ plain form
3521 5925757 1303191 306929 3945630 8812583 12342333 16112606 21497122 25987267
3513 25987267 26794553 24913376 22749274 20490491 17619646 15577614 16068441 18456316
3505 18456316 21034873 23065353 23756762 21638908 17339498 14700517 16165858 18690998
3497 18690998 17328474 11845957 6691927 4790528 4400958 2652954 -249335 -1718253
3489 -1718253 -583290 1070743 123533 -3598883 -5983599 -2280591 7465101 17472699
3481 17472699 21385677 17820927 10523338 4277668 1663778 2571346 4822062 5265331
3473 5265331 2192788 -2338037 -3740759 229858 6317001 8724762 5094561 -1603129
3465 -1603129 -6627915 -6809795 -574784 11432247 23526455 26785803 18752121 9428467
$$ packed form
3521E925757m622566r96262L638701M866953L529750L770273N384516M490145
3513B5987267Q07286j881177k164102k258783k870845k042032M90827K387875
3505A8456316K578557K030480O91409k117854m299410k638981J465341K525140
3497A8690998j362524n482517n154030j901399l89570j748004k902289j468918
3489a718253J134963J654033r47210l722416k384716L703008R745692J0007598
3481A7472699L912978l564750p297589o245670k613890R07568K250716M43269
3473E265331l072543m530825j402722L970617O087143K407761l630201o697690
3465a603129n024786j81880O235011J2007031J2094208L259348q033682r323654
$$ plain form
3457 9428467 11482014 24391337 34604142 32882257 24789974 20641723 21684389 22009676
3449 22009676 19097383 15256004 11499831 7157877 4009175 4066415 4338971 622460 -4294600
3440 -4294600 -3694721 1871150 4796625 3144443 4123499 11399491 17870272 17032033 13855195
3431 13855195 16407833 22434793 23592241 19551160 17744583 19813464 18344052 9326734
3423 9326734 -555988 -3097248 1315117 7109788 11692828 14966508 14858296 9650557
3415 9650557 2933407 449887 2523435 4677449 5578490 8777061 15220227 19405122
3407 19405122 16264138 8328658 2548626 2415886 6454243 12165236 17455525 19483748
3399 19483748 16380732 10227512 5201987 2884736 2226567 3432543 8087801 15410161
$$ packed form
3457I428467K053547J2909323J0212805j721885q092283m148251J042666L25287
3449B2009676k912293l841379l756173m341954l148702N7240K72556l716511m917060
3440d294600N99879N565871K925475j652182R79056P275992O470781q38239l176838
3431A3855195K552638O026960J157448m041081j806577K068881j469412r017318
3423I326734r882722k541260M412365N794671M583040L273680j08212n207739
3415I650557o717150k483520K073548K154014R01041L198571O443166M184895
3407A9405122l140984p935480n780032j32740M038357N710993N290289K028223
3399A9483748l103016o153220n025525k317251o58169J205976M655258P322360
$$ plain form
3391 15410161 22170160 26759580 29880738 31389055 30946096 31824551 38067508 46200080
3383 46200080 46165587 34045913 18230134 8592283 4899611 1311692 -2909615 -4523847
3375 -4523847 -4451316 -6408909 -8969441 -7224783 -2301859 -1107404 -4927423 -5591993 3704169
3366 3704169 19083459 30734491 32906812 26514982 15790287 5691835 -2331 -1120333
3358 -1120333 -582383 -426033 -44399 1346339 3041124 4055374 3477408 -119198 -6281167
3349 -6281167 -10198319 -7240101 -296027 2608265 -752454 -3732832 -874618 4528600
3341 4528600 6351657 4115020 1230255 -902044 -1921753 920755 9221250 18185820
3333 18185820 20888005 17670365 16189172 21175616 28457002 31034430 27896324 24021343
$$ packed form
3391A5410161O759999M589420L121158J508317m42959Q78455O242957Q132572
3383D6200080l4493j2119674j5815779r637851l692672l587919m221307j614232
3375d523847P2531j957593k560532J744658M922924J194455l820019o64570R296162
3366C704169J5379290J1651032K172321o391830j0724695j0098452n694166j118002
3358a120333N37950J56350L81634J390738J694785J014250n77966l596606o161969
3349f281167l917152K958218O944074K904292l360719k980378K858214N403218
3341D528600J823057k236637k884765k132299j019709K842508Q300495Q964570
3333A8185820K702185l217640j481193M986444P281386K577428l138106l874981
$$ plain form
3325 24021343 23014129 22609500 18248254 9512947 1071275 -2800554 -2519997 -955565
3317 -955565 711150 2370468 2331125 -734497 -3998685 -3004552 1726555 4737515 3045319
3308 3045319 -422390 -1674654 131189 4346423 10151856 14485682 13226893 6946646
3300 6946646 1456276 173189 104625 -1833979 -3031118 407068 7061904 12076223 12948649
3291 12948649 10270481 5810272 3028733 5794396 12674828 16069872 11473294 4440646
3283 4440646 3757862 10651638 19393528 25304960 26782524 22602240 13774685 6141456
3275 6141456 4721175 6861366 7037253 6399019 10060391 16171165 16677029 9986328 4001111
3266 4001111 3642550 3840888 -112726 -2808807 3141819 13922348 18198969 12940051
$$ packed form
3325B4021343j007214m04629m361246q735307q441672l871829K80557J564432
3317i55565J666715J659318l9343l065622l264188R94133M731107L010960j692196
3308C045319l467709j252264J805843M215234N805433M333826j258789o280247
3300F946646n490370j283087o8564j938604j197139L438186O654836N014319Q72426
3291A2948649k678168m460209k781539K765663O880432L395044m596578p032648
3283D440646o82784O893776Q741890N911432J477564m180284q827555p633229
3275F141456j420281K140191J75887o38234L661372O110774N05864o690701n985217
3266D001111l58561J98338l953614k696081N950626J0780529M276621n258918
$$ plain form
3258 12940051 7523155 10012314 15586626 13266851 1072487 -11133271 -14354778 -11269883
3250 -11269883 -11167064 -16892783 -21707281 -19028231 -10455003 -2131185 2948082 5834011
3242 5834011 7595044 8150042 7988843 8108230 8682805 9400484 9982741 9367836 6658269
3233 6658269 4149709 6205068 13013222 18929196 19633526 17177886 14945519 12283509
3225 12283509 8509413 7340574 11232813 15418272 14717201 12984591 17718608 27534932
3217 27534932 33786850 33712633 32989896 34956312 36235047 34445144 31623003 27774834 19406572
3208 19406572 7587694 -258704 -195539 3587112 6995553 11007131 14630596 11865544
3200 11865544 2130027 -4082508 1797080 13406704 17899150 13050936 7129702 4779315
$$ packed form
3258A2940051n416896K489159N574312k319775j2194364j2205758l221507L084895
3250a1269883J02819n725719m814498K679050Q573228Q323818N079267K885929
3242E834011J761033N54998j61199J19387N74575P17679N82257o14905k709567
3233F658269k508560K055359O808154N915974P04330k455640k232367k662010
3225A2283509l774096j168839L892239M185459p01071j732610M734017R816324
3217B7534932O251918p4217p22737J966416J278735j789903k822141l848169q368262
3208A9406572j1818878p846398O3165L782651L408441M011578L623465k765052
3200A1865544r735517o212535N879588J1609624M492446m848214n921234k350387
$$ plain form
3192 4779315 2641840 -1545019 -4498402 -3870511 -2441993 -3461716 -6719207 -11152171
3184 -11152171 -16841835 -22063543 -22216360 -15095752 -5522546 -1780049 -7196095 -16356406
3176 -16356406 -20210885 -15126746 -6575860 -3021378 -6550443 -11378743 -11592735 -7538260
3168 -7538260 -3335202 -836198 1661684 6359043 13540863 20962704 24447494 20876896
3160 20876896 11909552 2967783 -2444792 -5259200 -7122685 -7640710 -6933737 -7124704 -8480863
3151 -8480863 -7401355 -1655863 5168876 8247148 8273437 9477121 12361420 12911688 9115814
3142 9115814 4699331 5135734 11421475 18491587 19856143 14565024 9009482 9679257 14874619
3133 14874619 17426705 15408755 14396623 17379297 18977360 13948763 5789691 1024601
$$ packed form
3192D779315k137475m186859k953383O27891J428518j019723l257491m432964
3184a1152171n689664n221708j52817P120608R573206L742497n416046r160311
3176a6356406l854479N084139Q550886L554482l529065m828300k13992M054475
3168g538260M203058K499004K497882M697359P181820P421841L484790l570598
3160B0876896q967344q941769n412575k814408j863485n18025P06973j90967j356159
3151h480863J079508N745492O824739L078272K6289J203684K884299N50268l795874
3142I115814m416483M36403O285741P070112J364556n291119n555542O69775N195362
3133A4874619K552086k017950j012132K982674J598063n028597q159072m765090
$$ plain form
3125 1024601 -774219 -4573544 -10331632 -12940377 -10699821 -7566058 -6884775 -7933244
3117 -7933244 -8801504 -8373796 -5465410 162397 6113850 9968770 12768966 16693770 20688826
3108 20688826 22009961 20577327 18139310 15048718 11790331 11221036 14536427 17437879
3100 17437879 15592744 11484209 10048475 10173096 7446399 3065682 2021427 3838558
3092 3838558 3746301 2456436 5497975 12303886 15563203 13082937 10654593 10718335 8465849
3083 8465849 3174718 2723110 10356089 16575921 12690478 4742495 4295096 10848928 13616326
3074 13616326 7884803 161088 -2157037 1433447 6931518 9936976 7703780 2151248
3066 2151248 -111667 4480707 10210214 8651485 -40280 -7790701 -9197308 -5793822
$$ packed form
3125A024601j798820l799325n758088k608745K240556L133763O81283j048469
3117g933244q68260M27708K908386N627807N951453L854920K800196L924804L995056
3108B0688826J321135j432634k438017l090592l258387n69295L315391K901452
3100A7437879j845135m108535j435734J24621k726697m380717j044255J817131
3092C838558r2257j289865L041539O805911L259317k480266k428344O3742k252486
3083H465849n291131m51608P632979O219832l885443p947983m47399O553832K767398
3074A3616326n731523p723715k318125L590484N498071L005458k233196n552532
3066B151248k262915M592374N729507j558729q691765p750421j406607L403486
$$ plain form
3058 -5793822 -829760 3868945 5621123 1455384 -7479502 -16118830 -20851463 -21313237
3050 -21313237 -17395543 -9021954 985403 8337712 12226652 15193700 18302602 20663166
3042 20663166 23333732 28498843 34318656 35923774 32696516 29380263 28323526 25916464
3034 25916464 19357620 12199471 9678024 12077027 16151804 20374051 25477935 31711676
3026 31711676 38184972 43548087 45861426 43845516 39336310 35631877 32161375 24512142
3018 24512142 11908781 711888 -2877788 -344705 2669464 4555925 7937400 13527027
3010 13527027 18440644 20140566 18489656 14420077 9645763 6718669 6012562 3695575
3002 3695575 -3481776 -12184793 -15598488 -12342600 -7684636 -5327690 -2928414 2330488
$$ packed form
3058e793822M964062M698705J752178m165739q934886q639328m732633m61774
3050b1313237L917694Q373589J0007357P352309L888940K967048L108902K360564
3042B0663166K670566N165111N819813J605118l227258l316253j056737k407062
3034B5916464o558844p158149k521447K399003M074777M222247N103884O233741
3026C1711676O473296N363115K313339k015910m509206l704433l470502p649233
3018B4512142j2603361j1196893l589676K533083L014169J886461L381475N589627
3010A3527027M913617J699922j650910m069579m774314k927094p06107k316987
3002C695575p177351q703017l413695L255888M657964K356946K399276N258902
$$ plain form
2994 2330488 8162292 10238138 7693431 2443930 -4523752 -12724681 -19548904 -21503348
2986 -21503348 -17806855 -10518418 -1755856 6991250 13610664 16291514 15817883 14572314
2978 14572314 13050283 9855967 5759589 4836658 9402937 15581978 16782153 11487113
2970 11487113 5330357 4789139 10531202 17988842 22878623 24201980 22613368 18548780
2962 18548780 12869480 7418041 3367329 104197 -2754416 -3136046 1844407 12115741
2954 12115741 23763207 31744829 32874665 27500062 19966018 16077322 17503224 19549193
2946 19549193 17258862 12458727 10531387 10959030 7233448 -2196311 -9373809 -7407727
2938 -7407727 -293795 3452763 2743105 2404920 2433302 -2622279 -13097875 -21025993 -20300911
$$ packed form
2994B330488N831804K075846k544707n249501o967682q200929o824223j954444
2986b1503348L696493P288437Q762562Q747106O619414K680850m73631j245569
2978A4572314j522031l194316m096378r22931M566279O179041J200175n295040
2970A1487113o156756n41218N742063P457640M889781J323357j588612m064588
2962A8548780n679300n451439m050712l263132k858613l81630M980453J0271334
2954A2115741J1647466P981622J129836n374603p534044l888696J425902K045969
2946A9549193k290331m800135j927340M27643l725582r429759p177498J966082
2938g407727P113932L746558p09658l38185K8382n055581j0475596p928118P25082
$$ plain form
2929 -20300911 -13909957 -7623317 -1779214 6061800 14028734 16976100 13642240 8675387
2921 8675387 6918598 7594137 4870642 -5569467 -19886817 -27384812 -21269645 -7291972
2913 -7291972 2377261 3618737 3355310 7248294 11264121 9223264 2658481 -2601586
2905 -2601586 -5373491 -8350286 -11485996 -12771090 -13561120 -16175919 -17126571 -10103189 3409128
2896 3409128 13255432 12739104 6306147 2303787 2576216 2931800 948884 -867571 778169
2887 778169 5383077 9147283 9729522 9655241 13255277 19893767 23313446 19838904 13906982
2878 13906982 11747439 12643228 11528755 7725704 4720185 2867716 -129713 -1730689
2870 -1730689 3908783 14966302 20922299 16501624 9362929 8764129 13079503 15065780
$$ packed form
2929b0300911O390954O286640N844103P841014P966934K947366l333860m966853
2921H675387j756789O75539k723495j0440109j4317350p497995O115167J3977673
2913g291972R669233J241476k63427L892984M015827k040857o564783n260067
2905b601586k771905k976795l135710j285094p90030k614799r50652P023382J3512317
2896C409128R846304n16328o432957m002360K72429L55584j982916j816455J645740
2887G78169M604908L764206N82239p4281L600036O638490L419679l474542n931922
2878A3906982k159543Q95789j114473l803051l005519j852469k997429j600976
2870a730689N639472J1057519N955997m420675p138695n98800M315374J986277
$$ plain form
2862 15065780 14212829 15826160 20519014 22574587 18733430 12637513 9858380 12731290
2854 12731290 20125368 28256648 31562477 26674566 16458248 7624546 4190662 5372765
2846 5372765 8980580 13647079 17801372 19553452 18403114 15461077 12196392 10301904
2838 10301904 11304013 13841599 12905888 5441369 -3808182 -5863102 2523011 15540729
2830 15540729 25560150 30489458 32588369 32988982 30376911 24451612 18207016 15339205
2822 15339205 15614931 14406084 8542938 1884713 1948315 10116393 18649512 19843380 15041981
2813 15041981 10960867 9731405 7806287 3822179 1621569 3819288 7023313 6495808
2805 6495808 2801160 723032 2989895 7805744 12066441 14576470 15689938 15759227 15428702
$$ packed form
2862A5065780q52951J613331M692854K055573l841157o095917k779133K872910
2854A2731290P394078Q131280L305829m887911j0216318q833702l433884J182103
2846E372765L607815M666499M154293J752080j150338k942037l264685j894488
2838A0301904J002109K537586r35711p464519r249551k054920Q386113J3017718
2830A5540729J0019421M929308K098911M00613k612071n925299o244596k867811
2822A5339205K75726j208847n863146o658225O3602Q168078Q533119J193868m801399
2813A5041981m081114j229462j925118l984108k200610K197719L204025n27505
2805F495808l694648k078128K266863M815849M260697K510029J113468O9289l30525
$$ plain form
2796 15428702 16584400 20845194 26440823 28611687 25083271 19671818 17506378 17578690
2788 17578690 14182818 6138313 -289135 128009 4619899 7303840 7090988 6361912 5131858
2779 5131858 2127621 -333502 1331273 5255035 5679401 1988749 704534 6477547
2771 6477547 15392758 19611265 15519480 5424741 -5595232 -12233555 -11341997 -5079459
2763 -5079459 -437555 -2985560 -11292617 -18882842 -21138434 -19128430 -17204902 -18100009
2755 -18100009 -20526135 -20963042 -17360129 -10972125 -4994047 -2115261 -3000544 -5702117
2747 -5702117 -6616602 -3946948 -413354 -173881 -2815466 -3683636 -980946 1619661 1213180
2738 1213180 -214144 -776136 -2591826 -6284006 -6800033 -966096 5147952 3928161 -2047871
$$ packed form
2796A5428702J155698M260794N595629K170864l528416n411453k165440P2312
2788A7578690l395872q044505o427448M17144M491890K683941k12852p29076j230054
2779E131858l004237k461123J664775L923762M24366l690652j284215N773013
2771F477547Q915211M218507m091785j0094739j1019973o638323Q91558O262538
2763e079459M641904k548005q307057p590225k255592K010004J923528q95107
2755a8100009k426126m36907L602913O388004N978078K878786q85283k701573
2747e702117r14485K669654L533594K39473k641585q68170K702690K600607m06481
2738A213180j427324n61992j815690l692180n16027N833937O114048j219791n976032
$$ plain form
2729 -2047871 -4404769 -2596919 -3258604 -6609038 -4443021 5937445 15665609 16477033
2721 16477033 10916235 5811633 2838725 808026 839288 3055439 2864164 -3530866 -13181241
2712 -13181241 -20444031 -23416907 -22332273 -15903093 -4350351 7411518 14690012 18423609
2704 18423609 21479420 22860084 20345180 15872879 13096674 11668454 8614550 3636054
2696 3636054 -1058628 -4455620 -6762306 -7771039 -8076506 -9041683 -8949730 -3593991 5747292
2687 5747292 10396857 5642204 -1422589 -2208816 351160 -2437828 -10477725 -16181680
2679 -16181680 -17874429 -20724865 -24445194 -21496937 -10097801 1292675 6686289 10673500
2671 10673500 18308618 24855253 23035489 15266110 10814685 12974627 15605268 12120703
$$ packed form
2729b047871k356898J807850o61685l350434K166017J0380466R728164Q11424
2721A6477033n560798n104602k972908k030699L1262K216151j91275o395030r650375
2712a3181241p262790k972876J084634O429180J1552742J1761869P278494L733597
2704A8423609L055811J380664k514904m472301k776205j428220l053904m978496
2696C636054m694682l396992k306686j008733l05467r65177R1953N355739R341283
2687E747292M649565m754653p064793p86227K559976k788988q039897n703955
2679a6181680j692749k850436l720329K948257J1399136J1390476N393614L987211
2671A0673500P635118O546635j819764p769379m451425K159942K630641l484565
$$ plain form
2663 12120703 3337723 -3981874 -3670185 4747983 15657543 22189620 22281148 19335835
2655 19335835 17050861 15558156 13007290 8684723 3741748 490117 1047144 4759275
2647 4759275 7536210 6374882 3669544 3511562 4693746 2269615 -4037262 -8651736
2639 -8651736 -8509607 -6945169 -7260131 -8111165 -8195205 -9884619 -14066397 -16238338 -12676483
2630 -12676483 -6656613 -3407142 -2005136 2305592 10022903 17026105 20782174 21690178
2622 21690178 19182685 11765784 1157613 -7969718 -13033199 -15189817 -16107380 -16369681
2614 -16369681 -16833621 -18036093 -18113395 -14598400 -8520135 -3618323 -1291394 564283 3461139
2605 3461139 6320907 8056120 8915414 8466165 5373500 288134 -3954225 -6239707 -8425788
$$ packed form
2663A2120703q782980p319597L11689Q418168J0909560O532077R1528k945313
2655A9335835k284974j492705k550866m322567m942975l251631N57027L712131
2647D759275K776935j161328k705338j57982J182184k424131o306877m614474
2639h651736J42129J564438l14962q51034q4040j689414m181778k171941L561855
2630a2676483O019870L249471J402006M310728P717311P003202L756069R08004
2622B1690178k507493p416901j0608171r127331n063481k156618r17563k62301
2614a6369681m63940j202472p7302L514995O078265M901812K326929J855677K896856
2605C461139K859768J735213Q59294m49249l092665n085366m242359k285482k186081
$$ plain form
2596 -8425788 -11233792 -11908111 -8430164 -3938766 -3931638 -9480786 -15245504 -14636878 -6568772
2587 -6568772 2763947 5352792 -228849 -6641081 -5962653 958310 6754475 8541629
2579 8541629 11213798 17845853 22630026 18444216 7819761 188284 -368383 1398160
2571 1398160 567092 -1744989 -2339244 -1014008 895894 3415003 6922399 11051493 16129938
2562 16129938 22294911 25794979 21090646 9749932 2155241 5229394 12464729 12398233
2554 12398233 3996342 -3732248 -5671652 -5511451 -6163413 -4170201 2746431 9552932
2546 9552932 10086130 4519331 -3328543 -11304561 -17246836 -16959447 -9520986 -1095376 2057796
2537 2057796 1408090 1843624 3237261 2913847 3286436 8556648 14928228 13215347 2649480
$$ packed form
2596h425788k808004o74319L477947M491398P128n549148n764718O08626Q068106
2587f568772R332719K588845n581641o412232O78428O920963N796165J787154
2579H541629K672169O632055M784173m185810j0624455p631477n56667J766543
2571A398160q31068k312081n94255J325236J909902K519109L507396M129094N078445
2562A6129938O164973L500068m704333j1340714p594691L074153P235335o6496
2554A2398233q401891p728590j939404J60201o51962J993212O916632O806501
2546I552932N33198n566799p847874p976018n942275K87389P438461Q425610L153172
2537B057796o49706M35534J393637l23414L72589N270212O371580j712881j0565867
$$ plain form
2528 2649480 -6147562 -5156239 952931 2896763 -663372 -3789372 -2867157 -378326 -533922
2519 -533922 -4806889 -11252144 -16406705 -18757917 -20692506 -24564824 -26726760 -19990703
2511 -19990703 -4133623 10540664 13885339 7050075 -798544 -4018993 -4252750 -4647361
2503 -4647361 -5587947 -6257620 -6329564 -5229468 -2518109 364991 1047006 -547045 -1766919
2494 -1766919 -355505 3608187 8784050 13616912 16255909 15838905 14751338 17303330
2486 17303330 24094706 28967196 24439510 10849558 -2139200 -5075037 1326721 8012588
2478 8012588 8636299 5337497 2879042 1398355 -1678055 -5530107 -6438851 -3362513 1204004
2469 1204004 5555857 9778083 12143170 8722217 -1692510 -14582394 -22585890 -20380261
$$ packed form
2528B649480q797042R91323O109170J943832l560135l126000R22215K488831j55596
2519e33922m272967o445255n154561k351212j934589l872318k161936O736057
2511a9990703J5857080J4674287L344675o835264p848619l220449k33757l94611
2503d647361r40586o69673p1944J100096K711359K883100O82015j594051j219874
2494a766919J411414L963692N175863M832862K638997m17004j087567K551992
2486A7303330O791376M872490m527686j3589952j2988758k935837O401758O685867
2478H012588O23711l298802k458455j480687l076410l852052r08744L076338M566517
2469A204004M351853M222226K365087l420953j0414727j2889884q003496K205629
$$ plain form
2461 -20380261 -8209414 6890614 15432996 14816236 12202343 13774040 14791998 7741420
2453 7741420 -2788228 -4326078 4287931 10137686 6060231 1020497 4195309 10157491
2445 10157491 9507274 4923056 5030201 9026517 9811389 7897975 9423100 12771906 10073973
2436 10073973 1680765 -3186613 -1500380 -453990 -3889810 -5940814 -2410809 1812951
2428 1812951 2412745 3691754 9952858 16072410 14729377 8270096 5431796 8808704
2420 8808704 12686463 12502311 10430241 10687744 13269182 14022463 9614817 1683120 -4143067
2411 -4143067 -3970582 250862 3697469 4390957 3468893 1477638 -1615539 -3842734 -3287789
2402 -3287789 -1783609 -1251604 2517742 15164070 32363582 41240547 35753035 23345130
$$ packed form
2461b0380261J2170847J5100028Q542382o16760k613893J571697J017958p050578
2453G741420j0529648j537850Q614009N849755m077455n039734L174812N962182
2445A0157491o50217m584218J07145L996316P84872j913414J525125L348806k697933
2436A0073973q393208m867378J686233J046390l435820k051004L530005M223760
2428A812951N99794J279009O261104O119552j343033o459281k838300L376908
2420H808704L877759j84152k072070K57503K581438P53281m407646p931697n826187
2411d143067J72485M221444L446607O93488r22064j991255l093177k227195N54945
2402c287789J504180N32005L769346J2646328J7199512Q876965n487512j2407905
$$ plain form
2394 23345130 13210976 5811296 -1291634 -5154746 -2382000 3119343 4982332 3578697
2386 3578697 3742610 6352497 8647287 10275330 12464498 13166289 9460929 3435736 -316448
2377 -316448 -1817529 -4455707 -7836599 -8155547 -5213397 -2788741 -1650224 1973369 9872117
2368 9872117 18727881 24715266 27258259 27561257 27100915 27727347 29547100 29021206 23178123
2359 23178123 15005987 10011146 8279786 5548334 1562315 524697 2591507 2459248
2351 2459248 -1157137 -1908422 4355664 12492397 15764671 15201018 15534956 16400040 14377331
2342 14377331 10775396 10058550 11778351 11165976 7837936 6823322 9034964 7364983
2334 7364983 -3393678 -17246830 -23236830 -19224911 -13977973 -15006407 -19159564 -18145542
$$ packed form
2394B3345130j0134154p399680p102930l863112K772746N501343J862989j403635
2386C578697J63913K609887K294790J628043K189168P01791l705360o025193l752184
2377c16448j501081k638178l380892l18948K942150K424656J138517L623593P898748
2368I872117Q855764N987385K542993L02998m60342O26432J819753n25894n843083
2359B3178123q172136m994841j731360k731452l986019j037618K066810j32259
2351B459248l616385p51285O264086Q136733L272274n63653L33938Q65084k022709
2342A4377331l601935p16846J719801o12375l328040j014614K211642j669981
2334G364983j0758661j3853152n990000M011919N246938j028434m153157J014022
$$ plain form
2326 -18145542 -10374419 -2968031 -2232377 -6121196 -7999027 -5141014 -552730 2328128
2318 2328128 3402023 4323225 6192501 9876893 16034201 22834514 25412402 20412497
2310 20412497 11083457 5532596 8631155 16697306 21653343 19969272 15399581 12307039
2302 12307039 9304343 2954745 -3800454 -2710728 8067280 18251730 16439030 4512109
2294 4512109 -4436369 -2128630 6455043 11823324 11671300 10146020 9154167 6071892 194287
2285 194287 -3288301 948503 9901682 13061191 3493299 -13419541 -24743066 -23110159
2277 -23110159 -12616961 -2021141 3970352 5485123 4291844 3320194 5822112 10788039
2269 10788039 12058805 6485942 -81794 -469158 3306912 4402057 3388812 6472881
$$ packed form
2326a8145542P771123P406388P35654l888819j877831K858013M588284K880858
2318B328128J073895R21202J869276L684392O157308O800313K577888m999905
2310B0412497r329040n550861L098559Q066151M956037j684071m569691l092542
2302A2307039l002696o349598o755199J089726J0778008J0184450j812700j1926921
2294D512109q948478K307739Q583673N368281j52024j525280r91853l082275n877605
2285A94287l482588M236804Q953179L159509r567892j6912840j1323525J632907
2277b3110159J0493198J0595820N991493J514771j193279r71650K501918M965927
2269A0788039J270766n572863o567736l87364L776070J095145j013245L084069
$$ plain form
2261 6472881 11933898 9879311 -1145029 -8525220 -3234303 6456373 7991098 3643652
2253 3643652 5296943 14601185 20781842 17659673 11355940 8692028 7593333 3419963
2245 3419963 -2377373 -5152751 -4019922 -1383129 1402804 4292805 6767294 8578009
2237 8578009 10437819 12113171 11914133 9592045 7440327 7102862 7681930 8256355 9519201
2228 9519201 11419358 12050552 10755503 9748257 10877640 13431848 16856733 22442839
2220 22442839 29816291 34791787 33956105 29247672 25083329 23087052 22585521 23801921
2212 23801921 26606275 27794312 23882228 15990152 8373162 2776169 -2153608 -6468140
2204 -6468140 -7990409 -6033878 -2556861 724193 3163432 3155901 -786482 -6113823 -7194155
$$ packed form
2261F472881N461017k054587j1024340p380191N290917R690676J534725m347446
2253C643652J653291R304242O180657l122169o303733k663912j098695m173370
2245C419963n797336k775378J132829K636793K785933K890001K474489J810715
2237H578009J859810J675352j99038k322088k151718l37465N79068N74425J262846
2228I519201J900157O31194j295049j007246J129383K554208L424885N586106
2220B2442839P373452M975496q35682m708433m164343j996277n01531J216400
2212B3801921K804354J188037l912084p892076p616990n596993m929777m314532
2204f468140j522269J956531L477017L281054K439239p531l942383n327341j080332
$$ plain form
2195 -7194155 -1743833 6657176 13522595 17490055 18058720 13557405 4647612 -3048244
2187 -3048244 -3749476 2132319 9307519 14314344 18146877 22633004 26891774 28280913
2179 28280913 25924013 22626841 22461936 25314712 25004971 16103167 2742951 -3694869
2171 -3694869 2301303 13509062 19055794 16453317 10744022 5701635 1748072 160053
2163 160053 2583048 6771921 8669563 8359118 7812639 3349853 -11097913 -30916521
2155 -30916521 -39849015 -28092624 -5492453 9743547 11198921 6682694 4458498 5237240
2147 5237240 6622851 7473362 6560225 2960170 -649670 -145706 3326827 4033619 825621
2138 825621 122006 6561421 15456161 18777206 15102607 9135139 4185625 276490 -1921782
$$ packed form
2195g194155N450322Q401009O865419L967460N68665m501315q909793p695856
2187c048244p01232N881795P175200N006825L832533M486127M258770J389139
2179B8280913k356900l297172j64905K852776l09741q901804j3360216o437820
2171c694869N996172J1207759N546732k602477n709295n042387l953563j588019
2163A60053K422995M188873J897642l10445n46479m462786j4447766j9818608
2155c0916521q932494J1756391K2600171J5236000J455374m516227k224196P78742
2147E237240J385611Q50511r13137l600055l609840N03964L472533P06792l207998
2138H25621p03615O439415Q894740L321045l674599n967468m949514l909135k198272
$$ plain form
2129 -1921782 -757511 2728593 5330967 6357841 7541764 7581325 1770069 -10276841
2121 -10276841 -20594377 -20617871 -10861664 689066 7910574 10007952 7134415 -1308957
2113 -1308957 -12282031 -18200910 -14404886 -4913663 2823486 6903346 10886561 16382397
2105 16382397 20632347 21666584 21231240 21088045 20225829 17774759 15344421 13988082 11843954
2096 11843954 7805950 4923491 6417886 10032767 10256574 5202168 -2445331 -10355096
2088 -10355096 -17870754 -22500681 -20405744 -12363972 -4857190 -2146146 -611253 5345525
2080 5345525 14359162 19733255 18971632 16507321 15877943 14064447 7136672 -1493770 -3536473
2071 -3536473 3554813 12992049 17430633 17439140 17895516 19100471 16955375 11285005 7826630
$$ packed form
2129a921782J164271L486104K602374J026874J183923L9561n811256j2046910
2121a0276841j0317536k3494R756207J1550730P221508K097378k873537q443372
2113a308957j0973074n918879L796024R491223P737149M079860L983215N495836
2105A6382397M249950J034237m35344j43195q62216k451070k430338j356339k144128
2096A1843954m038004k882459J494395L614881K23807n054406p647499p909765
2088a0355096p515658m629927K094937Q041772P506782K711044J534893N956778
2080E345525R013637N374093p61623k464311o29378j813496o927775q630442k042703
2071c536473P091286R437236M438584Q507M56376J204955k145096n670370l458375
$$ plain form
2062 7826630 9756271 12112876 8260808 -1390020 -10731281 -15157185 -13535750 -6000866
2054 -6000866 4734945 11439972 8066018 -1807772 -7230045 -1961339 9524622 18713416
2046 18713416 21175542 16926883 7913129 -1917706 -7902015 -9179335 -9131062 -9090596 -5338994
2037 -5338994 4333606 14521353 17197788 11133951 2466808 -2887051 -3815260 -2057514
2029 -2057514 540889 2770144 4774161 8084690 13130744 17539443 18959246 18413120
2021 18413120 18379468 18670888 17085393 13342922 9315343 5723836 1588695 -3156992 -7404081
2012 -7404081 -11220354 -15408944 -18259051 -15889434 -7320750 2937426 8966383 8914830
2004 8914830 5426197 1844110 -672653 -2639243 -4067419 -3838175 -1744359 -97412
$$ packed form
2062G826630J929641K356605l852068r650828r341261m425904J621435P534884
2054f000866J0735811O705027l373954r873790n422273N268706J1485961R188794
2046A8713416K462126m248659r013754r830835n984309j277320M8273M0466L751602
2037e338994R672600J0187747K676435o063837q667143n353859r28209J757746
2029b057514K598403K229255K004017L310529N046054M408699J419803n46126
2021A8413120l3652K91420j585495l742471m027579l591507m135141m745687m247089
2012g404081l816273m188590k850107K369617Q568684J0258176O028957n1553
2004H914830l488633l582087k516763j966590j428176K29244K093816J646947
$$ plain form
1996 -97412 -1108234 -2600510 658717 9847585 19231598 22985907 22344559 22551141 24718070
1987 24718070 25084738 21681232 17304843 15134146 14740302 13674486 10986398 8450709
1979 8450709 9296258 14967531 22015355 24317852 20432619 15613652 13115016 7673279
1971 7673279 -5967556 -21168946 -25031024 -15762625 -5098382 -1352170 435246 6935933
1963 6935933 14222243 14705203 10101032 8524662 11698974 13256368 8833101 1251117
1955 1251117 -4139332 -4263564 630402 6017418 4773002 -4834378 -14356094 -14421172 -7595211
1946 -7595211 -5007750 -10411946 -15594019 -13359644 -7027817 -2923042 -218839 5745554
1938 5745554 14278498 19694446 19030912 14549107 9610906 6045436 4843527 5896411
$$ packed form
1996i7412j010822j492276L259227R188868R384013L754309o41348K06582K166929
1987B4718070L66668l403506m376389k170697l93844j065816k688088k535689
1979H450709Q45549N671273P047824K302497l885233m818967k498636n441737
1971G673279j3640835j5201390l862078R268399J0664243L746212J787416O500687
1963F935933P286310M82960m604171j576370L174312J557394m423267p581984
1955A251117n390449j24232M893966N387016j244416r607380r521716o5078O825961
1946g595211K587461n404196n182073K234375O331827M104775K704203N964393
1938E745554Q532944N415948o63534m481805m938201l565470j201909J052884
$$ plain form
1930 5896411 7209006 6922029 5600257 4358867 1919910 -3476703 -9702752 -11367825
1922 -11367825 -5575654 4560935 12479306 13386799 7630054 198783 -3709885 -3649750
1914 -3649750 -3475289 -5287345 -6205727 -3086938 2192225 5447972 6198840 7033974 8404948
1905 8404948 8519659 7578147 7159072 5801970 1138845 -2869668 2215998 17088261 30438139
1896 30438139 31601653 22743115 13630180 9100002 7891282 9495502 13797437 16099971
1888 16099971 11595338 4828524 5903436 15764352 23891443 23396011 19513199 18450993
1880 18450993 16826832 9922394 3194717 5441183 14613275 20997936 22673996 26741203
1872 26741203 34321181 35408803 23209236 5182502 -6219582 -8050460 -6282420 -5508247
$$ packed form
1930E896411J312595k86977j321772j241390k438957n396613o226049j665073
1922a1367825N792171J0136589P918371R07493n756745p431271l908668O0135
1914c649750J74461j812056r18382L118789N279163L255747P50868Q35134J370974
1905H404948J14711r41512m19075j357102m663125m008513N085666J4872263J3349878
1896C0438139J163514q858538r112935m530178j208720J604220M301935K302534
1888A6099971m504633o766814J074912R860916Q127091m95432l882812j062206
1880A8450993j624161o904438o727677K246466R172092O384661J676060M067207
1872B6741203P579978J087622j2199567j8026734j1402084j830878J768040P74173
$$ plain form
1864 -5508247 -5990917 -8312879 -13929444 -20755661 -23115663 -17619592 -6914459 2778594
1856 2778594 6639713 4687023 1704899 2442577 5567128 4515096 -3917474 -14768015
1848 -14768015 -21436778 -23639377 -24396302 -22126612 -12580364 1715207 11184552 10957574
1840 10957574 7384950 9035335 15150727 17580702 12012157 2748180 -3200032 -3071218
1832 -3071218 1117356 6217781 10724208 14941329 19299311 22746249 23618024 22505490
1824 22505490 22714143 26247545 30382419 30418176 25448862 19093018 14469213 11218113 8512670
1815 8512670 8024744 11045195 14210820 11824187 3122747 -5406964 -6565094 -17346
1807 -17346 7807028 10328982 6228715 -738578 -5831901 -7407987 -7726816 -9558961 -12191928
$$ packed form
1864e508247m82670k321962n616565o826217k360002N496071J0705133R693053
1856B778594L861119j952690k982124P37678L124551j052032q432570j0850541
1848a4768015o668763k202599p56925K269690R546248J4295571R469345k26978
1840A0957574l572624J650385O115392K429975n568545r263977n948212J28814
1832c071218M188574N100425M506427M217121M357982L446938Q71775j112534
1824B2505490K08653L533402M134874L5757m969314o355844m623805l251100k705443
1815H512670m87926L020451L165625k386633q701440q529711j158130O547748
1807a7346P824374K521954m100267o967293n093323j576086l18829j832145k632967
$$ plain form
1798 -12191928 -12331268 -9320522 -6996877 -8602797 -12086273 -13124635 -11050464 -8519872
1790 -8519872 -6710559 -4820382 -3513317 -4213662 -4885244 -1529445 5075871 9321423 9373623
1781 9373623 10348196 15502905 19485162 15518357 5673965 -1650236 -2164457 1771351 7012220
1772 7012220 12017423 14258678 11438237 5990572 3316888 4657494 6206838 5925869
1764 5925869 6254533 8616624 10119757 8350816 5850680 7095822 13279308 21580506
1756 21580506 27244023 25783997 16674300 6141147 2661261 7914154 15358430 18917316
1748 18917316 18962207 18088721 16060061 12314825 9143012 8178404 7061161 3609516 92367
1739 92367 -903791 -1578397 -4870476 -8206877 -7142730 -3229733 -1857020 -3126736 -1431244
$$ packed form
1798a2191928j39340L010746K323645j605920l483476j038362K074171K530592
1790h519872J809313J890177J307065p00345o71582L355799O605316M245552N2200
1781I373623R74573N154709L982257l966805r844392p324201n14221L935808N240869
1772G012220N005203K241255k820441n447665k673684J340606J549344k80969
1764E925869L28664K362091J503133j768941k500136J245142O183486Q301198
1756B1580506N663517j460026r109697j0533153l479886N252893P444276L558886
1748A8917316M4891q73486k028660l745236l171813r64608j117243l451645l517149
1739I2367r96158o74606l292079l336401J064147L912997J372713j269716J695492
$$ plain form
1730 -1431244 5566084 13738747 19299335 22678307 23698800 19032982 8225434 -2310377
1722 -2310377 -5702703 -2306159 2552925 5998729 9040815 12415595 14945864 15621380
1714 15621380 14449652 11464113 7030059 2685062 -279799 -2585281 -5582969 -8914804
1706 -8914804 -11534561 -14095417 -17477477 -19082298 -13931934 -1065876 13279717 21046274
1698 21046274 20154171 15356927 11992682 10929624 9836509 7084881 2757168 -2584313
1690 -2584313 -7421645 -7966195 -647203 12567744 23790362 26526795 22010897 16133382
1682 16133382 11764130 7403482 2551312 24442 1573392 4491523 4930606 2779957
1674 2779957 1123909 1854440 3651624 4133227 3085500 3474454 8775455 18238105 25579191
$$ packed form
1730a431244O997328Q172663N560588L378972J020493m665818j0807548j0535811
1722b310377l392326L396544M859084L445804L042086L374780K530269O75516
1714A5621380j171728k985539m434054m344997k964861k305482k997688l331835
1706h914804k619757k560856l382060j604821N150364J2866058J4345593P766557
1698B1046274q92103m797244l364245j063058j093115k751628m327713n341481
1690b584313m837332n44550P318992J3214947J1222618K736433m515898n877515
1682A6133382m369252m360648m852170k526870J548950K918131M39083k150649
1674B779957j656048P30531J797184M81603j047727L88954N301001R462650P341086
$$ plain form
1665 25579191 24826725 17650405 12185083 13744150 19435097 23142189 22626669 19512284
1657 19512284 15467967 12012263 11993455 17010898 23944264 27676649 27140759 25414287 24082038
1648 24082038 21503324 17475386 15390457 17162148 18976548 15640368 8011889 2770196
1640 2770196 4536657 10791345 15603263 16350691 14812754 12802272 9808801 5906415
1632 5906415 4171207 7149601 11898444 12120358 6011667 -898832 -2046182 3534303
1624 3534303 12194406 20271523 25318279 25582665 21846604 18223830 17780780 18600923 17390025
$$ packed form
1665B5579191p52466p176320n465322J559067N690947L707092n15520l114385
1657A9512284m044317l455704j8808N017443O933366L732385n35890j726472j332249
1648B4082038k578714m027938k084929J771691J814400l336180p628479n241693
1640B770196J766461O254688M811918P47428j537937k010482k993471l902386
1632E906415j735208K978394M748843K21914o108691o910499j147350N580485
1624C534303Q660103Q077117N046756K64386l736061l622774m43050Q20143j210898
$$ [...]
##END NTUPLES=NMR SPECTRUM
##END=
