##TITLE=31Pdec_DE-78-oil3TFA
 CDCl3, 64 sc
 25.11.2024
##JCAMPDX= 6.0         $$ Bruker NMR JCAMP-DX V2.0
##DATA TYPE= NMR SPECTRUM
##DATA CLASS= NTUPLES
##ORIGIN= UXNMR, Bruker Analytische Messtechnik GmbH
##OWNER= root
$$ XWIN-NMR		Version 3.5
$$ Mon Nov 25 16:20:22 2024 Russian Standard Time (UT+4h)  she@DPX200
##.OBSERVE FREQUENCY= 81.013821
##.OBSERVE NUCLEUS= ^31P
##.ACQUISITION MODE= SIMULTANEOUS
##.ACQUISITION SCHEME= undefined
##.AVERAGES= 64
##.DIGITISER RES= 17
##SPECTROMETER/DATA SYSTEM= spect
##.PULSE SEQUENCE= zgpg30
##.SOLVENT NAME= CDCl3
##.SHIFT REFERENCE= (INTERNAL, CDCl3, 0, 198.062)
##AUDIT TRAIL= $$ (NUMBER, WHEN, WHO, WHERE, WHAT)
$$ ##TITLE= Audit trail, XWIN-NMR		Version 3.5
$$ ##JCAMPDX= 5.01
$$ ##ORIGIN= Bruker BioSpin GmbH
$$ ##OWNER= she
$$ F:/spectra/data/she/nmr/P31/2/pdata/1/auditp.txt
$$ ##AUDIT TRAIL=  $$ (NUMBER, WHEN, WHO, WHERE, WHAT)
(   1,<2024-11-25 16:19:08.43 +0400>,<she>,<DPX200>,
      <continue with go, POWCHK disabled, PULCHK disabled
       configuration hash MD5:
       00 E9 B6 7A A2 85 ED C7 34 08 36 98 17 FE 4E 26
       data hash MD5: 32K
       05 D8 7E 36 BA E2 91 23 B2 13 33 40 54 0E 6A 55>)
(   2,<2024-11-25 16:19:11.64 +0400>,<she>,<DPX200>,
      <Start of raw data processing
       efp BC_mod = 2 LB = 1.5 FT_mod = 6 PKNL = 1 PHC0 = 2323.462 PHC1 = -70.51174 SI = 64K 
       data hash MD5: 64K
       AF D7 3E 3D 55 1E 40 BF B2 D4 FC BF D4 23 15 8B>)
(   3,<2024-11-25 16:19:48.68 +0400>,<she>,<DPX200>,
      <pk PHC0 = -0.8674835 PHC1 = 12.2 
       data hash MD5: 64K
       B9 FF 8B 55 2D FB 35 CB 83 FC EA F1 5B 4A AD CC>)
$$ ##END=
$$ 
$$ hash MD5
$$ B2 2E 96 BF DF 84 0F 93 30 13 B9 B6 45 80 DE 9F
##$RELAX= 
##$RELAX= 
##$RELAX= 
##$RELAX= 
##$RELAX= 
##$RELAX= 
##$RELAX= 
##$RELAX= 
$$ Bruker specific parameters
$$ --------------------------
##$DU= <F:/spectra>
##$EXPNO= 2
##$NAME= <P31>
##$PROCNO= 1
##$TYPE= <nmr>
##$USER= <she>
##$AMP= (0..31)
100 100 100 100 100 100 100 100 100 100 100 100 100 100 100 100 100 100 
100 100 100 100 100 100 100 100 100 100 100 100 100 100 
##$AQSEQ= 0
##$AQ_mod= 1
##$AUNM= <au_zg>
##$AUTOPOS= <>
##$BF1= 81.014009
##$BF2= 200.13
##$BF3= 200.13
##$BF4= 200.13
##$BF5= 200.13
##$BF6= 200.13
##$BF7= 200.13
##$BF8= 200.13
##$BYTORDA= 1
##$CFDGTYP= 0
##$CFRGTYP= 5
##$CHEMSTR= <none>
##$CNST= (0..31)
1 1 145 1 1 1 1 1 1 1 1 1 1 1 1 1 1 1 1 1 1 1 1 1 1 1 1 1 1 1 1 1 
##$CPDPRG= <waltz16>
##$CPDPRG1= <>
##$CPDPRG2= <waltz16>
##$CPDPRG3= <>
##$CPDPRG4= <mlev>
##$CPDPRG5= <mlev>
##$CPDPRG6= <mlev>
##$CPDPRG7= <mlev>
##$CPDPRG8= <mlev>
##$CPDPRGB= <>
##$CPDPRGT= <>
##$D= (0..31)
0 1 0 0 0 0 0 0 0 0.06 0 0.03 2e-05 3e-06 0 0 0.0002 0 0 0 0 0 0 0 0 0 
0 0 0 0 0 0 
##$DATE= 1732537047
##$DBL= (0..7)
120 120 120 11 120 120 24 19 
##$DBP= (0..7)
150 150 150 150 150 150 150 150 
##$DBP07= 0
##$DBPNAM0= <>
##$DBPNAM1= <>
##$DBPNAM2= <>
##$DBPNAM3= <>
##$DBPNAM4= <>
##$DBPNAM5= <>
##$DBPNAM6= <>
##$DBPNAM7= <>
##$DBPOAL= (0..7)
0.5 0.5 0.5 0.5 0.5 0.5 0.5 0.5 
$$ [...]
##$SUBNAM3= <"">
##$SUBNAM4= <"">
##$SUBNAM5= <"">
##$SUBNAM6= <"">
##$SUBNAM7= <"">
##$SUBNAM8= <"">
##$SUBNAM9= <"">
##$SW= 400.765351723535
##$SWIBOX= (0..15)
0 1 3 0 0 0 0 0 0 0 0 0 0 0 0 0 
##$SW_h= 32467.5324675325
##$TD= 32768
##$TD0= 1
##$TE= 0
##$TE2= 300
##$TE3= 300
##$TEG= 300
##$TL= (0..7)
0 120 53 12 22 120 120 120 
##$TP= (0..7)
150 150 150 150 150 150 150 150 
##$TP07= 0
##$TPNAME0= <>
##$TPNAME1= <>
##$TPNAME2= <>
##$TPNAME3= <>
##$TPNAME4= <>
##$TPNAME5= <>
##$TPNAME6= <>
##$TPNAME7= <>
##$TPOAL= (0..7)
0.5 0.5 0.5 0.5 0.5 0.5 0.5 0.5 
##$TPOFFS= (0..7)
0 0 0 0 0 0 0 0 
##$TUNHIN= 0
##$TUNHOUT= 0
##$TUNXOUT= 0
##$USERA1= <user>
##$USERA2= <user>
##$USERA3= <user>
##$USERA4= <user>
##$USERA5= <user>
##$V9= 5
##$VALIST= <valist>
##$VCLIST= <CCCCCCCCCCCCCCC>
##$VD= 0
##$VDLIST= <DDDDDDDDDDDDDDD>
##$VPLIST= <PPPPPPPPPPPPPPP>
##$VTLIST= <TTTTTTTTTTTTTTT>
##$WBST= 1024
##$WBSW= 4
##$XGAIN= (0..3)
0 0 0 0 
##$XL= 0
##$YL= 0
##$YMAX_a= 4104
##$YMIN_a= -21897
##$ZGOPTNS= <>
##$ZL1= 120
##$ZL2= 120
##$ZL3= 120
##$ZL4= 120
##$ABSF1= 0
##$ABSF2= 0
##$ABSG= 0
##$ABSL= 0
##$ALPHA= 0
##$AQORDER= 0
##$ASSFAC= 0
##$ASSFACI= 0
##$ASSFACX= 0
##$ASSWID= 0
##$AUNMP= <proc_1d>
##$AZFE= 0.1
##$AZFW= 0.5
##$BCFW= 0
##$BC_mod= 2
##$BYTORDP= 0
##$COROFFS= 0
##$CY= -3
##$DATMOD= 1
##$DC= 0
##$DFILT= <>
##$DTYPP= 0
##$F1P= 0
##$F2P= 0
##$FCOR= 1
##$FTSIZE= 65536
##$FT_mod= 6
##$GAMMA= 0
##$GB= 0
##$INTBC= 1
##$INTSCL= 9.790993e-09
##$ISEN= 30
##$LB= 1.5
##$LEV0= 0
##$LPBIN= 0
##$MAXI= 10000
##$MC2= 0
##$MEAN= 0
##$ME_mod= 0
##$MI= 50
##$NCOEF= 0
##$NC_proc= -9
##$NLEV= 6
##$NOISF1= 182.463
##$NOISF2= 159.3651
##$NSP= 0
##$NTH_PI= 0
##$NZP= 0
##$OFFSET= 198.0616
##$PC= 4
##$PHC0= 2322.594
##$PHC1= -58.31174
##$PH_mod= 1
##$PKNL= yes
##$PPARMOD= 0
##$PSCAL= 0
##$PSIGN= 0
##$REVERSE= no
##$SF= 81.0140089999434
##$SI= 65536
##$SIGF1= 159.3651
##$SIGF2= -187.1042
##$SINO= 113.3802
##$SIOLD= 16384
##$SREGLST= <1H.CDCl3>
##$SSB= 0
##$STSI= 65536
##$STSR= 0
##$SW_p= 32467.5324675325
##$SYMM= 0
##$S_DEV= 0
##$TDeff= 32768
##$TDoff= 0
##$TI= <>
##$TILT= no
##$TM1= 0
##$TM2= 0
##$TOPLEV= 0
##$USERP1= <user>
##$USERP2= <user>
##$USERP3= <user>
##$USERP4= <user>
##$USERP5= <user>
##$WDW= 1
##$XDIM= 65536
##$YMAX_p= 396664749
##$YMIN_p= -365542365
$$ End of Bruker specific parameters
$$ ---------------------------------
##NTUPLES= NMR SPECTRUM
##VAR_NAME=  FREQUENCY,     SPECTRUM/REAL,   SPECTRUM/IMAG
##SYMBOL=    X,             R,               I
##VAR_TYPE=  INDEPENDENT,   DEPENDENT,       DEPENDENT
##VAR_FORM=  AFFN,          ASDF,            ASDF
##VAR_DIM=   65536,         65536,           65536
##UNITS=     HZ,            ARBITRARY UNITS, ARBITRARY UNITS
##FACTOR=    0.49542278885378, 1,            1
##FIRST=     16045.7642231865, 0,            0
##LAST=      -16421.768244346, 0,            0
##MIN=       -16421.768244346, -365542365,   0
##MAX=       16045.7642231865, 396664749,    0
$$ Real data points
##PAGE= N=1
##DATA TABLE= (X++(R..R)), XYDATA
$$ [...]
##PAGE= N=2
##DATA TABLE= (X++(I..I)), XYDATA
$$ plain form
7339 -4501287 -2938964 -6464078 -15643641 -22345004 -21096633 -15903065 -12465651 -10750394
7331 -10750394 -9148427 -9381672 -12439228 -14883208 -13886846 -11599572 -10506190 -9046294
7323 -9046294 -6046802 -4806946 -7939675 -12417937 -14876182 -17734561 -24210743 -30757194
7315 -30757194 -31118764 -25857977 -21492198 -21295372 -22707698 -23017695 -22017855 -19420567 -14916827
7306 -14916827 -10745606 -9488532 -9690849 -8421373 -7327283 -10393388 -16018979 -17927094
7298 -17927094 -14803950 -12220375 -13046580 -12996474 -9069720 -5469075 -5930590 -6407539 -2582063
7289 -2582063 2680 -7500517 -22029622 -29368498 -21916462 -7818744 1128749 3728104
7281 3728104 5934491 8450003 5708678 -4083063 -15197493 -21938571 -24190195 -23129114
$$ packed form
7339d501287J562323l525114r179563o701363J248371N193568L437414J715257
7331a0750394J601967k33245l057556k443980R96362K287274J093382J459896
7323i046294K999492J239856l132729m478262k458245k858379o476182o546451
7315c0757194l61570N260787M365779J96826j412326l09997R99840K597288M503740
7306a4916827M171221J257074k02317J269476J094090l066105n625591j908115
7298a7927094L123144K583575q26205N0106L926754L600645m61515m76949L825476
7289b582063K584743p503197j4529105p338876P452036J4097718Q947493K599355
7281C728104K206387K515512k741325r791741j1114430o741078k251624J061081
$$ plain form
7273 -23129114 -16694666 -3819424 9849280 15744673 11768511 4281812 402668 1309999
7265 1309999 3902370 6176313 8771454 12190675 14523057 12904776 7251054 1582180
7257 1582180 62259 1765308 1701001 -2162164 -5893874 -5596545 -3051980 -1832088 -904305
7248 -904305 2481873 5377653 1404698 -9003600 -16961278 -15767277 -7973088 215870
7240 215870 6122536 9219065 7993126 2719628 -2377472 -3983018 -3744047 -4038208 -3355009
7231 -3355009 75935 3746477 4651390 4267004 4819081 4050015 -554506 -5658925 -7018917
7222 -7018917 -7708423 -13274794 -20250154 -18863889 -8040482 1464828 1748255 -2643941
7214 -2643941 -3991254 -2861597 -4318158 -8078173 -9306289 -6448056 -2359794 904804
$$ packed form
7273b3129114O434448J2875242J3668704N895393l976162p486699l879144R07331
7265A309999K592371K273943K595141L419221K332382j618281n653722n668874
7257A582180j519921J703049o4307l863165l731710K97329K544565J219892R27783
7248i04305L386178K895780l972955j0408298p957678J194001P794189Q188958
7240B15870N906666L096529j225939n273498n097100j605546K38971k94161O83199
7231c355009L430944L670542R04913l84386N52077p69066m604521n104419j359992
7222g018917o89506n566371o975360J386265J0823407R505310K83427m392196
7214b643941j347313J129657j456561l760015j228116K858233M088262L264598
$$ plain form
7206 904804 3561320 5390295 6072474 7935557 14336533 24508244 32621247 32961955 25059955
7197 25059955 13900496 6008722 4611786 7423501 9449849 8348647 6215733 6153993
7189 6153993 8804439 12548536 15093455 14358660 10056466 5068691 2915219 3318402 3033789
7180 3033789 1457252 1535350 3869403 4451375 942371 -2980713 -3147860 -1100126 -524454
7171 -524454 -692581 1424907 4649736 4697146 938758 -2902214 -4537973 -5140513 -5833967
7162 -5833967 -6654200 -8892215 -13504791 -16465406 -10882863 3909362 19181480 25341980
7154 25341980 21170812 12775697 6058811 2475466 273990 -2485089 -5613798 -6723277
7146 -6723277 -4413998 -1254396 -1223060 -4018936 -5011931 -1913801 1687027 1432646 -1806700
$$ packed form
7206I04804K656516J828975O82179J863083O400976J0171711Q113003L40708p902000
7197B5059955j1159459p891774j396936K811715K026348j101202k132914o1740
7189F153993K650446L744097K544919p34795m302194m987775k153472M03183k84613
7180C033789j576537P8098K334053N81972l509004l923084j67147K047734N75672
7171e24454j68127K117488L224829M7410l758388l840972j635759o02540o93454
7162e833967q20233k238015m612576k960615N582543J4792225J5272118O160500
7154B5341980m171168q395115o716886l583345k201476k759079l128709j109479
7146f723277K309279L159602L1336k795876r92995L098130L600828k54381l239346
$$ plain form
7137 -1806700 -3567438 -1662113 2027863 4531978 4516540 2739562 1259003 1551048 2650651
7128 2650651 2350253 695770 126748 1100074 281085 -4729822 -11068704 -13652310 -11000499
7119 -11000499 -5623300 -427094 2295300 129010 -6959643 -13741139 -13553138 -5974724
7111 -5974724 2512443 6449613 6721018 6397530 4576260 -2324700 -14282412 -25660830
7103 -25660830 -30020424 -25717681 -16589249 -8052652 -2973287 -953850 -741618 -2048738
7095 -2048738 -4575024 -6806765 -7549652 -7753982 -8537731 -7890489 -2441209 6803424 13695712
7086 13695712 14000070 10905023 10799980 14885459 17878304 14793180 6584393 -1221835
7078 -1221835 -3683607 -42442 5996908 9029873 6455344 835041 -3309102 -5097361
$$ packed form
7137a806700j760738J905325L689976K504115j5438j776978j480559K92045J099603
7128B650651l00398j654483n69022R73326q18989n010907o338882k583606K651811
7119a1000499N377199N196206K722394k166290p088653o781496J88001P578414
7111e974724Q487167L937170K71405l23488j821270o900960j1957712j1378418
7103b5660830m359594M302743R128432Q536597N079365K019437K12232j307120
7095b048738k526286k231741p42887k04330p83749O47242N449280R244633O892288
7086A3695712L04358l095047j05043M085479K992845l085124q208787p806228
7078a221835k461772L641165O039350L032965k574529n620303m144143j788259
$$ plain form
7070 -5097361 -7821624 -13227000 -17688000 -16395920 -9970973 -3785856 -845847 959692
7062 959692 2873195 469982 -10339350 -23844503 -27419416 -16433241 -1423019 4069442
7054 4069442 -753627 -6363037 -8557312 -12743581 -20877640 -23539352 -12097183 6768244
7046 6768244 17530016 15095807 9223914 8954069 10713633 5762720 -6344366 -17326407
7038 -17326407 -20763082 -18372481 -16111862 -17174511 -19424631 -18615985 -13993485 -10205304
7030 -10205304 -11998541 -17493595 -19932647 -16653427 -12315539 -11333185 -11410080 -8225831 -2988039
7021 -2988039 -262890 -204970 1588301 6620007 10673221 9378951 3042140 -4885662 -10880332
7012 -10880332 -12058009 -7239559 869890 6794786 7213642 3535686 -757009 -3273026
$$ packed form
7070e097361k724263n405376m461000J292080O424947O185117K940009J805539
7062I59692J913503k403213j0809332j3505153l574913J0986175J5010222N492461
7054D069442m823069n609410k194275m186269q134059k661712J1442169J8865427
7046F768244J0761772k434209n871893k69845J759564m950913j2107086j0982041
7038a7326407l436675K390601K260619j062649k250120Q08646M622500L788181
7030a0205304j793237n495054k439052L279220M337888R82354p6895L184249N237792
7021b988039K725149N7920J793271N031706M053214j294270o336811p927802n994670
7012a0880332j177677M818450Q109449N924896M18856l677956m292695k516017
$$ plain form
7004 -3273026 -2804672 1083896 7123877 12744702 16572362 19157989 20696630 19988498 16646342
6995 16646342 12575644 10105896 9890398 11256029 13122720 14027321 12851882 10054449
6987 10054449 6672385 2188864 -4289389 -10702913 -13123748 -11216422 -9438102 -11062734
6979 -11062734 -13932467 -14346144 -12462404 -11032955 -10824791 -10349118 -8876005 -6982667 -5001288
6970 -5001288 -3342264 -3587496 -6896915 -11601640 -14108846 -12047269 -5895277 1147289
6962 1147289 4107414 -525300 -10390556 -17859852 -17262389 -10206262 -2348725 2559999
6954 2559999 3340508 -404165 -6694532 -10198457 -7529005 -2231671 -176897 -1372491
6946 -1372491 -1235797 1145927 1902111 -435782 -2654890 -2895958 -3288820 -4954393 -6115865
$$ packed form
7004c273026M68354L888568O039981N620825L827660K585627J538641p08132l342156
6995A6646342m070698k469748k15498J365631J866691R04601j175439k797433
6987A0054449l382064m483521o478253o413524k420835J907326J778320j624632
6979a1062734k869733m13677J883740J429449K08164M75673J473113J893338J981379
6970e001288J659024k45232l309419m704725k507206K061577O151992P042566
6962A147289K960125m632714r865256p469296N97463P056127P857537M908724
6954B559999P80509l744673o290367l503925K669452N297334K054774j195594
6946a372491J36694K381724P56184k337893k219108k41068l92862j665573j161472
$$ plain form
6937 -6115865 -7246127 -11619365 -17209370 -14958002 -1347909 12701504 13558658 2495770
6929 2495770 -6894509 -7512739 -5547399 -7333986 -9520941 -7604439 -6029723 -11051887
6921 -11051887 -17841567 -14726494 -348038 12402719 12792923 5554440 2630177 6711962
6913 6711962 9934652 6851511 1485932 638660 6013105 15180842 25646094 34693443
6905 34693443 38552099 35576335 28811703 22579224 17536424 11199217 2160796 -8047629
6897 -8047629 -16049483 -18228047 -13233866 -4531641 1872993 4060573 5732571 9098450
6889 9098450 10239583 5260166 -2867143 -8712408 -12367929 -17029581 -21448383 -22028433
6881 -22028433 -20674022 -22438163 -25873559 -24388806 -17982023 -14535482 -17130706 -19139172
$$ packed form
6937f115865j130262m373238n590005K251368J3610093J4049413Q57154j1062888
6929B495770r390279o18230J965340j786587k186955J916502J574716n022164
6921a1051887o789680L115073J4378456J2750757L90204p238483k924263M081785
6913F711962L222690l083141n365579q47272N374445R167737J0465252R047349
6905C4693443L858656k975764o764632o232479n042800o337207r038421j0208425
6897h047629q001854k178564M994181Q702225O404634K187580J671998L365879
6889I098450J141133m979417q127309n845265l655521m661652m418802n80050
6881b2028433J354411j764141l435396J484753O406783L446541k595224k008466
$$ plain form
6873 -19139172 -15608356 -10652324 -8621628 -6776650 -3193876 -3275739 -9836155 -14393563
6865 -14393563 -8942435 -464893 -1412480 -9317802 -9584340 1581151 10729480 7097663
6857 7097663 -2986434 -7653647 -5917137 -4919140 -7496059 -10738717 -13235166 -16306377
6849 -16306377 -19536127 -20854973 -20424940 -20023502 -19155181 -15712576 -10399722 -7160707 -8661215
6840 -8661215 -13456384 -17989960 -19978726 -19625769 -18336952 -16476480 -12769876 -6781543
6832 -6781543 -1204491 524449 -1150628 -2192238 -244745 3076452 5704181 7747341
6824 7747341 9452488 9900994 9656611 11538236 16057314 18537763 13823703 2499397
6816 2499397 -9853852 -18263720 -21355278 -20383720 -17453955 -13744705 -8378540 -651260
$$ packed form
6873a9139172L530816M956032K030696J844978L582774q1863o560416m557408
6865a4393563N451128Q477542r47587p905322k66538J1165491R148329l631817
6857G097663j0084097m667213J736510R97997k576919l242658k496449l071211
6849a6306377l229750j318846M30033M01438Q68321L442605N312854L239015j500508
6840h661215m795169m533576j988766L52957J288817J860472L706604N988333
6832f781543N577052J728940j675077j041610J947493L321197K627729K043160
6824G747341J705147M48506k44383J881625M519078K480449m714060j1324306
6816B499397j2353249q409868l091558R71558K929765L709250N366165P727280
$$ plain form
6808 -651260 6129117 6259138 -1295730 -10943498 -17695644 -22141513 -25017768 -22102100 -10922278
6799 -10922278 861850 2025574 -7493455 -15993023 -15577239 -11206289 -10881517 -13075829
6791 -13075829 -9820158 706694 10708495 12031782 4866554 -4079617 -9603159 -11963927
6783 -11963927 -13239443 -12316359 -6324848 3069334 8710140 6017098 -937610 -5497987
6775 -5497987 -8143483 -14173552 -22554126 -24799306 -17471770 -8758957 -7565119 -11343048
6767 -11343048 -11228101 -5745492 -1722582 -2514591 -3196589 480569 4623441 2599327 -5860450
6758 -5860450 -14919646 -19882879 -20701806 -19557725 -18376209 -18500069 -19844253 -19777329 -15145090
6749 -15145090 -6454352 1655806 5429570 6270908 8437509 13224175 17465852 17973798
$$ packed form
6808f51260O780377J30021p554868r647768o752146m445869k876255K915668J1179822
6799a0922278J1784128J163724r519029q499568M15784M370950L24772k194312
6791a3075829L255671J0526852J0001801J323287p165228q946171n523542k360768
6783a1963927j275516R23084N991511R394182N640806k693042o954708m560377
6775e497987k645496o030069q380574k245180P327536Q712813J193838l777929
6767a1343048J14947N482609M022910p92009o81998L677158M142872k024114q459777
6758e860450r059196m963233q18927J144081J181516j23860j344184O6924M632239
6749a5145090Q690738Q110158L773764Q41338K166601M786666M241677N07946
$$ plain form
6741 17973798 15393843 12543274 10662356 9416352 9720070 13670666 20804308 26530701
6733 26530701 26125953 19745598 12428919 9427606 11864399 16054022 16464363 10466681
6725 10466681 1210310 -5097722 -5768610 -4397246 -5849728 -10054593 -13118837 -13520517
6717 -13520517 -13800480 -15806260 -17724809 -17427261 -15792550 -14228243 -11392608 -6043647
6709 -6043647 -1810497 -4491240 -13726892 -21380319 -20620391 -13969672 -9576318 -11475906
6701 -11475906 -16752192 -20924827 -22101630 -19911534 -14622600 -8749781 -5986291 -6510700
6693 -6510700 -6455921 -4266285 -3984118 -8573840 -13305663 -11278435 -3848150 752145 -786167
6684 -786167 -3038201 -1543954 405412 -1395140 -4224021 -3250544 -190040 -316513 -3011804
$$ packed form
6741A7973798k579955k850569j880918j246004L03718L950596P133642N726393
6733B6530701m04748o380355p316679l001313K436793M189623M10341n997682
6725A0466681r256371o308032o70888J371364j452482m204865l064244m01680
6717a3520517k79963k005780j918549K97548J634711J564307K835635N348961
6709f043647M233150k680743r235652p653427P59928O650719M393354j899588
6701a1475906n276286m172635j176803K190096N288934N872819K763490n24409
6693f510700N4779K189636K82167m589722m731823K027228P430285M600295j538312
6684g86167k252034J494247J949366j800552k828881R73477L060504j26473k695291
$$ plain form
6675 -3011804 -2774174 389479 -836877 -9897271 -19550512 -20655979 -13901921 -8025614
6667 -8025614 -8466491 -12485321 -15016897 -14976314 -14451707 -14608249 -14741748 -14425971 -14508434 -15463109
6657 -15463109 -15968241 -14475013 -12089369 -12327508 -16976465 -23126471 -25582066 -21776269
6649 -21776269 -13472733 -4631366 1124491 2209464 342092 -655670 695291 1336134
6641 1336134 -1725440 -6106060 -6881082 -3673308 -461752 1236553 3425087 4955931
6633 4955931 149124 -12524732 -25408578 -29670681 -24805185 -16272662 -7555552 549060
6625 549060 6074509 7319870 6460114 6288746 4647794 -2506686 -13470596 -21810563 -24541765
6616 -24541765 -23767357 -20674779 -14417970 -7649222 -6211190 -10799258 -14851307 -13945783
$$ packed form
6675c011804K37630L163653j226356r060394r653241j105467O754058N876307
6667h025614m40877m018830k531576M0583N24607j56542j33499L15777q2463r54675
6657a5463109n05132J493228K385644k38139m648957o150006k455595L805797
6649b1776269Q303536Q841367N755857J084973j867372r97762J350961O40843
6641A336134l061574m380620p75022L207774L211556J698305K188534J530844
6633D955931m806807j2673856j2883846m262103M865496Q532523Q717110Q104612
6625E49060N525449J245361q59756j71368j640952p154480j0963910q339967k731202
6616b4541765P74408L092578O256809O768748J438032m588068m052049R05524
$$ plain form
6608 -13945783 -12092690 -14886087 -20912039 -24391120 -22968874 -18408922 -12146597 -4858711
6600 -4858711 832373 1509345 -2949965 -8744125 -11561203 -9720291 -5194514 -2263150
6592 -2263150 -3145650 -4379881 -544513 7466240 11865693 7655535 -1328969 -8837878
6584 -8837878 -14129092 -19422141 -23771149 -25043946 -24985372 -26223426 -26030822 -19187942 -6417940
6575 -6417940 5479337 11540730 11675578 6637856 -2876158 -12544339 -15896691 -11711328
6567 -11711328 -5836904 -4141823 -7320984 -13383025 -20627635 -26458990 -27503086 -23277383
6559 -23277383 -16816120 -10380083 -3864663 1599521 2684454 -1535605 -7579917 -12041846
6551 -12041846 -14859764 -16812089 -17598725 -17956620 -19446686 -20268347 -16030650 -7320719 -1511275
$$ packed form
6608a3945783J853093k793397o025952l479081J422246M559952O262325P287886
6600d858711N691084O76972m459310n794160k817078J840912M525777K931364
6592b263150q82500j234231L835368Q010753M399453m210158q984504p508909
6584h837878n291214n293049m349008j272797N8574j238054J92604O842880J2770002
6575f417940J1897277O061393J34848n037722r514014r668181l352352M185363
6567a1711328N874424J695081l179161o062041p244610n831355j044096M225703
6559b3277383O461263O436037O515420N464184J084933m220059o044312m461929
6551a2041846k817918j952325p86636l57895j490066q21661M237697Q709931N809444
$$ plain form
6542 -1511275 -3290070 -7963318 -8640360 -5861800 -4801557 -6612051 -8972954 -12829543
6534 -12829543 -21348868 -32321025 -38048867 -34324371 -24982501 -16219634 -10312005 -6466906
6526 -6466906 -4417613 -4713009 -6804347 -8323748 -6386572 -555762 4797923 3315512
6518 3315512 -5977305 -16167573 -20013699 -17669958 -13493940 -8267382 -369788 7030743
6510 7030743 7356137 328922 -6201474 -6708822 -4803471 -6366390 -10780272 -13341313 -12775720
6501 -12775720 -11439388 -10106108 -7293913 -3042899 612916 2925684 5059079 7323321
6493 7323321 8501450 8235993 7687220 7309402 6107852 3849625 2097244 1881872 1761501
6484 1761501 -380552 -4372962 -7944862 -9454045 -8941281 -6454713 -1278151 5742222
$$ packed form
6542a511275j778795m673248o77042K778560J060243j810494k360903l856589
6534a2829543q519325j0972157n727842L724496R341870Q762867N907629L845099
6526f466906K049293k95396k091338j519401J937176N830810N353685j482411
6518C315512r292817j0190268l846126K343741M176018N226558P897594P400531
6510G030743L25394p027215o530396n07348J905351j562919m413882k561041N65593
6501a2775720J336332J333280K812195M251014L655815K312768K133395K264242
6493G323321J178129k65457n48773l77818j201550k258227j752381k15372j20371
6484A761501k142053l992410l571900j509183N12764K486568N176562P020373
$$ plain form
6476 5742222 10333540 7800013 -1370440 -10434793 -12164208 -5346141 4694735 11244525
6468 11244525 11722927 9235545 8966053 12045124 13366535 7390444 -4324858 -14465448
6460 -14465448 -18924608 -20178419 -20593940 -18035072 -11861291 -7857335 -10784150 -15476613
6452 -15476613 -12843731 -3214219 3952338 3499634 -86837 -1921410 -3329356 -6193093
6444 -6193093 -7814233 -5820256 -2556484 -98452 3919147 10515318 14277696 10147807
6436 10147807 1802016 -2937412 -2522382 -1391698 -1411057 -546283 433229 -3145723 -12667887
6427 -12667887 -23027210 -28537176 -28396212 -24994204 -20363691 -16004140 -13464469 -13415686
6419 -13415686 -15744753 -20899794 -28968062 -37311733 -41844822 -41331342 -38202079 -34921520
$$ packed form
6476E742222M591318k533527r170453r064353j729415O818067J0040876O549790
6468A1244525M78402k487382k69492L079071J321411n976091j1715302j0140590
6460a4465448m459160j253811m15521K558868O173781M003956k926815m692463
6452a5476613K632882R629512P166557m52704l586471j834573j407946k863737
6444f193093j621140J993977L263772K458032M017599O596171L762378m129889
6436A0147807q345791m739428M15030J130684j9359Q64774R79512l578952r522164
6427a2667887j0359323n509966J40964L402008M630513M359551K539671M8783
6419a3415686k329067n155041q068268q343671m533089N13480L129263L280559
$$ plain form
6411 -34921520 -32171131 -30771772 -31852710 -33596324 -30859302 -20641798 -6566735 4132125
6403 4132125 7499011 5515923 2589015 853770 -595831 -2357272 -1969283 3619186
6395 3619186 12677661 18549194 17027021 11911955 10231713 13108861 14876212 11127926
6387 11127926 4254303 93159 1547521 6583870 10955189 12088720 10976201 10104585
6379 10104585 9373769 5947360 -827978 -7366542 -11091343 -14208186 -18350350 -19347352
6371 -19347352 -13577309 -6693741 -7854353 -16016216 -20856657 -18385845 -16178232 -19732744
6363 -19732744 -23034213 -18813950 -10488147 -6061292 -5646014 -3393059 1714123 5174976
6355 5174976 5045876 3249823 151883 -5159594 -10130596 -11268872 -10957436 -14643111 -20991322
$$ packed form
6411c4921520K750389J399359j080938j743614K737022J0217504J4075063J0698860
6403D132125L366886j983088k926908j735245j449601j761441L87989N588469
6395C619186R058475N871533j522173n115066j680242K877148J767351l748286
6387A1127926o873623m161144J454362N036349M371319J133531j112519q71616
6379A0104585p30816l426409o775338o538564l724801l116843m142164r97002
6371a9347352N770043O883568j160612q161863m840441K470812K207613l554512
6363a9732744l301469M220263Q325803M426855M15278K252955N107182L460853
6355E174976j29100j796053l097940n311477m971002j138276L11436l685675o348211
$$ plain form
6346 -20991322 -22176229 -15443860 -7418339 -4307763 -4057853 -1783257 2152830 3666174
6338 3666174 954735 -4825258 -12206296 -19377228 -23500873 -22968002 -19223311 -14878336
6330 -14878336 -11609532 -10622294 -12513317 -15521199 -16697890 -15929999 -15716696 -16031579 -13555704
6321 -13555704 -7907847 -4109462 -5660279 -9147673 -9617703 -7766130 -7151106 -7024524 -3257850
6312 -3257850 4872601 13573802 19530985 21931855 20463606 15907707 12452945 14535460
6304 14535460 20333913 22392129 16281008 5695711 -2404792 -5188121 -5174577 -6287937
6296 -6287937 -10258126 -15740748 -19876752 -21020705 -19840231 -17582149 -14804010 -12804597
6288 -12804597 -13832399 -17515643 -19599873 -17597866 -15152507 -16203549 -17208333 -11658950
$$ packed form
6346b0991322j184907O732369Q025521L110576K49910K274596L936087J513344
6338C666174k711439n779993p381038p170932m123645N32871L744691M344975
6330a4878336L268804R87238j891023l007882j176691P67891K13303l14883K475875
6321a3555704N647857L798385j550817l487394m70030J851573O15024J26582L766674
6312c257850Q130451Q701201N957183K400870j468249m555899l454762K082515
6304A4535460N798453K058216o111121j0585297q100503k783329J3544j113360
6296f287937l970189n482622m136004j143953J180474K258082K778139J999413
6288a2804597j027802l683244k084230K002007K445359j051042j004784N549383
$$ plain form
6280 -11658950 -1605370 2761049 -3450634 -13550715 -18976197 -18990485 -17464445 -16340160
6272 -16340160 -16863089 -21447922 -28455284 -30068522 -22274952 -13136365 -13322554 -20732797
6264 -20732797 -22818307 -13586879 -117519 8675335 11767878 12087030 10253116 6647722
6256 6647722 4322489 4871140 4892429 1085241 -3639711 -3447321 2381036 8224232 8328028
6247 8328028 1998614 -6277926 -9963187 -5337792 4332712 10672621 8446743 986268
6239 986268 -4294235 -4163121 -1130461 1544319 3149923 4201781 4711156 4483857 3718422
6230 3718422 2965445 3010035 4129544 4887357 2955421 -1910948 -7063917 -9858545 -9452805
6221 -9452805 -5214687 3136574 11776378 13261603 4948185 -5963759 -10632258 -9589788
$$ packed form
6280a1658950J0053580M366419o211683j0100081n425482j4288J526040J124285
6272a6340160n22929m584833p007362j613238P793570R138587j86189p410243
6264b0732797k085510R231428J3469360Q792854L092543L19152j833914l605394
6256F647722k325233N48651K1289l807188m724952J92390N828357N843196J03796
6247H328028o329414q276540l685261M625395R670504O339909k225878p460475
6239I86268n280503J31114L032660K674780J605604J051858N09375k27299p65435
6230C718422p52977M4590J119509P57813j931936m866369n152969k794628M05740
6221i452805M238118Q351261Q639804J485225q313418j0911944m668499J042470
$$ plain form
6213 -9589788 -10085738 -14325513 -17495143 -17534136 -19022375 -24617022 -29382623 -28017326 -22597823
6204 -22597823 -18342768 -15948876 -13564278 -12841539 -16319888 -20320643 -17498573 -7473975
6196 -7473975 831558 -3693 -6677705 -9672104 -4612322 3804687 8302614 6844690
6188 6844690 3244550 1239078 -102228 -3722038 -8525381 -9431298 -4710705 281883
6180 281883 24882 -3089876 -2228291 3480688 7392181 4906398 -536637 -3297318 -3176236
6171 -3176236 -3914803 -7011606 -10809740 -14199132 -17661917 -21025648 -23034996 -23498894 -24034949
6162 -24034949 -26142373 -29103803 -29613739 -23817927 -11671271 303028 3660627 -2408456
6154 -2408456 -8750907 -6441795 2764567 9521122 8301658 1217277 -8001576 -17653089
$$ packed form
6213i589788m95950m239775l169630l8993j488239n594647m765601J365297N419503
6204b2597823M255055K393892K384598P22739l478349m000755K822070J0024598
6196g473975Q305533q35251o674012k994399N059782Q417009M497927j457924
6188F844690l600140k005472j341306l619810m803343r05917M720593M992588
6180B81883k57001l114758Q61585N708979L911493k485783n443035k760681J21082
6171c176236p38567l096803l798134l389392l462785l363731k009348m63898n36055
6162b4034949k107424k961430n09936N795812J2146656J1974299L357599o069083
6154b408456o342451K309112R206362O756555j219464p084381r218853r651513
$$ plain form
6146 -17653089 -24992632 -25835512 -20472720 -15473947 -15736293 -18072219 -16762644 -12644037
6138 -12644037 -11579571 -15041155 -17362425 -13184524 -3987987 4086422 6585998 4008598
6130 4008598 454595 -466228 435563 -1445726 -8448524 -16507025 -19780835 -18261835 -16963252
6121 -16963252 -17974609 -18047947 -15010942 -11620379 -10538698 -9795074 -6814953 -3600120 -3734913
6112 -3734913 -6607937 -8935167 -10335140 -12753619 -15135636 -13469728 -6681536 1404099
6104 1404099 6811444 8799526 7783747 3440948 -3458147 -9988283 -13616663 -14222952
6096 -14222952 -12960581 -11277669 -11535875 -15707356 -22225272 -26722250 -27174463 -25709386
6088 -25709386 -24190158 -21464077 -17128976 -14387002 -15518706 -17090122 -13922648 -6537764
$$ packed form
6146a7653089p339543q42880N362792M998773k62346k335926J309575M118607
6138a2644037J064466l461584k321270M177901R196537Q074409K499576k577400
6130D008598l554003r20823R01791j881289p002798q058501l273810J519000J298583
6121a6963252j011357p3338L037005L390563J081681P43624K980121L214833j34793
6112c734913k873024k327230j399973k418479k382017J665908O788192Q085635
6104A404099N407345J988082j015779m342799o899095o530136l628380o06289
6096a4222952J262371J682912k58206m171481o517916m496978m52213J465077
6088b5709386J519228K726081M335101K741974j131704j571416L167474P384884
$$ plain form
6080 -6537764 -564928 786983 -91734 378675 2800425 5613095 7252086 6799158 4697784
6071 4697784 3111261 3455673 3868552 1929658 -439443 1242877 6523979 8745212 3947250
6062 3947250 -2375848 -1199117 9074440 21014009 26532020 23574803 14975649 4423429
6054 4423429 -5086146 -11265108 -13245253 -12058011 -9615057 -7198262 -4862021 -2004148
6046 -2004148 1167920 2510032 -573958 -7318608 -12377347 -10720518 -3796470 1438795
6038 1438795 394422 -4287716 -7002847 -6261198 -4994192 -4817000 -3385213 1435706 7361322
6029 7361322 10162407 9412329 8998441 11308499 13267599 10187138 2604593 -3121043 -1640295
6020 -1640295 5529472 12012038 13346752 10293748 5955606 1840893 -1998779 -4300154
$$ packed form
6080f537764N972836J351911q78717M70409K421750K812670J638991m52928k101374
6071D697784j586523L44412M12879j938894k369101J682320N281102K221233m797962
6062C947250o323098J176731J0273557J1939569N518011k957217q599154j0552220
6054D423429r509575o178962j980145J187242K442954K416795K336241K857873
6046b004148L172068J342112l083990o744650n058739J656829O924048N235265
6038A438795j044373m682138k715131P41649J267006J77192J431787M820919N925616
6029G361322K801085p50078m13888K310058J959100l080461p582545n725636J480748
6020a640295P169767O482566J334714l053004m338142m114713l839672k301375
$$ plain form
6012 -4300154 -2595503 3175099 8637442 8724077 3628794 -756036 540637 5750247 8883034
6003 8883034 7414148 4997218 5747495 8125522 6882454 344954 -6890559 -9302282
5995 -9302282 -6533162 -2630931 -502088 623762 2315280 3964030 4067874 3062714
5987 3062714 2970795 4612407 6876885 8815170 10680022 12150041 11064992 5524578 -3087912
5978 -3087912 -10372717 -12513047 -9343166 -3989415 194475 2282891 3390225 3978841
5970 3978841 2875844 -50230 -1826585 346701 4334861 5067653 1800116 -663610
5962 -663610 297809 770808 -2681391 -6026266 -3728539 1025211 -460400 -9275260 -16683715
5953 -16683715 -16728016 -13648200 -13223476 -13719356 -11181138 -8251316 -10272168 -15492915 -16571027
$$ packed form
6012d300154J704651N770602N462343Q6635n095283m384830J296673N209610L132787
6003H883034j468886k416930P50277K378027j243068o537500p235513k411723
5995i302282K769120L902231K128843J125850J691518J648750J03844j005160
5987C062714r1919J641612K264478J938285J864852J470019j085049n540414q612490
5978c087912p284805k140330L169881N353751M183890K088416J107334N88616
5970C978841j102997k926074j776355K173286L988160P32792l267537k463726
5962f63610R61419M72999l452199l344875K297727M753750j485611q814860p408455
5953a6683715m4301L079816M24724m95880K538218K929822k020852n220747j078112
$$ plain form
5944 -16571027 -10899846 -3013909 2767465 5584793 3903710 -4454093 -15843660 -20888265
5936 -20888265 -15064450 -4774376 768377 -293131 -4101363 -8569562 -13725247 -17131781
5928 -17131781 -15055269 -8008860 -504831 4846147 8940423 11855239 11548166 8228239
5920 8228239 5813336 6384137 6175925 401062 -9410154 -16113385 -14950881 -8476413 -2860329
5911 -2860329 -1001445 -697496 966566 3278559 3142047 -190913 -3769998 -4963912 -4791554
5902 -4791554 -5541339 -6680341 -5721256 -2390381 1019846 3448099 6078633 8773054 8727833
5893 8727833 4744819 498934 939094 6526092 13009323 15949580 13840928 8184609
5885 8184609 2727005 1477330 4697844 7236745 3551818 -5455522 -13087267 -14726842
$$ packed form
5944a6571027N671181P885937N781374K817328j681083q357803j1389567n044605
5936b0888265N823815J0290074N542753j061508l808232m468199n155685l406534
5928a7131781K076512P046409P504029N350978M094276K914816l07073l319927
5920H228239k414903N70801k08212n774863r811216o703231J162504O474468N616084
5911b860329J858884L03949J664062K311993j36512l332960l579085j193914J72358
5902d791554p49785j139002R59085L330875L410227K428253K630534K694421m5221
5893H727833l983014m245885M40160N586998O483231K940257k108652n656319
5885H184609n457604j249675L220514K538901l684927r007340p631745j639575
$$ plain form
5877 -14726842 -12605367 -11779844 -13633303 -15067067 -12863800 -7207286 -1278402 1690413
5869 1690413 1123530 -855906 -2354030 -4140442 -7904228 -12408293 -13439459 -8464143
5861 -8464143 -100715 5861700 5379271 -608741 -6561890 -6450438 436990 7889319 9186206
5852 9186206 4823028 945742 516652 467400 -1667626 -3825995 -4746600 -7588531 -13578665
5843 -13578665 -16848604 -11855693 -2605601 2495832 2805366 4899526 10940580 15816421
5835 15816421 16481418 15956722 16079928 14211632 10127447 8263588 8890657 4900429 -6814712
5826 -6814712 -18071939 -20780391 -19087883 -21162297 -24156387 -18529721 -5010066 4510994
5818 4510994 3891053 393 406353 3313552 4108177 3654888 4078170 2385593 -4992184
$$ packed form
5877a4726842K121475Q25523j853459j433764K203267N656514N928884K968815
5869A690413n66883j979436j498124j786412l763786m504065j031166M975316
5861h464143Q363428N962415m82429n988012n953149J11452O887428P452329J296887
5852I186206m363178l877286m29090m9252k135026k158369r20605k841931n990134
5843a3578665l269939M992911R250092N101433L09534K094160O041054M875841
5835A5816421O64997n24696J23206j868296m084185j863859O27069l990228j1715141
5826f814712j1257227k708452J692508k074414k994090N626666J3519655R521060
5818D510994o19941l890660M05960K907199P94625m53289M23282j692577p377777
$$ plain form
5809 -4992184 -14770359 -19615520 -16429717 -7893382 1892482 9471559 11900086 8520024
5801 8520024 2030643 -4296732 -8791073 -9763559 -5626371 885145 2936005 -2094942
5793 -2094942 -8321210 -9678165 -8534384 -10363697 -13404519 -11028704 -2873453 4083371
5785 4083371 5864417 5688223 6148507 3876412 -4511219 -15797135 -23227849 -23421061 -17690666
5776 -17690666 -9237316 -1640287 1979221 978588 -2297292 -5073538 -6288903 -6154767
5768 -6154767 -5298475 -4296314 -2343450 2573643 9442646 11842600 4555091 -8025198
5760 -8025198 -15809470 -15936057 -15496000 -19648744 -24159788 -23803570 -21524153 -22836371 -25720362
5751 -25720362 -23460768 -15346633 -7739074 -5196481 -6292181 -8035416 -9303148 -9733837
$$ packed form
5809d992184r778175m845161L185803Q536335R785864P579077K428527l380062
5801H520024o489381o327375m494341r72486M137188O511516K050860n030947
5793b094942o226268j356955J143781j829313l040822K375815Q155251O956824
5785D083371J781046j76194M60284k272095q387631j1285916p430714j93212N730395
5776a7690666Q453350P597029L619508j000633l275880k776246j215365J34136
5768f154767Q56292J002161J952864M917093O869003K399954p287509j2580289
5760h025198p784272j26587M40057m152744m511044L56218K279417j312218k883991
5751b5720362K259594Q114135P607559K542593j095700j743235j267732m30689
$$ plain form
5743 -9733837 -9729243 -11655161 -16790153 -21169983 -19059584 -10964138 -3647816 -1330184 -1279077
5734 -1279077 518818 3662533 5630722 6430517 8161109 11549414 14647218 14148936 7988206
5725 7988206 -1725185 -8963210 -9542303 -6085068 -4284942 -5195004 -5357555 -3962952 -4445906
5716 -4445906 -8100999 -11552191 -12482281 -12831834 -13921822 -13405517 -10178872 -7656945 -8540660
5707 -8540660 -10579508 -11345151 -12840029 -16737293 -19081535 -15251625 -7223166 -507967
5699 -507967 3348345 5617252 4800721 -724295 -6271105 -4898039 2063772 5890066 2778898
5690 2778898 -1952820 -3807957 -5745131 -11060539 -16106769 -15736054 -11912389 -11071832 -14851424
5681 -14851424 -18393950 -17221065 -12055398 -7052322 -6109768 -10743870 -19008235 -25946670
$$ packed form
5743i733837M594j925918n134992m379830K110399Q095446P316322K317632N1107
5734a279077J797895L143715J968189P99795J730592L388305L097804m98282o160730
5725G988206r713391p238025n79093L457235J800126r10062j62551J394603m82954
5716d445906l655093l451192r30090l49553j089988N16305L226645K521927q83715
5707h540660k038848p65643j494878l897264k344242L829910Q028459O715199
5699e07967L856312K268907q16531n525016n546810J373066O961811L826294l111168
5690B778898m731718j855137j937174n315408n046230L70715L823665Q40557l779592
5681a4851424l542526J172885N165667N003076R42554m634102q264365o938435
$$ plain form
5673 -25946670 -26677322 -20000103 -9291452 -332401 2409015 -801868 -5002770 -5612754
5665 -5612754 -3421617 -2528422 -3880064 -4362356 -2754573 -2282742 -5079206 -7812445 -6054212
5656 -6054212 -403596 5016291 8017773 8668300 5702387 -3017697 -15956520 -26892076
5648 -26892076 -29929398 -24740973 -16680903 -12115875 -12937185 -15201539 -14188090 -10657297
5640 -10657297 -9581124 -12089016 -12497094 -6066622 3462614 8177461 6055763 2324739
5632 2324739 1324657 1439856 -920672 -5784291 -9976694 -11155595 -9745375 -7499263
5624 -7499263 -5336951 -3101333 -1457985 -2850494 -8574676 -15198410 -17008987 -13162593
5616 -13162593 -9352414 -10547909 -15177825 -18944135 -21104537 -23511371 -26240777 -28181274
$$ packed form
5673b5946670p30652O677219J0708651Q959051K741416l210883m200902o09984
5665e612754K191137Q93195j351642m82292J607783M71831k796464k733239J758233
5656f054212N650616N419887L001482O50527k965913q720084j2938823j0935556
5648b6892076l037322N188425Q060070M565028q21310k264354J013449L530793
5640a0657297J076173k507892m08078O430472R529236M714847k121698l731024
5632B324739j000082J15199k360528m863619m192403j178901J410220K246112
5624g499263K162312K235618J643348j392509n724182o623734j810577L846394
5616a3162593L810179j195495m629916l766310k160402k406834k729406j940497
$$ plain form
5608 -28181274 -29653418 -30365563 -27188326 -18671144 -9548807 -5461353 -5247463 -4547535 -5060877
5599 -5060877 -12300010 -24265063 -30925434 -27258224 -19374894 -14585071 -12368850 -9392027
5591 -9392027 -7099266 -8732740 -13295903 -17865314 -22451422 -27610903 -30386998 -27934330
5583 -27934330 -23207435 -22301102 -27225778 -34666855 -40213564 -40847255 -35551862 -26643483
5575 -26643483 -18175543 -10429340 341132 13392490 19891481 13903652 2985549 81421
5567 81421 6809843 12747085 10781269 4982823 1896155 1636269 826012 -1344152 -3509793
5558 -3509793 -4504318 -2637826 3645838 11951540 16311862 13749975 7256029 395707
5550 395707 -7008388 -15085853 -19923989 -17738070 -10865819 -5496427 -4224947 -3989528 -1118973
$$ packed form
5608b8181274j472144p12145L177237Q517182R122337M087454K13890O99928n13342
5599e060877p239133j1965053o660371L667210P883330M789823K216221K976823
5591i392027K292761j633474m563163m569411m586108n159481k776095K452668
5583b7934330M726895R06333m924676p441077n546709o33691N295393Q908379
5575b6643483Q467940P746203J0770472J3051358O498991n987829j0918103k904128
5567H1421O728422N937242j965816n798446l086668k59886q10257k170164k165641
5558c509793r94525J866492O283664Q305702M360322k561887o493946o860322
5550C95707p404095q077465m838136K185919O872251N369392J271480K35419K870555
$$ plain form
5541 -1118973 3932342 7076425 4737383 -2243285 -8595630 -9579145 -6005766 -2686208
5533 -2686208 -2079891 -2133684 -698491 1286143 2303369 2729142 2932691 1837001 -449595
5524 -449595 -1217330 1281846 5220488 8341088 11100239 14168727 15619882 13902866 11255260
5515 11255260 10466381 10131547 7098440 2243401 -455419 -9822 481082 -1279720 -4645226
5506 -4645226 -8953854 -14646057 -20474601 -23142760 -21429296 -18147746 -16497437 -16645825
5498 -16645825 -17400221 -19145639 -22945282 -27656141 -29851679 -26903842 -19755603 -12798978
5490 -12798978 -10841278 -15369483 -23474214 -30602428 -34054589 -33789133 -31197904 -28123393
5482 -28123393 -25856585 -23755858 -19950783 -14618195 -10820740 -10276112 -10461520 -8813354
$$ packed form
5541a118973N051315L144083k339042o980668o352345r83515L573379L319558
5533b686208O06317n3793J435193J984634J017226M25773K03549j095690k286596
5524d49595p67735K499176L938642L120600K759151L068488J451155j717016k647606
5515A1255260p88879l34834l033107m855039k698820M45597M90904j760802l365506
5506d645226m308628n692203n828544k668159J713464L281550J650309j48388
5498a6645825p54396j745418l799643m710859k195538K947837P148239O956625
5490a2798978J957700m528205q104731p128214l452161K65456K591229L074511
5482b8123393K266808K100727L805075N332588L797455N44628j85408J648166
$$ plain form
5474 -8813354 -7649932 -10548936 -14958321 -13860142 -5564049 3343880 6909611 6974719 8237811
5465 8237811 10311150 9506382 6121487 4305339 4711383 2575833 -4627781 -11448557 -10444889
5456 -10444889 -2713696 2057590 -2284233 -9673565 -9222857 208138 8344445 7708124
5448 7708124 3691887 5887059 13692331 17666172 13894254 9300842 10965879 16783126
5440 16783126 20338309 20083141 19080115 18757054 17556187 14522844 10796074 7968267
5432 7968267 6640259 5439934 864239 -8969331 -19247168 -21390556 -13865234 -5781246
5424 -5781246 -5572578 -10047596 -10241577 -5094043 -2346352 -6746434 -14182847 -18412971 -17859924
5415 -17859924 -14086745 -8493820 -3046102 -843064 -3497797 -9565598 -16116542 -20008056
$$ packed form
5474h813354J163422k899004m409385J098179Q296093Q907929L565731O5108J263092
5465H237811K073339q04768l384895j816148M06044k135550p203614o820776J003668
5456a0444889P731193M771286m341823p389332M50708R430995Q136307o36321
5448G708124m016237K195172P805272L973841l771918m593412J665037N817247
5440A6783126L555183k55168j003026l23061j200867l033343l726770k827807
5432G968267j328008j200325m575695r833570j0277837k143388P525322Q083988
5424e781246K08668m475018j93981N147534K747691m400082p436413m230124N53047
5415a7859924L773179N592925N447718K203038k654733o067801o550944l891514
$$ plain form
5407 -20008056 -18519340 -12213616 -6622784 -6894165 -10847618 -11808686 -8219600 -5006152
5399 -5006152 -4854029 -4536620 -2008111 -662739 -2862654 -5038618 -4074901 -3747284 -9055917
5390 -9055917 -17453822 -21490928 -18251433 -11247610 -4649492 -297173 1005801 -231427
5382 -231427 -1521915 -1614525 -2753805 -6085235 -7270507 -1675700 7749799 13105765 11165758
5373 11165758 5520518 301620 -2912940 -3057276 -542579 153545 -4805912 -11304593
5365 -11304593 -11424292 -5436810 -2184302 -5938764 -10929008 -11911090 -11606018 -12395219 -8884937
5356 -8884937 3044394 15606347 17333141 9449139 4647275 9542530 16665300 15766370
5348 15766370 6272517 -4551560 -10753385 -11400625 -8428030 -4314443 -646560 2893285
$$ packed form
5407b0008056J488716O305724N590832k71381l953453r61068L589086L213448
5399e006152J52123L17409K528509J345372k199915k175964R63717L27617n308633
5390i055917q397905m037106L239495P003823O598118M352319J302974j237228
5382b31427j290488r2610j139280l331430j185272N594807R425499N355966j940007
5373A1165758n645240n218898l214560j44336K514697O96124m959457o498681
5365a1304593j19699N987482L252508l754462m990244r82082L05072p89201L510282
5356h884937J1929331J2561953J726794p884002m801864M895255P122770q98930
5348A5766370r493853j0824077o201825o47240K972595M113587L667883L539845
$$ plain form
5340 2893285 7115024 10391292 9441122 4392355 776454 3935708 12158325 17602701
5332 17602701 14507290 5277777 -2273726 -3015106 1285573 5531791 6965500 5828522
5324 5828522 2439730 -2847572 -7015846 -5734706 1053928 7882814 9936263 8003767
5316 8003767 5767170 5131615 6097895 7807320 7161316 221674 -11382682 -19135084 -17410278
5307 -17410278 -11482915 -10446600 -14903924 -18045279 -17011584 -15787148 -17088360 -18749272
5299 -18749272 -19224069 -19893719 -20181635 -16751509 -9752844 -3852872 -718884 3401742 9908136
5290 9908136 14163244 13225123 10806854 9932884 7002840 -948000 -8827817 -10525735 -9038423
5281 -9038423 -11971466 -20054843 -27553687 -31204853 -30643742 -22609536 -4945958 13567672
$$ packed form
5340B893285M221739L276268r50170n048767l615901L159254Q222617N444376
5332A7602701l095411r229513p551503p41380M300679M246218J433709j136978
5324E828522l388792n287302m168274J281140O788634O828886K053449j932496
5316H003767k236597o35555R66280J709425o46004o939642j1604356p752402J724806
5307a7410278N927363J036315m457324l141355J033695J224436j301212j660912
5299a8749272m74797o69650k87916L430126O998665N899972L133988M120626O506394
5290I908136M255108r38121k418269q73970k930044p950840p879817j697918J487312
5281i038423k933043q083377p498844l651166N61111Q034206J7663578J8513630
$$ plain form
5273 13567672 17933620 4852870 -12273154 -20072466 -19360120 -17801350 -16045609 -9265846
5265 -9265846 1499110 8283442 6511131 98106 -4924881 -7097841 -7901530 -7160346
5257 -7160346 -3328870 2914464 8227087 10159105 9300636 6918546 2245936 -5420390
5249 -5420390 -12745036 -14259715 -9439874 -4262692 -3308584 -3837822 -1314962 2609725 2891789
5240 2891789 -499402 -3192191 -4240819 -6480723 -9121675 -7539534 -2182253 -427829
5232 -427829 -6517772 -16110478 -24126412 -31080954 -37140149 -37156942 -28463996 -17860021 -12937314
5223 -12937314 -10820185 -4154202 4897167 6492083 -1705249 -10612811 -12433206 -9128826
5215 -9128826 -5759643 -2585219 2429653 8505999 13273494 15798454 16079443 14504731
$$ packed form
5273A3567672M365948j3080750j7126024p799312P12346J558770J755741O779763
5265i265846J0764956O784332j772311o413025n022987k172960q03689P41184
5257g160346L831476O243334N312623J932018q58469k382090m672610p666326
5249e420390p324646j514679M819841N177182R54108n29238K522860L924687K82064
5240B891789l391191k692789j048628k239904k640952J582141N357281J754424
5232d27829o089943r592706q015934o954542o059195j6793Q692946J0603975M922707
5223a2937314K117129O665983R051369J594916q197332q907562j820395L304380
5215i128826L369183L174424N014872O076346M767495K524960K80989j574712
$$ plain form
5207 14504731 12857169 12252065 9683980 1393449 -9650272 -15327183 -12974285 -8457682
5199 -8457682 -6598607 -5301088 -2679658 -2884162 -8977248 -15528819 -15100019 -8526820 -2598582
5190 -2598582 -612726 -1209428 -3499394 -6736766 -7264293 -2713997 2206519 809634 -5747679
5181 -5747679 -10257019 -9989235 -8405268 -7160884 -4425731 -1630820 -3499678 -9332329
5173 -9332329 -12150391 -9475347 -7434595 -10335024 -13454019 -11301986 -6662929 -5389826
5165 -5389826 -7337922 -8745216 -9416261 -11102715 -12095036 -9833337 -6266736 -4540082 -2937680
5156 -2937680 1546475 6111376 5678913 1614051 -764072 -2212954 -8498849 -18873442
5148 -18873442 -24474561 -20558896 -12289200 -5162503 2311698 11657739 17718364 15757404
$$ packed form
5207A4504731j647562o05104k568085q290531j1043721n676911K352898M516603
5199h457682J859075J297519K621430k04504o093086o551571M28800O573199N928238
5190b598582J985856n96702k289966l237372n27527M550296M920516j396885o557313
5181e747679m509340K67784J583967J244384K735153K794911j868858n832651
5173i332329k818062K675044K040752k900429l118995K152033M639057J273103
5165e389826j948096j407294o71045j686454r92321K261699L566601J726654J602402
5156b937680M484155M564901m32463m064862k378123j448882o285895j0374593
5148a8873442n601119L915665Q269696P126697P474201R346041O060625j960960
$$ plain form
5140 15757404 9933864 7513611 8676320 9477983 11375713 18597236 27102744 26066642
5132 26066642 12872607 -1407395 -5797961 -2598315 -1711237 -6584536 -12200877 -14684092
5124 -14684092 -16182357 -19764979 -24718744 -28763885 -31391857 -32848869 -32135831 -28058660
5116 -28058660 -20875591 -11646487 -1647825 6306979 8357876 4055532 -1188889 -1300038
5108 -1300038 3323197 6898610 6198118 3711942 2223301 436862 -3416344 -6888928
5100 -6888928 -6030721 -1269964 2927490 3611304 1599959 -1005427 -2078201 1465832 11695449
5091 11695449 25390115 34910592 35194816 27802151 17094700 5694383 -4053933 -7564638
5083 -7564638 -1622694 10003979 18349055 17543132 9378232 -74365 -5329567 -2604280
$$ packed form
5140A5757404n823540k420253J162709Q01663J897730P221523Q505508j036102
5132B6066642j3194035j4280002m390566L199646Q87078m873299n616341k483215
5124a4684092j498265l582622m953765m045141k627972j457012P13038M077171
5116b8058660P183069R229104R998662P954804K050897m302344n244421j11149
5108a300038M623235L575413p00492k486176j488641j786439l853206l472584
5100f888928Q58207M760757M197454O83814k011345k605386j072774L544033J0229617
5091A1695449J3694666R520477K84224p392665j0707451j1400317r748316l510705
5083g564638N941944J1626673Q345076q05923q164900r452597n255202K725287
$$ plain form
5075 -2604280 9523795 26775248 38362979 34467327 16258488 -4067466 -15209611
5068 -15209611 -17201825 -18310639 -23606499 -30049156 -32338895 -29453959 -23847444 -17617123
5060 -17617123 -12385960 -10841769 -14871971 -22521049 -29185396 -31605931 -29202040 -22964461
5052 -22964461 -15717995 -12144058 -14613109 -18901283 -17847519 -10271200 -2903224 -2072804
5044 -2072804 -6764624 -11970192 -15703763 -19287605 -22609287 -23255597 -20636581 -17836525
5036 -17836525 -17792504 -19053003 -16973181 -9105711 1561134 9342624 11473147 10208941
5028 10208941 9624066 11787595 16216989 20693840 21330415 14654476 2564268 -6856736
5020 -6856736 -7222932 -1361260 2817509 2562464 1422740 937974 -2215623 -9132950 -14895905
$$ packed form
5075b604280J2128075J7251453J1587731l895652j8208839k0325954j1142145
5068a5209611j992214j108814n295860o442657k289739K884936N606515O230321
5060a7617123N231163J544191m030202p649078o664347k420535K403891O237579
5052b2964461P246466L573937k469051m288174J053764P576319P367976Q30420
5044b072804m691820n205568l733571l583842l321682o46310K619016K800056
5036a7836525M4021j260499K079822P867470J0666845P781490K130523j264206
5028A0208941n84875K163529M429394M476851O36575o675939j2090208r421004
5020f856736l66196N861672M178769k55045j139724m84766l153597o917327n762955
$$ plain form
5011 -14895905 -15212974 -11976984 -8573070 -4249838 2235900 7216870 5994694 46109
5003 46109 -4864537 -6622470 -8114647 -11433361 -15389267 -18795670 -21983097 -24393021 -24210064
4994 -24210064 -21379259 -18282977 -16617161 -15871143 -15461172 -16048047 -17775362 -19053541 -18482458
4985 -18482458 -17248940 -18457514 -23516272 -29133894 -29057338 -20488217 -8231829 -77239
4977 -77239 1710294 1235151 1580445 1246348 -888215 -2516458 -2755958 -4730279 -8966572
4968 -8966572 -9283646 -1311860 8813009 11463800 6830713 3558125 5094649 5526831
4960 5526831 108455 -7486994 -11271734 -10674739 -9084425 -9042871 -11715011 -17258720 -22760642
4951 -22760642 -23142144 -17340241 -11056561 -10104185 -12745145 -11878108 -4126699 6135399
$$ packed form
5011a4895905l17069L235990L403914M323232O485738M980970j222176n948585
5003D6109m910646j757933j492177l318714l955906l406403l187427k409924J82957
4994b4210064K830805L096282J665816P46018M09971n86875j727315j278179N71083
4985a8482458J233518j208574n058758n617622P6556Q569121J2256388Q154590
4977g7239J787533m75143L45294l34097k134563j628243k39500j974321m236293
4968h966572l17074P971786J0124869K650791m633087l272588J536524M32182
4960E526831n418376p595449l784740N96995J590314M1554k672140n543709n501922
4951b2760642l81502N801903O283680R52376k640960Q67037P751409J0262098
$$ plain form
4943 6135399 12039805 11143675 5958930 -607548 -7554487 -13389302 -15046434 -12277437
4935 -12277437 -10744279 -16001863 -25245072 -30467233 -29847784 -29452581 -32247121 -33051727 -28025652
4926 -28025652 -21653064 -18845575 -16997404 -12750883 -10392398 -15015556 -21963207 -22245076
4918 -22245076 -15708791 -10297186 -10080552 -11735642 -11308135 -7703518 -1583413 3209639
4910 3209639 809757 -7689172 -11653934 -5102071 2801967 1132293 -5682095 -6205525
4902 -6205525 -1195565 -205585 -3904232 -5222100 -4325337 -6270119 -7223369 -616289 5861644
4893 5861644 -1418531 -18699689 -30079619 -34093576 -42467184 -53867704 -55037685 -48766969
4885 -48766969 -51825735 -62093079 -59614478 -45725314 -45269580 -60972450 -66206418 -57219469
$$ packed form
4943F135399N904406q96130n184745o566478o946939n834815j657132K768997
4935a2277437J533158n257584r243209n222161O19449L95203k794540q04606N026075
4926b8025652O372588K807489J848171M246521K358485m623158o947651k81869
4918b2245076O536285N411605K16634j655090M27507L604617O120105M793052
4910C209639k399882q498929l964762O551863P904038j669674o814388n23430
4902f205525N009960R89980l698647j317868Q96763j944782r53250O607080O477933
4893E861644p280175j7281158j1379930m013957q373608j1400520j169981O270716
4885d8766969l058766j0267344K478601J3889164M55734j5702870n233968Q986949
$$ plain form
4877 -57219469 -66152127 -100269981 -122607869 -130270589 -191546688 -338505038 -467911359
4870 -467911359 -438645079 -255596586 -70925683 3499378 2720886 9170670 32260921
4863 32260921 36203143 22965048 21914137 30765297 25025936 8095280 3896216 11754805
4855 11754805 10525539 -774844 -4006723 2429253 3310379 -2128300 -738927 5125067
4847 5125067 -481175 -15735742 -20563034 -9877433 -721067 -2317465 -3750921 2829419
4839 2829419 9210363 8513536 6266458 6848858 5651167 1251085 254717 4390807 6913000
4830 6913000 6165723 8155851 11658714 6583633 -7274482 -15527634 -10437514 -2347125
4822 -2347125 -1723455 -3404257 1647075 10713294 15948969 17242692 18348887 17676879 12242029
$$ packed form
4877e7219469q932658l4117854k2337888p662720o1276099j46958350j29406321
4870d67911359K9266280J83048493J84670903P4425061p78492O449784K3090251
4863C2260921L942222j3238095j050911Q851160n739361j6930656m199064P858589
4855A1754805j229266j1300383l231879O435976Q81126n438679J389373N863994
4847E125067n606242j5254567m827292J0685601R156366j596398j433456O580340
4839B829419O380944o96827k247078N82400j197691m400082r96368M136090K522193
4830F913000p47277J990128L502863n075081j3858115q253152N090120Q090389
4822b347125O23670j680802N051332R066219N235675J293723J106195o72008n434850
$$ plain form
4813 12242029 4850589 -477655 -4785409 -9472027 -11550847 -10142350 -11344450 -19421546
4805 -19421546 -28529594 -30219178 -24537230 -17338703 -11291688 -5956879 -2296607 -457912
4797 -457912 3119719 10061946 15094029 12905485 6546742 2617406 1362116 -1306960
4789 -1306960 -4288557 -1850701 6199363 11991226 9367803 1468786 -3852491 -3184031
4781 -3184031 217815 1783677 780451 -477111 -1177245 -3262719 -7192017 -9395310
4773 -9395310 -7166734 -3948287 -5264333 -10672304 -14986548 -16842778 -19862693 -24820421
4765 -24820421 -27264620 -24685110 -19774176 -14439244 -7213537 478627 2681759 -1864112
4757 -1864112 -5459622 -2206608 2837067 2217107 -1120869 1913349 12007912 19710497
$$ packed form
4813A2242029p391440n328244m307754m686618k078820J408497j202100q077096
4805a9421546r108048j689584N681948P198527O047015N334809L660272J838695
4797d57912L577631O942227N032083k188544o358743l929336j255290k669076
4789a306960k981597K437856Q050064N791863k623423p899017n321277O68460
4781c184031L401846J565862j003226j257562p00134k085474l929298k203293
4773i395310K228576L218447j316046n407971m314244j856230l019915m957728
4765b4820421k444199K579510M910934N334932P225707P692164K203132m545871
4757a864112l595510L253014N043675o19960l337976L034218J0094563P702585
$$ plain form
4749 19710497 18134876 10193538 2170500 -3609426 -7463787 -8570373 -5820888 -407365
4741 -407365 4491375 5922038 2909472 -2816245 -8124514 -11681392 -15023829 -19222857
4733 -19222857 -22183044 -21593435 -19134770 -18663502 -20751506 -22054789 -20116000 -15879474
4725 -15879474 -10945492 -5321591 484537 3466930 1038507 -4502609 -7159183 -4145397
4717 -4145397 217819 -215321 -5248194 -8782608 -7562007 -4990884 -3979799 -870927
4709 -870927 8284506 18628572 20635670 12574812 1992834 -5571533 -11916425 -18261279
4701 -18261279 -19984967 -14227115 -6558970 -3701290 -3850325 -1108219 3366844 2424343
4693 2424343 -5343130 -12354911 -12354670 -8006650 -5188475 -4568608 -3319316 -2135917 -4981483
$$ packed form
4749A9710497j575621p941338q023038n779926l854361j106586K749485N413523
4741d07365M898740J430663l012566n725717n308269l556878l342437m199028
4733a9222857k960187N89609K458665M71268k088004j303283J938789M236526
4725a5879474M933982N623901N806128K982393k428423n541116k656574L013786
4717d145397M363216m33140n032873l534414J220601K571123J011085L108872
4709h70927R155433J0344066K007098q060858j0581978p564367o344892o344854
4701a8261279j723688N757852P668145K857680j49035K742106M475063r42501
4693B424343p767473p011781K41M348020K818175O19867J249292J183399k845566
$$ plain form
4684 -4981483 -12145435 -18464937 -19804581 -17094483 -11668190 -1455477 12893037 21717185
4676 21717185 14726874 -3994694 -18153288 -19588750 -17832347 -23554084 -31030561 -27027350
4668 -27027350 -11657417 1524985 4422311 1784246 -577918 -3381311 -6915391 -7081531
4660 -7081531 -3208922 -1422386 -5232657 -9882167 -10473592 -8589364 -6422239 -2084739
4652 -2084739 3721627 4068828 -4307510 -14213987 -18341225 -19870531 -24536252 -28448441
4644 -28448441 -24232181 -15132871 -11637004 -15445947 -17639180 -13435481 -8772197 -9462059
4636 -9462059 -12098036 -10065777 -3049022 3745104 6686112 6937529 8227239 12803056
4628 12803056 18429105 19721326 14325337 6697880 3192132 4775495 7811249 10381870
$$ packed form
4684d981483p163952o319502j339644K710098N426293J0212713J4348514Q824148
4676B1717185o990311j8721568j4158594j435462J756403n721737p476477M003211
4668b7027350J5369933J3182402K897326k638065k362164k803393l534080j66140
4660g081531L872609J786536l810271m649510n91425J884228K167125M337500
4652b084739N806366L47201q376338r906477m127238j529306m665721l912189
4644b8448441M216260R099310L495867l808943k193233M203699M663284o89862
4636i462059k635977K032259P016755O794126K941008K51417J289710M575817
4628A2803056N626049J292221n395989p627457l505748J583363L035754K570621
$$ plain form
4620 10381870 13379721 16134355 16168340 14239890 15138868 21328896 28795270 31503807 28175762
4611 28175762 22494664 17540790 12500440 5844119 -80669 -840943 3182713 5683849
4603 5683849 3095036 220128 1905710 3027395 -4601972 -17035640 -20742797 -12094772
4595 -12094772 -3378474 -4974092 -11809653 -13776847 -9940580 -4479213 2581722 11012218
4587 11012218 14428772 9416675 4476809 8862065 17849789 20693712 18199306 19156528
4579 19156528 22808488 19641191 9036838 1628386 2188148 3378611 -237783 -4109691
4571 -4109691 -3936649 -3077004 -4528815 -4879480 -1617597 1596575 2015423 2825206 6272982
4562 6272982 8543314 6235353 2033395 -131722 19339 2115408 6643445 10336396
$$ packed form
4620A0381870K997851K754634L3985j928450Q98978O190028P466374K708537l328045
4611B8175762n681098m953874n040350o656321n924788p60274M023656K501136
4603E683849k588813k874908J685582J121685p629367j2433668l707157Q648025
4595a2094772Q716298j595618o835561j967194L836267N461367P060935Q430496
4587A1012218L416554n012097m939866M385256Q987724K843923k494406R57222
4579A9156528L651960l167297j0604353p408452N59762J190463l616394l871908
4571d109691J73042Q59645j451811l50665L261883L214172M18848Q09783L447776
4562F272982K270332k307961m201958k165117J51061K096069M528037L692951
$$ plain form
4554 10336396 7172017 -1911578 -7132841 -2546390 5358265 6600135 -61232 -8389840
4546 -8389840 -13070479 -12322950 -6854026 -658716 1125023 -1296859 -2113073 1253297 4179982
4537 4179982 2578348 -1132745 -3269901 -4431494 -5953074 -6170159 -4001900 -1192035
4529 -1192035 2034473 7594287 12909135 10983964 1299490 -6989475 -7947614 -7208881 -11148721
4520 -11148721 -15584815 -13454941 -7130656 -3825779 -3742359 -2228386 64039 -1178827
4512 -1178827 -4412309 -3502491 2373466 7944620 10380091 11574982 12278995 10280498 4505553
4503 4505553 -3810233 -12959477 -19618259 -18724229 -9987985 -1603575 -1134905 -5359764 -6033675
4494 -6033675 -3060404 -3654176 -9660804 -14461094 -13251693 -8904058 -6189497 -6500694 -9471956
$$ packed form
4554A0336396l164379r083595n221263M586451P904655J241870o661367q328608
4546h389840m680639P47529N468924O195310J783739k421882q16214L366370K926685
4537D179982j601634l711093k137156j161593j521580k17085K168259K809865
4529a192035L226508N559814N314848j925171r684474q288965r58139P38733l939840
4520a1148721m436094K129874O324285L304877Q3420J513973K292425j242866
4512a178827l233482R09818N875957N571154K435471J194891P04013j998497n774945
4503D505553q315786r149244o658782Q94030Q736244Q384410M68670m224859o73911
4494f033675K973271n93772o006628m800290J209401M347635K714561l11197k971262
$$ plain form
4485 -9471956 -13823067 -15350743 -9893563 111475 7218384 8486681 8285050 10162502
4477 10162502 11368435 8053360 1381640 -4771380 -9117671 -12937987 -16663196 -18934601
4469 -18934601 -18344142 -14832319 -9601452 -3821560 2536409 9460011 14348993 13217366
4461 13217366 5760258 -3348320 -9748929 -12967180 -13225284 -9282024 -2617699 1028068
4453 1028068 -930254 -3013941 438305 6218970 7294953 3709983 1398753 2332129
4445 2332129 3382636 3968927 7157528 12725450 15990074 14841914 12313933 10914750
4437 10914750 9276281 5525544 -100531 -6460154 -11627608 -12314720 -7323716 -813153
4429 -813153 2244804 2721649 4680459 7643357 7322311 3047780 -1717638 -5663582 -9963056
$$ packed form
4485i471956m351111j527676N457180J0005038P106909J268297k01631J877452
4477A0162502J205933l315075o671720o153020m346291l820316l725209k271405
4469a8934601N90459L511823N230867N779892O357969O923602M888982j131627
4461A3217366p457108r108578o400609l218251k58104L943260O664325L645767
4453A028068j958322k083687L452246N780665J075983l584970k311230R33376
4445B332129J050507N86291L188601N567922L264624j148160k527981j399183
4437A0914750j638469l750737n626075o359623n167454o87112M991004O510563
4429h13153L057957M76845J958810K962898l21046m274531m765418l945944m299474
$$ plain form
4420 -9963056 -12648777 -9785139 -3114568 313297 -2029881 -4612131 -2163495 3546332
4412 3546332 7187757 5994921 1335777 -2072312 1279979 11391410 19706906 17740404
4404 17740404 7971307 187583 -1840001 -2561170 -4186565 -3184742 1163515 3605080
4396 3605080 1579618 -548378 643568 2655490 3502016 5955972 11004718 13717995
4388 13717995 10664832 5696851 3187749 725584 -5870139 -14438940 -19043420 -17819916
4380 -17819916 -13523189 -8527789 -3438293 925916 3421045 3674933 2172892 867518
4372 867518 3251821 10312329 16971917 17457638 13837248 13069916 15594765 14623646 8155631
4363 8155631 2943056 3089483 3205798 -2018684 -8939982 -11471374 -9844490 -6798806 -1444535
$$ packed form
4420i963056k685721K863638O670571L427865k343178k582250K448636N709827
4412C546332L641425j192836m659144l408089L352291J0111431Q315496j966502
4404A7740404r769097p783724k027584p21169j625395J001823M348257K441565
4396C605080k025462k127996J191946K011922Q46526K453956N048746K713277
4388A3717995l053163m967981k509102k462165o595723q568801m604480J223504
4380a7819916M296727M995400N089496M364209K495129K53888j502041j305374
4372H67518K384303P060508O659588M85721l620390p67332K524849r71119o468015
4363H155631n212575J46427J16315n224482o921298k531392J626884L045684N354271
$$ plain form
4354 -1444535 5957717 8550470 372707 -13717262 -22400725 -19963655 -9067773 4704895
4346 4704895 15112982 15804800 5943587 -6164774 -10943694 -8045120 -4649497 -5438240
4338 -5438240 -8926077 -11565281 -10609973 -4703344 3822424 8886504 6973427 1725498
4330 1725498 -1248944 -1495945 -1776340 -2116290 -699424 1470703 1622011 -286494 -1759453
4321 -1759453 -1145599 1597075 5090408 5570883 -244948 -8773831 -11148912 -4910396 1320913
4312 1320913 -501037 -7297473 -11805950 -14068720 -18051771 -21378629 -17734757 -7616027
4304 -7616027 1598828 5639571 6570457 6841896 6575707 6404388 7481243 9024622 10011322
4295 10011322 11567344 13675482 12687436 6936679 912780 -1797696 -5011362 -12321729
$$ packed form
4354a444535P402252K592753q177763j4089969q683463K437070J0895882J3772668
4346D704895J0408087O91818r861213j2108361m778920K898574L395623p88743
4338e438240l487837k639204R55308N906629Q525768N064080j913077n247929
4330A725498k974442k47001k80395l39950J416866K170127J51308j908505j472959
4321a759453O13854K742674L493333M80475n815831q528883k375081O238516O231309
4312A320913j821950o796436m508477k262770l983051l326858L643872J0118730
4304g616027R214855M040743R30886K71439k66189j71319J076855J543379R86700
4295A0011322J556022K108138r88046n750757o023899k710476l213666p310367
$$ plain form
4287 -12321729 -18107486 -15422848 -8699882 -7683133 -11419689 -10539781 -4771833 -4831467 -14280537
4278 -14280537 -22067653 -18664934 -9416682 -4851378 -5566638 -4619447 85894 3623964
4270 3623964 2479601 -636813 -684583 3689479 8317267 7461589 392106 -7194692 -10355850
4261 -10355850 -11312079 -14996209 -20493288 -22251953 -18550602 -12973876 -8083331 -3583673
4253 -3583673 -562394 -1267921 -4107471 -4745651 -2893327 -2474655 -4782136 -7508634 -10854817
4244 -10854817 -17628253 -25891258 -28490078 -22480276 -13147435 -6226339 -1778015 1689292
4236 1689292 2839531 909014 -914371 918310 6184611 12315971 16939887 17874326
4228 17874326 14168619 8350961 4458356 3479277 4101089 7058781 13678061 20554833
$$ packed form
4287a2321729n785757K684638O722966J016749l736556Q79908N767948n9634r449070
4278a4280537p787116L402719R248252M565304p15260R47191M705341L538070
4270C623964j144363l116414m7770M374062M627788q55678p069483p586798l161158
4261a0355850r56229l684130n497079j758665L701351N576726M890545M499658
4253c583673L021279p05527k839550o38180J852324M18672k307481k726498l346183
4244a0854817o773436q263005k598820O009802R332841O921096M448324L467307
4236A689292J150239j930517j823385J832681N266301O131360M623916R34439
4228A7874326l705707n817658l892605r79079O21812K957692O619280O876772
$$ plain form
4220 20554833 21774849 17195967 12868123 12381450 13438788 13660957 13411297 11586905 5515041
4211 5515041 -2282386 -3489156 6005929 19858242 28209229 27571477 21699182 15916718
4203 15916718 12584634 10049650 5454563 -40583 -942167 4848459 11683704 14430830
4195 14430830 16717415 23751110 31046360 29799453 20931930 13464179 10514854 7973701
4187 7973701 6111196 9888945 16621166 16277856 7521502 1815807 7156598 17812337
4179 17812337 24282166 23894174 17987902 8355971 209015 -631916 3435848 4947036
4171 4947036 4677483 10520973 21626658 27091639 23698012 21164781 25550692 31354240
4163 31354240 34478710 38114641 40739350 34469956 21705074 16577967 22441917 25475062
$$ packed form
4220B0554833J220016m578882m327844m86673J057338K22169k49660j824392o071864
4211E515041p797427j206770R495085J3852313Q350987o37752n872295n782464
4203A5916718l332084k534984m595087n495146r01584N790626O835245K747126
4195A4430830K286585P033695P295250j246907q867523p467751k949325k541153
4187G973701j862505L777749O732221l43310q756354n705695N340791J0655739
4179A7812337O469829l87992n906272r631931q146956q40931M067764J511188
4171D947036k69553N843490J1105685N464981l393627k533231M385911N803548
4163C1354240L124470L635931K624709o269394j2764882n127107N863950L033145
$$ plain form
4155 25475062 19053939 15595303 23867092 34005007 37115791 39967355 47046221 48996870
4147 48996870 43589407 45596799 59210150 65560320 57048955 55875928 74929336 93762630
4139 93762630 105217654 144885451 220977731 249852529 139331628 -69795441 -223888756
4132 -223888756 -234074842 -165171248 -122485731 -119802075 -106946251 -71811935 -48165234
4125 -48165234 -47951447 -47379849 -34592777 -24162739 -24095691 -25458086 -26094553 -33681660 -43931087
4116 -43931087 -43107688 -33407390 -30770350 -36409334 -34769442 -21901756 -12404679 -14199677
4108 -14199677 -18241917 -18708186 -23070300 -34729526 -43349970 -41053119 -34019113 -30314047
4100 -30314047 -28546458 -25505224 -23788072 -25113260 -25765855 -24457023 -25651625 -29972968
$$ packed form
4155B5475062o421123l458636Q271789J0137915L110784K851564P078866J950649
4147D8996870n407463K007392J3613351O350170q511365j173027J9053408J8833294
4139I3762630J1455024L9667797P6092280K8874798j10520901k09127069j54093315
4132b23888756j0186086O8903594M2685517K683656J2855824L5134316K3646701
4125d8165234K13787N71598J2787072J0430038O7048j362395o36467p587107j0249427
4116d3931087Q23399R700298K637040n638984J639892J2867686R497077j794998
4108a4199677m042240m66269m362114j1659226q620444K296851P034006L705066
4100c0314047J767589L041234J717152j325188o52595J308832j194602m321343
$$ plain form
4092 -29972968 -30241271 -22493894 -13066461 -9553400 -11585800 -14901444 -17853303 -19665169
4084 -19665169 -18379213 -14546498 -11743782 -10521028 -7107394 -377213 5478332 7284958
4076 7284958 6355328 4105153 191794 -3518553 -3516735 -843979 -354542 -2530393 -3194167
4067 -3194167 -2686944 -6621442 -14518261 -17030283 -10036377 -3282603 -7357114 -17897333
4059 -17897333 -21258107 -12906086 -2195967 664376 -4124988 -9188897 -10175829 -9817310
4051 -9817310 -12551048 -17363021 -18517581 -13880808 -8754258 -8091692 -8437513 -3330171 5602320
4042 5602320 10222148 7887189 4064991 2366076 336393 -2648901 -1871010 4096666
4034 4096666 8559420 5730181 -1293900 -6601993 -9962212 -13960012 -17912751 -20405733
$$ packed form
4092b9972968k68303P747377R427433L513061k032400l315644k951859j811866
4084a9665169J285956L832715K802716J222754L413634O730181N855545J806626
4076G284958r29630k250175l913359l710347J818K672756M89437k175851o63774
4067c194167N07223l934498p896819k512022O993906O753774m074511j0540219
4059a7897333l360774Q352021J0710119K860343m789364n063909r86932L58519
4051i817310k733738m811973j154560M636773N126550O62566l45821N107342Q932491
4042E602320M619828k334959l822198j698915k029683k985294P77891N967676
4034D096666M462754k829239p024081n308093l360219l997800l952739k492982
$$ plain form
4026 -20405733 -23114896 -26020184 -23462347 -12056123 1195861 6433452 4085666 2618190
4018 2618190 4729407 4310904 -2374766 -10464100 -13808104 -12363678 -9420854 -6208758
4010 -6208758 -2300193 1894653 5511242 7906334 7911236 5086368 2216142 2930305 5799979
4001 5799979 4870962 -1925990 -8837869 -9772114 -6530869 -5906445 -10708007 -17464925 -21699237
3992 -21699237 -21609048 -17109366 -9281436 -1532840 1939069 261032 -3562921 -6852537
3984 -6852537 -9520410 -11380643 -10619078 -7376743 -5916726 -9350036 -13815640 -12560912
3976 -12560912 -5865371 -2131035 -7169260 -16218754 -19730334 -14693200 -6865396 -3073228
3968 -3073228 -4578792 -7698931 -8119715 -4281597 1473270 4853765 4132519 2303231 3160475
$$ packed form
4026b0405733k709163k905288K557837J1406224J3251984N237591k347786j467476
4018B618190K111217m18503o685670q089334l344004J444426K942824L212096
4010f208758L908565M194846L616589K395092M902k824868k870226P14163K869674
4001E799979r29017o796952o911879r34245L241245O24424m801562o756918m234312
3992b1699237R0189M499682P827930P748596L471909j678037l823953l289616
3984f852537k667873j860233P61565L242335J460017l433310m465604J254728
3976a2560912O695541L734336n038225r049494l511580N037134P827804L792168
3968c073228j505564l120139m20784L838118N754867L380495p21246j829288Q57244
$$ plain form
3959 3160475 6290386 8592197 9900873 13063269 17683539 18175399 10996443 772594
3951 772594 -5013163 -6263363 -10448305 -21315309 -31449410 -29805157 -15322649 928177
3943 928177 7992718 6057832 2992459 2770251 1857283 -3255929 -9960341 -13441822 -13356751
3934 -13356751 -13050321 -13656921 -12504302 -7292938 736868 8036148 11183296 8119945
3926 8119945 -696391 -11367011 -18197016 -17654379 -10948070 -2863977 1867557 1915530 -23157
3917 -23157 -216363 2098704 4279708 3863167 1174094 -2099346 -5171293 -7959296 -10170459
3908 -10170459 -11677191 -12386594 -11099762 -6680354 -1275455 476180 -2809423 -7073931
3900 -7073931 -8377728 -7677799 -7789356 -9106274 -11333159 -15420959 -19573867 -17672786 -7830496
$$ packed form
3959C160475L129911K301811J308676L162396M620270M91860p178956j0223849
3951G72594n785757j250200m184942j0867004j0134101J644253J4482508J6250826
3943I28177P064541j934886l065373k22208r12968n113212o704412l481481Q5071
3934a3356751L06430o06600J152619N211364Q029806P299280L147148l063351
3926H119945q816336j0670620o830005N42637O706309Q084093M731534M7973j938687
3917b3157j93206K315067K181004m16541k689073l273440l071947k788003k211163
3908a0170459j506732p09403J286832M419408N404899J751635l285603m264508
3900g073931j303797O99929j11557j316918k226885m087800m152908J901081R842290
$$ plain form
3891 -7830496 877630 -2145730 -14556704 -24050026 -25120633 -23938278 -25437625 -25347992
3883 -25347992 -19490431 -12707806 -11712321 -14459438 -13912212 -9331741 -6801948 -9394111
3875 -9394111 -12789115 -11545550 -5592966 975822 5116274 7278658 9440351 11690245
3867 11690245 11452522 6541039 -1947576 -10979164 -18481347 -22909171 -21959392 -15639787
3859 -15639787 -9427072 -9416781 -14426783 -17984544 -18106063 -18837831 -21272507 -20674199 -15558432
3850 -15558432 -12025313 -14096778 -16658712 -14493781 -12153650 -16489079 -23788492 -24084983
3842 -24084983 -16517907 -10709297 -12167593 -15077456 -12212618 -4858518 855969 2121903
3834 2121903 -145855 -5176184 -12218219 -18397302 -20353851 -18028587 -15238061 -16347867
$$ packed form
3891g830496Q708126l023360j2410974r493322j070607J182355j499347Q9633
3883b5347992N857561O782625R95485k747117N47226M580471K529793k592163
3875i394111l395004J243565N952584O568788M140452K162384K161693K249894
3867A1690245k37723m911483q488615r031588p502183m427824R49779O319605
3859a5639787O212715J0291n010002l557761j21519p31768k434676N98308N115767
3850a5558432L533119k071465k561934K164931K340131m335429p299413k96491
3842b4084983P567076N808610j458296k909863K864838P354100N714487J265934
3834B121903k267758n030329p042035o179083j956549K325264K790526j109806
$$ plain form
3826 -16347867 -22321722 -29379978 -32088799 -28729819 -22482083 -16205147 -8663539 1216914
3818 1216914 9159358 9558517 3425835 -2988597 -6906455 -10341278 -12564458 -8736697
3810 -8736697 1019936 7997628 5431589 -2295005 -6634024 -7039841 -9279910 -13902751
3802 -13902751 -14390322 -7747193 -177871 864563 -4208770 -9410701 -11516638 -12284334
3794 -12284334 -13628214 -14048877 -10484317 -2286059 7066719 12120422 10173023 4268973
3786 4268973 337869 881314 3000246 3121627 1210142 -1048880 -3176607 -4205242 -1076021
3777 -1076021 6721011 12967921 11179440 4773339 3851572 10387578 14160927 7457949
3769 7457949 -3261231 -6874423 -3165886 -511201 -1595408 -1240151 2277653 3644833
$$ packed form
3826a6347867n973855p058256k708821L358980O247736O276936P541608R880453
3818A216914P942444L99159o132682o414432l917858l434823k223180L827761
3810h736697R756633O977692k566039p726594m339019m05817k240069m622841
3802a3902751m87571O643129P569322J042434n073333n201931k105937p67696
3794a2284334j343880m20663L564560Q198258R352778N053703j947399n904050
3786D268973l931104N43445K118932J21381j911485k259022k127727j028635L129221
3777a076021P797032O246910j788481o406101r21767O536006L773349o702978
3769G457949j0719180l613192L708537K654685j084207L55257L517804J367180
$$ plain form
3761 3644833 231669 -3157990 -2589533 -751414 -544318 283974 3294287 4135986 -1231309
3752 -1231309 -9913822 -17237522 -23916639 -31769372 -36350983 -31503204 -19318059 -8463004
3744 -8463004 -3339759 -1083266 1419419 3907619 6049721 8032985 7097490 -553851
3736 -553851 -12801417 -21687540 -22307137 -17450940 -12258646 -8937373 -8252023 -11051272 -15422494
3727 -15422494 -16498039 -12326609 -6799678 -4077794 -3482592 -2989013 -4297823 -9957229
3719 -9957229 -17315586 -19928928 -14896758 -5609233 2762345 7723479 9293139 8267063
3711 8267063 5967182 4169943 3877430 4462202 4558074 3582033 2141795 1068782 107906
3702 107906 -2441097 -8415066 -17459110 -25764532 -28025678 -22321042 -13547483 -10050830
$$ packed form
3761C644833l413164l389659N68457J838119K07096Q28292L010313Q41699n367295
3752a231309q682513p323700o679117p852733m581611M847779J2185145J0855055
3744h463004N123245K256493K502685K488200K142102J983264r35495p651341
3736e53851j2247566q886123o19597M856197N192294L321273O85350k799249m371222
3727a5422494j075545M171430N526931K721884N95202M93579j308810n659406
3719i957229p358357k613342N032170R287525Q371578M961134J569660j026076
3711H267063k299881j797239k92513N84772R5872r76041j440238j073013r60876
3702A07906k549003n973969r044044q305422k261146N704636Q773559L496653
$$ plain form
3694 -10050830 -14759853 -20913717 -19632646 -11234507 -5071719 -7483864 -14539351 -18911480
3686 -18911480 -19101546 -17732243 -14859305 -8922470 -2133303 1249138 1142677 365892 -2104223
3677 -2104223 -9817773 -20218010 -24751891 -20442816 -14737690 -14496359 -15972440 -11882468
3669 -11882468 -4329324 -2883508 -10505992 -18588211 -18188891 -11133611 -6328832 -7758636
3661 -7758636 -10224847 -6862377 2250160 10502404 12216841 7713771 1369283 -3029221
3653 -3029221 -4107381 -2168894 1243517 3807293 4293809 3776581 3742481 3608012 1533614
3644 1533614 -2864294 -7993365 -11791415 -12489124 -9121640 -3233535 933351 190849 -4148724
3635 -4148724 -8160957 -9461148 -7725768 -3103980 2883593 6429282 5000297 968728
$$ packed form
3694a0050830m709023o153864J281071Q398139O162788k412145p055487m372129
3686a8911480j90066J369303K872938N936835O789167L382441j06461p76785k470115
3677b104223p713550j0400237m533881M309075N705126K41331j476081M089972
3669a1882468P553144J445816p622484q082219L99320P055280M804779j429804
3661g758636k466211L362470R112537Q252244J714437m503070o344488m398504
3653c029221j078160J938487L412411K563776M86516n17228l4100j34469k074398
3644A533614m397908n129071l798050o97709L367484N888105M166886p42502m339573
3635d148724m012233j300191J735380M621788N987573L545689j428985m031569
$$ plain form
3627 968728 -1568956 -2448923 -4247194 -6693687 -6832549 -4295987 -1835268 -687425 8845
3618 8845 -751596 -5255692 -11876205 -15514489 -14382429 -11711406 -9857168 -7845458 -5923235
3609 -5923235 -6824351 -10383691 -12358569 -11213455 -10808422 -13389263 -15171529 -12540444 -7911860
3600 -7911860 -5548661 -5769487 -6957039 -8975867 -10888462 -10009522 -7488996 -9755135 -18944492
3591 -18944492 -26630412 -23913465 -14357586 -9339696 -12186231 -14483473 -8543580 2780738
3583 2780738 10494131 9530201 2767134 -2677825 -2354022 1323130 2386110 -1040751 -5230385
3574 -5230385 -7575571 -9897003 -12618006 -11613347 -5801390 -2390856 -7535259 -15596463
3566 -15596463 -15572036 -5997991 4364806 9417786 11320289 13333336 14886738 15061847
$$ packed form
3627I68728k537684q79967j798271k446493j38862K536562K460719J147843O96270
3618H845p60441m504096o620513l638284J132060K671023J854238K011710J922223
3609e923235r01116l559340j974878J145114M05033k580841j782266K631085M628584
3600g911860K363199k20826j187552k018828j912595Q78940K520526k266139r189357
3591a8944492p685920K716947R555879N017890k846535k297242N939893J1324318
3583B780738P713393r63930o763067n444959L23803L677152J062980l426861m189634
3574e230385k345186k321432k721003J004659N811957L410534n144403q061204
3566a5596463K4427R574045J0362797N052980J902503K013047J553402J75109
$$ plain form
3558 15061847 14366081 11540932 4561803 -3675585 -6405202 -1725634 4460086 5778070
3550 5778070 1391941 -5884969 -12462367 -14422951 -10898182 -8100626 -13651705 -24782423
3542 -24782423 -28726663 -18569348 -3232597 2835266 -4061488 -15101543 -20137524 -16380516
3534 -16380516 -8208739 -2383078 -2718359 -7222703 -11135214 -13012184 -15176053 -17806234
3526 -17806234 -16977323 -10903952 -4339897 -3303129 -7606697 -11528068 -10452404 -4852340
3518 -4852340 851309 1952845 -2315403 -7152055 -6711652 -991691 4117170 4178926 757571
3509 757571 -2007232 -2147805 -351624 972476 -1630818 -9152317 -16477310 -16697201 -10443484
3500 -10443484 -6146310 -8947520 -14262582 -15156575 -11407808 -7873182 -8098586 -12944216
$$ packed form
3558A5061847o95766k825149o979129q237388k729617M679568O185720J317984
3550E778070m386129p276910o577398j960584L524769K797556n551079j1130718
3542b4782423l944240J0157315J5336751O067863o896754j1040055n035981L757008
3534a6380516Q171777N825661l35281m504344l912511j876970k163869k630181
3526a7806234Q28911O073371O564055J036768m303568l921371J075664N600064
3518d852340N703649J101536m268248m836652M40403N719961N108861O1756l421355
3509G57571k764803j40573J796181J324100k603294p521499p324993k19891O253717
3500a0443484M297174k801210n315062q93993L748767L534626k25404m845630
$$ plain form
3492 -12944216 -21232236 -28059147 -26892398 -17581701 -8020682 -3493109 564137 9327209
3484 9327209 17278768 14593644 2148171 -8951382 -12602359 -13846554 -18169945 -22695840
3476 -22695840 -22064851 -17260463 -13349328 -11514673 -8410969 -2885818 545381 -3510589
3468 -3510589 -14358031 -24703317 -27645941 -23046239 -15545220 -7842229 257714 6379895
3460 6379895 5124853 -3674857 -11257792 -9883294 -3313149 -1301016 -5516675 -7901801
3452 -7901801 -3346820 2737809 2361056 -4092296 -8709072 -6153521 13104 1500260
3444 1500260 -5016163 -13391032 -14748803 -8321511 -2089158 -1564366 -2947633 -1113920
3436 -1113920 760306 -3673091 -12242676 -15912070 -11777126 -6624011 -6223920 -8178668
$$ packed form
3492a2944216q288020o826911J166749R310697R561019M527573M057246Q763072
3484I327209P951559k685124j2445473j1099553l650977j244195m323391m525895
3476b2695840O30989M804388L911135J834655L103704N525151L431199m055970
3468c510589j0847442j0345286k942624M599702P501019P702991Q099943O122181
3460F379895j255042q799710p582935J374498O570145K012133m215659k385126
3452g901801M554981O084629l76753o453352m616776K555551O166625J487156
3444A500260o516423q374869j357771O427292O232353N24792j383267J833713
3436a113920J874226m433397q569585l669394M134944N153115M00091j954748
$$ plain form
3428 -8178668 -7868811 -5240958 -2395106 364668 2574279 2103194 -1025783 -3185012 -2469544
3419 -2469544 -1390467 -1311773 887586 6333096 9141447 3876977 -5275363 -9467017 -7550469
3410 -7550469 -6596611 -10377229 -14435713 -14396693 -12742843 -13427451 -14440752 -11181956 -5215372
3401 -5215372 -3973123 -10880509 -20102416 -23616344 -20718994 -17050478 -15708355 -14113626
3393 -14113626 -10647160 -9488051 -14943862 -23793135 -28156805 -25081624 -18590362 -12378412
3385 -12378412 -5743586 1780948 6766077 6026247 1146070 -4080483 -8104117 -10933489
3377 -10933489 -11844428 -10820746 -9758093 -9149445 -6355561 -895313 1594184 -3941895
3369 -3941895 -13156156 -16495949 -12097485 -8008457 -10005104 -13591175 -11885991 -6405736
$$ packed form
3428h178668L09857K627853K845852K759774K209611m71085l128977k159229P15468
3419b469544J079077P8694K199359N445510K808351n264470r152340m191654J916548
3410g550469R53858l780618m058484L9020J653850o84608j013301L258796N966584
3401e215372J242249o907386r221907l513928K897350L668516J342123J594729
3393a4113626L466466J159109n455811q849273m363670L075181O491262O211950
3385a2378412O634826P524534M985129p39830m880177n226553m023634k829372
3377a0933489r10939J023682J062653O08648K793884N460248K489497n536079
3369c941895r214261l339793M398464M089028j996647l586071J705184N480255
$$ plain form
3361 -6405736 -4435685 -8177117 -12235462 -11723935 -8080495 -5560610 -5587467 -6863957 -8862825
3352 -8862825 -12407083 -17295358 -21630502 -24072775 -25305771 -26269690 -25894004 -22224967 -15906760
3343 -15906760 -10843685 -10092157 -11880236 -11258923 -5567994 3223325 11714838 18772786
3335 18772786 25077754 30487434 33421258 32130026 25322470 12688070 -3032699 -15277794
3327 -15277794 -18405942 -14487734 -12662759 -19444631 -31350406 -39522430 -40061713 -36495343
3319 -36495343 -32906034 -29079608 -23748876 -18872043 -17914069 -21824904 -28812465 -36153908
3311 -36153908 -40139934 -36718381 -25705867 -13046067 -5341819 -2953136 -2039297 -2303751
3303 -2303751 -7473579 -17381989 -25166023 -25380344 -20847785 -17839371 -17693669 -17400325 -15892341
$$ packed form
3361f405736J970051l741432m058345N11527L643440K519885k6857j276490j998868
3352h862825l544258m888275m335144k442273j232996r63919L75686L669037O318207
3343a5906760N063075P51528j788079O21313N690929Q791319Q491513P057948
3335A8772786O304968N409680K933824j291232o807556j2634400j5720769j2245095
3327a5277794l128148L918208J824975o781872j1905775q172024n39283L566370
3319c6495343L589309L826426N330732M876833R57974l910835o987561p341443
3311c6153908l986026L421553J1012514J2659800P704248K388683R13839k64454
3303b303751n169828r908410p784034k14321M532559L008414J45702K93344J507984
$$ plain form
3294 -15892341 -14620769 -13162854 -9865473 -7077733 -10021671 -18399175 -24095418 -20773875
3286 -20773875 -12138801 -6494776 -5810604 -5261184 -2221560 336477 407562 1247914 5771700
3277 5771700 10500222 9578923 3231167 -1890649 -598773 5654628 11425298 12332365 7560358
3268 7560358 404745 -3153614 545760 8070769 11609498 7615939 361764 -4145164
3260 -4145164 -4703102 -3481951 -1276988 2410350 6336134 7933094 6099461 1388071
3252 1388071 -5129825 -10766711 -11208152 -5613633 -443196 -3311670 -12712004 -18473158
3244 -18473158 -13966221 -4060625 1113867 -2749346 -11478495 -17992795 -17535958 -9219664
3236 -9219664 3985177 16376071 22681247 21245023 14284663 5669614 -1226359 -4553089
$$ packed form
3294a5892341J271572J457915L297381K787740k943938q377504n696243L321543
3286b0773875Q635074N644025O84172N49420L039624K558037P1085Q40352M523786
3277E771700M728522r21299o347756n121816J291876O253401N770670R07067m772007
3268G560358p155613l558359L699374P525009L538729l993559p254175m506928
3260d145164n57938J221151K204963L687338L925784J596960j833633m711390
3252A388071o517896n636886m41441N594519N170437k868474r400334n761154
3244a8473158M506937R905596N174492l863213q729149o514300M56837Q316294
3236i219664J3204841J2390894O305176j436224o960360q615049o895973l326730
$$ plain form
3228 -4553089 -4261951 -1886544 20209 -1033572 -5413052 -9862175 -9933377 -5296261 -705201
3219 -705201 267438 44838 2367052 5210131 3459302 -2308786 -5642468 -3598287 -560732
3210 -560732 -715347 -2203887 -1938014 -1314327 -2870495 -5021475 -4791694 -3041283 -2267376
3201 -2267376 -1207754 3495210 11111786 16625770 16696465 12724906 8372404 6720056 9035967
3192 9035967 13414461 15299628 12123825 6749153 3813451 3814775 3681557 1995416 340913
3183 340913 261964 2009400 5450305 9088748 9359382 4597141 -1202574 -2507501 643964
3174 643964 3778360 5281712 7419534 10161172 9721682 4766551 -747076 -2757477 -1051315
3165 -1051315 3172472 8871615 12541338 9441330 704253 -5438227 -3540424 1684511
$$ packed form
3228d553089K91138K375407J906753j053781m379480m449123p1202M637116M591060
3219g05201R72639k22600K322214K843079j750829n768088l333682K044181L037555
3210e60732j54615j488540K65873O23687j556168k150980K29781J750411P73907
3201b267376J059622M702964P616576N513984P0695l971559m352502j652348K315911
3192I035967M378494J885167l175803n374672k935702J324j33218j686141j654503
3183C40913p8949J747436L440905L638443K70634m762241n799715j304927L151465
3174F43964L134396J503352K137822K741638m39490m955131n513627k010401J706162
3165a051315M223787N699143L669723l100008q737077o142480J897803N224935
$$ plain form
3157 1684511 2026160 -3452262 -8866192 -10278529 -9322207 -9489873 -12870172 -19445056 -26093714
3148 -26093714 -27599572 -22090637 -14031895 -8459825 -4382560 1798656 8533250 10604923
3140 10604923 7484093 3941725 1927476 -1806111 -8229520 -12325204 -10223945 -5270659
3132 -5270659 -2988868 -3472876 -2673699 1441561 7641199 13907575 17507811 14850165 5474971
3123 5474971 -5081424 -10288825 -9773421 -8316627 -8986171 -10929457 -12871877 -14525268
3115 -14525268 -14873894 -13229594 -11854937 -13184924 -14434629 -10100104 -875619 5228268
3107 5228268 2896552 -4172635 -9699159 -12711646 -15181744 -16311539 -14587022 -12723851
3099 -12723851 -14903576 -20211795 -23515486 -22065406 -17135896 -10254560 -2354352 3998658
$$ packed form
3157A684511L41649n478422n413930j412337R56322j67666l380299o574884o648658
3148b6093714j505858N508935Q058742N572070M077265O181216O734594K071673
3140A0604923l120830l542368k014249l733587o423409m095684K101259M953286
3132e270659K281791m84008P99177M115260O199638O266376L600236k657646r375194
3123E474971j0556395n207401N15404J456794o69544j943286j942420j653391
3115a4525268l48626J644300J374657j329987j249705M334525R224485O103887
3107E228268k331716p069187n526524l012487k470098j129795J724517J863171
3099a2723851k179725n308219l303691J450080M929510O881336P900208O353010
$$ plain form
3091 3998658 6202270 5476436 5165927 5506177 4023951 379372 -3686853 -8203644 -13308159
3082 -13308159 -14773522 -8423236 462525 264190 -11693908 -24429229 -27805255 -24735245
3074 -24735245 -23785259 -26144599 -26771517 -23731420 -19139886 -13964382 -8677687 -6652590
3066 -6652590 -10327591 -15741417 -16973090 -14436170 -12997741 -13809926 -14310441 -14539724 -16556741
3057 -16556741 -18894513 -18888938 -19480702 -25462502 -32997775 -31975881 -20759926 -10001366
3049 -10001366 -8435496 -12567677 -14529886 -12968567 -10974434 -9390875 -8196256 -9932026
3041 -9932026 -15777347 -21426650 -22055097 -18755719 -15741945 -14143019 -12982867 -13385738 -17114108
3032 -17114108 -23190755 -29929255 -37437677 -43947049 -43420906 -32902200 -19913017 -16022804
$$ packed form
3091C998658K203612p25834l10509L40250j482226l644579m066225m516791n104515
3082a3308159j465363O350286Q885761j98335j1958098j2735321l376026L070010
3074b4735245R49986k359340o26918L040097M591534N175504N286695K025097
3066f652590l675001n413826j231673K536920J438429q12185n00515k29283k017017
3057a6556741k337772N575n91764n981800p535273J021894J1215955J0758560
3049a0001366J565870m132181j962209J561319J994133J583559J194619j735770
3041i932026n845321n649303o28447L299378L013774J598926J160152m02871l728370
3032a7114108o076647o738500p508422o509372N26143J0518706J2989183L890213
$$ plain form
3024 -16022804 -23719157 -34973330 -41615232 -41040903 -32424450 -15028678 7103695 24482538
3016 24482538 30170540 25895448 18106325 10657098 3503444 -3757495 -9835570 -12761949
3008 -12761949 -11716241 -7981295 -3970215 -717970 2721333 6132864 6050497 -400050
3000 -400050 -10332658 -17009336 -17118487 -13274897 -8813693 -3207164 5649220 16593189
2992 16593189 24866060 26589324 22703751 17911459 15345327 13054181 7607156 759046
2984 759046 -1117212 4328666 11385976 14006153 13748388 15264833 16915600 12418126 1152439
2975 1152439 -9523603 -13317758 -11456934 -9138478 -10123528 -15753111 -24429033 -30480579
2967 -30480579 -28175012 -18906905 -10412050 -7279599 -6761152 -5691825 -5974604 -9792718
$$ packed form
3024a6022804p696353j1254173o641902N74329Q616453J7395772K2132373J7378843
3016B4482538N688002m275092p789123p449227p153654p260939o078075k926379
3008a2761949J045708L734946M011080L252245L439303L411531q2367o450547
3000d00050r932608o676678j09151L843590M461204N606529Q856384J0943969
2992A6593189Q272871J723264l885573m792292k566132k291146n447025o848110
2984G59046j876258N445878P057310K620177k57765J516445J650767m497474j1265687
2975A152439j0676042l794155J860824K318456r85050n629583q675922o051546
2967c0480579K305567R268107Q494855L132451N18447J069327k82779l818114
$$ plain form
2959 -9792718 -14505518 -16929731 -18613735 -21739521 -23136880 -18281352 -9424386 -4039523
2951 -4039523 -5744846 -11469030 -16960870 -20220402 -19640419 -13991521 -5548182 930889
2943 930889 3972808 6857703 11917463 16583944 16999153 12943699 7147267 1774115 -2341662
2934 -2341662 -4561262 -4723337 -3880986 -3348158 -3552001 -4458925 -5818677 -6045955 -2598567
2925 -2598567 4671719 11716539 14052557 11835715 9036523 7817692 6395651 3205745
2917 3205745 349763 500172 1914726 -347944 -7992097 -16607748 -20106600 -16422192
2909 -16422192 -8075247 1017153 7758770 10382938 9039806 5942915 3814109 4117450
2901 4117450 6738964 9828412 9347033 1381370 -12758066 -25725050 -31399305 -31381185
$$ packed form
2959i792718m712800k424213j684004l125786j397359M855528Q856966N384863
2951d039523j705323n724184n491840l259532N79983N648898Q443339O479071
2943I30889L041919K884895N059760M666481M15209m055454n796432n373152m115777
2934b341662k219600j62075Q42351N32828k03843r06924j359752k27278L447388
2925b598567P270286P044820K336018k216842k799192j218831j422041l189906
2917C205745k855982J50409J414554k262670p644153q615651l498852L684408
2909a6422192Q346945R092400O741617K624168j343132l096891k128806L03341
2901D117450K621514L089448m81379p965663j4139436j2966984n674255J8120
$$ plain form
2893 -31381185 -30828931 -29654163 -23161616 -11265843 -888371 3100980 4111235 7422341
2885 7422341 11655295 11187104 4652729 -3382106 -8122088 -8533496 -6844223 -7219919 -13516480
2876 -13516480 -24671155 -33175170 -31887765 -22223191 -12426226 -8211723 -8615475 -10586065
2868 -10586065 -12963904 -14690370 -13434952 -8876372 -4795930 -5046344 -8747846 -11802227
2860 -11802227 -12358138 -12523883 -14544835 -17031107 -16157268 -10369202 -2872293 1337511 347215
2851 347215 -4023263 -9719764 -15805968 -19832887 -17622666 -8442129 2155975 7794244
2843 7794244 7583678 4168971 -1373185 -8055897 -11363629 -7930365 -2817118 -4591326
2835 -4591326 -12424369 -15874547 -9893528 -2210921 -1524817 -5691138 -7794250 -7624679 -9065639
$$ packed form
2893c1381185N52254J174768O492547J1895773J0377472L989351J010255L311106
2885G422341M232954m68191o534375q034835m739982m11408J689273l75696o296561
2876a3516480j1154675q504015J287405R664574R796965M214503m03752j970590
2868a0586065k377839j726466J255418M558580M080442k50414l701502l054381
2860a1802227n55911j65745k020952k486272Q73839N788066P496909M209804r90296
2851C47215m370478n696501o086204m026919K210221R180537J0598104N638269
2843G794244k10566l414707n542156o682712l307732L433264N113247j774208
2835d591326p833043l450178N981019P682607O86104m166321k103112J69571j440960
$$ plain form
2826 -9065639 -10387152 -6360017 1503188 5420608 2217422 -3771453 -9176535 -15128245
2818 -15128245 -20353601 -18550091 -7183921 6341168 11936070 6964668 -3904119 -14915286
2810 -14915286 -21576929 -20719805 -13218397 -4704853 373108 3565561 7840807 10807441
2802 10807441 7401796 -1907738 -10564299 -13685728 -12510584 -10905674 -10826041 -11429696 -9745506
2793 -9745506 -2486379 9655174 20114595 22702691 19406151 17502392 18882582 17834181
2785 17834181 11079639 4190234 4112475 9428737 12537544 8938573 322398 -9337628
2777 -9337628 -16451048 -18033084 -13674870 -7064961 -2365413 260223 2570909 3302536
2769 3302536 -249219 -6241705 -8933520 -6418913 -3372459 -4176580 -6971224 -7102419 -3787801
$$ packed form
2826i065639j321513M027135P863205L917420l203186n988875n405082n951710
2818a5128245n225356J803510J1366170J3525089N594902m971402j0868787j1011167
2810a4915286o661643Q57124P501408Q513544N077961L192453M275246K966634
2802A0807441l405645r309534q656561l121429J175144J604910P9633o03655J684190
2793i745506P259127J2141553J0459421K588096l296540j903759J380190j048401
2785A7834181o754542o889405p7759N316262L108807l598971q616175r660026
2777i337628p113420j582036M358214O609909M699548K625636K310686P31627
2769C302536l551755n992486k691815K514607L046454q04121k794644j31195L314618
$$ plain form
2760 -3787801 -500870 -250207 -2863092 -6071696 -7414355 -5513258 -812060 4892961
2752 4892961 9752773 12290099 11441001 7953213 5052644 5109530 5909326 3403677 -1732590
2743 -1732590 -4183161 -1522175 2657606 5003774 7191230 11259587 14420365 12985032
2735 12985032 8251885 3539474 -1993248 -10783224 -19704332 -21977155 -16695589 -10882015
2727 -10882015 -10665268 -14895449 -18881401 -20232509 -19241630 -17168880 -16060805 -17320957
2719 -17320957 -19204096 -18880674 -17816445 -20920121 -28608862 -34089196 -31409987 -22699569
2711 -22699569 -14434155 -9763688 -7690373 -6742542 -5830092 -3918185 -2197466 -3965556
2703 -3965556 -8849265 -10185670 -2835499 8599730 14435844 11489491 5274230 1894875
$$ packed form
2760c787801L286931K50663k612885l208604j342659J901097M701198N705021
2752D892961M859812K537326q49098l487788k900569N6886P99796k505649n136267
2743a732590k450571K660986M179781K346168K187456M068357L160778j435333
2735A2985032m733147m712411n532722q789976q921108k272823N281566N813574
2727a0882015K16747m230181l985952j351108R90879K072750J108075j260152
2719a7320957j883139L23422J064229l103676p688741n480334K679209Q710418
2711b2699569Q265414M670467K073315R47831R12450J911907J720719j768090
2703c965556m883709j336405P350171J1435229N836114k946353o215261l379355
$$ plain form
2695 1894875 2870262 7086721 12089036 13260880 7507718 -1033378 -4078764 516652
2687 516652 6280584 7374316 5311926 4392017 5468040 7243829 9412298 11227074 10693722
2678 10693722 8251676 7515679 9354271 9538137 6037804 4076457 8719841 16103305
2670 16103305 17906434 11974884 2825445 -5750466 -11981912 -12128753 -3236840 9750638
2662 9750638 16788894 14274705 8232474 5069301 5152592 6846218 10306202 14401355 15347795
2653 15347795 11502248 5141565 -2253897 -10876563 -17000302 -14072063 -3439585 3633281
2645 3633281 772747 -3626838 854055 10129161 11845684 4426974 -1237166 1615046
2637 1615046 7831824 10428318 9089342 6200906 2721590 952931 3732700 7670802
$$ packed form
2695A894875R75387M216459N002315J171844n753162q541096l045386M595416
2687E16652N763932J093732k062390r19909J076023J775789K168469J814776n33352
2678A0693722k442046p35997J838592J83866l500333j961347M643384P383464
2670A6103305J803129n931550r149439q575911o231446j46841Q891913J2987478
2662I750638P038256k514189o042231l163173Q3291J693626L459984M095153R46440
2653A5347795l845547o360683p395462q622666o123739K928239J0632478P072866
2645C633281k860534m399585M480893R275106J716523p418710n664140K852212
2637A615046O216778K596494j338976k888436l479316j768659K779769L938102
$$ plain form
2629 7670802 4913280 -4502042 -10124326 -6259283 -1774729 -7358901 -19467536 -25766391
2621 -25766391 -21907178 -13425542 -4137813 6782983 16683040 18703976 11453644 1487216
2613 1487216 -6032028 -11677528 -14637298 -10000486 1935965 11227092 10164884 4497291
2605 4497291 5419558 13842995 20333807 18891085 12939200 7597365 3537128 504046
2597 504046 473907 3665471 5825716 3327297 -1845874 -5388954 -6556244 -7638400 -9501429
2588 -9501429 -10822706 -10548786 -8450915 -4523977 -452369 -94951 -5145965 -11368371 -12912166
2579 -12912166 -10002702 -8445687 -11340055 -15449336 -16813604 -15823352 -14766376 -14040083
2571 -14040083 -13450021 -14185843 -16464876 -17662400 -15871747 -13180654 -12256993 -11851094 -9481034
$$ packed form
2629G670802k757522r415322n622284L865043M484554n584172j2108635o298855
2621b5766391L859213Q481636R287729J0920796R900057K020936p250332r966428
2613A487216p519244n645500k959770M636812J1936451R291127j062208n667593
2605D497291R22267Q423437O490812j442722n951885n341835m060237l033082
2597E04046l0139L191564K160245k498419n173171l543080j167290j082156j863029
2588i501429j321277K73920K097871L926938M071608L57418n051014o222406j543795
2579a2912166K909464J557015k894368m109281j364268R90252J056976P26293
2571a4040083N90062p35822k279033j197524J790653K691093R23661M05899K370060
$$ plain form
2562 -9481034 -6884201 -8358453 -14180090 -19685574 -20955015 -18049010 -12878147 -7539248
2554 -7539248 -4767828 -6147591 -9194160 -9534394 -6489897 -3371598 -2261580 -2278411 -3065055
2545 -3065055 -5490890 -8217970 -8332046 -6515362 -6531653 -8029193 -5684794 1570670 6263572
2536 6263572 1800275 -8303294 -15283513 -15378619 -10580569 -3103676 5222887 10901164
2528 10901164 11867241 10785277 10409703 8234311 1218430 -6888870 -9662920 -7789912
2520 -7789912 -7711383 -11275091 -14021986 -14032303 -15138337 -19727832 -24805711 -27363099 -28099041
2511 -28099041 -27807712 -25432213 -21814217 -20184659 -20721293 -19702918 -16252509 -14463765
2503 -14463765 -16048105 -16409760 -11739542 -5080842 -1168482 500632 3102623 6675912
$$ packed form
2562i481034K596833j474252n821637n505484j269441K906005N170863N338899
2554g539248K771420j379763l046569l40234L044497L118299J110018j6831p86644
2545c065055k425835k727080j14076J816684j6291j497540K344399P255464M692902
2536F263572m463297j0103569o980219r5106M798050P476893Q326563N678277
2528A0901164R66077j081964l75574k175392p015881q107300k774050J873008
2520g789912P8529l563708k746895j0317j106034m589495n077879k557388p35942
2511b8099041K91329K375499L617996J629558n36634J018375L450409J788744
2503a4463765j584340l61655M670218O658700L912360J669114K601991L573289
$$ plain form
2495 6675912 9213479 10452146 10560883 8071948 3057426 -680577 -732208 -538166 -4490836
2486 -4490836 -11248179 -16209678 -17995804 -17932695 -15758197 -11048030 -6867669 -6481985 -7671374
2477 -7671374 -5675802 -975776 1263052 -678914 -2796986 -1889107 275109 565262 -1339451
2468 -1339451 -3645738 -4710428 -3890730 -2035148 -1016345 -1328752 -1549522 -1782600 -4545244
2459 -4545244 -9131838 -9109537 -898895 8464135 9311423 3035499 -523063 1284644 493452
2450 493452 -7352267 -15228920 -15447150 -10555575 -7481907 -7077581 -6207451 -5417260 -7241016
2441 -7241016 -9899264 -9552068 -6878879 -5107377 -3244428 1839798 7212569 5113286
2433 5113286 -5997587 -17528440 -20406241 -14262558 -4815889 3533556 9326023 11687861
$$ packed form
2495F675912K537567J238667J08737k488935n014522l738003n1631J94042l952670
2486d490836o757343m961499j786126O3109K174498M710167M180361L85684j189389
2477g671374J995572M700026K238828j941966k118072R07879K164216K90153j904713
2468a339451k306287j064690Q19698J855582J018803l12407k20770k33078k762644
2459d545244m586594K2301Q210642R363030Q47288o275924l558562J807707p91192
2450D93452p845719p876653k18230M891575L073668M04326Q70130P90191j823756
2441g241016k658248L47196K673189J771502J862949N084226N372771k099283
2433E113286j1110873j1530853k877801O143683R446669Q349445N792467K361838
$$ plain form
2425 11687861 10368615 6826396 2556214 -2561633 -8207347 -11611632 -10332444 -5839851
2417 -5839851 -1373497 2850455 8720042 14801827 16390706 12684392 9727253 12665719
2409 12665719 17859206 17125830 8484403 -1997988 -8627431 -11108737 -10342206 -5229001
$$ packed form
2425A1687861j319246l542219m270182n117847n645714l404285J279188M492593
2417e839851M466354M223952N869587O081785J588879l706314k957139K938466
2409A2665719N193487p33376q641427j0482391o629443k481306P66531N113205
$$ [...]
##END NTUPLES=NMR SPECTRUM
##END=
