##TITLE=31Pdec_DE-77ORG_d6AW2
 aceton-d6, 64 sc
 27.11.2024
##JCAMPDX= 6.0         $$ Bruker NMR JCAMP-DX V2.0
##DATA TYPE= NMR SPECTRUM
##DATA CLASS= NTUPLES
##ORIGIN= UXNMR, Bruker Analytische Messtechnik GmbH
##OWNER= root
$$ XWIN-NMR		Version 3.5
$$ Wed Nov 27 16:30:28 2024 Russian Standard Time (UT+4h)  she@DPX200
##.OBSERVE FREQUENCY= 81.013821
##.OBSERVE NUCLEUS= ^31P
##.ACQUISITION MODE= SIMULTANEOUS
##.ACQUISITION SCHEME= undefined
##.AVERAGES= 64
##.DIGITISER RES= 17
##SPECTROMETER/DATA SYSTEM= spect
##.PULSE SEQUENCE= zgpg30
##.SOLVENT NAME= Acetone
##.SHIFT REFERENCE= (INTERNAL, Acetone, 0, 198.062)
##AUDIT TRAIL= $$ (NUMBER, WHEN, WHO, WHERE, WHAT)
$$ ##TITLE= Audit trail, XWIN-NMR		Version 3.5
$$ ##JCAMPDX= 5.01
$$ ##ORIGIN= Bruker BioSpin GmbH
$$ ##OWNER= she
$$ F:/spectra/data/she/nmr/P31/2/pdata/1/auditp.txt
$$ ##AUDIT TRAIL=  $$ (NUMBER, WHEN, WHO, WHERE, WHAT)
(   1,<2024-11-27 16:29:11.37 +0400>,<she>,<DPX200>,
      <created by zg, POWCHK disabled, PULCHK disabled
       configuration hash MD5:
       00 E9 B6 7A A2 85 ED C7 34 08 36 98 17 FE 4E 26
       data hash MD5: 32K
       DA 21 EF 6D 93 75 16 14 BD 8E 5F 55 56 2B 12 FF>)
(   2,<2024-11-27 16:29:13.60 +0400>,<she>,<DPX200>,
      <Start of raw data processing
       efp BC_mod = 2 LB = 1.5 FT_mod = 6 PKNL = 1 PHC0 = 2192.521 PHC1 = 272.4883 SI = 64K 
       data hash MD5: 64K
       24 32 7B A5 82 F2 AF E4 FD D7 AD 51 5C C4 FF 6E>)
(   3,<2024-11-27 16:29:48.70 +0400>,<she>,<DPX200>,
      <pk PHC0 = 81.95031 PHC1 = 0 
       data hash MD5: 64K
       D2 7B FA EA DD 5A 62 89 CF 16 28 FA 45 18 26 3A>)
$$ ##END=
$$ 
$$ hash MD5
$$ C8 9F B0 21 75 5C EA 26 69 A6 FF 26 53 76 0E 60
##$RELAX= 
##$RELAX= 
##$RELAX= 
##$RELAX= 
##$RELAX= 
##$RELAX= 
##$RELAX= 
##$RELAX= 
$$ Bruker specific parameters
$$ --------------------------
##$DU= <F:/spectra>
##$EXPNO= 2
##$NAME= <P31>
##$PROCNO= 1
##$TYPE= <nmr>
##$USER= <she>
##$AMP= (0..31)
100 100 100 100 100 100 100 100 100 100 100 100 100 100 100 100 100 100 
100 100 100 100 100 100 100 100 100 100 100 100 100 100 
##$AQSEQ= 0
##$AQ_mod= 1
##$AUNM= <au_zg>
##$AUTOPOS= <>
##$BF1= 81.014009
##$BF2= 200.13
##$BF3= 200.13
##$BF4= 200.13
##$BF5= 200.13
##$BF6= 200.13
##$BF7= 200.13
##$BF8= 200.13
##$BYTORDA= 1
##$CFDGTYP= 0
##$CFRGTYP= 5
##$CHEMSTR= <none>
##$CNST= (0..31)
1 1 145 1 1 1 1 1 1 1 1 1 1 1 1 1 1 1 1 1 1 1 1 1 1 1 1 1 1 1 1 1 
##$CPDPRG= <waltz16>
##$CPDPRG1= <>
##$CPDPRG2= <waltz16>
##$CPDPRG3= <>
##$CPDPRG4= <mlev>
##$CPDPRG5= <mlev>
##$CPDPRG6= <mlev>
##$CPDPRG7= <mlev>
##$CPDPRG8= <mlev>
##$CPDPRGB= <>
##$CPDPRGT= <>
##$D= (0..31)
0 1 0 0 0 0 0 0 0 0.06 0 0.03 2e-05 3e-06 0 0 0.0002 0 0 0 0 0 0 0 0 0 
0 0 0 0 0 0 
##$DATE= 1732710550
##$DBL= (0..7)
120 120 120 11 120 120 24 19 
##$DBP= (0..7)
150 150 150 150 150 150 150 150 
##$DBP07= 0
##$DBPNAM0= <>
##$DBPNAM1= <>
##$DBPNAM2= <>
##$DBPNAM3= <>
##$DBPNAM4= <>
##$DBPNAM5= <>
##$DBPNAM6= <>
##$DBPNAM7= <>
##$DBPOAL= (0..7)
0.5 0.5 0.5 0.5 0.5 0.5 0.5 0.5 
$$ [...]
##$SUBNAM2= <"">
##$SUBNAM3= <"">
##$SUBNAM4= <"">
##$SUBNAM5= <"">
##$SUBNAM6= <"">
##$SUBNAM7= <"">
##$SUBNAM8= <"">
##$SUBNAM9= <"">
##$SW= 400.765351723535
##$SWIBOX= (0..15)
0 1 3 0 0 0 0 0 0 0 0 0 0 0 0 0 
##$SW_h= 32467.5324675325
##$TD= 32768
##$TD0= 1
##$TE= 0
##$TE2= 300
##$TE3= 300
##$TEG= 300
##$TL= (0..7)
0 120 53 12 22 120 120 120 
##$TP= (0..7)
150 150 150 150 150 150 150 150 
##$TP07= 0
##$TPNAME0= <>
##$TPNAME1= <>
##$TPNAME2= <>
##$TPNAME3= <>
##$TPNAME4= <>
##$TPNAME5= <>
##$TPNAME6= <>
##$TPNAME7= <>
##$TPOAL= (0..7)
0.5 0.5 0.5 0.5 0.5 0.5 0.5 0.5 
##$TPOFFS= (0..7)
0 0 0 0 0 0 0 0 
##$TUNHIN= 0
##$TUNHOUT= 0
##$TUNXOUT= 0
##$USERA1= <user>
##$USERA2= <user>
##$USERA3= <user>
##$USERA4= <user>
##$USERA5= <user>
##$V9= 5
##$VALIST= <valist>
##$VCLIST= <CCCCCCCCCCCCCCC>
##$VD= 0
##$VDLIST= <DDDDDDDDDDDDDDD>
##$VPLIST= <PPPPPPPPPPPPPPP>
##$VTLIST= <TTTTTTTTTTTTTTT>
##$WBST= 1024
##$WBSW= 4
##$XGAIN= (0..3)
0 0 0 0 
##$XL= 0
##$YL= 0
##$YMAX_a= 9155
##$YMIN_a= -3670
##$ZGOPTNS= <>
##$ZL1= 120
##$ZL2= 120
##$ZL3= 120
##$ZL4= 120
##$ABSF1= 0
##$ABSF2= 0
##$ABSG= 0
##$ABSL= 0
##$ALPHA= 0
##$AQORDER= 0
##$ASSFAC= 0
##$ASSFACI= 0
##$ASSFACX= 0
##$ASSWID= 0
##$AUNMP= <proc_1d>
##$AZFE= 0.1
##$AZFW= 0.5
##$BCFW= 0
##$BC_mod= 2
##$BYTORDP= 0
##$COROFFS= 0
##$CY= -3
##$DATMOD= 1
##$DC= 0
##$DFILT= <>
##$DTYPP= 0
##$F1P= 0
##$F2P= 0
##$FCOR= 1
##$FTSIZE= 65536
##$FT_mod= 6
##$GAMMA= 0
##$GB= 0
##$INTBC= 1
##$INTSCL= 9.790993e-09
##$ISEN= 30
##$LB= 1.5
##$LEV0= 0
##$LPBIN= 0
##$MAXI= 10000
##$MC2= 0
##$MEAN= 0
##$ME_mod= 0
##$MI= 50
##$NCOEF= 0
##$NC_proc= -8
##$NLEV= 6
##$NOISF1= 182.463
##$NOISF2= 159.3651
##$NSP= 0
##$NTH_PI= 0
##$NZP= 0
##$OFFSET= 198.0616
##$PC= 4
##$PHC0= 2274.471
##$PHC1= 272.4883
##$PH_mod= 1
##$PKNL= yes
##$PPARMOD= 0
##$PSCAL= 0
##$PSIGN= 0
##$REVERSE= no
##$SF= 81.0140089999434
##$SI= 65536
##$SIGF1= 159.3651
##$SIGF2= -187.1042
##$SINO= 113.3802
##$SIOLD= 16384
##$SREGLST= <1H.CDCl3>
##$SSB= 0
##$STSI= 65536
##$STSR= 0
##$SW_p= 32467.5324675325
##$SYMM= 0
##$S_DEV= 0
##$TDeff= 32768
##$TDoff= 0
##$TI= <>
##$TILT= no
##$TM1= 0
##$TM2= 0
##$TOPLEV= 0
##$USERP1= <user>
##$USERP2= <user>
##$USERP3= <user>
##$USERP4= <user>
##$USERP5= <user>
##$WDW= 1
##$XDIM= 65536
##$YMAX_p= 381349848
##$YMIN_p= -35395885
$$ End of Bruker specific parameters
$$ ---------------------------------
##NTUPLES= NMR SPECTRUM
##VAR_NAME=  FREQUENCY,     SPECTRUM/REAL,   SPECTRUM/IMAG
##SYMBOL=    X,             R,               I
##VAR_TYPE=  INDEPENDENT,   DEPENDENT,       DEPENDENT
##VAR_FORM=  AFFN,          ASDF,            ASDF
##VAR_DIM=   65536,         65536,           65536
##UNITS=     HZ,            ARBITRARY UNITS, ARBITRARY UNITS
##FACTOR=    0.49542278885378, 1,            1
##FIRST=     16045.7642231865, 0,            0
##LAST=      -16421.768244346, 0,            0
##MIN=       -16421.768244346, -35395885,    0
##MAX=       16045.7642231865, 381349848,    0
$$ Real data points
##PAGE= N=1
##DATA TABLE= (X++(R..R)), XYDATA
$$ [...]
6749i880218M337492M196610P55195k595982k440511P90781L746408L620171J58672
6740B688618m255594n995472l294717J444311L941004K869236O18776o71836j173217
6731c828891j083654M39388K706772K948148L58748j945920j287573O71696R45892
6722g5394l8055K25132J772023K207912O94325q86223p49663P59392J966517J500027
6712G375993m66103j888422q40045J618574K350854O06113j008433j120106j717529
6703D910896l573950l507239J34877K885136R7438n151102n956027j850136J204461
6694a0805646P05008O57743L478280N451692L323537N4667l1109K034231K263439
6685G131842K22603j074912m30535J12971j106557k964187l108595p06324K342481
$$ y = [-9880218, -5542726, -1346116, -590921, -3186903, -5627414, -4836633, -1090225, 2529946, 2688618, -1566976, -7562448, -10857165, -9412854, -5471850, -2602614, -1983838, -2655674, -3828891, -4912545, -4473157, -1766385, 1181763, 1540511, -405409, -1692982, -1021286, -75394, -113449, 111683, 1883706, 4091618, 4785943, 3899720, 3150057, 3909449, 5875966, 7375993, 6909890, 5021468, 4181423, 5799997, 8150851, 8756964, 7748531, 6628425, 4910896, 1336946, -2170293, -2035416, 849720, 947158, -4203944, -10159971, -12010107, -10805646, -10100638, -9442895, -5964615, -512923, 2810614, 2865281, 2834172, 4868403, 7131842, 7354445, 6279533, 5848998, 5961969, 4855412, 1891225, -1217370, -1923694, 418787]
6676D18787K742328o19667m453637m301622k01683L284471L122107Q61402j202213
6667c49727l157861m802017l751364M45629L529142J960064j289139r29439K431269
6658e913443L471790Q70385p90545J275284L710008K680063l60090j750912j358076
6649A834464j561457k446246j843307M49548J931335J214762k13612q55423j395593
6640b885529k601992k933456m09944L916190O541856N677791K987806O41457j475839
6631I458340m234279o470418o012915l081075l37776P95599J673459L368643M298645
6622e41777K774573L24926m7592J691642K512370Q56003j207678j290089K4492
6613E096870P93930R14431J484422J975196P28086j716222k516050p25103Q87185
$$ y = [418787, 3161115, 2541448, -1912189, -6213811, -6415494, -3131023, -8916, 852486, -349727, -3507588, -8309605, -12060969, -11615340, -8086198, -6126134, -7415273, -8344712, -5913443, -2441653, -1571268, -2361813, -1086529, 2623479, 5303542, 4943452, 3192540, 1834464, 273007, -2173239, -4016546, -3566998, -1635663, -420901, -634513, -1489936, -2885529, -5487521, -8420977, -8830921, -4914731, 1627125, 7304916, 10292722, 10934179, 9458340, 5224061, -1246357, -7259272, -10340347, -10678123, -9882524, -8209065, -4840422, -541777, 2232796, 2557722, 2510130, 4201772, 6714142, 7570145, 6362467, 5072378, 5096870, 5890800, 6805231, 8289653, 10264849, 10992935, 9276713, 6760663, 6035560, 6922745]
6604F922745O850j388798j48785K493570K174643j763872m559396k664516J178027
6595B250468K043262l69396k144657r66982J700161L680418M237392L088804J20571
6586A3640041l235192m617276l593612k178953j885182j910906q77130J163514
6578c494696L030082L414809J376024k583445n751819n401605k194080M24023
6570a1180707O31497J6787M23319J363162J711395J855988K592653L380890L127281
6561C922265J694580j60263j250875k42404K662419M273514J425007l938361n954746
6552B431136k486793J884422K548049Q70893M18620O51993j180830m155232m603277
6543c621019j963171Q60093K557512M368608N875546M443613J0762l557599l648727
$$ y = [6922745, 6929595, 5540797, 5392012, 7885582, 10060225, 8296353, 3736957, 1072441, 2250468, 4293730, 3924334, 1779677, 812695, 2512856, 6193274, 10430666, 13519470, 13640041, 10404849, 5787573, 2193961, 15008, -1870174, -3781080, -4658210, -3494696, -464614, 2950195, 4326219, 1742774, -4009045, -9410650, -11604730, -11180707, -10549210, -10532423, -10109104, -8745942, -7034547, -5178559, -2585906, 794984, 3922265, 5616845, 5456582, 4205707, 3963303, 6625722, 10899236, 12324243, 8385882, 2431136, -55657, 1828765, 4376814, 5247707, 5666327, 6318320, 5137490, 982258, -3621019, -5584190, -4724097, -2166585, 2202023, 8077569, 12521182, 12531944, 8974345, 5325618]
6534E325618k197189j932571k246004j165059P17575R86750q70051k634161k116481
6525f131573M23458K579653K173928l10101j836240k41009K808192L743775J786627
6516D996710k52282j65801P96640L44197j265058j611476N58794L506423M027966
6507A0936113P81282l671545m874937j526783K422176K416090q86323k945698
6499B650375j934957o52670j375830k360151j164813J435822L068854L097395
6491B764025K193731N63232j181094j292644M53494J178443j135558l725657k609790
6482b791818J044872K285632l2324j578020L08958K240469L55785l166205l149304
6473d481955Q39734M016520L275392N94622j162291k136403l205009k824672O54512
$$ y = [5325618, 3128429, 1195858, -1050146, -2215205, -1497630, -510880, -1380931, -4015092, -6131573, -5708115, -3128462, -954534, -1264635, -3100875, -3341884, -533692, 3210083, 4996710, 4744428, 4578627, 5375267, 5719464, 4454406, 2842930, 3401724, 6908147, 10936113, 11717395, 8045850, 3170913, 1644130, 4066306, 6482396, 5596073, 2650375, 715418, 62748, -1313082, -3673233, -4838046, -3402224, -333370, 2764025, 4957756, 5520988, 4339894, 3047250, 3500744, 4679187, 3543629, -182028, -2791818, -1746946, 538686, 506362, -1071658, -762700, 1477769, 1833554, -1332651, -4481955, -3642221, 374299, 3649691, 4244313, 3082022, 945619, -2259390, -5084062, -4429550]
6464d429550M908034N290625P87662m284286n381845k675531J25949M15937j128236
6455f371241k156438j271357O78792J412496k59880k637790k879825q00145O29875
6446a3655513n18017k060071o25469L343804N797724M333887J185702n185R88507
6437a214631J103033j166413k930479o62141L942116M884243M7939m573465k370580
6428b940378M100290N949267M28835n288302m706402n84598R25490l17433m34974
6419b868205O21137k92973k698420k692970L41707K912676L419403L570768L478535
6410E791658J051179k623240l016219P08052L531082K042339p98413j217760k68791
6401E199887m31487p80936L91155J510875M15698j597441k290555k481033l584679
$$ y = [-4429550, 478484, 5769109, 6556771, 2272485, -3109360, -5784891, -5658942, -5243005, -6371241, -8527679, -9799036, -9120244, -7707748, -7967628, -10605418, -13485243, -14285388, -13655513, -14173530, -16233601, -16859070, -13515266, -7717542, -3383655, -2197953, -2203138, -1214631, -111598, -1278011, -4208490, -4870631, -928515, 3955728, 4003667, -569798, -2940378, 1159912, 7109179, 7538014, 2249712, -2456690, -3041288, -2115798, -2433231, -2868205, -2247068, -2540041, -5238461, -7931431, -7589724, -4677048, -1257645, 2313123, 5791658, 6842837, 4219597, 1203378, 1911430, 5442512, 7484851, 6686438, 5468678, 5199887, 4768400, 3987464, 4378619, 5889494, 6305192, 4707751, 2417196, -63837, -3648516]
6392c648516l666732m09812L769017M167238N14842k727300k253172J196769M996352
6383A938686O539070M096801r05512l625812j238275K676751K870403n2645j438557
6374A0860910n65753j065885l431517l353890P23066L952902J979494k754800
6366F344527m845968k864103N87965L012650L244017R49720k082362k228220J419417
6357C537643M683993L561294p4940j623104q79332j386315l345338k673268J508878
6348C309511L656442m84339o642256p135266j373267L707817L465731P95821J58548
6339e41258J067283P85492M2115J505883M173370L993916L2881m099971n536824
6330A422887n037839l658563n81585L731388N824797L564408l83225k179761j782156
$$ y = [-3648516, -7315248, -7725060, -3956043, 211195, 726037, -2001263, -4254435, -3057666, 1938686, 8477756, 12574557, 11669045, 8043233, 6804958, 9481709, 12352112, 12299467, 10860910, 10295157, 9229272, 5797755, 2443865, 3166931, 7119833, 9099327, 6344527, 1498559, -1365544, -777579, 2235071, 5479088, 6428808, 4346446, 2118226, 3537643, 8221636, 11782930, 11707990, 10084886, 9205554, 7819239, 4473901, 1800633, 3309511, 6965953, 6481614, -160642, -7295908, -8669175, -4961358, -1495627, -699806, -541258, 526025, 1311517, 1353632, 2859515, 7032885, 11026801, 11059682, 6959711, 1422887, -3614952, -7273515, -7855100, -4123712, 1701085, 5265493, 4882268, 2702507, 920351]
6321I20351j501260j600715n33915J695403L410719L750852K930060J014961j360793
6312H725663k336591j153300K89601M21064N32103J635245J367494k069964n172298
6303B239017l325635J639456L572869J143466r57796k41036L67783q98517j029499
6294B510108J695519L317198J47628m709595n397721j477291K210435K430739
6286G27020N06915r62276j143116o84474n00858r01011r06748Q21154L583367
6277E39973M632798K732808J04979o21247J94773M99840k57778j069505j350315
6268E406326j249327q49241l95447l74515l77013P17424K371686K076797r80308
6259F346382l743920k930615M52424K463382J275763j227796k468722j901396
$$ y = [920351, -580909, -2181624, -2715539, -1020136, 2390583, 6141435, 9071495, 10086456, 8725663, 6389072, 5235772, 5525373, 5946437, 6478540, 8113785, 9481279, 7411315, 2239017, -1086618, 552838, 4125707, 5269173, 4311377, 4070341, 4438124, 3539607, 2510108, 4205627, 7522825, 7670453, 2960858, -2436863, -3914154, -1703719, 727020, 1233935, 271659, -871457, -1555931, -2056789, -2957800, -3864548, -3043394, 539973, 5172771, 7905579, 8010558, 7389311, 7584084, 8083924, 7826146, 6756641, 5406326, 4156999, 3307758, 2912311, 2537796, 2160783, 2878207, 5249893, 7326690, 6346382, 2602462, -328153, 124271, 2587653, 3863416, 2635620, 166898, -1734498]
6251a734498p25207j82484l90933m65357R1009M81643O6118L4340J589562K872886
6241A637079P35374l954435o187948l404465J021749K773941J928208R13816K07277
6232d329404q21246j207027O1149J515935J353249N99445J237805K693187L088756
6223D191849K517923K152953J586763N45j552821j975367k488223m061077m561194
6214d188649k163651N17740J26411j455930N3086L752021M471444R90789k326245
6205b22984k575801j536189r31479J11845J381717N91293j874205k091291J143219
6196f003875L777893K838163P91853N93419Q20027n44546j523776K27380K382907
6187C359445J194911k496582m941934n287030n244257m458540r53313M295223
$$ y = [-1734498, -2459705, -2642189, -3033122, -3498479, -3407470, -2925827, -2859709, -2825369, -1235807, 1637079, 2372453, -1581982, -7769930, -11174395, -10152646, -7378705, -5450497, -4536681, -4329404, -5150650, -6357677, -6296528, -4780593, -3427344, -2827899, -1590094, 1103093, 4191849, 6709772, 8862725, 10449488, 10450033, 8897212, 6921845, 4433622, 372545, -4188649, -6352300, -5834560, -5708149, -7164079, -7110993, -3358972, 1112472, 2103261, -222984, -2798785, -4334974, -5266453, -5154608, -3772891, -3181598, -5055803, -7147094, -6003875, -2225982, 612181, 1404034, 1997453, 2817480, 2272934, 749158, 976538, 3359445, 4554356, 2057774, -2884160, -8171190, -13415447, -17873987, -18827300, -14532077]
6179a4532077P521326P016499M373931J167639k024443l546647j714443J548605
6171a89610K112230k39963j024794J823286L992684J109663m010144m774447k69709
6162a470804L287460J277098l125718l850194l11533K611918J984254K79806N92336
6153A274623J881136J403778n67685j719160j973415l055491m188345k346572
6145i291131K297985N128609L337161J19852j65881J680996J797531j36565o17183
6136D151374J620376L280529J440364k198202l910483k938614j705899j814459
6128b075014j993514n59212J544015J656199p85315k912436j892208J355231L486745
6119b175509L137557J931727J249172N07174o74497j163223n87691o33366k136152
$$ y = [-14532077, -7010751, 5748, 4379679, 5547318, 3522875, -23772, -1738215, -189610, 1922620, 1682657, 657863, 2481149, 6473833, 7583496, 3573352, -1201095, -1470804, 1816656, 3093754, -31964, -3882158, -4193691, -1581773, 402481, 682287, 1274623, 3155759, 4559537, 3991852, 2272692, 299277, -2756214, -6944559, -9291131, -6993146, -1864537, 1472624, 1592476, 1426595, 3107591, 4905122, 4768557, 4151374, 5771750, 9052279, 10492643, 8294441, 4383958, 1445344, -260555, -2075014, -4068528, -4627740, -3083725, -1427526, -2212841, -5125277, -7017485, -5662254, -2175509, 962048, 2893775, 4142947, 4650121, 3975624, 2812401, 2224710, 1591344, -544808]
6110e44808k887625q05216K218023K527926M2470j564581o4551K571150L293770
6101D786558J787166Q8984k81079L16247P02422O14462J093150K757706L907776
6092A5773392J816828l281942p116381o050054j806016O11055p22873k605546
6084c381537j299422K743642N631311M476344L17677l115189l325491j593623
6076D53712j024943k240133k614528l94662K470077L150124J769275L39950n24615
6067A384257j267875j080528R71190L189310K836686L61977j056124l10969M29571
6058E457495k40094r83834p65901p45996j598853j693111P3669J757981Q43757
6049B105113k092120l946851k523347J544910N271590N284845R44562l989427
$$ y = [-544808, -3432433, -4237649, -2019626, 508300, 550770, -1013811, -1078362, 1492788, 4786558, 6573724, 6662708, 6381629, 6697876, 7400298, 8014760, 9107910, 11865616, 15773392, 17590220, 14308278, 7191897, 1141843, -664173, -53118, -775991, -3381537, -4680959, -1937317, 3693994, 8170338, 8488015, 5372826, 2047335, 453712, -571231, -2811364, -5425892, -5820554, -3350477, -200353, 1568922, 1908872, 1384257, 116382, -964146, 7044, 3196354, 6033040, 6395017, 5338893, 5027924, 5457495, 5217401, 4233567, 3467666, 2721670, 1122817, -570294, -496625, 1261356, 2105113, 12993, -3933858, -6457205, -4912295, 359295, 5644140, 6588702, 2599275]
6041B599275m748810j226814J980186J845772L11895R8180M36093m91675j672576
6032h68474j142588J75859M082j132311p47004J192876K022569N53568j403205
6023a344628j955738j077108O39025K770480M133341L275671P06808j050531l79495
6014E717825J656992K804637J810747q47401l278955l478169j527480L6838n56697
6005B338337j717244j110620K93445k17323k117743j933317J104426L475098K734318
5996B849377R62627R19191J901470J942242J458593J755271J949812N67524j257754
5987A3048353j415228p06210j832026m834790o641409n354694k327967M02865
5979i661106K287192L293286L065481J966827J250430J424967J783576J826228
$$ y = [2599275, -2149535, -3376349, -1396163, 449609, 761504, 859684, 1295777, 804102, -868474, -2011062, -1835203, -1831121, -2963432, -3710436, -2517560, -494991, 58577, -1344628, -3300366, -4377474, -3738449, -967969, 3165372, 6441043, 7147851, 6097320, 5717825, 7374817, 10179454, 11990201, 11142800, 7863845, 4385676, 2858196, 2895034, 2338337, 621093, -489527, -196082, -413405, -2531148, -4464465, -3360039, 115059, 2849377, 3812004, 4731195, 6632665, 8574907, 10033500, 11788771, 13738583, 14306107, 13048353, 11633125, 10926915, 9094889, 4260099, -2381310, -7736004, -10063971, -9661106, -7373914, -4080628, -1015147, 951680, 2202110, 3627077, 5410653, 7236881]
5971G236881J612454O76792j411579l257633k804217p85012l27126k125446k955021
5962d139907p31278J873818J516807n78065q53822P98532J356392J4928p50987
5953a493582L42473J581663J762620K052884K951538K581366M6731k191926j768719
5944E865048j26418q1124j314775j288353L61595J481929J168989Q55432J295690
5935H218013J238265O214r70801n19020K63364j07301j032058r93365k86201p09008
5925E108102k664199m144168l106078n121K583476K559970K35324k142529k550249
5916d125472q96310J171725J880874Q14505p98559j149897L71829K343194K782706
5907B394595J506908Q6274o67906j585291k774071k443582N9034J901953L32582
$$ y = [7236881, 8849335, 9526127, 8114548, 4856915, 2052698, 1267686, 940560, -1184886, -4139907, -4871185, -2997367, -1480560, -2058625, -2912447, -2113915, -757523, -742595, -1493582, -1151109, 430554, 2193174, 4246058, 7197596, 9778962, 9825693, 7633767, 5865048, 5738630, 5657506, 4342731, 3054378, 3415973, 4897902, 6066891, 6922323, 8218013, 9456278, 9462492, 8491691, 7972671, 8236035, 8128734, 7096676, 6103311, 5817110, 5108102, 2443903, -1700265, -4806343, -4811464, -2227988, 331982, 567306, -1575223, -4125472, -5021782, -3850057, -1969183, -1154678, -1953237, -3103134, -2731305, -388111, 2394595, 3901503, 3987777, 3319871, 1734580, -1039491, -3483073, -3424039, -1522086, -1189504]
5898a189504k583482k296063J499624M313762L524532J554198J018536P59384
5890F600987r01083k607717k780825k793964l780701l279242N04678L609833J006245
5881d421789m872372o213711o19600N844004P470187N312275K800887L21292k493006
5872C128167l406368p25740K995910M204732L151971K128091J177480p25232k214350
5863I714661j404812O6979r05004l499942l831259j085999J311227J159716K45372
5854A770939O05064J472803J429893P84666K62473l85978j138480j153506n97718
5845C050156r10309k163139k397829q51179M41938j73557j323016r53791M84489
5836d796237J168956Q04835N68028J217086K654127M196737M241681J360853k997482
$$ y = [-1189504, -3772986, -6069049, -4569425, -255663, 3268869, 4823067, 5841603, 6600987, 5699904, 3092187, 311362, -2482602, -6263303, -9542545, -9037867, -5428034, -4421789, -9294161, -15507872, -16127472, -10283468, -2813281, 2498994, 5299881, 5621173, 3128167, -278201, -1003941, 1991969, 6196701, 9348672, 11476763, 12654243, 11929011, 9714661, 8309849, 8376828, 7471824, 3971882, 140623, -945376, 365851, 1525567, 1770939, 2376003, 3848806, 5278699, 6063365, 6325838, 5939860, 4801380, 3647874, 3050156, 2139847, -23292, -2421121, -3272300, -2830362, -3003919, -4326935, -5280726, -4796237, -3627281, -2822446, -2254418, -1037332, 1616795, 5813532, 10055213, 11416066, 8418584]
5827H418584m909344k763100L51570R34943m33849j241477j329816j865838j983335
5818d821662l13203J358397J38033k746262l026418P0644K600547K145003J185824
5809c409097K485434M690210M967224L252615J229134q52931l570133n813852
5801B978604n478457k314064J579777L839919L458189J014155j743157l117456
5793B17510k869458j832704k78558J882589L354481K159121j259986l815293l543344
5784e985642j516106O68604K612060L342203J131368l004189m879494k729474
5776a0360670m5711J09281R5507K933499N929361M584189N57863o68567J024424
5767D159176N65846k665418k832128K475140P284279O086871J815598O1066J40247
$$ y = [8418584, 3509240, 746140, 1097710, 2032653, 1598804, 357327, -972489, -2838327, -4821662, -5134865, -3776468, -3638435, -6384697, -9411115, -9340471, -6739924, -4594921, -3409097, -923663, 3766547, 8733771, 11986386, 13215520, 12362589, 8792456, 2978604, -2499853, -4813917, -3234140, 605779, 4063968, 5078123, 3334966, 217510, -2651948, -4484652, -4763210, -2880621, 473860, 2632981, 1372995, -2442298, -5985642, -7501748, -6833144, -4221084, -878881, 252487, -2751702, -7631196, -10360670, -10406381, -10297100, -10201593, -7268094, -1338733, 3245456, 3803319, 3134752, 4159176, 4725022, 2059604, -772524, 1702616, 8986895, 15073766, 16889364, 16950430, 17090677]
5758A7090677k076399n772018o293339l270384j325141k572662l895203k639956
5750a0754425k98569R97424J597170K126486J702781M38892N70567K644489L383305
5741B408120L25106l609634l667265r0575K288332R95852j215776j272847k33812
5732d072499q04098k664456l011880r18728J416262J970642J423160J564790K595634
5723b501173L152285K349290P79936l51220n63904o91408k116100m738894n864159
5714a0545347k746095L096299O169251L460920j114551j515391K303478M713008
5706C821572K750828j66451l50064N41698q39215l388733l310440m41110J566807
5697A84892J098234N45138J772436L185723K721851R63137l92631j021509j316349
$$ y = [17090677, 15014278, 9242260, 2948921, -321463, -1646604, -4219266, -8114469, -10754425, -11052994, -10055570, -8458400, -6331914, -4629133, -4190241, -3619674, -975185, 2408120, 2733226, -876408, -4543673, -4634248, -2345916, -1350064, -2565840, -3838687, -4072499, -4876597, -7541053, -10552933, -11471661, -10055399, -8084757, -6661597, -5096807, -2501173, 651112, 3000402, 3780338, 3429118, 2865214, 2173806, 57706, -4681188, -10545347, -13291442, -10195143, -4025892, -564972, -1679523, -3194914, -891436, 3821572, 6572400, 6405949, 6055885, 6597583, 5758368, 2369635, -940805, -1381915, 184892, 1283126, 1828264, 3600700, 6786423, 9508274, 10471411, 10078780, 9057271, 7740922]
5688G740922j017175q3423N13816K77348Q1765L02478l47530k484812m113924
5679H69465l101741m59175J084017R61300Q06176J093826N18659r65248j219446
5670d12167P09266K387548R75940k781513n359883m684651j857994J215995M060322
5661e747137O584707P182857L844603k508481p341421o621490j318185L476413
5653b448134M011417J241191j477445k339335j629199J55368K616757M354874
5645D485494L678949Q70669j733391k444149j826641j171048o75639m343L89380
5636A569281l04563j842153k839849k123986J50176K529478L271514J773905p14761
5627A469042k136096j518966M40020K426074L349703K351953o66242m035097n059762
$$ y = [7740922, 6723747, 6640324, 7154140, 7431488, 7513253, 7815731, 7468201, 4983389, 869465, -2232276, -2691451, -1607434, -646134, 160042, 1253868, 1772527, 807279, -412167, 297099, 2684647, 3660587, 879074, -4480809, -9165460, -11023454, -9807459, -5747137, 837570, 8020427, 11865030, 9356549, 2015128, -4606362, -5924547, -2448134, 1563283, 2804474, 1327029, -1012306, -2641505, -2486137, 130620, 4485494, 8164443, 9035112, 7301721, 4857572, 3030931, 1859883, 1184244, 1179901, 1569281, 1264718, -577435, -3417284, -5541270, -5391094, -2861616, 409898, 2183803, 1469042, -667054, -2186020, -1746000, 680074, 4029777, 6381730, 5715488, 1680391, -3379371]
5618c379371k729297R63143L088177K546608L11426k059753l249285k459567k01851
5609g169770J563517J223895o22586j858837j204748P40609K456200K846237J999947
5600b5536J173809J548559K578318K426015O50527p36362k5062J535131J456605
5591A0582004l76260j624031p48539J187037J894117J0340l589973n735417l532580
5582a933302J463671L426461p78474o353247n925229O40226O023589N189225Q14201
5573B567121k115393k496432j633155J96984K411336K626701P8081j989146q09314
5564a163217J401073J155872l66803M45113L048643L330340L17515k452309k620937
5555C095290j743354j553866j521379j292941j860854k820257j874789J213380
$$ y = [-3379371, -6108668, -5145525, -2057348, 489260, 800686, -1259067, -4508352, -6967919, -7169770, -5606253, -4382358, -5004944, -6863781, -8068529, -7327920, -4871720, -2025483, -25536, 1148273, 2696832, 5275150, 7701165, 8351692, 7615330, 7590268, 9125399, 10582004, 10205744, 8581713, 7833174, 9020211, 10914328, 10924668, 7334695, 1599278, -1933302, -469631, 2956830, 2178356, -4174891, -10100120, -9459894, -3436305, 1752920, 2567121, 451728, -2044704, -3677859, -3480875, -1069539, 1557162, 1635243, -353903, -1163217, 237856, 1393728, 1026925, 1472038, 4520681, 7851021, 8168536, 5716227, 3095290, 1351936, -201930, -1723309, -3016250, -4877104, -7697361, -9572150, -8358770]
5547h358770L318113K484195Q56403J007027K101382K113129J348950J014682
5539E885111L71165j631230l434995k799021p27524l22071k010819k907241j256712
5530h833337J079631J487122N2706r66324n7177K022073L084083J528974j974242
5521b576491m730412m499847j752162J066335K321092K485352K700852K992133
5513a993148K453313Q16442p91521r27670M53111J764778J524007l7132j533883
5504A728297k193663k282535k013251j063795O00926K179680K617506J441402
5496A014567q11309k660852k769151j545588q11437j088411o25502J449891K812910
5487e034882J312796q98373j77734K555538K917628K21895j345854J49889J238630
$$ y = [-8358770, -5040657, -2556462, -1700059, -693032, 1408350, 3521479, 4870429, 5885111, 6256276, 4625046, 1190051, -1608970, -2336494, -2658565, -4669384, -7576625, -8833337, -7753706, -6266584, -6213878, -7180202, -7237379, -5215306, -2131223, -602249, -2576491, -7306903, -11806750, -13558912, -12492577, -10171485, -7686133, -4985281, -1993148, 460165, 1276607, 485086, -442584, 10527, 1775305, 3299312, 3262180, 1728297, -465366, -2747901, -4761152, -5824947, -5224021, -3044341, -426835, 1014567, 203258, -2457594, -5226745, -6772333, -7583770, -8672181, -9297683, -7847792, -5034882, -3722086, -4620459, -4798193, -2242655, 674973, 896868, -448986, -299097, 939533]
5478I39533n44828k065748k10890K152093P44254k713538l171399m36562J024944
5469d282141k62517r96710N97844J928287J015411r6336Q64699K539199K336905
5460C644641M21444r41029o08683N39739J047683K34859j198448j675786o87744
5451G76676K27828j69881m21174J368126L620276K866566p58770l190853k464729
5442A854065j472251k922732m793719l491477O71444M038799M425645K852814
5434A162588J136495n1240p81159j076305p92394K45968J763197K610553J728889
5425E946592k44082j466142j248096n56727R5608J429915L307668L749193J429674
5416A2443603k127267m146223l468746r46830J879192L509454K985804P74634
$$ y = [939533, 394705, -1671043, -1881933, 270160, 1014414, -1699124, -4870523, -5307085, -4282141, -4544658, -5541368, -4943524, -3015237, -1999826, -2096162, -1231463, 1307736, 3644641, 4066085, 3125056, 2516373, 3056112, 4103795, 4338654, 3140206, 1464420, 776676, 1004504, 834623, 413449, 1781575, 5401851, 8268417, 7509647, 4318794, 1854065, 381814, -2540918, -7334637, -10826114, -10154670, -6115871, -1690226, 1162588, 2299083, 2247843, 1466684, 390379, -402015, -156047, 1607150, 4217703, 5946592, 5702510, 4236368, 2988272, 2431545, 2527153, 3957068, 7264736, 11013929, 12443603, 10316336, 6170113, 2701367, 1754537, 3633729, 7143183, 10128987, 10903621]
5408A0903621j497009k741597l064421k671308j565571n09816m86959q67578j82428
5399b683066R15511J34385k190300k526267L94527K800568J349899j462811j074122
5390d341676J933381K701357m70218l759566l447761m56378J963397K522245K357877
5381i97342K759261L731611M179000L001409M34693j890154k783061k706642k363385
5372C365390j282309P35256K039947J122905p25871j109522k00312j39687j265517
5363B540280j889120j699231k082319k633388r66663K674315M149296J085398
5355A178568l059737l516578o78332J202245M41192n17398K69331J397913P96512
5346b486284j083376j988846n49614K443052M561075L518680l35864l446092k661324
$$ y = [10903621, 9406612, 6665015, 3600594, 929286, -636285, -1146101, -1633060, -2500638, -2683066, -1767555, -1633170, -3823470, -6349737, -5955210, -3154642, -1804743, -3267554, -4341676, -2408295, 293062, -177156, -3936722, -7384483, -7840861, -5877464, -3355219, -997342, 1761919, 5493530, 9672530, 12673939, 13108632, 11218478, 8435417, 5728775, 3365390, 2083081, 2818337, 4858284, 5981189, 5255318, 4145796, 3945484, 3805797, 2540280, 651160, -1048071, -3130390, -5763778, -6730441, -4056126, 93170, 1178568, -1881169, -5397747, -6076079, -4873834, -4432642, -4950040, -4680709, -3282796, -2486284, -3569660, -5558506, -6108120, -3665068, 896007, 4414687, 4078823, 632731, -2028593]
5337b028593N67198J776036l26394k037984m68390J739259M49070l178747l938288
5328g446833k55280L428128L028668J57288r71277N86213K320181K432300J517456
5319D796844O65275J03030l08813p93894j819307l374971m355878l703542j802019
5310a0593275J27443J420862J978067J826436J575982K102586K805004J821963
5302C065068p59468k089693q61806Q5330j701783l729288k472360L20536K79454
5293g864010j933457j500994K060953L549972O32965k234316j096293J611022
5285f774158J982975R83774J702380L599519L717619J500931j031588k225399
5277C456053j468270Q74077K245692k61900m661936m659599J385199O474150M330210
$$ y = [-2028593, -1461395, 314641, -11753, -2049737, -2518127, -778868, -329798, -3508545, -7446833, -7702113, -4273985, -1245317, -1088029, -2059306, -1473093, 847088, 3279388, 4796844, 5462119, 5565149, 5256336, 4462442, 2643135, -731836, -5087714, -8791256, -10593275, -10465832, -9044970, -7066903, -5240467, -3664485, -1561899, 1243105, 3065068, 2305600, 215907, -645899, -560569, -2262352, -5991640, -8464000, -8143464, -7864010, -9797467, -11298461, -9237508, -5687536, -5054571, -7288887, -8385180, -6774158, -4791183, -3807409, -2105029, 1494490, 5212109, 6713040, 5681452, 3456053, 1987783, 2861860, 5107552, 4845652, 183716, -4475883, -3090684, 3383466, 7713676]
5268G713676j409992k905849M44489K775602J599274k09659j231482l113643n002959
5259a340543l100614K588395O601160N129076M35389l338793m684194l765094
5251a475218j082669J412219J551667M55146J176367L208365K718227p83545k983603
5242D196956j715953k59236j111842j554453Q84628L046653R87500l032382l582185
5233b140314k61117K137389J079746n89605L79020K943578L476907M45598l750542
5224C720660n151842k270496K171813M068031K423787j08244j095175q19730m76322
5215B462482j09437M69373O14197J53561K30134J351343J892524J26477l028131
5206D162523m626859k861724R40916L332044K054689j135706j984145P99268L287962
$$ y = [7713676, 6303684, 3397835, 3842324, 6617926, 8217200, 8007541, 6776059, 3662416, -1340543, -4441157, -1852762, 4748398, 9877474, 10312863, 6974070, 2289876, -1475218, -2557887, -1145668, 405999, 861145, 2037512, 5245877, 7964104, 7180559, 4196956, 2481003, 2221767, 1109925, -444528, 440100, 3486753, 4474253, 1441871, -2140314, -2401431, -264042, 815704, 226099, 605119, 3548697, 7025604, 7471202, 3720660, -1431182, -3701678, -1529865, 2538166, 4961953, 4853709, 3758534, 2938804, 2462482, 2353045, 2822418, 3436615, 3590176, 3820310, 5171653, 7064177, 7190654, 4162523, -464336, -3326060, -2385144, 946900, 3001589, 1865883, -118262, 681006, 3968968]
5197C968968J797642j372574j398325J300262J817527q75974k133761L26555K302460
5188E732780O0426l473414l529340p92998N60348m39754j256777p08273r7674
5179c944676j56459j00893M87296J119456J400660J106266J19825o89933p0404
5170g28862J210503P58493j541817k801150j838625j352071l080311m167839j589028
5161a5130707K617926M239508K922287J643900J697448J703222O12749j207459
5153i01126k964042l321910q32200L426707N645684L956734J014087k93247p32038
5144D998649j668695j682489J60437J172206n19270j826685Q6714J918291n22868
5135B116290m266943l435706O17344J327856j788041k326198J679926M010199
$$ y = [3968968, 5766610, 4394036, 2995711, 4295973, 6113500, 5237526, 3103765, 3430320, 5732780, 5793206, 2319792, -1209548, -2002546, -1442198, -1881952, -3138729, -3847002, -3944676, -4101135, -4202028, -3714732, -2595276, -1194616, -88350, 31475, -658458, -728862, 481641, 1240134, -301683, -3102833, -4941458, -6293529, -9373840, -13541679, -15130707, -12512781, -8273273, -5350986, -3707086, -2009638, -306416, 306333, -901126, -3865168, -7187078, -8019278, -4592571, 1053113, 5009847, 6023934, 5730687, 4998649, 3329954, 1647465, 1807902, 2980108, 2460838, 634153, 720867, 2639158, 2116290, -2150653, -5586359, -4969015, -3641159, -5429200, -7755398, -6075472, -2065273]
5127b065273N94539l712501k848916J558356L666269J964758j4078P27033L688803
5118C558990O102139N196642P05436l980044n061227k992693j394613j570196
5110E64434j627799r42364j043476j540175j13024K213043J111768l583995n826544
5101a0788132j968629L449856M493261K100098R66066J804682K010695J510014
5093C577911K310922L371277J304828l604976o614421m791641p40828J227177
5085c959751K36400j260083j302105p09277j542344l735890m239604q65724L579967
5076a3798411L758910q46582m149951j201211M903896P046957L403971r51349
5068a833770j390923R73475K352726J768326J318038K217678K917703J615563
$$ y = [-2065273, -1470734, -5183235, -8032151, -6473795, -2807526, -842768, -856846, -129813, 3558990, 9661129, 14857771, 15563207, 11583163, 6521936, 3529243, 2134630, 564434, -1063365, -2005729, -3049205, -4589380, -4702404, -2489361, -1377593, -4961588, -10788132, -12756761, -9306905, -4813644, -2713546, -1747480, 57202, 2067897, 3577911, 5888833, 9260110, 10564938, 6959962, 345541, -4446100, -5186928, -3959751, -3723351, -4983434, -6285539, -6994816, -8537160, -12273050, -16512654, -17378378, -13798411, -10039501, -10886083, -15036034, -16237245, -11333349, -4286392, -882421, -1833770, -3224693, -2251218, 101508, 1869834, 3187872, 5405550, 8323253, 9938816]
5060I938816q30451j902445r75764j41134q74426j701168p65125Q26238O62148
5051D236689q98204j259914p989L58401j305308k777734j954337K02610J705224
5042a700562K363528K838761K587934O46496k457714m961933n503143l882966
5034a0069599j045160J318394K113317K002381K245113K645469K072310O18694
5026A900919n95885j417773k346898k609336j030656J331408K094097J094716
5018a579408L42788N22327M99889K19506P41538J339799K24284j652132j576424
5009i17833j97861r12773l232660k269807K968029O338268L261712k128843l145170
5000b36938j29820J291887r07774l381105l547754k688497k523189k273854k42286
$$ y = [9938816, 9108365, 7205920, 6230156, 6089022, 5214596, 3513428, 2748303, 3574541, 4236689, 3338485, 2078571, 2070582, 2428983, 1123675, -1654059, -3608396, -3405786, -1700562, 662966, 3501727, 6089661, 6736157, 4278443, -683490, -6186633, -10069599, -11114759, -9796365, -7683048, -5680667, -3435554, -790085, 1282225, 1900919, 1305034, -112739, -2459637, -5068973, -6099629, -4768221, -2674124, -1579408, -1236620, -714293, -214404, 5102, 746640, 2086439, 2310723, 658591, -917833, -1115694, -2028467, -5261127, -7530934, -4562905, 1775363, 5037075, 2908232, -236938, -366758, 925129, 17355, -3363750, -6911504, -9600001, -12123190, -14397044, -14639330]
4991a4639330L538830O938489P409781M374137K30420j943439j728489r73181
4983C207218m99491K95988P42387q39074l601902m361423k254493J50199J194858
4974e965733J799515J926284j53036l524105m194303j104761J852101J987593
4966g376445J305492J469102M92766k340732l454343q48873J743262Q45493j131586
4957i295864p63026L53026m65641j045640K002367O738329Q314977N606146J053559
4948A2498233l348575n846609m054978J287723M973682L964632J706512J703213
4940A2883833J500188j763091m774192l431276m69986p43154k623657j443674
4932h65009J616421J623065j453816l378096l050572k606665k023232K4586J888371
$$ y = [-14639330, -11100500, -4162011, 3247770, 7621907, 7852327, 5908888, 4180399, 3207218, 2707727, 3003715, 3746102, 2907028, -694874, -5056297, -7310790, -7160591, -5965733, -4166218, -2239934, -2392970, -5917075, -10111378, -11216139, -9364038, -7376445, -6070953, -4601851, -4109085, -6449817, -9904160, -10753033, -9009771, -8164278, -9295864, -10058890, -9705864, -10171505, -11217145, -9214778, -2476449, 5838528, 11444674, 12498233, 9149658, 3303049, -751929, 535794, 5509476, 9474108, 11180620, 12883833, 14384021, 12620930, 7846738, 4415462, 3945476, 3202322, 578665, -865009, 751412, 2374477, 920661, -2457435, -5508007, -8114672, -10137904, -10113318, -8224947]
4923h224947J436967M52454J035982R63150j575676k827346L07484L529818K000095
4914b902019r59666j91912J475374r73066m199969k127818K457560K819658N06103
4905d095755J264761K989406k8233m775813m315023j118034k209345m923070j891542
4896a9102648L692037L267632n66793O90672L891928L01426n067020q53880P661041
4887f085605N975933k411073j932635M454534J55189j0558357o967976P308623
4879a0061367O830289o779673l461584J6432311J5627087m137777J8576762J02427082
4871A35453130J56644851Q9251867n1940039j28358351q9451296k0531375n637711
4864H5431076k5564752k3648917j559298L357331r622701j1416322J296297N813375
$$ y = [-8224947, -6787980, -6335526, -5299544, -4336394, -5912070, -8739416, -8431932, -4902114, -2902019, -3861685, -4053597, -2578223, -3551289, -7751258, -9879076, -7421516, -4601858, -4095755, -2830994, 158412, 130179, -4645634, -8960657, -10078691, -12288036, -17211106, -19102648, -15410611, -12142979, -12709772, -12019100, -8127172, -7825746, -12892766, -13746646, -6085605, -109672, -2520745, -4453380, 1154, 156343, -10402014, -17369990, -10061367, -3231078, -10010751, -13472335, 2959976, 18587063, 14449286, 33026048, 135453130, 292097981, 381349848, 329409809, 201051458, 111600162, 91068787, 85431076, 59866324, 36217407, 34658109, 38015440, 28392739, 16976417, 18272714, 24086089]
4856B4086089k807271p476064k916311r10397m294743l312411K818673L983675
4848I171240j100896k982845O04538K199845q0877l56003J877538P29279l628277
4839F433542m376195l82409K337777J686684J542126K767484J869600j312414
4831A0566195l136625k991784l088394k827820o04272J067489m27524j662284
4823c105019J229291M426017K477875j249687J63501M660763M364480q87398l775007
4814H304816k073036n73206r82630j87982J276561q68364n411594n900760j469053
4805g885248J572047M18193o53677R86166K570106K821873M224598O175883M115301
4796A4345242j770468m833697k097566J240869O94767j239139j265553r09423
$$ y = [24086089, 21278818, 13802754, 10886443, 9976046, 5681303, 2368892, 5187565, 9171240, 8070344, 5087499, 5692037, 7891882, 7811005, 7455002, 9332540, 10061819, 6433542, 2057347, 1674938, 4012715, 5699399, 7241525, 10009009, 11878609, 10566195, 7429570, 4437786, 1349392, -1478428, -2082700, -1015211, -1442735, -3105019, -1875728, 2550289, 5028164, 3778477, 3941978, 8602741, 12967221, 12079823, 8304816, 6231780, 5658574, 4675944, 4487962, 5764523, 4896159, -515435, -6416195, -7885248, -6313201, -5895008, -6548685, -5562519, -2992413, -170540, 4054058, 10229941, 14345242, 12574774, 7741077, 5643511, 6884380, 7579147, 6340008, 5074455, 4165032]
4788D165032j852741j839110L85937J453193r77429l692484l133100p88122M44096
4779e834728J128725K698602L770984K833519J377212J058048Q16169l52993j063079
4770F432459o57161j088883k850395k767842Q46681M346595L683940K12626k033092
4761F124928k226955k328587k968579l191031k650776j292971J413666M568101
4753b552204N306318K611512o00989j644874j776587k988215l798576j818748
4745g262363J523952K682703J223096j78527k21952j79156q83779j427543j065037
4736e788606k87219K26266L12093J16034J73121J094035K311208K147636J03505
4727D08073k074782k569032j489270P3405J369118J543947o8766k032264j434377
$$ y = [4165032, 2312291, 473181, 859118, 2312311, 1334882, -2357602, -5490702, -6278824, -5834728, -4706003, -2007401, 1763583, 4597102, 5974314, 7032362, 7848531, 7495538, 6432459, 5775298, 4686415, 1836020, -931822, -85141, 4261454, 7945394, 8158020, 6124928, 3897973, 1569386, -1399193, -4590224, -7241000, -8533971, -7120305, -2552204, 2754114, 5365626, 4764637, 3119763, 1343176, -1645039, -5443615, -7262363, -5738411, -3055708, -1832612, -2011139, -2233091, -2412247, -3296026, -4723569, -5788606, -6075825, -5849559, -5537466, -5421432, -5248311, -4154276, -1843068, 304568, 408073, -1666709, -4235741, -5725011, -5651606, -4282488, -2738541, -2807307, -4839571, -6273948]
4718f273948J948336M309825K618167j193474k968293j541378R01391K087417
4710a11957J227198j123541k846382j627092J612739K844941O43003j019766J189457
4701G88600L981745K011234l521682o202589l754568n18221O4965l0693J557048
4692e624161K944369J744723k14231Q6371J493603N68231k350321l214238n15637
4683e081291K320956J946020n29078j905595j341167k36037O71393J568876J871250
4674g14673R20697J5082R57062K529953J613649j389737j876714K094813N687823
4665I837955L520031k497047n872223m583991k524733k278055j794088M42324
4657e749827J828851K2224k585839k000850J790966N044325M758086J106487l302848
$$ y = [-6273948, -4325612, -15787, 2602380, 1408906, -1559387, -3100765, -2199374, -111957, 1115241, -8300, -2854682, -4481774, -2869035, -24094, 618909, -400857, 788600, 4770345, 6781579, 3259897, -2942692, -6697260, -7215481, -7150516, -7181209, -5624161, -2679792, -935069, -1149300, -1062929, 430674, 998905, -1351416, -4565654, -5081291, -2760335, -814315, -1343393, -3248988, -4590155, -4826192, -4154799, -2585923, -714673, 206024, 221106, 1178168, 3708121, 5321770, 3932033, 2055319, 4150132, 9837955, 13357986, 10860939, 4988716, 404725, -2120008, -4398063, -6192151, -5749827, -3920976, -3898752, -6484591, -8485441, -6694475, -1650150, 3107936, 4214423, 911575]
4648I11575n223000l342082j01825Q94250j15976N02672L408727M326199Q18967
4639B079507l000684k303249J187696K332219N53584m70941L23553L04385j245959
4630b39889j601735M69899K618466K934461K289091J521777l3811j893919j934832
4621D129508k33079J11941j976861l138208q32490K169393J938163m93314j130081
4612E44972M54996R33028q18735j835884n9421K372791K605265J133716J61178
4603E491906j65316j214759k595704k279673o1005J639171J212463M487j67558
4594A864012K62927Q3011j27291P95919J903669J349407k18803m39380O05716
4585F079187K80705j919158l061268j626045k15524j107561k291339j037467J260694
$$ y = [911575, -4311425, -7653507, -7755332, -6861082, -6977058, -6474386, -3065659, 1260540, 2079507, -921177, -3224426, -2036730, 295489, 849073, 378132, 701685, 1006070, -239889, -1841624, -1371725, 1246741, 4181202, 6470293, 7992070, 7958259, 6064340, 4129508, 3896429, 4008370, 2031509, -1106699, -1939189, 230204, 2168367, 1675053, 544972, 999968, 1932996, 1114261, -721623, -781044, 1591747, 4197012, 5330728, 5491906, 5326590, 4111831, 1516127, -763546, -824551, 814620, 2027083, 2031570, 1864012, 2126939, 2209950, 2082659, 2878578, 4782247, 6131654, 5912851, 5473471, 6079187, 6359892, 4440734, 1379466, -246579, -462103, -1569664, -3861003, -4898470, -3637776]
4576c637776J502324N0615n60988m86864j625721k807902r11818L229660N081530
4567a66940L380067J876112K564321K250802j380283m932109m457294j819338
4559b684662j289676k383972j252597K061448L144956L59573k308765j190081
4551e543776J942848K992042J254968n32514m77658N47082Q47194m8059j393489
4542d11362k147288j731529n73610J37477j78412n58982L13246K148063L283316
4533B80919K970885K148366J401493k38015k974136m187043j415099K994813L576810
4524D558993r04682n035514l796791Q69445L611644L291263K797895K735487N55985
4515H683725l666083n703636l266059N42195K182355K413467L285078L824030
$$ y = [-3637776, -2135452, -2084837, -2645825, -3132689, -4758410, -7566312, -8478130, -5248470, -166940, 3213127, 5089239, 7653560, 9904362, 8524079, 3591970, -865324, -2684662, -3974338, -6358310, -7610907, -5549459, -2404503, -2044930, -4353695, -5543776, -3600928, -608886, 646082, 113568, -364090, 182992, 1030186, 982127, -411362, -2558650, -4290179, -4863789, -4726312, -4904724, -5463706, -5150460, -3002397, 280919, 3251804, 5400170, 6801663, 6563648, 3589512, -597531, -2012630, 982183, 4558993, 3654311, -1381203, -5177994, -4308549, -696905, 2594358, 5392253, 8127740, 8683725, 5017642, -685994, -3952053, -3409858, -1227503, 1185964, 4471042, 8295072]
4507H295072K308423K15738p1278L39703j175031l633076l541080o16523J721199
4498C843147J684240R94849R07502K84687j180401j511848l2979P96625o78369
4489E107453k272322j387208P79561J290372R5535l85724O03922J349494P78575
4480E959658r3182o9788P58917J699382K081219J156104j089678k930148k288579
4471E183905N18333K758841K379019k1091k494781l716214l287395j475343N86367
4462D31641J418140O83980m58275r12762q47637j026122j715414k568603k883739
4453g878791j946593n0257J027928L5485j396780m76432K423404L800230K315916
4444b145890R77085K071360L109863J082772j898661j620426J194667J936035
$$ y = [8295072, 10603495, 10819233, 10747955, 11087658, 9912627, 6279551, 2738471, 2121948, 3843147, 5527387, 6522236, 7429738, 7714425, 6534024, 5022176, 4989197, 5785822, 5107453, 2835131, 1447923, 2227484, 3517856, 3613391, 3227667, 3831589, 5181083, 5959658, 5866476, 5796688, 6555605, 8254987, 10336206, 11492310, 10402632, 7472484, 5183905, 5702238, 8461079, 10840098, 10819007, 8324226, 4608012, 1320617, -154726, 431641, 1849781, 2533761, 2075486, 1162724, 315087, -711035, -2426449, -4995052, -7878791, -9825384, -9875641, -8847713, -8812228, -10209008, -10685440, -8262036, -4461806, -2145890, -1168805, 902555, 4012418, 5095190, 3196529, 1576103, 2770770, 4706805]
4436D706805k59714j311278O09715K062298M70850j715153j854978j564494k705836
4427a561785l053091m42958K209389J249273j062803j09596K667046J537147l642995
4418b210373o190333k700082J840243J909681p30715r31088J875194L858944K846990
4409d31539L86427j289339j455361m66491Q41776J490261J132761J37920j160792
4400h14377k125541j194484K058777M522947K544957k257890m080777r98219K303599
4391d1008J857634m0268K25684J393540M38071j467390j116150P79816P58642
4382B788571j552651l252666k914378j523030L32664K325101K583005M5671k493203
4373c660916j801482N54278P44786r39518j214956p6220k70117j236619J94685
$$ y = [4706805, 4447091, 3135813, 3745528, 5807826, 6278676, 4563523, 2708545, 1144051, -1561785, -4614876, -5057834, -2848445, -1599172, -2661975, -2771571, -104525, 1432622, -2210373, -8400706, -11100788, -9260545, -7350864, -8081579, -9012667, -7137473, -3278529, -431539, -45112, -1334451, -2789812, -3256303, -2414527, -924266, 208495, 346415, -814377, -2939918, -4134402, -2075625, 2447322, 4992279, 2734389, -1346388, -2344607, -41008, 1816626, 1776358, 2002042, 3395582, 3833653, 2366263, 1250113, 2029929, 2788571, 1235920, -2016746, -4931124, -6454154, -6121490, -3796389, -1213384, -1167713, -3660916, -5462398, -4908120, -4163334, -5102852, -6317808, -6394028, -6664145, -7900764, -7706079]
4364g706079L084289K940746k70702j462936P47212J577007j054711k257926J396221
4355c006879N573556N109084J810711J02352m19365k341132m140005k619684Q43866
4346I12504K123243P48180l94693k86260j98731k65945J31203k01103k489719
4337G8679m855429m613893k394725n73155O70498K173119K706023J084671m88887
4328f213099O34222K941543L183131J554728K09836j267911m028603n561906k616928
4319a1164987K749144N343508L976250J435392r74921l227437k844218J834277
4311b872992N994761L490816k944247m622402j22861L056328J140881r42371N6777
4302B234690k32276m599367p483278l722079K486466M092821J607228L86502J466066
$$ y = [-7706079, -4621790, -1681044, -1951746, -3414682, -2667470, -1090463, -2145174, -4403100, -3006879, 2566677, 7675761, 9486472, 9588824, 9169459, 6828327, 2688322, 68638, 912504, 3035747, 3783927, 3389234, 3102974, 2904243, 2638298, 2769501, 2568398, 78679, -4776750, -9390643, -11785368, -12358523, -11688025, -9514906, -6808883, -5724212, -6213099, -5578877, -2637334, 545797, 2100525, 2310361, 1042450, -2986153, -8548059, -11164987, -8415843, -3072335, 903915, 2339307, 1364386, -1863051, -4707269, -2872992, 3121769, 6612585, 3668338, -954064, -1076925, 1979403, 3120284, 2177913, 2234690, 2002414, -2596953, -10080231, -13802310, -11315844, -7223023, -5615795, -5229293, -3763227]
4293c763227J634679L649j381105j846609k306358k506537j612927m3594J687379
4284a0134650L584672L975851O14074m013570l658941K316810O302670L374268
4276B361184j211578r70344J526497O17748j534017J018486O422926O983492J442643
4267A6657037l484363l783920k361357j988119j466793k15407j68659j355415
4259A833004j069446J000946J728157n1837j621914j034407M52726J487047K327621
4250E051897K835708K308228J464484J257330L38427k597503n129001m099969
4242A429601r85953M62682L74570J220178J916176j97950k933539j909016J262729
4233F39478J072373k041811k242775J062825K097765m58057q96979K603546L871458
$$ y = [-3763227, -2128548, -2124899, -3506004, -5352613, -7658971, -10165508, -11778435, -11822029, -10134650, -6549978, -2574127, -1960053, -5973623, -9632564, -7315754, -1013084, 2361184, 1149606, 179262, 1705759, 2323507, 789490, 1807976, 8230902, 15214394, 16657037, 13172674, 9388754, 7027397, 5039278, 3572485, 3357078, 3188419, 1833004, 763558, 1764504, 3492661, 3440824, 1818910, 784503, 1237229, 2724276, 5051897, 7887605, 10195833, 11660317, 12917647, 13256074, 10658571, 5529570, 1429601, 443648, 906330, 1280900, 2501078, 4417254, 4219304, 1285765, -623251, 639478, 1711851, -329960, -2572735, -1509910, 587855, 129798, -767181, 1836365, 5707823]
4224E707823l20029l944549j701494K337564K045511j294874k995074k862925
4216c028047k954730k179340Q14303L229544K112956n28761j252008m37943P1076
4207d152950P96484K014644J347924j847265l701475j583936J445638J932699
4199c748237J326399J819972J705200m24740j569655N47255K771166J981124O07793
4190E016277J461371J979919n07111k594624l67093L141752K742740m87489k227892
4181H157850k669537m358443n532911k654533K734718N865287N323783K852078
4173I718292l40132k585973j356526J631248M23263n118248o354115O68272O862330
4164C548411L629147l275221l595203J051854K170881n68122j377760l3337L08175
$$ y = [5707823, 5387794, 1443245, -258249, 2079315, 4124826, 2829952, -165122, -3028047, -5982777, -8162117, -7347814, -4118270, -2005314, -2534075, -3786083, -4224026, -4152950, -3356466, -1341822, 6102, -1841163, -5542638, -7126574, -5680936, -3748237, -2421838, -601866, 1103334, 678594, -891061, -343806, 2427360, 4408484, 5016277, 6477648, 8457567, 7950456, 5355832, 4988739, 8130491, 10873231, 10385742, 8157850, 5488313, 1129870, -4403041, -7057574, -4322856, 1542431, 6866214, 9718292, 9378160, 6792187, 5435661, 7066909, 7490172, 2371924, -3982191, -3313919, 3548411, 7177558, 3902337, 307134, 1358988, 3529869, 2961747, 1583987, 1550650, 1858825]
4155A858825J433542M699669M215597k398615n226797J883662P420789J799273
4147A5685945k321752P564802J5658964M449997k729982K9535330P8305539P3380649
4139B19529492l475366p9338649q2042362l1397772J733970m409932j3210260
4132G389121k583294P376687O01472p993017m180191K003461n77632m137974P89
4123b100578M481354J009401m512394m253106j545424j144706M00633M957062
4115b707758N895970L96182l103246R54773M851555R14853n217710m755696J915
4106b769162J786431Q16703J131859J300228j451701l586351r62727K768394K040584
4097A074258j012133j068314P01842j33566k172140p78028L026765M280476K655993
$$ y = [1858825, 3292367, 7992036, 12207633, 9809018, 4582221, 6465883, 13886672, 15685945, 13364193, 20928995, 36587959, 41037956, 38307974, 67843304, 146148843, 219529492, 216054126, 136715477, 54673115, 23275343, 25009313, 20599381, 7389121, 4805827, 12182514, 12783986, 4790969, 610778, 2614239, 2036607, -2101367, -2100578, 2380776, 3390177, -1122217, -5375323, -6920747, -8065453, -7664820, -2707758, 3188212, 3584394, 481148, 1435921, 6287476, 7202329, 1984619, -2771077, -2769162, -982731, -166028, 965831, 2266059, 814358, -2771993, -3734720, -966326, 1074258, 62125, -1006189, -304347, -437913, -2610053, -3388081, -361316, 3919160, 6575153]
4088F575153J971154K717663J882264r05319l116579m192527n231133n023887
4080e323211j710210K611687L870522J782066o59977k104471k896020j849868
4072f279482K048442N724579M788413k4237l555589l254533j443724n60950j98350
4063b755431L52844L3813k008159m330740m364547j148681L256906N129169K787473
4054c047353j105219k519984j051578N13772J152145K312264L510073K112009
4046A876129j115939j506438K025936M288266J896203j250906q59042N50715j207875
4037D697049m046451l238084J76852J289016m03205j047732M79622J637521J655406
4028A199994K172540K767768J285033j335979j620640P31893K297064J451421
$$ y = [6575153, 8546307, 11263970, 13146234, 12240915, 9124336, 4931809, -299324, -5323211, -7033421, -4421734, -551212, 1230854, 570877, -1533594, -4429614, -6279482, -4231040, 1493539, 6281952, 6257715, 2702126, -552407, -1996131, -2557081, -2755431, -2402587, -2368774, -4376933, -8707673, -13072220, -14220901, -10963995, -5834826, -3047353, -4152572, -6672556, -7724134, -7210362, -6058217, -3745953, -235880, 1876129, 760190, -746248, 1279688, 5567954, 7464157, 6213251, 5354209, 5904924, 4697049, 650598, -2587486, -2410634, -1121618, -1524823, -2572555, -2092933, -455412, 1199994, 3372534, 6140302, 7425335, 6089356, 4468716, 5200609, 7497673, 8949094]
4020H949094J99983R2096K61173j6047k76986o14418j460419k006253j682525
4011C445698j996994l641919l728100j59963L350073K030976j868744k028235
4003d597208J876780L985522K109039M26388J262368J659733L95090J020272M329629
3994A2467613M620824j619297q805898r516933m531050k05980Q88284J169983
3986e532454K053347K165293Q37250p66703j714944j675465j54004K147686K645027
3977E033J51530k684812k843129j142822k64690m25475j23816N93084J025052
3968e710045K260978M863438N665309J521855m476085n643645j005851K983800
3960D59754J473091k622388l865537j703017O92614J950986K889388L098542J264983
$$ y = [8949094, 9149077, 9241173, 9502346, 9486299, 9209313, 8594895, 7134476, 5128223, 3445698, 1448704, -2193215, -5921315, -6081278, -2731205, -700229, -2568973, -4597208, -2720428, 1265094, 3374133, 3800521, 5062889, 6722622, 7117712, 8137984, 12467613, 17088437, 15469140, 6663242, -2853691, -7384741, -7590721, -6702437, -5532454, -3479107, -1313814, -476564, -1243267, -2958211, -4633676, -4787680, -2639994, 5033, 156563, -2528249, -5371378, -6514200, -6778890, -7204365, -7328181, -6735097, -5710045, -3449067, 1414371, 7079680, 8601535, 4125450, -1518195, -2524046, 459754, 1932845, -689543, -4555080, -6258097, -5565483, -3614497, -725109, 2373433, 3638416]
3951C638416j490467k252429p29376J17634j173066k102758k72436K489464K670329
3942H95311L96363p42243J006278L208976K969171P30856j055722j504800j753330
3933D150860k553144l064094k148838N4553K071399K368203Q92030o58025o55697
3924D57247M88558J177798J207782J736752K479549J358505j836353l842306k111499
3915A116033J240238K232623M58217j064269o78638J42176l83520k331942m877878
3906d146960o767688o033294j727737L743400O307918M732087J563288n24796
3898b853782j153568q34673L63479J960754K875508K820841K268459Q89121j808787
3889D527352m070501k861421J711193N335509M320050k46776m337889n349246
$$ y = [3638416, 2147949, -104480, -833856, -716222, -1889288, -3992046, -4264482, -1775018, 895311, 1291674, 549431, 1555709, 4764685, 7733856, 8464712, 7408990, 5904190, 4150860, 1597716, -1466378, -3615216, -3560663, -1489264, 878939, 1770969, 1112944, 457247, 945805, 2123603, 3331385, 5068137, 7547686, 8906191, 7069838, 3227532, 1116033, 2356271, 4588894, 5047111, 3982842, 3304204, 3446380, 3062860, 730918, -4146960, -10914648, -16947942, -18675679, -14932279, -8624361, -3892274, -2328986, -2853782, -4007350, -4842023, -4478544, -2517790, 357718, 3178559, 5447018, 6336139, 4527352, 456851, -2404570, -693377, 4642132, 8962182, 8715406, 4377517, -971729]
3881i71729l529590o91170J194469J233754M16328L91214J249159J731196J442583
3872B466214J020877K98610j304521k555491j493213Q14815Q82261j754116l096862
3863d721426m81972L365020M436014K843551J351428P59333j64282j579297k257559
3854C550810j604733K7598K090053L322821K063573j071232k569979l69915K744108
3845H183104K562842j003031m252410m458083j965807J336650L286511K298258
3837E988034o78394k182914n22386J461042N40054j795482j919279k29501k66783
3828C94391k217936k208678J129549L991354L171064O56893r0596N71833l0937
3819E366937k020290k792102j132659J048862J401111R251r82556j09877J422507
$$ y = [-971729, -4501319, -5192489, -3998020, -2764266, -2347938, -1956724, -707565, 1023631, 2466214, 3487091, 3785701, 2481180, -74311, -1567524, -752709, 129552, -1624564, -4721426, -5203398, -1838378, 2597636, 5441187, 6792615, 7551948, 7387666, 5808369, 3550810, 1946077, 1973675, 4063728, 7386549, 9450122, 8378890, 5808911, 5438996, 8183104, 10745946, 9742915, 5490505, 1032422, -933385, 403265, 3689776, 5988034, 5309640, 3126726, 2604340, 4065382, 4605436, 2809954, 890675, 661174, 394391, -1823545, -4032223, -2902674, 1088680, 4259744, 4916637, 4826041, 5397874, 5366937, 3346647, 554545, -578114, 470748, 1871859, 1881110, 898554, 788677, 2211184]
3810B211184Q75351k466116n511150m501753J77211L969876L384808k58080l075422
3801e194091l171976j680365k36492Q87295K039904K820030K298529M49051j320423
3792c108538j518411j65713J514403K639363K931300J863825o39177k532737j179225
3783a94910K312515K970379j500924o405081n674878l38818K735465L15066l252633
3774i033819k672099J452195M527435M059805J376007j069826j787567n38920
3766c686789J547968K486620J310517p78830j786051r55862R29567K496509K692351
3757D256000J624449O18204M07125l95598l128717n611793l852430J829520N657291
3748A404051L619600r48501k121427M42441J986682J28791k542214l381664k865413
$$ y = [2211184, 3086535, 620419, -4890731, -9392484, -9215273, -5245397, -1860589, -2118669, -5194091, -8366067, -10046432, -10282924, -9395629, -7355725, -4535695, -2237166, -1788115, -3108538, -4626949, -4792662, -3278259, -638896, 2292404, 4156229, 3517052, 984315, -194910, 2117605, 5087984, 3587060, -2818021, -8492899, -8831717, -6096252, -5781186, -9033819, -11705918, -10253723, -5726288, -1666483, -290476, -1360302, -3147869, -3686789, -2138821, 347799, 1658316, 879486, -906565, -1862427, -932860, 1563649, 4256000, 5880449, 6498653, 6905778, 6510180, 3381463, -2230330, -6082760, -4253240, 1404051, 5023651, 4075150, 1953723, 2396164, 4382846, 4511637, 1969423, -1412241, -4277654]
3739d277654j776146O20128L415696K829952k442989p277218n624715J266305
3731a3266641O234301N460214K219519Q41133J158421R29252K16959L15565O04458
3722D713181k99662j594416j487931m43483l73997j282539j612589j398034j831366
3713e610836j912433P32477N039195O337417K714642j651794j835857J542091
3705E354902L724116J792133k830635o450913o081583j907076J932515J084371
3697c382170l136776m368197L09395N760579N857772K036811K87582J798017K094621
3688G257634j072932m480873m903920l133461j079051R85753K401442J179007
3680b846401k339333l985277j002324L390735L880551K18532k707991j646374
$$ y = [-4277654, -6053800, -5433672, -2017976, 811976, -1631013, -8908231, -14532946, -13266641, -7032340, -1572126, 647393, 1488526, 2646947, 3576199, 3793158, 4108723, 4713181, 4413519, 2819103, 1331172, 887689, 513692, -768847, -2381436, -3779470, -5610836, -7523269, -6790792, -1751597, 4585820, 7300462, 5648668, 3812811, 5354902, 9079018, 10871151, 8040516, 1589603, -4491980, -6399056, -4466541, -3382170, -6518946, -10887143, -10577748, -4817169, 1040603, 3077414, 3364996, 5163013, 7257634, 6184702, 1703829, -3200091, -6333552, -7412603, -6426850, -4025408, -2846401, -5185734, -9171011, -10173335, -6782600, -2902049, -2683517, -5391508, -7037882]
3672g037882J198536J979411N56521K4513J656012K758846P39465k454474k579209
3663c158261N97990K519035M64296k343926j747511J010045J505113j071477l317870
3654e542566l058024j523460k06351R07641J644042J283525L00291j30784k72627
3645f598313r03052r91745N20225J641704R5118j742876K66231M437013M471006
3636A195311q14637n068292l762175r7854J308380J020509J379637J632784P50181
3627b456156O26930K019467J561594k338594m820757j429763L973950M495973
3619A632644O56299j204172P89360K368099J217340l1587L85339N10152r39954
3610E383520k158679j701969m18046J002672K683990L298594J147268k035707
$$ y = [-7037882, -5839346, -3859935, -3303414, -3278901, -1622889, 1135957, 1875422, -579052, -3158261, -2560271, -41236, 423060, -1920866, -3668377, -2658332, -1153219, -2224696, -5542566, -8600590, -10124050, -10330401, -9422760, -7778718, -6495193, -6194902, -6325686, -6598313, -7501365, -8493110, -7972885, -6331181, -6236063, -7978939, -7712708, -3275695, 1195311, 380674, -4687618, -8449793, -8547647, -7239267, -6218758, -4839121, -3206337, -2456156, -1829226, 190241, 1751835, -586759, -5407516, -6837279, -2863329, 1632644, 2288943, 1084771, 1874131, 4242230, 5459570, 5427983, 5813322, 6323474, 5383520, 3224841, 1522872, 1104826, 2107498, 4791488, 8090082, 9237350, 7201643]
3602G201643k606941r50450j315928m666884o483242l584577J285705M092155
3594g028519M742195M924524M224199J613526j713504l912850m928492n067936
3586g146857l353547K56056L082462K839066R28279J61222O46900M64009p55875
3577b878285j505715j046156j30529O45238J413710K036192J885587O97710j023703
3568I4049k222813j747712N61671L042594L630193K357057J077601N61752k76923
3559G077469j825147k620354j721434k46695N57073Q86145R18763j45268k152910
3550G27642l054782j537906J044558K798217L515858L348607J488437j757883
3542F572748l623553k134203P91466J881363P26418r34352k534406m319265m907213
$$ y = [7201643, 4594702, 3644252, 2328324, -2338560, -8821802, -12406379, -11120674, -7028519, -2286324, 2638200, 6862399, 8475925, 6762421, 2849571, -2078921, -7146857, -10500404, -10244348, -7161886, -4322820, -3394541, -3233319, -2586419, -2122410, -2878285, -4384000, -5430156, -5560685, -4915447, -3501737, -1465545, 420042, 1117752, 94049, -2128764, -3876476, -3314805, -272211, 3357982, 5715039, 6792640, 7354392, 7077469, 5252322, 2631968, 910534, 663839, 1220912, 2107057, 3025820, 2880552, 727642, -2327140, -3865046, -2820488, -22271, 3493587, 6842194, 8330631, 6572748, 2949195, 814992, 1606458, 3487821, 4214239, 3279887, 745481, -3573784, -8480997]
3533h480997k644153R92141K548355J252401l09441l09920M04096R59291K039432
3524c548795L643363L781766J163551k399880l889781k475398R5370J728936J720157
3515a80711Q49834L79595N43176K6294k129896m190267k961523J889678O342151
3506E68331O358314K790725J24498N42701J323838q96125m919254o184162k908751
3497c199885J338678K321628M40942p85960k86600l82404k142557l143229j388000
3488g227387J216066J665332L49321L7674J350285K030267O81658j167625j344059
3479b408468K51224J889510K028338O64870p51298o94602P99804K208621K415883
3470F403882J606145k0557k714148n329389n057614j056584L249017M013019J922520
$$ y = [-8480997, -11125150, -10133009, -7584654, -6332253, -6641694, -6951614, -6547518, -5588227, -3548795, 94568, 3876334, 5039885, 2640005, -1249776, -3725174, -3629804, -1900868, -180711, 669123, 1048718, 1591894, 1618188, -511708, -4701975, -7663498, -5773820, 568331, 6926645, 9717370, 9841868, 10384569, 11708407, 10812282, 5893028, -291134, -3199885, -1861207, 460421, 901363, 115403, -171197, -553601, -2696158, -5839387, -7227387, -6011321, -4345989, -3996668, -3958994, -2608709, -578442, 103216, -1064409, -2408468, -2157244, -267734, 1760604, 2425474, 1674176, 979574, 1779378, 3987999, 6403882, 8010027, 7989470, 5275322, -54067, -5111681, -6168265, -2919248, 1093771, 3016291]
3461C016291N85022J057404J305122N46271L50873J122140J184305K04691p7740
3452I294379L16686j097828m308118n146787j565272K083878J116984j966892
3444a272970j124359L609561N871960K627374j496247j559739P10317P37850j459467
3435F644280k022704R4242J687375O75306r19357o87754M15542J18528j331603
3426D673855j790771o51297P21718J581176K475321L189776K337520k07703k478234
3417I851361l101481k931399k633323p96941L119923N640273K608769m412952
3409G344230q522472n450629J380089N342731M102744O47091j631854k229310
3401I82620k121594j492231l4757J491056J377346r81939l702542l977055j384740
$$ y = [3016291, 3601313, 4658717, 5963839, 6510110, 6860983, 7983123, 9167428, 9372119, 9294379, 9611065, 8513237, 4205119, -941668, -2506940, -423062, 693922, -1272970, -2397329, 1212232, 7084192, 9711566, 8215319, 6655580, 7365897, 8103747, 6644280, 4621576, 4715818, 6403193, 7078499, 6159142, 5471388, 5886930, 6005458, 4673855, 2883084, 2231787, 2953505, 4534681, 7010002, 10199778, 12537298, 12329595, 9851361, 6749880, 3818481, 1185158, 388217, 3508140, 9148413, 11757182, 7344230, -1178242, -6628871, -5248782, 93949, 4196693, 4843784, 3211930, 982620, -1138974, -2631205, -2665962, -1174906, 202440, -779499, -4482041, -8459096, -9843836]
3392i843836J219460J091380q01918j103456J264153L725853L822075K325761
3384A699472J335712Q96251n44862l002188m224712k425075J346332M075662L760628
3375B917220J314898o26439q20100o10014j367888j966969p19660J059528M87024
3366c32400j810665j783329J516492L412423M05471l979054m146988o08850J636720
3357e690180J178445J046921J973019R49708k220457k873728J145477N080127
3349E89332M160398R19328Q80868L745551M222737M71833l462020l902361j898680
3340E726986k85287J70130J88633K8497l68951p62453j007650j014880l58850
3331B316175O71143L16270k073372l441448l95018M819286N849959J019344l665725
$$ y = [-9843836, -8624376, -7532996, -8334914, -9438370, -8174217, -4448364, -626289, 1699472, 3035184, 3931435, 3386573, 384385, -3840327, -6265402, -4919070, -843408, 2917220, 4232118, 3605679, 2785579, 2175565, 807677, -1159292, -1878952, -819424, -332400, -2143065, -3926394, -2409902, 1002521, 1407992, -2571062, -6718050, -7326900, -5690180, -4511735, -3464814, -1491795, -542087, -2762544, -5636272, -4490795, 589332, 4749730, 5669058, 6549926, 10295477, 14518214, 14990047, 11528027, 7625666, 5726986, 5441699, 5611829, 5800462, 5828959, 5460008, 4697555, 3689905, 2675025, 2316175, 2987318, 3303588, 1230216, -2211232, -2606250, 2213036, 8062995, 9082339, 5416614]
3322E416614k797732J070766K119704R4664n95731J134237J681901m89344k180325
3313E454754j240091l14619j920444l533142j544177K255796K693596r90076l787214
3304b925617k180219J071046J487871o14731j257531R16429K873425J913916p33143
3295E51446k296728k286341k068151k039602j428764k45653P46789J741450L319716
3286d005838M197721K192884j885802m082525k465623J37824N57874j50569O11416
3277d892638K023956J433412m39675l12074J850975K358284q6683k164867j485181
3268a714491k12509o79596j155707O05027K635840J700162r98079j394109J042385
3259a71077K670026J415429o13310q93502K74139J250357J291994M04926j015328
$$ y = [5416614, 2618882, 3689648, 5809352, 5904016, 5308285, 6442522, 8124423, 7635079, 5454754, 4214663, 3900044, 1979600, -1553542, -3097719, -841923, 1851673, 861597, -2925617, -5105836, -4034790, -2546919, -3161650, -4419181, -3502752, -629327, 1284589, 551446, -1745282, -4031623, -6099774, -8139376, -9568140, -9813793, -9067004, -7325554, -4005838, 191883, 2384767, 498965, -3583560, -6049183, -5911359, -5353485, -5504054, -4892638, -2868682, -1435270, -1874945, -2187019, -336044, 2022240, 1935557, -229310, -1714491, -1927000, -2606596, -3762303, -3157276, -521436, 1178726, 180647, -1213462, -171077, 2498949, 3914378, 3301068, 2407566, 2681705, 3932062, 5224056, 5628982, 4613654]
3250D613654j813409j222092n43906j498183k921317j975691J011738K340602
3242b008604O97898n24631J138515K731276M38932l828568m655699r76629K422359
3233d565151J602254j803871l734587k866261q56215Q97771K665898M822610O283695
3224B446143N230755J436147k574906l634513j557661M51869q6342j614113r51203
3215h53824J809815L049718L92409m172960o536042m525538N95603N299731O103018
3206A161930K284565k915507n026834k956240K74387J783037K007275K558897
3198h28490K869477J187111k047635m212680l836100j979727j29021J416879K486021
3189e074165K158264J55168k035279k733044k107991j422162p20970J179579M201455
$$ y = [4613654, 2800245, 1578153, 1034247, -463936, -3385253, -5360944, -4349206, -2008604, -1310706, -1835337, -696822, 2034454, 2473386, -1355182, -6010881, -6987510, -4565151, -2962897, -4766768, -8501355, -11367616, -12223831, -11326060, -8660162, -3837552, 2446143, 7676898, 9113045, 6538139, 2903626, 1345965, 1797834, 1711492, 97379, -853824, 955991, 4005709, 4398118, 225158, -6310884, -10836422, -10240819, -4941088, 1161930, 3446495, 530988, -4495846, -7452086, -7177699, -5394662, -3387387, -828490, 2040987, 3228098, 1180463, -3032217, -6868317, -8848044, -8977065, -7560186, -5074165, -2915901, -2760733, -4796012, -7529056, -9637047, -11059209, -11780179, -10600600, -6399145]
3180f399145N966163M332157L81344k353414j863705K2132l609k504646m464217
3171f886940k957561J169535M127072L432217M72358j351865l55468J991783K945304
3162B586435J292431j631042l388295k820927r82837L38446O85385R18614J373172
3153a628618J247567L20766n0387J060579K133437J137614q63840m82520K922400
3144E796998N319109K976617k255325n059660l350779k88914N47052n50479j096552
3135B038067l77951K13718o2554k04331O77476J775810J601641P6332j091166
3126D647042l31008J737127K754865J444620o58284j191484k26308m7715j569690
3117F559165k826228k026720m31470l85783j546665j340192R82343K975870K349159
$$ y = [-6399145, -432982, 3899175, 4280519, 1927105, 63400, 85532, 81923, -2422723, -6886940, -9844501, -8674966, -4547894, -1115677, -643319, -1995184, -2350652, -358869, 2586435, 3878866, 2247824, -1140471, -3961398, -4944235, -4605789, -3920404, -3001790, -1628618, -381051, -60285, -110672, 949907, 3083344, 4220958, 3357118, 2874598, 5796998, 11116107, 14092724, 11837399, 6777739, 3426960, 3138046, 3685098, 3134619, 2038067, 1660116, 1873834, 1811280, 1606949, 2284425, 4060235, 5661876, 5738208, 4647042, 4316034, 6053161, 8808026, 10252646, 9594362, 8402878, 8176570, 8128855, 6559165, 3732937, 1706217, 1274747, 888964, -657701, -1997893, -1015550, 1960320, 4309479]
3108D309479l2443j555045j139265K2351L73513l82022j331076j362634k81055
3099a378197P71763M05011j182721k030186o34650K115208L842253L165089P27634
3090E801204j784530k863164j779940Q91825L145941K891467J04277k768639l204842
3081D33599j389792p7223j351299l874656m138214p12513L621523M961978K922512
3072C95915O07841J8603l44341k246971m241001l663000q20880J564193K562932
3063f166709L619637M741563L589628j53920k709371j122985K072252K332868
3055F202963l26112j912881q67318K16089l27274n99447P11984J278040r23802
3046C452242l423701k639335L11719J240715l29972m27792K501819M234304Q45981
$$ y = [4309479, 4277036, 2721991, 1582726, 1605077, 1978590, 1596568, 265492, -1097142, -1378197, -606434, -201423, -1384144, -3414330, -4048980, -1933772, 1908481, 5073570, 5801204, 4016674, 1153510, -626430, 265395, 3411336, 6302803, 6407080, 3638441, 433599, -956193, -1033416, -2384715, -6259371, -10397585, -11110098, -7488575, -2526597, 395915, 1003756, 1022359, 678018, -1568953, -5809954, -9472954, -10293834, -8729641, -6166709, -2547072, 2194491, 5784119, 5630199, 2920828, 1797843, 3870095, 6202963, 5876851, 3963970, 3096652, 3312741, 2985467, 2386020, 3098004, 4376044, 3452242, 28541, -2610794, -2299075, -1058360, -1388332, -1816124, 685695, 4919999, 5765980]
3037E765980m852910o572621k892507J383685K267393J378853K190267M380731
3029C048871M811402K746969P74280L69561l09726k778171m932592l905387o63720
3020h38513J249924R87684J108641K635465K895788M7389l194536l149980n67108
3011A174754P56000l31173j395741r48704m63863j114825j519672k44905J695443
3002b392686K495924J997662R34492o46158k474188k955765j013901J779157K772517
2993D97054J433840n87815j953428k460864j933699k81725J429043J820285J209057
2984h28252J079613J520693J092149n03016j669384j436643o85220o2424J064055
2975d28429K310465J443276j940840m088135j578330L220514M793239J999737
$$ y = [5765980, 913070, -5659551, -8552058, -7168373, -4900980, -3522127, -1331860, 3048871, 7860273, 10607242, 11381522, 11751083, 11441357, 8663186, 3730594, -174793, -838513, 411411, 1399095, 2507736, 5143201, 8038989, 8086378, 4891842, 1741862, 1174754, 1930754, 1599581, 203840, -744864, -1208727, -2323552, -3843224, -4088129, -2392686, 103238, 2100900, 3035392, 2389234, -84954, -3040719, -4054620, -2275463, 497054, 1930894, 1343079, -610349, -3071213, -5004912, -5286637, -3857594, -2037309, -828252, 251361, 1772054, 2864203, 2361187, 691803, -744840, -1430060, -1492484, -428429, 1882036, 3325312, 1384472, -2703663, -4281993, -1061479, 3731760, 5731497]
2967E731497j013472j650116k097681m052467m716888j545329K398732K374607
2959d571117p48808k056392n17925o1237k338125l773740j685516J410653K436962
2950a1905245K611208M111039N309448L618372N91096m28483o2163j475900m151072
2941a781700m146240o56620K507523K783081J740213R53973n92875l127230m149153
2932f469028k331737n9037L48210m5299M25480R41603M65198J69807Q77352R83411
2922d694040j35333J81476L184782M922807J745350k984573l043245J424228M485401
2913E086853L430873J340052N84837j91052j427821q06487J698239K131179j067175
2904A0779498l562688j683748J344050Q6342m795787p502380n102099n30725K069559
$$ y = [5731497, 4718025, 3067909, 970228, -3082239, -7799127, -9344456, -6945724, -4571117, -5319925, -7376317, -7894242, -7955479, -10293604, -14067344, -15752860, -14342207, -11905245, -9294037, -5182998, 126450, 3744822, 4335918, 3907435, 3845272, 2369372, -1781700, -5927940, -6584560, -4077037, -1293956, 446257, 1400230, 807355, -2319875, -6469028, -8800765, -8859802, -8511592, -8556891, -8131411, -7189808, -6724610, -6554803, -5677451, -4694040, -4829373, -4647897, -1463115, 3459692, 5205042, 2220469, -822776, 601452, 5086853, 8517726, 9857778, 10442615, 10251563, 8823742, 8017255, 9715494, 11846673, 10779498, 7216810, 5533062, 6877112, 6963454, 2167667, -5334713, -10436812, -10967537, -8897978]
2895h897978J701308K4950r90048n06181O18334P38125k52472m34900J190429
2886f808433K726319K061837J35281o71920k91198n69097j687623j627889O24253
2877f108470L458321M630697L382156N23500k124767k502355j79622K445540K330250
2868E855250p01320l927153n038733l934150j471450J424104L085255J866059
2860b842138j228745k528558l005L634521M069041J059521j171438M03197L529899
2851D922295L714353K40511k995908k796138n92131K48581p43662j367458q91777
2842b61334r35195j903937j617518J044143L606926L234588P44540q80072p00357
2833B331784j47352n9297j7567l49278k187347n052411o430499m655118r60105
$$ y = [-8897978, -7196670, -7171720, -8161768, -8667949, -8049615, -7311490, -7563962, -7998862, -6808433, -4082114, -2020277, -1884996, -2556916, -2848114, -3417211, -5104834, -6732723, -6108470, -2650149, 1980548, 5362704, 5886204, 3761437, 1259082, 1079460, 3525000, 5855250, 5153930, 1226777, -3811956, -7746106, -9217556, -7793452, -4708197, -2842138, -4070883, -6599441, -6602446, -2967925, 1101116, 2160637, 989199, 1392396, 4922295, 8636648, 8877159, 5881251, 3085113, 2492982, 2741563, 1997901, 630443, -261334, -1196529, -3100466, -4717984, -3673841, -66915, 3167673, 3912213, 3032141, 2331784, 2184432, 2125135, 2107568, 1758290, -429057, -5481468, -11911967, -16567085, -17527190]
2824a7527190K035883L077888L051200L501905M615589M694768K194557j697665
2816C946935l791409k721798m85256O99637J068733J379562O00177j967166m112401
2807e382986l365882r48428J82637J92167J581336M092437M457882J581156j751875
2798F38444l052440k674291j557042J36909J388105Q48492j65164J093326L737099
2789C93438L709277N85486j015330R09807J871580j730863o113926n693324j321205
2780h405060K193226L525174M170205L160653j010319m860540l358049J392544
2772c192166J895034l387111p239280m451392R78458K909437J898044K252931
2764h336045M185472M366708K404067J549691L039514L853976J209538l340001
$$ y = [-17527190, -15491307, -12413419, -9362219, -5860314, -1244725, 3450043, 5644600, 3946935, 155526, -2566272, -3051528, -2351891, -1283158, 96404, 696581, -1270585, -5382986, -8748868, -9697296, -9514659, -9322492, -7741156, -3648719, 809163, 2390319, 638444, -2413996, -5088287, -6645329, -6508420, -5120315, -4271823, -4436987, -3343661, 393438, 4102715, 4688201, 3672871, 4582678, 6454258, 4723395, -1390531, -7083855, -8405060, -6211834, -2686660, 1483545, 4644198, 3633879, -1226661, -4584710, -3192166, -1297132, -4684243, -11923523, -16374915, -15396457, -12487020, -10588976, -8336045, -4150573, 216135, 2620202, 4169893, 7209407, 11063383, 12272921, 8932920]
2756H932920n710295l956878k3057K792010L222490K411730J416107r6304j991109
2747F997614k473082p51063O60849q73196l698870m014043j747222l13629o36184
2738f848826n9505J993056K347769L5959j029376J634784M574180L943841J491821
2729H083703O32619L33336j775975l366310q58179K994738J951636l562656o091322
2720a658410k237476K259221J289594l039194m396612j196732K502650L170760
2712c306199J389460j15476K79330J768415K118912L42773j752115j872978n71201
2703a719079j47500p05606k65942J188245J354352J5549k5222K126012L439941
2694E260750K036578N19481J306366K048183n17669m705969n999326l439200p9507
$$ y = [8932920, 3222625, -734253, -757310, 2034700, 5257190, 7668920, 9085027, 8988723, 6997614, 4524532, 3773469, 4434318, 3561122, -137748, -4151791, -5899013, -6212642, -6848826, -6908331, -4915275, -2567506, -2531547, -3560923, -1926139, 2648041, 6591882, 8083703, 8716322, 9049658, 7273683, 3907373, 3049194, 6043932, 7995568, 4432912, -1658410, -3895886, -1636665, -347071, -3386265, -7782877, -8979609, -6476959, -3306199, -1916739, -2032215, -1752885, 15530, 2134442, 2477215, 725100, -1147878, -1719079, -1866579, -2572185, -2838127, -1649882, -295530, -279981, -305203, 1820809, 5260750, 7297328, 7816809, 9123175, 11171358, 10653689, 5947720, -51606, -3490806, -3570313]
2685c570313J753078J980125N78953k239788m116581k614538P02531J728035l57338
2676f155836k065959j016606R04267R69897n59239j560041j022945M60986J832760
2667h212716K301580J969376J901610K446128K032443m75131k944323k260733
2659c241766Q02004K251152P33771q30012m17456J26271q04976j203193Q34969
2650a749236K971237J878599j315435k679419j481304o98163j793098k682594
2642g549413j558010M10874J463966J959660L128249M657107M989674L249724
2634A0751831Q565l172217m525791l383281j198257k63201r03743j131372K47473
2625c569993J657493J226140p3885J15945J456463Q75389k677524n747725m465451
$$ y = [-3570313, -1817235, 162890, 741843, -1497945, -5614526, -8229064, -7526533, -5798498, -6155836, -8221795, -9238401, -8334134, -7364237, -7923476, -9483517, -10506462, -10045476, -8212716, -5911136, -3941760, -2040150, 405978, 2438421, 1963290, -981033, -3241766, -2439762, -188610, 545161, -284851, -702307, -576036, -1381012, -2584205, -1749236, 1222001, 3100600, 1785165, -894254, -2375558, -3073721, -4866819, -7549413, -9107423, -8696549, -7232583, -5272923, -2144674, 2512433, 7502107, 10751831, 10760396, 7588179, 3062388, -320893, -1519150, -1782351, -2686094, -3817466, -3569993, -1912500, -686360, -760245, -644300, 812163, 1687552, -989972, -6737697, -11203148]
2616a1203148K11801L536660K833135J64861j121632m77503K66703l2507n91278
2607f412908M583K154063M598208N193376L089859K04556p72336L8794N5442j379025
2597F774612j731215O4621P85611k233619n971522n558717j702606M86176m12498
2588i499157m57328K349551M328382K179647j507424k246498j90940R08985n97362
2579d732144k897758l906228l071609q31342J542831K435634K019628K610825
2571f830163N050509O428679L861195r51324l758704l270093j729519q51789l45671
2562b396880j09305o27305r23734Q22866L851750M703969J732484k409558m152482
2553D91805l231131k038790j903930j715189j37806K054249K630595P53102j665802
$$ y = [-11203148, -10991347, -7454687, -4621552, -4456691, -5578323, -6055826, -5789123, -5821630, -6412908, -6408325, -4254262, 343946, 5537322, 8627181, 8831737, 8059401, 8098195, 8153637, 6774612, 5043397, 5108018, 5893629, 3660010, -2311512, -7870229, -9572835, -9086659, -9499157, -9956485, -7606934, -3278552, -1098905, -2606329, -4852827, -5043767, -4134782, -4732144, -7629902, -11536130, -14607739, -15439081, -13896250, -11460616, -9440988, -6830163, -1779654, 4649025, 8510220, 7558896, 3800192, 530099, -1199420, -2051209, -2396880, -2506185, -3133490, -4057224, -3234358, 617392, 5321361, 7053845, 4644287, 491805, -2739326, -4778116, -6682046, -8397235, -8535041, -6480792, -3850197, -3097095, -4762897]
2544d762897k216542j034159k25862n74157p97242k71460p1842n51542n06402
2535a1012105R2605n08362k048435j271963K586547M875785K026485k010067q04201
2526h073711M998622Q568613O426058J686067k006467m274496n056072l144282
2518h75668O34686L009425K640930J398833M71002p72439j383139P95202L972513
2509I891345K880814l218485q012081o716182k517097q01533j384961r83400K78222
2500a0583358L8363j026589j71096K475190M214663M037437K894843Q72647k269743
2491D82357m744912m489377k549840j562992j721064j274807L6834J234234K610493
2482a1979074M614450N357814K933939o32060j559469K08273J567514J647871
$$ y = [-4762897, -6979439, -8013598, -8239460, -8813617, -9610859, -9882319, -9954161, -10505703, -11012105, -10919500, -11427862, -13476297, -14748260, -12161713, -7285928, -5259443, -7269510, -8073711, -3075089, 5493524, 11919582, 13605649, 11599182, 7324686, 2268614, -875668, -240982, 2768443, 5409373, 6808206, 7279208, 6506769, 5123630, 5918832, 9891345, 12772159, 9553674, 1541593, -5174589, -7691686, -8493219, -9878180, -10861580, -10583358, -10544995, -11571584, -11742680, -9267490, -5052827, -1015390, 1879453, 2752100, 482357, -4262555, -8751932, -11301772, -12864764, -14585828, -15860635, -15823801, -14589567, -11979074, -7364624, -2006810, 927129, 295069, -1264400, -1056127, 511387, 2159258]
2474B159258K254051L087467J429683k441038m172663j617487J718650J936274
2466D354195K08648M9185J430348R93095k603788o303251o179443k059686K143225
2457g967472K650666o7910k133894j154945J196212K126047J334506K23973o32701
2448d425518j197737q25624L06290L43354j163795j380105J424559L815977J756121
2439a346478k530723l316642j3912K518150K161833K061547L979879M999358K907299
2430A1420311k65257k399135m189295n494748l708443J225193M802165M295998
2422E686789K638960K479446J275658l036788o149392l233483K575776M037183
2414F274149J83601l474233l929440l437590l425298j933288J589576M133534
$$ y = [2159258, 4413309, 7500776, 8930459, 6489421, 2316758, 699271, 2417921, 4354195, 4562843, 4612028, 6042376, 7035471, 4431683, -1871568, -8051011, -10110697, -7967472, -5316806, -5384716, -7518610, -8673555, -7477343, -5351296, -4016790, -3792817, -4425518, -5623255, -6448879, -6142589, -5799235, -6963030, -8343135, -6918576, -3102599, -1346478, -3877201, -7193843, -7207755, -4689605, -2527772, -466225, 3513654, 8513012, 11420311, 11155054, 8755919, 4566624, -928124, -4636567, -3411374, 1390791, 5686789, 8325749, 10805195, 12080853, 9044065, 2894673, -338810, 2236966, 6274149, 6457750, 2983517, -945923, -4383513, -7808811, -9742099, -8152523, -4018989]
2406d018989L644859J807056P95536O07694P90869J573070K153222R78676j236137
2397G095856j869299p56655q75745l336532n051547l319425K05382K319362K582016
2388c006587K519602K535162K000842J093013N27609L76331M37332O64143L62175
2379G509622j386837l549897l433757m69742K366724K462249P90900m47089j059011
2370B783162j558944j041801P86211J526216o11327l054694k129737J128442K484172
2361C11700J087383M0850M42282j34875k125234k039720J498317M322540K806610
2352F209853l75185p62622O65343j63236k789126k727516O44545K386842m36833
2343B652065m314923m770026k422701o73779l19631K17029J262871J789248J836358
$$ y = [-4018989, -374130, 1432926, 2228462, 2836156, 3627025, 5200095, 7353317, 8331993, 7095856, 5226557, 4469902, 3594157, 257625, -4793922, -8113347, -7907965, -5588603, -3006587, -486985, 2048177, 4049019, 5142032, 5669641, 6045972, 6483304, 7147447, 7509622, 6122785, 2572888, -860869, -1330611, 1036113, 3498362, 4289262, 3842173, 2783162, 1224218, 182417, 968628, 2494844, 1883517, -1171177, -3300914, -2172472, 311700, 1399083, 1439933, 1882215, 1747340, -377894, -2417614, -919297, 3403243, 6209853, 5834668, 5072046, 5737389, 5574153, 2785027, 57511, 702056, 3088898, 2652065, -1662858, -6432884, -8855585, -9529364, -9848995, -9631966, -8369095, -6579847, -4743489]
2334d743489K180399K283380J138662l48879k95791J068674J534504J57653j667992
2325A307121k515258k435513j934923j102439q2174Q58731J764752K384400J668232
2316h7071n52776k086251p80984J949466K554085L71934j491628q76044O42225
2307c57044Q58037K75772N29254J346866J099560o42908k582338l012010r34770
2298c419581K961729N819233M725764L13083l319029l315490j079652M82794P45922
2289C914773P43507N90570k87719j477065k141998k471695k848195k452530m91787
2280f922139J885006K637622J345328o98620k243087k634385j511692N16792J645115
2271e980060Q25494p20262j257276q53839m60232K10750J950485L960932M477594
$$ y = [-4743489, -2563090, -279710, 858952, 510073, 214282, 1282956, 2817460, 2975113, 1307121, -1208137, -3643650, -5578573, -6681012, -6763186, -5904455, -4139703, -1755303, -87071, -639847, -2726098, -3507082, -1557616, 996469, 1368403, -123225, -999269, -357044, 500993, 776765, 1306019, 2652885, 3752445, 3109537, 527199, -2484811, -3419581, -457852, 5361381, 10087145, 10400228, 7081199, 3765709, 2686057, 3168851, 3914773, 4658280, 5248850, 4961131, 3484066, 1342068, -1129627, -3977822, -6430352, -6922139, -5037133, -2399511, -1054183, -1752803, -3995890, -6630275, -8141967, -7625175, -5980060, -5154566, -5874828, -7132104, -7985943, -8446175, -8235425, -6284940, -2324008, 2153586]
2262B153586L112861R77668j011851k414513k553172j269364R8601Q5636r92084
2253a812632j776119j712540q84565P84480K564416K571544L97252j297126j00274
2244a265564K568901L686929K987934K182525J259481q41670k841296k394756
2236E342484l79515J37320q54347m32413J478003J227732k167863m388835k190130
2227b227564J385332J496908j520895l229200j539515J228239K222025J384678
2219g99992O71327J414615K830477K848926O49631j975846k739442j764709q27885
2210C07102l89582L46651R25310P5023j399340j305129P7257J66083j360619j813691
2200d370935k01986J169413J090420J318843K318020J587601j167149j746245
$$ y = [2153586, 5266447, 6244115, 5232264, 2817751, 264579, -1004785, -906184, -820548, -1812632, -3588751, -5301291, -6185856, -5401376, -2836960, -265416, 131836, -1165290, -1265564, 1303337, 4990266, 7978200, 10160725, 11420206, 10578536, 7737240, 5342484, 4962969, 5100289, 4245942, 3813529, 5291532, 6519264, 4351401, -37434, -2227564, -842232, 654676, -866219, -4095419, -5634934, -4406695, -2184670, -799992, -128665, 1285950, 4116427, 6965353, 7614984, 5639138, 2899696, 1134987, 307102, -82480, 264171, 1189481, 1264504, -134836, -1439965, -1362708, -1196625, -2557244, -4370935, -4572921, -3403508, -2313088, -994245, 1323775, 2911376, 1744227, -2018]
2192b018J988397N300381K872821l154174o256893m411972j171231M41019L86561
2183d007109q70272k742661l063532l36576L137380M064032L025855K592579K019179
2174C818875j155392n056650m779197j33987L497955L226202K153039K947562
2166D518407L254400N72605k707382k854140k13178K340111L681239L894672J982372
2157A4469106k233585n778925n742348l518480k415355k271614l48212L028470
2149d810943M059244J407778j390860j191648L04255j42885j915513j650378J333377
2140c997573L986719L978937K266006M42676j679031m196168n237670l471520
2132g907624q55054q3323n29631R2177J081790j36070k560166k157981J230724
$$ y = [-2018, 1986379, 7286760, 10159581, 7005407, 748514, -3663458, -4834689, -4393670, -4007109, -4877381, -7620042, -10683574, -11020150, -7882770, -3818738, -792883, 1799696, 3818875, 2663483, -2393167, -7172364, -7306351, -3808396, -582194, 1570845, 4518407, 7772807, 8345412, 5638030, 2783890, 2570712, 4910823, 8592062, 12486734, 14469106, 12235521, 6456596, 714248, -2804232, -5219587, -7491201, -7839413, -4810943, -751699, 656079, -734781, -1926429, -1622174, -1765059, -3680572, -5330950, -3997573, -10854, 3968083, 6234089, 6676765, 4997734, 801566, -4436104, -7907624, -8762678, -8846001, -9375632, -9283455, -8201665, -8337735, -10897901, -13055882, -11825158]
2123a1825158K770402N76722o07267K636311N851138L406180k250219m361421
2115c803312k180155o91826j599380j769603l41895j79921j407363l75739L265581
2106i083613M956258K836450O83344O84769k16446l301335l986146L71936M431483
2097b623300K594489j939974k392862R63197K343728K11356j508575q10984L00712
2088b862213P40355J465498J755005q0941k190803r34301K459972K670676j270750
2079A752498l948508j741353K269518L943903L694078L424972K279729p90203
2071A0884634l559964l539819k074202j909393k681550k298750j135283j165859
2063g480186j891006p70319K384878M630060M061264K319105J992513L177217
$$ y = [-11825158, -9054756, -8478034, -9085301, -6448990, -597852, 2808328, 558109, -3803312, -5983467, -6675293, -8274673, -10044276, -10386171, -10566092, -11973455, -12349194, -9083613, -4127355, -1290905, -607561, 77208, -139238, -3440573, -7426719, -7054783, -2623300, -28811, -1968785, -4361647, -3398450, -1054722, -843366, -2351941, -3162925, -2862213, -2121858, -656360, 1098645, 1017704, -1173099, -2107400, 352572, 3023248, 1752498, -2196010, -3937363, -1667845, 2276058, 5970136, 9395108, 11674837, 10884634, 7324670, 3784851, 1710649, -198744, -2880294, -5179044, -6314327, -7480186, -9371192, -10141511, -7756633, -3126573, 934691, 3253796, 5246309, 8423526]
2055H423526L684656J934546j117246k926970k148892j73862O90224J57878k67910
2046H255950k77972j311073l431200m097111j805139J027834J201101o14265j073805
2037b125680O73281J930873Q00010j056120j053409P39737K034587J364219m71163
2028B836335j645627j259513q4499M31185q0392m25483N29229K206060L020297
2019E527592K409815J213455J66712q33514j739606j799610p29375L42181P6738
2010D634388j223514j939273j366141o03224o20128l93903J567879M071185L650878
2001G778147p59225n271893n257450j232453J967330J686596K04070K98007J189215
1992F02344Q87323J3302L38949J065144j17711k755306l658653j596815Q56909
$$ y = [8423526, 12108182, 14042728, 12925482, 9998512, 7849620, 7675758, 8365982, 8523860, 8255950, 7977978, 6666905, 3235705, -861406, -2666545, -1638711, -437610, -1051875, -2125680, -1452399, 478474, 1278484, 222364, -831045, -91308, 1943279, 3307498, 2836335, 1190708, -68805, -153304, 277881, 197489, -227994, 301235, 2507295, 5527592, 7937407, 9150862, 9317574, 8484060, 6744454, 4944844, 4215469, 4557650, 4634388, 3410874, 1471601, 105460, -497764, -1117892, -1511795, 56084, 4127269, 7778147, 7018922, 1747029, -3510421, -4742874, -2775544, -1088948, -884878, -586871, 602344, 1489667, 1502969, 1841918, 2907062, 2789351, 34045, -3624608, -5221423, -4364514]
1983d364514J124714n7910m49837L52554R24767L05750j000627j723102q44954
1974e733159J323635K736960J458230j582991l112464j596729P18031J000037
1966d788450m65897j367755q50639R1630Q64420J752156K498276K454333K094944
1957B283018K480255L151503K496717M67615j016244q53175n8387K89257L72099
1948I612658J07363j445438l798156m375224k089976L45598N3673j733133j867506
1939e190141m13542q9401j206161j103531R51571K228509J207160R3798N72286
1930b949452M62537k368495n505527n091779j667715R24550J362442J595624K305242
1921a0932573J872418L12806J45306K085307L482588K647021J328734R81989O3818
$$ y = [-4364514, -3239800, -3297710, -3747547, -3394993, -2470226, -2164476, -3165103, -4888205, -5733159, -4409524, -1672564, -214334, -1797325, -4909789, -6506518, -5788487, -4788450, -5254347, -6622102, -7472741, -7381111, -6516691, -4764535, -2266259, 188074, 2283018, 4763273, 7914776, 10411493, 10879108, 9862864, 9009689, 8951302, 9240559, 9612658, 9720021, 8274583, 4476427, 101203, -1988773, -1643175, -1589502, -3322635, -5190141, -5603683, -5693084, -6899245, -8002776, -7051205, -4822696, -3615536, -3521738, -2949452, -2486915, -4855410, -10360937, -15452716, -17120431, -16195881, -14833439, -13237815, -10932573, -9060155, -8747349, -8602043, -6516736, -3034148, -387127, 941607, 1923596, 1987414]
1912A987414k249414k957567M25234M814131N040460J018501k718067l764312
1904A596380l721909l515515j576903K191556M858456M747191L781157L498511
1896A1858924K119019j675470m996076m316172r14240Q20918n47348k526554l179582
1887c356581l147454l043667k008117K21461K188077K732705K422395K196376
1879a794805K106232J984893J857981J164201q66499l452251m428587k887403
1871f316238k25148K028760L790273N053144M748580K289591j056720l537113
1863F775129m514013l871241j516120J265813J870020k63457j973412m35220K468956
1854a93545K718880K01295j254234P1739J310714j76366k617416k696670n67712
$$ y = [1987414, -262000, -3219567, -2794333, 2019798, 7060258, 8078759, 5360692, 1596380, -2125529, -5641044, -7217947, -5026391, -167935, 4579256, 8360413, 11858924, 13977943, 12302473, 7306397, 2990225, 2075985, 2896903, 2349555, -176999, -3356581, -6504035, -9547702, -11555819, -11334358, -9146281, -6413576, -3991181, -1794805, 311427, 2296320, 4154301, 5318502, 4452003, 999752, -3428835, -6316238, -6541386, -4512626, -722353, 4330791, 9079371, 11368962, 10312242, 6775129, 2261116, -1610125, -3126245, -1860432, 9588, -253869, -2227281, -2662501, -193545, 2525335, 2726630, 1472396, 1544135, 2854849, 2678483, 61067, -2635603, -3203315]
1845c203315N75063q94964l036031k903658K68019M483133O695875N222218J166313
1836H372653k580241l997739l245683j450320N72978J965494J789263N70316N50869
1827B547590K712493M549217K903147j480698m552378m173716k348247j594781
1819a437373j552281p84074J0511r62216l132427l624322j054745K556855M356712
1810e623360L823612K536934J739746J205898K39222j028040j531232l71660J852123
1801B843243L016012J533434j360856k372160L2216L315290L580459L05112l015793
1792G876957l268911j458816j020450l109278n053960l875674k15849K493716
1784g632265K562791K109537L574680N529332M308543k80547l757544k867679
$$ y = [-3203315, -2628252, -3523216, -6559247, -9462905, -9194886, -4711753, 1984122, 7206340, 8372653, 5792412, 1794673, -1451010, -2901330, -2328352, -362858, 1426405, 1996721, 2547590, 5260083, 9809300, 12712447, 11231749, 6679371, 2505655, 157408, -1437373, -2989654, -3773728, -3763217, -4725433, -7857860, -11482182, -12536927, -9980072, -5623360, -1799748, 737186, 2476932, 3682830, 3922052, 2894012, 1362780, 991120, 2843243, 5859255, 7392689, 6031833, 3659673, 3691889, 7007179, 10587638, 10892750, 7876957, 4608046, 3149230, 2128780, -980498, -6034458, -9910132, -10125981, -7632265, -5069474, -2959937, 614743, 6144075, 10452618, 10172071, 6414527, 3546848]
1776C546848j07936K09117j584709j680620M76241J090816j598492m143933l200539
1767f993207m19775Q50052Q13990J662677K930467K393278L92635o57147m95266
1758D77704r50541j894925j217829P97177J042938j371693l272628k176827K96612
1749h270012J554453J626161J576489R68616p26650k271408k427973j793326r97832
1740a0761482Q49174L852965N693073M765016K917436K356007J837926q67176
1732A0642939m452512n671177m367028l180224k846669j603923P61860K007028
1724h709706J149361j06039l44901L1536Q12961K512444M135895L456307O08052
1715C545910j450827j252301o63173r90246m51780K145442M057135K149548j957174
$$ y = [3546848, 3438912, 3648029, 2063320, 382700, 858941, 1949757, 351265, -3792668, -6993207, -7412982, -6562930, -5748940, -4086263, -1155796, 1237482, 1630117, 972970, 477704, -472837, -2367762, -3585591, -2788414, -1745476, -3117169, -6389797, -8566624, -8270012, -6715559, -5089398, -3512909, -2544293, -3270943, -5542351, -7970324, -9763650, -10761482, -9912308, -6059343, -366270, 4398746, 7316182, 9672189, 11510115, 10642939, 6190427, 519250, -3847778, -7028002, -9874671, -11478594, -10716734, -8709706, -7560345, -7666384, -8011285, -7979749, -7166788, -4654344, -518449, 2937858, 3545910, 2095083, 842782, 179609, -810637, -1262417, 883025, 4940160, 7089708, 5132534]
1706E132534l681773j715541O63736O49045m68576J59853K525405L593042J344978
1697H202703k280617l469357j326373Q65983P0819k290688k522008p2719K037593
1688g84664K140212K039097L147378L504727Q12199l491720n533536l541264M98908
1679a208663L079259K170411j061225k976568j234825J914054K204393m61329
1671B425507j568137R96168L209578R55764l509704m991129k838903o25291L1774
1662e914373N12470P95365q79658l473439l102260R73932M462246M127247K110808
1653c87662J724243K248034J200588o31773l42157J878474K421869l80489l450685
1644D280442k861210J116960M439560M209091J758618M26655J202924J800803
$$ y = [5132534, 1450761, -264780, 398956, 1048001, 579425, 739278, 3264683, 6857725, 8202703, 5922086, 2452729, 1126356, 1992339, 2063158, -227530, -2749538, -2822257, -784664, 1355548, 3394645, 6542023, 10046750, 10858949, 7367229, 1833693, -1707571, -1208663, 1870596, 4041007, 2979782, 3214, -1231611, 682443, 2886836, 2425507, 857370, 1853538, 5063116, 6018880, 2509176, -2481953, -5320856, -5946147, -5914373, -5401903, -4606538, -5486196, -8959635, -12061895, -11087963, -6625717, -2498470, -387662, 1336581, 3584615, 4785203, 4153430, 3811273, 5689747, 8111616, 7731127, 4280442, 1419232, 2536192, 6975752, 11184843, 12943461, 13370116, 14573040, 16373843]
1636A6373843M9761l201317n424087n521903m283024k607115j024895n26209j851720
1627h016666l771238l810595j176941K323109M493023M576846K894937L11265
1619b176260j652090j756522m92224P51560J869370L552007M752358L262279n31572
1610G578906l130316k400220j57675J143390J757441K668127K697602M31022k564438
1601H023839l422687k015552o39647l63351l44870k50319m73461j20050K115733
1592B509635M630632L702724j035064m792380l527801M79352J825817m57380j950753
1583A384782L26482L509088L220214n7827k022528j068157j72103j530543k836921
1574G52487j345176J044969M72522k440421l111821q4776K665255J853895n46815
$$ y = [16373843, 16423604, 13222287, 7798200, 2276297, -2006727, -4613842, -5638737, -6164946, -8016666, -11787904, -15598499, -16775440, -14452331, -9959308, -5382462, -2487525, -2176260, -3828350, -5584872, -6077096, -5325536, -3456166, 95841, 4848199, 8110478, 7578906, 4448590, 2048370, 1890695, 3034085, 4791526, 7459653, 10157255, 10588277, 8023839, 4601152, 2585600, 1945953, 1582602, 1237732, 987413, 513952, 393902, 2509635, 7140267, 10842991, 9807927, 5015547, 1487746, 1967098, 3792915, 3335535, 1384782, 1711264, 5220352, 8440566, 8382739, 6360211, 5292054, 5119951, 3589408, 752487, -592689, 452280, 924802, -1515619, -4627440, -4712216, -2046961, -193066, -739881]
1565g39881j175729m13640n01579r56236M37412L220847M282928K074392j704591
1556D523923m381348m303816j282811K795425M537746K440205j015984k685047
1548F28293k800021l068164k517040P29186M503453M297360K81154k172149l07899
1539d25827K237231J636847m56690o06373O18649N40609l13482Q82830L975106
1530H088900N319141K751646j682372m401269l827791j108859J187164J033548
1522G360108j219627l043138k539021n54216P56635O42603P5528J66641J193464
$$ y = [-739881, -1915610, -2329250, -2830829, -3787065, -3349653, -128806, 4154122, 6228514, 4523923, 142575, -4161241, -5444052, -2648627, 1889119, 4329324, 3313340, 628293, -2171728, -5239892, -7756932, -7027746, -2524293, 1773067, 2054221, -117928, -425827, 1811404, 3448251, 2991561, 2385188, 3003837, 3544446, 3230964, 4113794, 8088900, 13408041, 16159687, 14477315, 10076046, 6248255, 5139396, 6326560, 7360108, 6140481, 3097343, 558322, 4106, 760741, 1403344, 1478872, 1645513, 2838977]
$$ [...]
##END NTUPLES=NMR SPECTRUM
##END=
