##TITLE=31Pdec_DE-77_ORG_d6A
 aceton-d6, 64 sc
 26.11.2024
##JCAMPDX= 6.0         $$ Bruker NMR JCAMP-DX V2.0
##DATA TYPE= NMR SPECTRUM
##DATA CLASS= NTUPLES
##ORIGIN= UXNMR, Bruker Analytische Messtechnik GmbH
##OWNER= root
$$ XWIN-NMR		Version 3.5
$$ Tue Nov 26 14:37:18 2024 Russian Standard Time (UT+4h)  she@DPX200
##.OBSERVE FREQUENCY= 81.013821
##.OBSERVE NUCLEUS= ^31P
##.ACQUISITION MODE= SIMULTANEOUS
##.ACQUISITION SCHEME= undefined
##.AVERAGES= 64
##.DIGITISER RES= 17
##SPECTROMETER/DATA SYSTEM= spect
##.PULSE SEQUENCE= zgpg30
##.SOLVENT NAME= D2O
##.SHIFT REFERENCE= (INTERNAL, D2O, 0, 198.062)
##AUDIT TRAIL= $$ (NUMBER, WHEN, WHO, WHERE, WHAT)
$$ ##TITLE= Audit trail, XWIN-NMR		Version 3.5
$$ ##JCAMPDX= 5.01
$$ ##ORIGIN= Bruker BioSpin GmbH
$$ ##OWNER= she
$$ F:/spectra/data/she/nmr/P31/2/pdata/1/auditp.txt
$$ ##AUDIT TRAIL=  $$ (NUMBER, WHEN, WHO, WHERE, WHAT)
(   1,<2024-11-26 14:35:42.00 +0400>,<she>,<DPX200>,
      <continue with go, POWCHK disabled, PULCHK disabled
       configuration hash MD5:
       00 E9 B6 7A A2 85 ED C7 34 08 36 98 17 FE 4E 26
       data hash MD5: 32K
       41 DD 53 1C 45 0A 93 FE 98 6F 7C C4 6E EB 48 CA>)
(   2,<2024-11-26 14:35:43.40 +0400>,<she>,<DPX200>,
      <Start of raw data processing
       efp BC_mod = 2 LB = 1.5 FT_mod = 6 PKNL = 1 PHC0 = 2322.594 PHC1 = -58.31174 SI = 64K 
       data hash MD5: 64K
       3F 75 98 73 2C 6F 4D 21 CE 73 71 09 D7 9C B8 37>)
(   3,<2024-11-26 14:36:31.17 +0400>,<she>,<DPX200>,
      <pk PHC0 = -2.28914 PHC1 = 0 
       data hash MD5: 64K
       B4 13 9C 73 3A 51 23 0D EA 33 82 42 5B 34 8A 88>)
$$ ##END=
$$ 
$$ hash MD5
$$ 08 30 93 00 B3 89 E2 CC E8 32 FA F5 4B 37 48 66
##$RELAX= 
##$RELAX= 
##$RELAX= 
##$RELAX= 
##$RELAX= 
##$RELAX= 
##$RELAX= 
##$RELAX= 
$$ Bruker specific parameters
$$ --------------------------
##$DU= <F:/spectra>
##$EXPNO= 2
##$NAME= <P31>
##$PROCNO= 1
##$TYPE= <nmr>
##$USER= <she>
##$AMP= (0..31)
100 100 100 100 100 100 100 100 100 100 100 100 100 100 100 100 100 100 
100 100 100 100 100 100 100 100 100 100 100 100 100 100 
##$AQSEQ= 0
##$AQ_mod= 1
##$AUNM= <au_zg>
##$AUTOPOS= <>
##$BF1= 81.014009
##$BF2= 200.13
##$BF3= 200.13
##$BF4= 200.13
##$BF5= 200.13
##$BF6= 200.13
##$BF7= 200.13
##$BF8= 200.13
##$BYTORDA= 1
##$CFDGTYP= 0
##$CFRGTYP= 5
##$CHEMSTR= <none>
##$CNST= (0..31)
1 1 145 1 1 1 1 1 1 1 1 1 1 1 1 1 1 1 1 1 1 1 1 1 1 1 1 1 1 1 1 1 
##$CPDPRG= <waltz16>
##$CPDPRG1= <>
##$CPDPRG2= <waltz16>
##$CPDPRG3= <>
##$CPDPRG4= <mlev>
##$CPDPRG5= <mlev>
##$CPDPRG6= <mlev>
##$CPDPRG7= <mlev>
##$CPDPRG8= <mlev>
##$CPDPRGB= <>
##$CPDPRGT= <>
##$D= (0..31)
0 1 0 0 0 0 0 0 0 0.06 0 0.03 2e-05 3e-06 0 0 0.0002 0 0 0 0 0 0 0 0 0 
0 0 0 0 0 0 
##$DATE= 1732617248
##$DBL= (0..7)
120 120 120 11 120 120 24 19 
##$DBP= (0..7)
150 150 150 150 150 150 150 150 
##$DBP07= 0
##$DBPNAM0= <>
##$DBPNAM1= <>
##$DBPNAM2= <>
##$DBPNAM3= <>
##$DBPNAM4= <>
##$DBPNAM5= <>
##$DBPNAM6= <>
##$DBPNAM7= <>
##$DBPOAL= (0..7)
0.5 0.5 0.5 0.5 0.5 0.5 0.5 0.5 
##$DBPOFFS= (0..7)
$$ [...]
##$SUBNAM3= <"">
##$SUBNAM4= <"">
##$SUBNAM5= <"">
##$SUBNAM6= <"">
##$SUBNAM7= <"">
##$SUBNAM8= <"">
##$SUBNAM9= <"">
##$SW= 400.765351723535
##$SWIBOX= (0..15)
0 1 3 0 0 0 0 0 0 0 0 0 0 0 0 0 
##$SW_h= 32467.5324675325
##$TD= 32768
##$TD0= 1
##$TE= 0
##$TE2= 300
##$TE3= 300
##$TEG= 300
##$TL= (0..7)
0 120 53 12 22 120 120 120 
##$TP= (0..7)
150 150 150 150 150 150 150 150 
##$TP07= 0
##$TPNAME0= <>
##$TPNAME1= <>
##$TPNAME2= <>
##$TPNAME3= <>
##$TPNAME4= <>
##$TPNAME5= <>
##$TPNAME6= <>
##$TPNAME7= <>
##$TPOAL= (0..7)
0.5 0.5 0.5 0.5 0.5 0.5 0.5 0.5 
##$TPOFFS= (0..7)
0 0 0 0 0 0 0 0 
##$TUNHIN= 0
##$TUNHOUT= 0
##$TUNXOUT= 0
##$USERA1= <user>
##$USERA2= <user>
##$USERA3= <user>
##$USERA4= <user>
##$USERA5= <user>
##$V9= 5
##$VALIST= <valist>
##$VCLIST= <CCCCCCCCCCCCCCC>
##$VD= 0
##$VDLIST= <DDDDDDDDDDDDDDD>
##$VPLIST= <PPPPPPPPPPPPPPP>
##$VTLIST= <TTTTTTTTTTTTTTT>
##$WBST= 1024
##$WBSW= 4
##$XGAIN= (0..3)
0 0 0 0 
##$XL= 0
##$YL= 0
##$YMAX_a= 3608
##$YMIN_a= -8686
##$ZGOPTNS= <>
##$ZL1= 120
##$ZL2= 120
##$ZL3= 120
##$ZL4= 120
##$ABSF1= 0
##$ABSF2= 0
##$ABSG= 0
##$ABSL= 0
##$ALPHA= 0
##$AQORDER= 0
##$ASSFAC= 0
##$ASSFACI= 0
##$ASSFACX= 0
##$ASSWID= 0
##$AUNMP= <proc_1d>
##$AZFE= 0.1
##$AZFW= 0.5
##$BCFW= 0
##$BC_mod= 2
##$BYTORDP= 0
##$COROFFS= 0
##$CY= -3
##$DATMOD= 1
##$DC= 0
##$DFILT= <>
##$DTYPP= 0
##$F1P= 0
##$F2P= 0
##$FCOR= 1
##$FTSIZE= 65536
##$FT_mod= 6
##$GAMMA= 0
##$GB= 0
##$INTBC= 1
##$INTSCL= 9.790993e-09
##$ISEN= 30
##$LB= 1.5
##$LEV0= 0
##$LPBIN= 0
##$MAXI= 10000
##$MC2= 0
##$MEAN= 0
##$ME_mod= 0
##$MI= 50
##$NCOEF= 0
##$NC_proc= -8
##$NLEV= 6
##$NOISF1= 182.463
##$NOISF2= 159.3651
##$NSP= 0
##$NTH_PI= 0
##$NZP= 0
##$OFFSET= 198.0616
##$PC= 4
##$PHC0= 2320.305
##$PHC1= -58.31174
##$PH_mod= 1
##$PKNL= yes
##$PPARMOD= 0
##$PSCAL= 0
##$PSIGN= 0
##$REVERSE= no
##$SF= 81.0140089999434
##$SI= 65536
##$SIGF1= 159.3651
##$SIGF2= -187.1042
##$SINO= 113.3802
##$SIOLD= 16384
##$SREGLST= <1H.CDCl3>
##$SSB= 0
##$STSI= 65536
##$STSR= 0
##$SW_p= 32467.5324675325
##$SYMM= 0
##$S_DEV= 0
##$TDeff= 32768
##$TDoff= 0
##$TI= <>
##$TILT= no
##$TM1= 0
##$TM2= 0
##$TOPLEV= 0
##$USERP1= <user>
##$USERP2= <user>
##$USERP3= <user>
##$USERP4= <user>
##$USERP5= <user>
##$WDW= 1
##$XDIM= 65536
##$YMAX_p= 362351471
##$YMIN_p= -146153641
$$ End of Bruker specific parameters
$$ ---------------------------------
##NTUPLES= NMR SPECTRUM
##VAR_NAME=  FREQUENCY,     SPECTRUM/REAL,   SPECTRUM/IMAG
##SYMBOL=    X,             R,               I
##VAR_TYPE=  INDEPENDENT,   DEPENDENT,       DEPENDENT
##VAR_FORM=  AFFN,          ASDF,            ASDF
##VAR_DIM=   65536,         65536,           65536
##UNITS=     HZ,            ARBITRARY UNITS, ARBITRARY UNITS
##FACTOR=    0.49542278885378, 1,            1
##FIRST=     16045.7642231865, 0,            0
##LAST=      -16421.768244346, 0,            0
##MIN=       -16421.768244346, -146153641,   0
##MAX=       16045.7642231865, 362351471,    0
$$ Real data points
##PAGE= N=1
##DATA TABLE= (X++(R..R)), XYDATA
$$ [...]
##PAGE= N=2
##DATA TABLE= (X++(I..I)), XYDATA
$$ plain form
7446 -7134835 -5144616 -2411002 478634 2260459 1474339 -1110007 -2403218 -1169136
7438 -1169136 -312130 -2373481 -4772033 -3449213 23858 7870 -4339093 -7158201 -4776876
7429 -4776876 -1547691 -3343375 -8972431 -12436935 -11470505 -9218996 -8218323 -7098006
7421 -7098006 -4153131 -1105079 -1480844 -6205095 -11795154 -13107144 -8295589 -1067132
7413 -1067132 2963760 2150973 -512413 -2433787 -4197854 -6299202 -6566633 -3535279 159862
7404 159862 978802 -630054 -1550508 -629289 1109603 3180968 4938720 3725396 -1859687
7395 -1859687 -7707716 -8112457 -3964554 -2011716 -5129797 -8544116 -7638277 -4445776 -3215510
7386 -3215510 -3876423 -4027318 -4065457 -5525615 -6407609 -3260436 2673873 5992622 4161997
$$ packed form
7446g134835J990219K733614K889636J781825p86120k584346j293211J234082
7438a169136Q57006k061351k398552J322820L473071j5988m346963k819108K381325
7429d776876L229185j795684n629056l464504R66430K251509J000673J120317
7421g098006K944875L048052l75765m724251n590059j311990M811555P228457
7413a067132M030892q12787k663386j921374j764067k101348k67431L031354L695141
7404A59862Q18940j608856r20454R21219J738892K071365J757752j213324n585083
7395a859687n848029m04741M147903J952838l118081l414319R05839L192501J230266
7386c215510o60913j50895l8139j460158q81994L147173N934309L318749j830625
$$ plain form
7377 4161997 126353 -2847273 -5258730 -8801428 -12783014 -15295686 -15928826 -15254370 -13190446
7368 -13190446 -9999763 -7675825 -7884177 -9056245 -8032699 -4779843 -3041909 -5271243
7360 -5271243 -8889332 -9328166 -5621544 -1031504 1349448 1564983 1277224 1336342 1738949
7351 1738949 2476513 3256325 3444355 3378396 4652411 7707872 10102610 9019766 5064849
7342 5064849 1611584 362755 -370460 -2321230 -4127057 -2998970 1461786 6534942
7334 6534942 9124155 8242591 5078928 1652812 -445060 -688825 553959 2733035 5352843
7325 5352843 7359845 7042181 3625140 -996696 -3281447 -1657327 1411689 1983231 -915200
7316 -915200 -4527164 -6107920 -5837556 -5178322 -4052299 -1646236 939312 1454515 35067
$$ packed form
7377D161997m035644k973626k411457l542698l981586k512672o33140O74456K063924
7368a3190446L190683K323938k08352j172068J023546L252856J737934k229334
7360e271243l618089m38834L706622M590040K380952K15535k87759N9118M02607
7351A738949P37564P79812J88030o5959J274015L055461K394738j082844l954917
7342E064849l453265j248829p33215j950770j805827J128087M460756N073156
7334F534942K589213q81564l163663l426116k097872k43765J242784K179076K619808
7325E352843K007002l17664l417041m621836k284751J624120L069016N71542k898431
7316i15200l611964j580756K70364O59234J126023K406063K585548N15203j419448
$$ plain form
7307 35067 -429614 1827288 5273684 7617070 8382490 7800877 5436508 1833794 -407943
7298 -407943 342417 1894231 855951 -2715490 -5659523 -6116408 -5162734 -4247935 -3301712
7289 -3301712 -1640157 973386 4264713 7062519 7389338 4590925 896544 -924240
7281 -924240 -872586 -756575 -797523 201051 1903867 2780001 3340056 5683522 9207952 10152047
7271 10152047 6819827 2343717 400938 565973 9728 -2055463 -3988864 -4821547 -5689309
7262 -5689309 -8212495 -12426875 -16341735 -17535398 -15700872 -13196827 -12119715 -11644668
7254 -11644668 -9866015 -7234017 -5685274 -5111414 -3783118 -1968706 -1657194 -2608036 -2500277
7245 -2500277 -1474539 -2226677 -4420062 -3643346 1803703 7333161 8205147 5585403 3371768
$$ packed form
7307C5067m64681K256902L446396K343386P65420n81613k364369l602714k241737
7298d07943P50360J551814j038280l571441k944033m56885R53674R14799R46223
7289c301712J661555K613543L291327K797806L26819k798413l694381j820784
7281i24240N1654J16011m0948R98574J702816Q76134N60055K343466L524430R44095
7271A0152047l332220m476110j942779J65035n56245k065191j933401q32683q67762
7262e689309k523186m214380l914860j193663J834526K504045J077112M75047
7254a1644668J778653K631998J548743N73860J328296J814412L11512r50842J07759
7245b500277J025738p52138k193385P76716N447049N529458Q71986k619744k213635
$$ plain form
7236 3371768 2429523 1484342 672669 411646 -699031 -3167122 -4252453 -1984924 1022712
7227 1022712 1718382 1858070 4424131 7148658 5111505 -1401884 -6967500 -8388266 -7061884
7218 -7061884 -4540837 -1008467 1709574 916414 -2181665 -3032427 -140949 3245771 4761788
7209 4761788 5869650 7822353 8875463 7525368 5218886 4019978 4217513 5294799
7201 5294799 6471789 5715930 1554901 -3558826 -5467153 -4565035 -5513481 -9543632 -11862088
7192 -11862088 -8939697 -3909204 -1818980 -3310826 -5899742 -7935017 -8313211 -5807864
7184 -5807864 -1899562 -806379 -3266132 -3873575 1323457 7998953 9242480 5412829
7176 5412829 2815875 4134366 5831199 4778278 2321387 1065062 1690572 3797456
$$ packed form
7236C371768r42245r45181q11673k61023j110677k468091j085331K267529L007636
7227A022712O95670J39688K566061K724527k037153o513389n565616j420766J326382
7218g061884K521047L532370K718041p93160l098079q50762K891478L386720J516017
7209D761788J107862J952703J053110j350095k306482j198908J97535J077286
7201E294799J176990p55859m161029n113727j908327R02118r48446m030151k318456
7192a1862088K922391N030493K090224j491846k588916k035275l78194K505347
7184e807864L908302J093183k459753o07443N197032O675496J243527l829651
7176E412829k596954J318491J696833j052921k456891j256325O25510K106884
$$ plain form
7168 3797456 6625238 8346962 7521552 5536235 4856538 4891782 2667586 -2277693 -6902198
7159 -6902198 -8984184 -9225759 -8364299 -5554361 -1112988 1939732 1143364 -2191847 -4496653
7150 -4496653 -3526900 275262 4539256 6391889 4620077 1179148 -646939 42289 1210570
7141 1210570 1085057 31357 -1151193 -2741193 -4948776 -6842356 -7323721 -5933674 -2296700
7132 -2296700 3505663 9392357 12095736 10721646 8008499 7003283 8006135 9774924
7124 9774924 11733431 13196610 12167915 7529460 1759630 -1057783 -92035 1379109
7116 1379109 407919 -2155155 -3564633 -3089568 -2470580 -3011298 -3835642 -3484717 -2145005
7107 -2145005 -1279172 -1417655 -1426619 -219681 1692692 2977132 3266034 3506696 4792051
$$ packed form
7168C797456K827782J721724q25410j985317o79697L5244k224196m945279m624505
7159f902198k081986k41575Q61460K809938M441373L052720p96368l335211k304806
7150d496653R69753L802162M263994J852633j771812l440929j826087O89228J168281
7141A210570j25513j053700j182550j590000k207583j893580m81365J390047L636974
7132b296700N802363N886694K703379j374090k713147j005216J002852J768789
7124I774924J958507J463179j028695m638455n769830k817413R65748J471144
7116A379109r71190k563074j409478M75065O18988n40718q24344L50925J339712
7107b145005Q65833j38483q964J206938J912373J284440K88902K40662J285355
$$ plain form
7098 4792051 7335993 10296872 12139718 11597902 8967968 6222582 5201393 5812270 6449511
7089 6449511 5830959 3849933 1026343 -2055424 -4843463 -6966674 -8295759 -8652348 -7852159
7080 -7852159 -6262548 -4636820 -3102817 -1342514 -225019 -1619833 -5268431 -7498740
7072 -7498740 -5382328 -1240895 -218186 -3483214 -6843400 -6921027 -5744200 -7136230 -10628187
7063 -10628187 -11888492 -8674400 -3654846 -677278 -231215 60128 1688653 3770974
7055 3770974 4946627 4924502 3708173 1029892 -2260778 -3683026 -1808404 1426843 3067526
7046 3067526 3039647 3288351 3659782 1975162 -1560770 -3822002 -3860783 -4641662 -7509707
7037 -7509707 -8883788 -5892072 -1871083 -1769140 -4581253 -5456824 -3730141 -3206296 -4846901
$$ packed form
7098D792051K543942K960879J842846n41816k629934k745386j021189O10877O37241
7089F449511o18552j981026k823590l081767k788039k123211j329085l56589Q00189
7080g852159J589611J625728J534003J760303J117495j394814l648598k230309
7072g498740K116412M141433J022709l265028l360186p7627J176827j392030l491957
7063a0628187j260305L214092N019554K977568M46063K91343J628525K082321
7055C770974J175653k2125j216329k678281l290670j422248J874622L235247J640683
7046C067526k7879K48704L71431j684620l535932k261232l8781p80879k868045
7037g509707j374081K991716M020989J01943k812113q75571J726683N23845j640605
$$ plain form
7028 -4846901 -4965334 -1729511 1679301 2261642 1280319 1049661 1315216 1020096 502088
7019 502088 -134506 -1905186 -4377063 -5284834 -4477981 -4723069 -6381915 -5324409 480647
7010 480647 6026545 5459867 585478 -1767053 736678 4128290 5140142 4831914 4711234
7001 4711234 3976267 2238645 1292016 2175812 3248456 3039654 2588584 2948344 2551380
6992 2551380 -389332 -4227486 -5414811 -3358207 -1227893 -1398706 -2235292 -868308 2194596
6983 2194596 3460687 1420636 -1182736 -1374132 -460021 -2081388 -6415023 -9290560 -7825058
6974 -7825058 -4288252 -2619345 -3055035 -2642906 -224150 1578363 -320255 -5707838 -11266831
6965 -11266831 -13867644 -13304862 -11898992 -11453166 -11032942 -8493493 -3795881 658456 3060409
$$ packed form
7028d846901j18433L235823L408812N82341r81323k30658K65555k95120n18008
7019E02088o36594j770680k471877r07771Q06853k45088j658846J057506N805056
7010D80647N545898n66678m874389k352531K503731L391612J011852l08228j20680
7001D711234p34967j737622r46629Q83796J072644k08802m51070L59760l96964
6992B551380k940712l838154j187325K056604K130314j70813q36586J366984L062904
6983B194596J266091k040051k603372j91396R14111j621367m333635k875537J465502
6974g825058L536806J668907m35690M12129K418756J802513j898618n387583n558993
6965a1266831k600813N62782J405870M45826M20224K539449M697612M454337K401953
$$ plain form
6956 3060409 3826841 3778915 2691302 714816 -549859 192191 2462101 5378518 8760610
6947 8760610 11528022 11117162 6754955 1805167 332101 2192373 3758580 2674657
6939 2674657 -393840 -3978528 -7189151 -9063849 -8878588 -7351699 -5924894 -5022807 -4549057
6930 -4549057 -5440637 -8571778 -12360241 -13697634 -11521853 -7753638 -4621718 -2710594
6922 -2710594 -1643941 -967290 -116196 1164718 2359343 3201027 4622719 7346076 10235497
6913 10235497 11623751 11467500 10517234 8549799 5714504 4436067 6930962 11357271
6905 11357271 13525474 12269164 10103631 8707899 7088455 4445320 1463124 -1700716
6897 -1700716 -5238650 -7030094 -4262984 1049028 2574152 -1911933 -6554179 -5062750
$$ packed form
6956C060409P66432m7926j087613j976486j264675P42050K269910K916417L382092
6947H760610K767412m10860m362207m949788j473066J860272J566207j083923
6939B674657l068497l584688l210623j874698J85261J526889J426805R02087M73750
6930d549057q91580l131141l788463j337393K175781L768215L131920J911124
6922b710594J066653O76651Q51094J280914J194625Q41684J421692K723357K889421
6913A0235497J388254j56251r50266j967435k835295j278437K494895M426309
6905A1357271K168203j256310k165533j395732j619444k643135k982196l163840
6897a700716l537934j791444K767110N312012J525124m486085m642246J491429
$$ plain form
6889 -5062750 1029631 5604356 6764813 7720176 10123508 11424977 9518294 6314157
6881 6314157 5124078 6692558 9257346 11232547 12608723 14211695 16285072 17815823
6873 17815823 17394186 15005672 12614351 12414942 14541721 16707242 16040545 11521393 5073433
6864 5073433 -9164 -2253009 -3067932 -3977981 -4147618 -2430328 -557023 -1351249 -4234790
6855 -4234790 -5815739 -5119086 -4700357 -5898014 -6896536 -6927392 -8198855 -11140214 -11758283
6846 -11758283 -7389066 -1788342 -83155 -1078473 463082 5292198 8710085 8023927
6838 8023927 5928931 5360657 5322326 3842168 1743704 937736 1039040 93119 -2368454
6829 -2368454 -4891885 -6358182 -7428846 -9608053 -13191163 -16250068 -16192184 -12822136 -9069887
$$ packed form
6889e062750O092381M574725J160457R55363K403332J301469j906683l204137
6881F314157j190079J568480K564788J975201J376176J602972K073377J530751
6873A7815823m21637k388514k391321j99409K126779K165521o66697m519152o447960
6864E073433n082597k243845q14923r10049j69637J717290J873305p94226k883541
6855d234790j580949O96653M18729j197657r98522l0856j271463k941359o18069
6846a1758283M369217N600724J705187r95318J541555M829116L417887o86158
6838H023927k094996n68274l8331j480158k098464q05968J01304r45921k461573
6829b368454k523431j466297j070664k179207l583110l058905N7884L370048L752249
$$ plain form
6820 -9069887 -7708155 -8155255 -7832079 -5851137 -3592748 -2133834 -1077189 121436 1423722
6811 1423722 2889241 4553603 5585355 4916216 2576153 -781145 -4928518 -8912538
6803 -8912538 -9888671 -5911433 332971 3632342 2607782 1069313 2121335 4007830
6795 4007830 3704408 2000803 2163107 4878157 7393863 7566129 6590597 7162050 10134091
6786 10134091 13581210 14679088 12240366 7579288 3038021 -69376 -1857337 -2885853
6778 -2885853 -3770538 -5463544 -8550090 -11961878 -13496238 -12073116 -8697693 -5044391
6770 -5044391 -2099398 -343852 78669 37 882127 3024588 5004255 5687572 5972213
6761 5972213 7560015 10529750 13095133 13543123 11592926 7933809 3339664 -1270904
$$ packed form
6820i069887J361732m47100L23176J980942K258389J458914J056645J198625J302286
6811A423722J465519J664362J031752o69139k340063l357298m147373l984020
6803h912538r76133L977238O244404L299371j024560j538469J052022J886495
6795D007830l03422j703605J62304K715050K515706J72266r75532N71453K972041
6786A0134091L447119J097878k438722m661078m541267l107397j787961j028516
6778b885853q84685j693006l086546l411788j534360J423122L375423L653302
6770e044391K944993J755546M22521p8632Q82090K142461J979667O83317K84641
6761E972213J587802K969735K565383M47990j950197l659117m594145m610568
$$ plain form
6753 -1270904 -4417698 -4706034 -2409928 112714 470520 -1355627 -3440262 -4535188 -5028395
6744 -5028395 -5309554 -4882230 -3595697 -2013479 67506 3330972 6258205 5552135 1212382
6735 1212382 -1690175 631840 4975547 5605208 2506851 666871 2276939 4750610
6727 4750610 6348244 8476194 11446328 12934213 12339939 12201924 13356595 13054323 10102210
6718 10102210 7423729 6673720 4691145 -1067984 -7497924 -10433558 -10921026 -12370571
6710 -12370571 -14332007 -14078755 -12198302 -11432658 -11482603 -10117130 -8294737 -8798326 -10414399
6701 -10414399 -9173012 -5600626 -4986413 -9173777 -13388911 -13231825 -10122688 -7368377
6693 -7368377 -5077287 -2026095 802500 1741411 1094705 -224195 -2265644 -3985235 -2500106
$$ packed form
6753a270904l146794k88336K296106K522642L57806j826147k084635j094926m93207
6744e028395k81159M27324J286533J582218K080985L263466K927233p06070m339753
6735A212382k902557K322015M343707O29661l098357j839980J610068K473671
6727D750610J597634K127950K970134J487885n94274j38015J154671l02272k952113
6718A0102210k678481p50009j982575n759129o429940k935634m87468j449545
6710a2370571j961436K53252J880453P65644m9945J365473J822393n03589j616073
6701a0414399J241387L572386O14213m187364m215134J57086L109137K754311
6693g368377K291090L051192K828595R38911o46706j318900k041449j719591J485129
$$ plain form
6684 -2500106 2603719 6674077 5072945 -903585 -6294448 -8867387 -9798911 -9611802 -7708307
6675 -7708307 -5498936 -5794794 -8421821 -9825570 -7974182 -4759417 -2510802 -911031
6667 -911031 1149018 3017101 3474437 2939861 2771897 3330867 3931548 3839361 2515483
6658 2515483 5866 -2249664 -2535887 -1631975 -2475201 -5606523 -7196555 -4176845 396458
6649 396458 623221 -4144503 -8195085 -6988001 -2279317 1662483 3607690 4621605 4412638
6640 4412638 1976586 -1177153 -1858598 653615 3935257 6138275 7866134 9687101
6632 9687101 10218081 8092283 4224155 745045 -1224076 -1729398 -1106775 -95617 171421
6623 171421 -572807 -1334573 -1665834 -2719478 -5226406 -7605004 -7894167 -6785240 -6633473
$$ packed form
6684b500106N103825M070358j601132n976530n390863k572939r31524J87109J903495
6675g708307K209371k95858k627027j403749J851388L214765K248615J599771
6667i11031K060049J868083M57336n34576j67964N58970O00681r2187j323878
6658B515483k509617k255530k86223R03912q43226l131322j590032L019710M573303
6649C96458K26763m767724m050582J207084M708684L941800J945207J013915k08967
6640D412638k436052l153739o81445K512213L281642K203018J727859J820967
6632I687101N30980k125798l868128l479110j969121n05322O22623J011158K67038
6623A71421p44228p61766l31261j053644k506928k378598k89163J108927J51767
$$ plain form
6614 -6633473 -7741385 -7905689 -6072359 -4295506 -4899163 -7237885 -8816416 -8760318 -8508421
6605 -8508421 -9201748 -9922057 -9142630 -6990439 -5107670 -4541936 -4696697 -4517367 -3797607
6596 -3797607 -2673463 -597903 2936465 6773816 8542773 7292077 4775363 3391611
6588 3391611 3436044 3126934 1035687 -2174828 -4448995 -4543840 -3522912 -3772122 -6120187
6579 -6120187 -8427344 -8007619 -5118498 -2684583 -2628385 -4050092 -5118772 -4846382 -2681374
6570 -2681374 1206630 4271710 2963095 -2339655 -6265571 -4943175 -1363108 -910373
6562 -910373 -3279587 -3185421 1320421 5919605 6540037 4757439 4465438 6137947 7181436
6553 7181436 6246584 4537869 3597580 3821982 4821433 5802546 5925955 5372164 5547851
$$ packed form
6614f633473j107912j64304J833330J776853o03657k338722j578531N6098K51897
6605h508421o93327p20309P79427K152191J882769N65734j54761J79330P19760
6596c797607J124144K075560L534368L837351J768957j250696k516714j383752
6588C391611M4433l09110k091247l210515k274167r4845J020928k49210k348065
6579f120187k307157M19725K889121K433915N6198j421707j068680K72390K165008
6570b681374L888004L065080j308615n302750l925916J322396L580067M52735
6562i10373k369214R4166M505842M599184O20432j782598k92001J672509J043489
6553G181436r34852j708715r40289K24402R99451R81113J23409n53791J75687
$$ plain form
6544 5547851 7160366 8624242 7632888 4109313 419570 -1497607 -2284887 -3970450 -7088144
6535 -7088144 -9695415 -9537653 -6769933 -3774099 -2294757 -1809019 -1108896 -128462 840726
6526 840726 2411528 4912885 6916840 6895411 5658135 5052767 4827931 3209299 294579
6517 294579 -1785294 -2129509 -1751047 -809219 1764686 5232853 6899744 6218793 5916045
6508 5916045 7481672 8773063 8164960 7813194 9906979 12456295 12218254 9714557 7807157
6499 7807157 6913652 5263410 2730807 800299 -460869 -1873210 -2298044 -25245 3370305
6490 3370305 4405699 2989210 2505869 4184689 5299248 3943708 1742998 244149
6482 244149 -1792782 -5360185 -8522282 -9217700 -8313620 -7524220 -6542587 -4773287 -3888301
$$ packed form
6544E547851J612515J463876r91354l523575l689743j917177p87280j685563l117694
6535g088144k607271J57762K767720K995834J479342M85738P00123R80434R69188
6526H40726J570802K501357K003955k1429j237276o05368k24836j618632k914720
6517B94579k079873l44215L78462R41828K573905L468167J666891o80951l02748
6508E916045J565627J291391o08103l51766K093785K549316k38041k503697j907400
6499G807157q93505j650242k532603j930508j261168j412341m24834K272799L395550
6490C370305J035394j416489m83341J678820J114559j355540k200710j498849
6482B44149k036931l567403l162097o95418R04080P89400R81633J769300Q84986
$$ plain form
6473 -3888301 -5692011 -8682347 -9555254 -7530321 -4898415 -3751911 -4106598 -4753158 -4240243
6464 -4240243 -1637849 2029454 3921951 2730702 973157 1881110 4808338 6154260
6456 6154260 4455917 2038569 1508458 2881218 4507188 4854725 3137202 171218 -1151253
6447 -1151253 1582475 6768874 9884375 8721523 5463892 2940848 1253798 -693998
6439 -693998 -2650912 -3724768 -3885763 -3242308 -1575539 -42217 -1134726 -4841636 -7000161
6430 -7000161 -4282680 857578 3388544 2488168 1431893 1482158 241478 -3379079 -6693272
6421 -6693272 -7373008 -6748920 -6940600 -7230138 -5372390 -628801 6072959 12945073 16874005
6412 16874005 14810473 7891208 1827232 524934 1392428 -97470 -3333448 -3956293
$$ packed form
6473c888301j803710k990336q72907K024933K631906J146504l54687o46560N12915
6464d240243K602394L667303J892497j191249j757545R07953K927228J345922
6456F154260j698343k417348n30111J372760J625970L47537j717523k965984j322471
6447a151253K733728N186399L115501j162852l257631k523044j687050j947796
6439f93998j956914j073856j60995O43455J666769J533322j092509l706910k158525
6430g000161K717481N140258K530966r00376j056275N0265j240680l620557l314193
6421f693272o79736O24088j91680k89538J857748M743589O701760O872114L928932
6412A6874005k063532o919265o063976j302298Q67494j489898l235978o22845
$$ plain form
6404 -3956293 -1025990 1611859 1120945 -1168800 -3094848 -4566391 -5879963 -6151442 -5046088
6395 -5046088 -3843753 -3420935 -3111549 -2699459 -3561738 -6517809 -10105923 -12030125 -10987747
6386 -10987747 -6744053 -435255 4789391 6023883 4386645 3810529 4985317 3888328
6378 3888328 -1534821 -6660700 -5686387 447553 5618295 6833831 6946287 9085510 12057703
6369 12057703 12528485 9535543 5483451 3622629 5144194 8264413 10163516 9998408
6361 9998408 9289368 9290499 9698685 10542301 12928029 16361124 17725843 15126573 10547946
6352 10547946 6325376 1627407 -4255286 -7940258 -6164538 -2297821 -3017232 -8776360
6344 -8776360 -13245448 -12914483 -11477058 -12753211 -14776831 -14237834 -12324127 -11978498 -12453824
$$ packed form
6404c956293K930303K637849m90914k289745j926048j471543j313572k71479J105354
6395e046088J202335M22818L09386M12090q62279k956071l588114j924202J042378
6386a0987747M243694O308798N224646J234492j637238n76116J174788j096989
6378C888328n423149n125879R74313O133940N170742J215536J12456K139223K972193
6369A2057703M70782k992942m052092j860822J521565L120219J899103j65108
6361I998408p09040J131M08186Q43616K385728L433095J364719k599270m578627
6352A0547946m222570m697969n882693l684972J775720L866717p19411n759128
6344h776360m469088L30965J437425j276153k023620N38997J913707L45629m75326
$$ plain form
6335 -12453824 -10901833 -7494380 -5043948 -4606403 -4800506 -4750783 -4714167 -4252730 -2515870
6326 -2515870 -262996 558505 -800375 -3534269 -6764172 -9593541 -10348131 -7982027 -4200962
6317 -4200962 -2238131 -3228450 -5303178 -6521438 -7207883 -8671680 -10566553 -10670233 -7647734
6308 -7647734 -3571897 -2445010 -5376983 -8522324 -7775359 -4535395 -3706627 -6117323 -6959340
6299 -6959340 -3118894 2023754 3843566 2980252 2875059 3607608 2827136 1269577 2364758
6290 2364758 6419737 9536024 8996706 6200911 3558963 1806587 1293743 2729369 5301493
6281 5301493 6691438 6203599 5488973 5139302 3297515 -810694 -4570528 -5344140 -4222298
6272 -4222298 -4155121 -5622235 -6350047 -4754062 -1959669 -538819 -2122578 -5919700 -9185893
$$ packed form
6335a2453824J551991L407453K450432M37545j94103M9723L6616M61437J736860
6326b515870K252874Q21501j358880k733894l229903k829369p54590K366104L781065
6317d200962J962831r90319k074728j218260o86445j463797j894873j03680L022499
6308g647734M075837J126887k931973l145341P46965L239964Q28768k410696q42017
6299f959340L840446N142648J819812q63314j05193P32549p80472j557559J095181
6290B364758M054979L116287n39318k795795k641948j752376n12844J435626K572124
6281E301493J389945m87839p14626l49671j841787m108209l759834p73612J121842
6272d222298O7177j467114p27812J595985K794393J420850j583759l797122l266193
$$ plain form
6263 -9185893 -9842099 -8748087 -8247416 -8491560 -7096950 -2975726 1576091 3685795 2940069
6254 2940069 450817 -3091819 -6749686 -8524513 -7386474 -5017111 -3627620 -3021874
6246 -3021874 -1647313 467613 1884451 2082313 1504780 -162613 -3586042 -7856784 -10961303
6237 -10961303 -12154596 -12171854 -11355888 -9550374 -7719279 -7411658 -8251088 -8075667 -6205040
6228 -6205040 -4539503 -4492736 -4778753 -3635792 -1716033 -1088993 -2304715 -4031588 -5088591
6219 -5088591 -5450920 -5539268 -5764260 -6673398 -8419099 -9961500 -9718093 -7277044 -3856835
6210 -3856835 -909855 1136780 2544294 3277349 2879562 1210676 -962465 -2139679 -1008015
6201 -1008015 2319223 5763406 6554195 3811222 -245942 -2515757 -2668297 -3654322 -7950586
$$ packed form
6263i185893o56206J094012N00671k44144J394610M121224M551817K109704p45726
6254B940069k489252l542636l657867j774827J138039K369363J389491O05746
6246c021874J374561K114926J416838J97862n77533j667393l423429m270742l104519
6237a0961303j193293j7258Q15966J805514J831095L07621q39430J75421J870627
6228f205040J665537M6767k86017J142961J919759O27040j215722j726873j057003
6219e088591l62329q8348k24992r09138j745701j542401K43407K441049L420209
6210c856835K946980K046635J407514P33055l97787j668886k173141j177214J131664
6201a008015L327238L444183P90789k742973m057164k269815j52540r86025m296264
$$ plain form
6192 -7950586 -14284707 -19295490 -21593919 -22200088 -21239148 -17027541 -9662646 -2964216 -338120
6183 -338120 -234323 1324396 4487788 5392452 2648821 321509 2359327 6751563 8217577
6174 8217577 5321151 1739293 708139 1216307 566981 -1613205 -3495788 -3844074 -3027193
6165 -3027193 -1743496 -140419 1677745 3160899 3684696 3066244 1560154 -438432 -2559690
6156 -2559690 -4371314 -5179929 -4146984 -1040446 2973598 5721138 5739322 3682640 1759612
6147 1759612 1622638 2843805 3510902 2334357 130432 -942801 217108 2157797 2133936
6138 2133936 -975753 -5193250 -7056194 -4744846 248763 4338703 4824216 2044677
6130 2044677 -1278312 -2943406 -3342632 -4362905 -6668514 -9008000 -10169366 -10350880 -10018227
$$ packed form
6192g950586o334121n010783k298429o06169R60940M211607P364895O698430K626096
6183c38120J03797J558719L163392R04664k743631k327312K037818M392236J466014
6174H217577k896426l581858j031154N08168o49326k180186j882583l48286Q16881
6165c027193J283697J603077J818164J483154N23797o18452j506090j998586k121258
6156b559690j811624q08615J032945L106538M014044K747540J8184k056682j923028
6147A759612j36974J221167O67097j176545k203925j073233J159909J940689k3861
6138B133936l109689m217497j862944K311348M993609M089940M85513k779539
6130B044677l322989j665094l99226j020273k305609k339486j161366j81514L32653
$$ plain form
6121 -10018227 -8651765 -5873480 -3062842 -2306749 -3824672 -5667883 -5999255 -4595451
6113 -4595451 -2227249 58032 955120 -200462 -2092286 -2489568 -1180433 -138329 -99380
6104 -99380 730453 3033009 3960976 1219916 -2266002 -1641624 2529254 4457794 1346347
6095 1346347 -2782578 -3317527 -1258914 -208678 -352098 513092 1951002 1480995 -506521
6086 -506521 -1020639 -16995 -1203738 -5876246 -10016887 -9913623 -7239649 -5505293 -4320388
6077 -4320388 -1046767 3666738 6288321 5735076 4205940 2519305 -1280532 -7442025
6069 -7442025 -12350256 -13103617 -11509668 -10935485 -11210308 -9521555 -5092022 -2631 4097277
6060 4097277 7251552 9126580 8465107 5531660 2953416 2715460 3651052 3299187 1434893
$$ packed form
6121a0018227J366462K778285K810638P56093j517923j843211l31372J403804
6113d595451K368202K285281Q97088j155582j891824l97282J309135J042104L8949
6104i9380Q29833K302556R27967k741060l485918O24378M170878J928540l111447
6095A346347m128925n34949K058613J050236j43420Q65190J437910m70007j987516
6086e06521n14118J003644j186743m672508m140641J03264K673974J734356J184905
6077d320388L273621M713505K621583n53245j529136j686635l799837o161493
6069g442025m908231p53361J593949N74183k74823J688753M429533N089391M099908
6060D097277L154275J875028o61473k933447k578244k37956R35592l51865j864294
$$ plain form
6051 1434893 390779 2080475 5699204 8531341 8578826 6276655 3729166 2246108 857783
6042 857783 -2243130 -6839883 -10056559 -9107077 -4352014 866811 3368534 2803020 1216925
6033 1216925 355659 -105561 -1438462 -3512765 -4542149 -3356776 -952594 840279 1370702
6024 1370702 957051 -499970 -3284184 -6545820 -8687084 -9256884 -9293656 -9484973 -9038588
6015 -9038588 -6918182 -3553958 -830469 -483448 -2374567 -4250550 -3968341 -2398956 -2820804
6006 -2820804 -6312864 -9393279 -8416277 -4934529 -3531030 -4992375 -5548711 -3333139 -1363287
5997 -1363287 -2283663 -3927456 -2968447 -130156 1452111 926529 -497520 -2750956 -6342150
5988 -6342150 -9605637 -9986424 -7741872 -5444996 -4145668 -2831102 -1357152 -982355 -2024803
$$ packed form
6051A434893j044114J689696L618729K832137M7485k302171k547489j483058j388325
6042H57783l100913m596753l216676R49482M755063N218825K501723n65514j586095
6033A216925q61266m61220j332901k074303j029384J185373K404182J792873N30423
6024A370702m13651j457021k784214l261636k141264n69800l6772j91317M46385
6015i038588K120406L364224K723489L47021j891119j875983K82209J569385m21848
6006b820804l492060l080415R77002L481748J403499j461345n56336K215572J969852
5997a363287r20376j643793R59009K838291J582267n25582j424049k253436l591194
5988f342150l263487l80787K244552K296876J299328J314566J473950L74797j042448
$$ plain form
5979 -2024803 -3695410 -6136458 -9818443 -13039796 -13156720 -10549029 -8247818 -7215665
5971 -7215665 -5300399 -1646225 1302249 1578908 348852 -843394 -2500946 -4867294
5963 -4867294 -5894569 -3905811 -301474 2478765 3902681 4487502 4086694 3068817 3192309
5954 3192309 5092910 6752789 6645223 6352791 7541179 8460844 6634387 3323649 1755846
5945 1755846 2056885 1689403 232742 -312003 -41685 -1842198 -6398829 -10000397 -9240052
5936 -9240052 -5562133 -3355560 -5172955 -10145630 -15499432 -18275725 -16978080 -13019769
5928 -13019769 -9705336 -8798104 -9035980 -8799310 -8787349 -10505128 -13048712 -13421710 -10250314
5919 -10250314 -5712259 -3005691 -2732256 -2841327 -1887893 -923507 -1478110 -3045067 -4274697
$$ packed form
5979b024803j670607k441048l681985l221353j16924K607691K301211J032153
5971g215665J915266L654174K948474K76659j230056j192246j657552k366348
5963d867294j027275J988758L604337K780239J423916N84821m00808j017877J23492
5954C192309J900601J659879j07566k92432J188388R19665j826457l310738j567803
5945A755846L01039l67482j456661n44745K70318j800513m556631l601568P60345
5936i240052L677919K206573j817395m972675n353802k776293J297645L958311
5928a3019769L314433R07232k37876K36670J1961j717779k543584l72998L171396
5919a0250314M538055K706568K73435j09071R53434R64386n54603j566957j229630
$$ plain form
5910 -4274697 -5751346 -8915097 -12190883 -11532635 -6312447 -1519341 -1436346 -3698208 -3118140
5901 -3118140 527535 2890566 2401594 2442992 5419122 8802632 8820378 5101800 126512
5892 126512 -3373797 -3235204 1021662 6210752 7323341 3374042 -912089 -1178491 1299929
5883 1299929 2759412 2749852 3503908 5341791 6557065 7251319 9569637 13654761 16379791
5874 16379791 15250293 11571566 8571508 7627849 7370590 5905068 3170903 977218
5866 977218 635868 930641 -509617 -3809201 -6511413 -7216917 -7415014 -8335339 -8306903
5857 -8306903 -5635339 -2221330 -1253642 -2524703 -3357395 -3360144 -4462674 -6355562 -6068281
5848 -6068281 -3012640 -426810 -3643 1124228 5215557 8905005 7225704 870058
$$ packed form
5910d274697j476649l163751l275786O58248N220188M793106Q2995k261862N80068
5901c118140L645675K363031m88972M1398K976130L383510J7746l718578m975288
5892A26512l500309J38593M256866N189090J112589l949299m286131k66402K478420
5883A299929J459483r560P54056J837883J215274O94254K318318M085124K725030
5874A6379791j129498l678727l000058r43659k57259j465522k734165k193685
5866I77218l41350K94773j440258l299584k702212p05504j98097r20325K8436
5857h306903K671564L414009R67688j271061q32692k749j102530j892888K87281
5848f068281L055641K585830M23167J127871M091329L689448j679301o355646
$$ plain form
5840 870058 -4662369 -6633543 -7751912 -10546070 -12685537 -10265096 -3850829 1394832
5832 1394832 1402694 -2755682 -6766979 -7667037 -5824146 -3390751 -2234178 -3285097 -6261504
5823 -6261504 -9094660 -8912682 -5260574 -1712062 -2281473 -6242249 -8662820 -6669036 -2886340
5814 -2886340 -1257559 -1586931 -765139 1688583 2385166 -1108456 -6451703 -8887902 -6443437
5805 -6443437 -1695402 1287874 990862 -679576 -1211562 -549141 -627365 -2101318 -3092156
5796 -3092156 -2058074 -481177 -988440 -3635518 -6073051 -7036616 -7434557 -7872771 -7605747
5787 -7605747 -6837388 -7649635 -10824401 -13414027 -11731231 -6076874 -559789 1530940 547473
5778 547473 -1155517 -2000492 -1994577 -2038545 -2984087 -4682989 -5746303 -4827932 -2127297 967845
$$ packed form
5840H70058n532427j971174j118369k794158k139467K420441O414267N245661
5832A394832P862m158376m011297r00058J842891K433395J156573j050919k976407
5823f261504k833156J81978L652108L548512n69411l960776k420571J993784L782696
5814b886340J628781l29372Q21792K453722O96583l493622n343247k436199K444465
5805f443437M748035K983276k97012j670438n31986O62421p8224j473953r90838
5796c092156J034082J576897n07263k647078k437533r63565l97941m38214K67024
5787g605747P68359q12247l174766k589626J682796N654357N517085K090729r83467
5778E47473j702990q44975N915m3968r45542j698902j063314R18371K700635L095142
$$ plain form
5768 967845 3381040 4547042 3614059 211810 -3628160 -4144581 153938 5987280 8232362
5759 8232362 5316014 788729 -579941 2356867 6377113 7527672 5066966 1738360
5751 1738360 529790 1837395 3978335 5504305 5929470 4732757 1354508 -3344531
5743 -3344531 -6990133 -8069404 -7695382 -8127067 -10001857 -11799147 -11660187 -9023579 -4831254
5734 -4831254 -917322 1031677 744314 -377784 -867602 -980085 -2150164 -4591723 -6292770
5725 -6292770 -5021120 -971366 3243931 5227986 4803358 3157625 815629 -2440951
5717 -2440951 -5831649 -7308040 -5890546 -3255916 -1895515 -2446268 -3946995 -5692805
5709 -5692805 -7046335 -6295586 -2358068 2352231 3598938 720911 -2270542 -2274822 -1036661
$$ packed form
5768I67845K413195J166002r32983l402249l839970n16421M298519N833342K245082
5759H232362k916348m527285j368670K936808M020246J150559k460706l328606
5751A738360j208570J307605K140940J525970M25165j196713l378249m699039
5743c344531l645602j079271L74022m31685j874790j797290J38960K636608M192325
5734d831254L913932J948999k87363j122098m89818j12483j170079k441559j701047
5725f292770J271650M049754M215297J984055m24628j645733k341996l256580
5717b440951l390698j476391J417494K634630J360401n50753j500727j745810
5709e692805j353530P50749L937518M710299J246707k878027k991453m280J238161
$$ plain form
5700 -1036661 -1365427 -1968984 604843 6160415 10579965 11312112 10008733 9036777 8070997
5691 8070997 5532369 1557531 -2103615 -4282049 -5256605 -5868269 -6679212 -7899826 -9498795
5682 -9498795 -11027617 -11342454 -8989805 -3643393 2887182 8049217 11044783 12767635
5674 12767635 13330699 11768500 8806448 7237658 7866293 7719713 4796154 1991576 2707667
5665 2707667 4615765 2449892 -3829888 -8629806 -8762917 -7064827 -6857513 -7530373 -7703597
5656 -7703597 -8446900 -10362073 -10999118 -8652432 -6024449 -6439811 -8408226 -7804961 -4343821
5647 -4343821 -2085617 -3527779 -6210590 -5817654 -851535 6022599 10126889 8650514
5639 8650514 3532505 -199771 -2610 1461629 468928 -2579694 -4318008 -3458336 -1852097
$$ packed form
5700a036661l28766o03557K573827N555572M419550P32147j303379r71956r65780
5691H070997k538628l974838l661146k178434r74556o11664q10943j220614j598969
5682i498795j528822l14837K352649N346412O530575N162035K995566J722852
5674A2767635N63064j562199k962052j568790O28635j46580k923559k804578P16091
5665B707667J908098k165873o279780m799918j33111J698090K07314o72860j73224
5656g703597p43303j915173o37045K346686K627983m15362j968415O03265L461140
5647d343821K258204j442162k682811L92936M966119O874134M104290j476375
5639H650514n118009l732276J97161J464239r92701l048622j738314Q59672J606239
$$ plain form
5630 -1852097 -879567 508061 3617168 7739920 10766042 11219112 9655979 8583321 10259786
5621 10259786 13783508 15472818 13212354 8994996 5752343 3552275 1220599 -120688
5613 -120688 1436133 4352414 4622662 1258800 -2460374 -3957659 -4577759 -6585427 -9501034
5604 -9501034 -11160624 -10700858 -8873110 -6562529 -4321283 -2506302 -865845 1245754
5596 1245754 3428354 3762766 619806 -5447839 -12051298 -16749559 -18263856 -16577135
5588 -16577135 -12425794 -6798753 -1057704 2701767 2586465 -1024465 -5257181 -7570100
5580 -7570100 -7980687 -7572700 -6155226 -3137604 300210 2070542 1811751 829531 -106620
5571 -106620 -1021953 -1381285 -704650 -216196 -1559253 -3945312 -4830678 -3374276 -934022
$$ packed form
5630a852097R72530J387628L109107M122752L026122M53070j563133j072658J676465
5621A0259786L523722J689310k260464m217358l242653k200068k331676j341287
5613a20688J556821K916281K70248l363862l719174j497285o20100k007668k915607
5604i501034j659590M59766J827748K310581K241246J814981J640457K111599
5596A245754K182600L34412l142960o067645o603459m698261j514297J686721
5588a6577135M151341N627041N741049L759471j15302l610930m232716k312919
5580g570100m10587M07987J417474L017622L437814J770332k58791r82220r36151
5571a06620r15333l59332O76635M88454j343057k386059q85366J456402K440254
$$ plain form
5562 -934022 1675318 4605410 6483149 4767126 -174871 -4058848 -3476322 171457 2940996
5553 2940996 2868574 886953 -1219219 -2248094 -1934378 -1048893 -614374 -625907 -338560
5544 -338560 219729 260214 -342277 -1049466 -1776286 -2302544 -1155741 2521979 6358599
5535 6358599 6905263 4491700 2903033 3921040 5470614 5726020 5368647 4682864 2303149
5526 2303149 -1363041 -3184404 -2025969 -955207 -2244432 -3619268 -2445572 -362281
5518 -362281 -246492 -1439966 -1823394 -2153324 -4162096 -6279417 -5610804 -2926942 -1518374
5509 -1518374 -1937767 -1822867 -272654 1491330 3356978 6317012 9365065 10139113 8831655
5500 8831655 8033220 8515594 8511832 7379079 6599568 6794828 7046460 7519489 9276441 10956199
$$ packed form
5562i34022K609340K930092J877739j716023m941997l883977N82526L647779K769539
5553B940996p2422j981621k106172j028875L13716Q85485M34519j1533K87347
5544c38560N58289M0485o02491p07189p26820n26258J146803L677720L836620
5535F358599N46664k413563j588667J018007J549574K55406l57373o85783k379715
5526B303149l666190j821363J158435J070762j289225j374836J173696K083291
5518c62281J15789j193474l83428l29930k008772k117321O68613K683862J408568
5509a518374m19393J14900J550213J763984J865648K960034L048053P74048j307458
5500H831655p98435M82374l762j132753p79511J95260K51632M73029J756952J679758
$$ plain form
5490 10956199 9399660 4733362 1267640 1700318 3566988 3277906 824154 -1574905
5482 -1574905 -2954437 -3421936 -2542971 -350242 1378581 1001717 -682611 -1641213 -1330860
5473 -1330860 -875877 -1242440 -2375495 -3606819 -4154328 -3710439 -2785914 -1710083 518019
5464 518019 4951574 10330709 13872638 14774638 15014885 16066855 16696066 14854544 10178625
5455 10178625 3975966 -1663109 -4367332 -3136187 -158392 994909 -401902 -1903066
5447 -1903066 -2179362 -2822863 -4914723 -6848906 -7213479 -6977067 -6867809 -5453007 -2206203
5438 -2206203 351232 486658 556566 2949428 5141503 3245330 -964721 -1562628 3049482
5429 3049482 7880224 8606922 6962975 6904756 8607991 8950650 6257533 2203570 -385469
$$ packed form
5490A0956199j556539m666298l465722M32678J866670k89082k453752k399059
5482a574905j379532m67499Q78965K192729J728823l76864j684328r58602L10353
5473a330860M54983l66563j133055j231324n47509M43889R24525J075831K228102
5464E18019M433555N379135L541929R02000K40247J051970O29211j841522m675919
5455A0178625o202659n639075k704223J231145K977795J153301j396811j501164
5447a903066k76296o43501k091860j934183l64573K36412J09258J414802L246804
5438b206203K557435J35426O9908K392862K192075j896173m210051n97907M612110
5429C049482M830742P26698j643947n8219J703235L42659k693117m053963k589039
$$ plain form
5420 -385469 -165526 1901658 3440572 2647347 -145992 -3055841 -4676588 -5101128 -5322087
5411 -5322087 -6258370 -7786860 -8066136 -4987213 471629 3854944 2328487 -1141028 -1536296
5402 -1536296 1280369 3015461 1989863 1300758 2866891 3735299 858521 -3926620 -6770535
5393 -6770535 -6953212 -5976298 -4021705 -1133067 -28716 -3282256 -8458391 -10443031 -8658970
5384 -8658970 -7698042 -10018383 -12203339 -10265415 -5172102 -709288 1521167 2467457 2976963
5375 2976963 3249107 3577408 3575981 1935295 -1168149 -2796225 -461030 4511053 8729924
5366 8729924 10573780 10299783 8011988 4305484 1643426 1816216 2730584 1125322 -1906758
5357 -1906758 -1917923 2054929 5602856 5141383 2431986 1117429 1923833 3597423 5900484
$$ packed form
5420c85469K19943K067184J538914p93225k793339k909849j620747m24540k20959
5411e322087r36283j528490k79276L078923N458842L383315j526457l469515l95268
5402a536296K816665J735092j025598o89105J566133Q68408k876778m785141k843915
5393f770535j82677R76914J954593K888638J104351l253540n176135j984640J784061
5384h658970R60928k320341k184956J937924N093313M462814K230455R46290N09506
5375B976963K72144L28301j427j640686l103444j628076K335195M972083M218871
5366H729924J843856k73997k287795l706504k662058J72790R14368j605262l032080
5357a906758j1165L972852L547927m61473k709397j314557Q06404J673590K303061
$$ plain form
5348 5900484 8870161 10861732 9968511 6450858 2080894 -1650009 -3393016 -2064764
5340 -2064764 1066905 2534796 1096829 -107862 1675940 4173856 3427771 -187079
5332 -187079 -3147496 -4568425 -6478964 -8987871 -9771188 -8667567 -8383899 -9615075 -9512838
5323 -9512838 -6549506 -3219953 -1904067 -1291754 660121 2867540 2857696 467372 -2588909
5314 -2588909 -5334904 -7580852 -8718885 -8530511 -8099406 -8155334 -7692340 -5943869 -4349107
5305 -4349107 -4485846 -5250269 -4475106 -2549735 -1841014 -2709201 -2670042 -112998 3183190
5296 3183190 4349943 3048756 1687589 2491917 5190154 7681004 8561520 8427273 8348363
5287 8348363 7728162 4999073 580777 -2419035 -1528319 1979140 4482958 4070266 2164741
$$ packed form
5348E900484K969677J991571q93221l517653m369964l730903j743007J328252
5340b064764L131669J467891j437967j204691J783802K497916p46085l614850
5332a87079k960417j420929j910539k508907p83317J103621K83668j231176J02237
5323i512838K963332L329553J315886O12313J951875K207419r844k390324l056281
5314b588909k745995k245948j138033J88374M31105n5928M62994J748471J594762
5305d349107j36739p64423P75163J925371P08721q68187L9159K557044L296188
5296C183190J166753j301187j361167Q04328K698237K490850Q80516j34247p8910
5287H348363o20201k729089m418296k999812Q90716L507459K503818m12692j905525
$$ plain form
5278 2164741 1378629 2741851 5155775 6858250 6999521 5903709 4207066 2366419 1165903
5269 1165903 1673328 3633417 4635446 2465676 -1896705 -5177500 -5580556 -3924990 -1142856
5260 -1142856 2883607 7205869 9010484 6707880 2232026 -1469413 -3933170 -6332526
5252 -6332526 -8271465 -7829806 -4721637 -1319151 210361 510836 1776113 4424862 6218686
5243 6218686 5206532 2788271 2474426 5428649 8838817 9645240 8266284 7049903 6640889
5234 6640889 6215960 5998646 6561198 6451621 3881154 438124 -453553 1212081 2088602
5225 2088602 967688 -112647 -829458 -3530448 -7513881 -7745614 -2450168 2817059 2674657
5216 2674657 -690448 -2129335 -1661941 -2543152 -4078195 -2413143 2863353 8293769 11777105
$$ packed form
5278B164741p86112J363222K413924J702475J41271j095812j696643j840647j200516
5269A165903N07425J960089J002029k169770m362381l280795m03056J655566K782134
5260a142856M026463M322262J804615k302604m475854l701439k463757k399356
5252f332526j938939M41659L108169L402486J529512L00475J265277K648749J793824
5243F218686j012154k418261l13845K954223L410168Q06423j378956j216381m09014
5234F640889m24929k17314N62552j09577k570467l443030q91677J665634Q76521
5225B088602j120914j080335p16811k700990l983433k31733N295446N267227j42402
5216B674657l365105j438887M67394q81211j535043J665052N276496N430416L483336
$$ plain form
5207 11777105 13268062 11422583 5145548 -1856229 -3702363 -45760 3843158 5108839
5199 5108839 6104240 8236624 8750276 5999250 3065497 3053123 4444840 4052308 1600585
5190 1600585 -1185773 -3292438 -3816081 -1395339 3211991 6407694 6111360 4651632 5000755
5181 5000755 6496292 6908403 6411123 6374984 6135596 4457822 2909045 4072999 6932944
5172 6932944 7698050 5544578 4177077 6495578 10373779 11564889 9162070 6205509
5164 6205509 5563320 6999539 8395658 8403611 7131768 5118360 2819219 913973 -35791
5155 -35791 -418084 -1019667 -1435232 -336204 2200572 4177772 4325915 3606381 3003666
5146 3003666 1880387 230286 248309 2950297 5214556 3668759 111663 -910209 950305
$$ packed form
5207A1777105J490957j845479o277035p001777j846134L656603L888918J265681
5199E108839R95401K132384N13652k751026k933753j2374J391717l92532k451723
5190A600585k786358k106665n23643K420742M607330L195703k96334j459728L49123
5181E000755J495537M12111m97280l6139k39388j677774j548777J163954K859945
5172F932944P65106k153472j367501K318501L878201J191110k402819k956561
5164F205509o42189J436219J396119P953j271843k013408k299141j905246r49764
5155c5791l82293o01583m15565J099028K536776J977200J48143p19534o02715
5146C003666j123279j650101J8023K701988K264259j545797l557096j021872J860514
$$ plain form
5137 950305 1804142 270587 -694686 332706 502207 -2030036 -4412089 -3649521 -1367033
5128 -1367033 -724978 -1335275 -744840 1025065 1896694 1377748 627514 -185208 -1668748
5119 -1668748 -3006604 -2762442 -1618268 -1757073 -3409905 -4210645 -2391013 1107022 4242773
5110 4242773 6288592 7860949 9110952 8654431 4907719 -1202442 -5758045 -5574586 -2107259
5101 -2107259 253469 -210402 -1046930 -282096 363502 -1330476 -4089114 -4833092 -2879086
5092 -2879086 -17214 2611814 5261552 7566736 8002900 5742358 1818581 -1784613
5084 -1784613 -3587682 -3416010 -2330365 -1505540 -1029559 -418229 -117759 -1169040 -3318181
5075 -3318181 -5091244 -6016040 -6960776 -7918310 -7605327 -5911127 -4413273 -3530287 -1672297
$$ packed form
5137I50305Q53837j533555r65273J027392J69501k532243k382053P62568K282488
5128a367033O42055o10297N90435J769905Q71629n18946p50234q12722j483540
5119a668748j337856K44162J144174j38805j652832q00740J819632L498035L135751
5110D242773K045819J572357J250003m56521l746712o110161m555603J83459L467327
5101b107259K360728m63871q36528P64834O45598j693978k758638p43978J954006
5092b879086K861872K629028K649738K305184M36164k260542l923777l603194
5084a784613j803069J71672J085645Q24825M75981O11330L00470j051281k149141
5075c318181j773063r24796r44736r57534L12983J694200J497854Q82986J857990
$$ plain form
5066 -1672297 1465171 3383825 2449995 804509 1463599 4348442 7170725 8465123 7835871
5057 7835871 5146223 1597701 -224389 478674 1354851 736283 510441 2581587 4874470
5048 4874470 4180351 1087025 -1434303 -2721922 -3986403 -4655049 -3330709 -1451891 -1567918
5039 -1567918 -2374601 -156786 4489657 6205747 2536472 -2332957 -3758212 -2860675 -3616978
5030 -3616978 -6420549 -7946500 -6186299 -2698692 -149925 331972 -566086 -1185870 -44342
5021 -44342 2640160 4486733 3007303 -1625300 -6522711 -8989128 -8849038 -7573673 -6002852
5012 -6002852 -4166427 -3040709 -4460691 -8204191 -10858348 -9610214 -6186075 -4721171
5004 -4721171 -6352722 -8542276 -9323046 -9011189 -7641787 -4481474 -1017774 -495840 -2725425
$$ packed form
5066a672297L137468J918654r33830j645486O59090K884843K822283J294398o29252
5057G835871k689648l548522j822090P03063Q76177o18568k25842K071146K292883
5048D874470o94119l093326k521328j287619j264481o68646J324340J878818j16027
5039a567918q06683K217815M646443J716090l669275m869429j425255Q97537p56303
5030c616978k803571j525951J760201L487607K548767M81897q98058o19784J141528
5021d4342K684502J846573j479430m632603m897411k466417J40090J275365J570821
5012f002852J836425J125718j419982l743500k654157J248134L424139J464904
5004d721171j631551k189554p80770L11857J369402L160313L463700N21934k229585
$$ plain form
4995 -2725425 -3241138 -126905 2199211 -439581 -4979996 -5283628 -1177076 1617545 -131711
4986 -131711 -3386135 -3765323 -560030 4052539 8020399 10514246 11671253 12057938 11812628
4977 11812628 10639301 9069372 8393281 8443723 7210069 3971241 860527 -301065 -635495
4968 -635495 -1779803 -2978023 -2726616 -1226435 944134 4337264 8593691 11396369 11860652
4959 11860652 12236456 13701627 13722347 10749037 8003197 8580153 10090848 8777490 5973742
4950 5973742 5439537 6917422 7686584 8155766 10182828 11749898 9262433 3800687 -629038
4941 -629038 -3698080 -7675498 -10965422 -9086283 -1753500 6730559 13638722 18859225
4933 18859225 20867177 17974407 13093991 11001736 11183149 9504289 6226122 5460291
$$ packed form
4995b725425n15713L114233K326116k638792m540415l03632M106552K794621j749256
4986a31711l254424l79188L205293M612569L967860K493847J157007L86685k45310
4977A1812628j173327j569929o76091N0442j233654l238828l110714j161592l34430
4968f35495j144308j198220K51407J500181K170569L393130M256427K802678M64283
4959A1860652L75804J465171K0720k973310k745840N76956J510695j313358k803748
4950E973742n34205J477885P69162M69182K027062J567070k487465n461746m429725
4941f29038l069042l977418l289924J879139P332783Q484059O908163N220503
4933A8859225K007952k892770m880416k092255J81413j678860l278167p65831
$$ plain form
4925 5460291 7020656 6295657 2825622 1778633 5659195 11068192 14840422 17307267
4917 17307267 18730646 18525708 18351174 19927062 20206558 15441693 9210279 8668949 13467684
4908 13467684 16743374 16529691 17022907 18937278 18756255 17819502 21442537 28124873 30542973
4899 30542973 28218818 27711492 29395996 26879691 20952229 20005756 24178487 24073133 18489923
4890 18489923 17431694 23368086 26756514 25298042 28778555 38172265 40586958 33678419
4882 33678419 32921889 43964467 52200892 52934383 63653950 88472990 103103509 101224834
4874 101224834 117821737 163094840 167208041 56039551 -128634429 -253203373 -247147171
4867 -247147171 -173999097 -128421117 -122671449 -112747701 -86668511 -70735306 -72451433
$$ packed form
4925E460291J560365p24999l470035j046989L880562N408997L772230K466845
4917A7307267J423379k04938j74534J575888K79496m764865o231414n41330M798735
4908A3467684L275690k13683M93216J914371j81023r36753L623035O682336K418100
4899C0542973k324155n07326J684504k516305n927462r46473M172731j05354n583210
4890A8489923j058229N936392L388428j458472L480513R393710K414693o908539
4882C3678419p56530J1042578Q236425P33491J0719567K4819040J4630519j878675
4874A01224834J6596903M5273103M113201j11168490j84673980j24568944O056202
4867b47147171P3148074M5577980N749668R923748K6079190J5933205j716127
$$ plain form
4860 -72451433 -70758869 -57665811 -48320205 -49019557 -47955131 -40559096 -36871001 -39850969
4852 -39850969 -39481822 -32760329 -29430896 -33197169 -35026024 -30144426 -26026876 -28263702
4844 -28263702 -32112043 -33028051 -33438563 -34426754 -31836029 -25258374 -20926113 -21353764 -21210392
4835 -21210392 -17423510 -14642893 -16528429 -19638135 -20278702 -20378869 -22423980 -24693420
4827 -24693420 -25217831 -25061250 -24736845 -22597187 -19186177 -17834235 -18704274 -17722270 -13727949
4818 -13727949 -11189850 -13175500 -16705172 -17743261 -16106989 -12999584 -8426221 -3771848
4810 -3771848 -2603530 -6089256 -11171925 -15285661 -19046181 -22555870 -23536269 -21548962
4802 -21548962 -19856845 -20326604 -20265100 -17181040 -13210989 -11710858 -12290823 -12259284 -10847998
$$ packed form
4860g2451433J692564J3093058R345606o99352J064426P396035L688095k979968
4852c9850969L69147O721493L329433l766273j828855M881598M117550k236826
4844b8263702l848341r16008m10512r88191K590725O577655M332261m27651J43372
4835b1210392L786882K780617j885536l109706o40567j00167k045111k269440
4827b4693420n24411J56581L24405K139658L411010J351942q70039R82004L994321
4818a3727949K538099j985650l529672j038089J636272L107405M573363M654373
4810c771848J168318l485726n082669m113736l760520l509689r80399J987307
4802b1548962J692117m69759O1504L084060L970051J500131n79965L1539J411286
$$ plain form
4793 -10847998 -9465727 -9459666 -11375007 -14652512 -17025351 -16601872 -15314836 -17046903 -21128645
4784 -21128645 -21628266 -15474220 -7676551 -5227235 -8605380 -12941733 -15499648 -17813644
4776 -17813644 -21042605 -23165457 -21923798 -18295082 -15516532 -15280685 -15915718 -14704562
4768 -14704562 -11596851 -9437698 -9969525 -11143974 -10043262 -7236584 -5903918 -7312785
4760 -7312785 -9658053 -10997561 -10762458 -8673398 -5021378 -1957608 -1487340 -2105395 -734353
4751 -734353 1720637 671877 -5151305 -11006689 -12632972 -11918911 -13053986 -15695213 -15647522
4742 -15647522 -11135021 -5102849 -1497779 -1716998 -4739113 -8579894 -11013820 -10402514
4734 -10402514 -6966713 -2995558 -1201210 -2591191 -5955477 -9503440 -12624694 -15393215
$$ packed form
4793a0847998J382271O061j915341l277505k372839M23479J287036j732067m081742
4784b1128645m99621O154046P797669K449316l378145m336353k557915k313996
4776a7813644l228961k122852J241659L628716K778550K35847o35033J211156
4768a4704562L107711K159153n31827j174449J100712K806678J332666j408867
4760g312785k345268j339508K35103K089060L652020L063770M70268o18055J371042
4751g34353K454990j048760n823182n855384j626283P14061j135075k641227M7691
4742a5647522M512501O032172L605070k19219l022115l840781k433926O11306
4734a0402514L435801L971155J794348j389981l364286l547963l121254k768521
$$ plain form
4726 -15393215 -16893653 -15863735 -13265334 -11867394 -12166014 -11395926 -8613102 -7757333 -12099030
4717 -12099030 -17960065 -18670608 -13743725 -9115970 -8297775 -8467602 -6472896 -3699844 -2588342
4708 -2588342 -2342678 -1082503 642169 1296849 1074224 657804 -756530 -3793856 -6888856
4699 -6888856 -8190537 -8158235 -8336966 -8879611 -9185671 -9783546 -11588621 -14022089 -15445711
4690 -15445711 -14942313 -12710583 -9587338 -7006481 -6266354 -6913483 -7005036 -5776696 -4746554
4681 -4746554 -5392838 -7210459 -8910339 -9895736 -9543293 -6880209 -2528923 557995 198248
4672 198248 -1998921 -2334804 599765 4364710 5322324 2235398 -2689630 -6320422 -8202227
4663 -8202227 -10609323 -14221389 -15751268 -12477281 -7586530 -6975822 -10949584 -13537161
$$ packed form
4726a5393215j500438J029918K598401J397940k98620P70088K782824Q55769m341697
4717a2099030n861035p10543M926883M627755Q18195j69827J994706K773052J111502
4708b588342K45664J260175J724672O54680k22625m16420j414334l037326l095000
4699f888856j301681L2302j78731n42645l06060n97875j805075k433468j423622
4690a5445711N03398K231730L123245K580857P40127o47129r1553J228340J030142
4681d746554o46284j817621j699880r85397L52443K663084M351286L086918l59747
4672A98248k197169l35883K934569L764945R57614l086926m925028l630792j881805
4663h202227k407096l612066j529879L273987M890751O10708l973762k587577
$$ plain form
4655 -13537161 -11016143 -6676309 -5125722 -6033312 -6507315 -6215348 -6535839 -7225582 -7697264
4646 -7697264 -9614881 -14236549 -18433189 -17438756 -11337184 -5316705 -3257764 -4104026 -5049758
4637 -5049758 -5398770 -6014934 -7051553 -7911265 -8618867 -9986656 -12411299 -14927892 -15684413
4628 -15684413 -13618913 -9631234 -5671704 -2857851 -1220842 -909147 -2239689 -4594421
4620 -4594421 -6821981 -8804873 -10928492 -12098983 -10746572 -8276161 -8700102 -13454256
4612 -13454256 -18961246 -20985501 -19285011 -16185805 -12685552 -8371233 -3882336 -1101960
4604 -1101960 -1195726 -3554576 -6067486 -6186980 -3321264 -474365 -1250432 -4716297 -6113738
4595 -6113738 -3570006 -562509 -7067 138176 2377600 4403512 2521057 -1963257 -4121275
$$ packed form
4655a3537161K521018M339834J550587r07590m74003K91967l20491o89743m71682
4646g697264j917617m621668m196640R94433O101572O020479K058941q46262r45732
4637e049758l49012o16164j036619q59712p07602j367789k424643k516593p56521
4628a5684413K065500L987679L959530K813853J637009L11695j330542k354732
4620d594421k227560j982892k123619j170491J352411K470411m23941m754154
4612a3454256n506990k024255J700490L099206L500253M314319M488897K780376
4604a101960r3766k358850k512910j19494K865716K846899p76067l465865j397441
4595f113738K543732L007497N55442J45243K239424K025912j882455m484314k158018
$$ plain form
4586 -4121275 -2002516 1822048 4391143 4732266 2993584 329221 -1072752 -535172 -405193
4577 -405193 -2507170 -4841017 -4948464 -4536987 -6594764 -9419639 -8468357 -3812395 -903098
4568 -903098 -3274030 -8626585 -13053732 -15392591 -16252557 -16072491 -15538071 -15388926 -14884385
4559 -14884385 -12690499 -9595286 -7851213 -7725562 -7401226 -6191693 -4802729 -2681441
4551 -2681441 1101290 4199579 2583073 -3214370 -7686978 -7760654 -6509200 -7503137 -9612562
4542 -9612562 -10284690 -10266999 -11376132 -12282449 -10506736 -7071259 -5554285 -7249802 -10118042
4533 -10118042 -11925299 -11966475 -10292214 -7584710 -5417587 -4611513 -3748688 -1214973 1780406
4524 1780406 2290729 -462707 -4287376 -7212230 -9472030 -11648632 -12574894 -10602383 -6465847
$$ packed form
4586d121275K118759L824564K569095L41123j738682k664363j401973N37580J29979
4577d05193k101977k333847j07447M11477k057777k824875R51282M655962K909297
4568i03098k370932n352555m427147k338859q59966J80066N34420J49145N04541
4559a4884385K193886L095213J744073J25651L24336J209533J388964K121288
4551b681441L782731L098289j616506n797443m472608p3676J251454r93937k109425
4542i612562o72128J7691j109133r06317J775713L435477J516974j695517k868240
4533a0118042j807257m1176J674261K707504K167123Q06074Q62825K533715K995379
4524A780406N10323k753436l824669k924854k259800k176602r26262J972511M136536
$$ plain form
4515 -6465847 -3504185 -4365616 -7865402 -9922303 -7891673 -3310156 171675 797592 -318838
4506 -318838 -1496547 -2206869 -2582526 -2734591 -3037158 -4191124 -6618729 -10071471 -13406822
4497 -13406822 -14380882 -10972531 -4205048 1691156 3846147 4223291 6073312 8196764
4489 8196764 6310547 -125928 -6335219 -8293041 -6922862 -5009582 -3301292 -1588919
4481 -1588919 -738459 -1138303 -1063852 1103836 4280878 5928751 4681016 713679 -4655302
4472 -4655302 -8549390 -7995446 -3703898 -529381 -2102084 -6464937 -8935992 -7842334
4464 -7842334 -5371227 -3922336 -3709442 -3353350 -1370296 2296782 5394805 5246601 2267228
4455 2267228 -192772 -413951 -379278 -1908901 -3446306 -2922738 -1354172 -836407 -1030168
$$ packed form
4515f465847K961662q61431l499786k056901K030630M581517L481831O25917j116430
4506c18838j177709p10322l75657j52065l02567j153966k427605l452742l335351
4497a3406822r74060L408351O767483N896204K154991L77144J850021K123452
4489H196764j886217o436475o209291j957822J370179J913280J708290J712373
4481a588919Q50460l99844P4451K167688L177042J647873j247735l967337n368981
4472d655302l894088N53944M291548L174517j572703m362853k471055J093658
4464g842334K471107J448891K12894L56092J983054L667078L098023j48204k979373
4455B267228k460000k21179L4673j529623j537405N23568J568566N17765j93761
$$ plain form
4446 -1030168 -609787 -366091 -1598103 -2917656 -2162007 -456716 -863533 -3647406 -6279365
4437 -6279365 -7606678 -8538057 -8938029 -7575496 -5340438 -4845782 -6175679 -6455955 -4633428
4428 -4633428 -3484662 -5517099 -9587126 -12994252 -14579933 -14426557 -12678455 -10088395
4420 -10088395 -8005630 -6764327 -5650128 -4883212 -5453557 -6547668 -5925564 -3823117 -3490620
4411 -3490620 -6308805 -9340075 -9865325 -9595597 -11653651 -15616277 -18592900 -19526902 -19301357
4402 -19301357 -17947537 -15187522 -13013582 -14127057 -17544709 -18741082 -14892002 -7827477
4394 -7827477 -1370214 2214982 2817640 1703206 804671 1105102 1302039 -410090 -3330912
4385 -3330912 -5052574 -5127948 -5262894 -5556625 -3817382 97410 2523876 874948 -2369650
$$ packed form
4446a030168M20381K43696j232012j319553P55649J705291m06817k783873k631959
4437f279365j327313r31379l99972J362533K235058M94656j329897k80276J822527
4428d633428J148766k032437m070027l407126j585681J53376J748102K590060
4420a0088395K082765J241303J114199P66916n70345j094111O22104K102447L32497
4411c490620k818185l031270n25250K69728k058054l962626k976623r34002K25545
4402a9301357J353820K760015K173940j113475l417652j196373L849080P064525
4394g827477O457263L585196O02658j114434q98535L00431J96937j712129k920822
4385c330912j721662p5374j34946k93731J739243L914792K426466j648928l244598
$$ plain form
4376 -2369650 -3388362 -2659345 -3620922 -7084310 -10537200 -12518386 -14209430 -16280556 -17054728
4367 -17054728 -14730732 -9538249 -3267923 1713951 3270095 1528150 -176339 947609
4359 947609 2649730 187533 -6318687 -10882312 -9246233 -3811460 783139 3243631
4351 3243631 4282793 3456805 1005577 -10680 2449018 5356780 4364408 -11562 -3877642
4342 -3877642 -5936411 -7401188 -7255551 -3068933 3375439 6556865 4457049 820207
4334 820207 -1026870 -2064570 -3566046 -3804157 -1655230 114798 -1546126 -5498721 -8298134
4325 -8298134 -8597110 -7467213 -6348688 -6629878 -9055923 -11674336 -10898090 -6686848 -3796922
4316 -3796922 -5270140 -7745007 -6774155 -4077784 -4949858 -9974588 -14106674 -13754047 -10577967
$$ packed form
4376b369650j018712P29017r61577l463388l452890j981186j691044k071126p74172
4367a7054728K323996N192483O270326M981874J556144j741945j704489J123948
4359I47609J702121k462197o506220m563625J636079N434773M594599K460492
4351C243631J039162q25988k451228j016257K459698K907762r92372m375970l866080
4342c877642k058769j464777J45637M186618O444372L181426k099816l636842
4334H20207j847077j037700j501476k38111K148927J770028j660924l952595k799413
4325h298134k98976J129897J118525k81190k426045k618413P76246M211242K889926
4316c796922j473218k474867R70852K696371q72074n024730m132086L52627L176080
$$ plain form
4307 -10577967 -7865871 -6797309 -7123246 -8390394 -9268865 -7995340 -4587722 -981583
4299 -981583 1473584 2901355 3154531 1427209 -1768340 -4342393 -5335669 -6158544 -7996952
4290 -7996952 -9419140 -8026756 -3854693 81532 677025 -2266682 -5940448 -7288845
4282 -7288845 -5793836 -3386123 -1974102 -1926670 -2847517 -4356723 -5568295 -5253991 -3431743
4273 -3431743 -1565982 -433456 704010 1944023 1706033 -699468 -3294083 -3970231 -3118373
4264 -3118373 -1964651 -307120 1802075 2187628 -632422 -4368718 -5961665 -6304327 -8318747
4255 -8318747 -11302143 -11353706 -7375381 -2676743 -105506 768064 895876 -179533 -2250568
4246 -2250568 -3615985 -3751722 -4104079 -5079200 -5115256 -4001913 -3978788 -5677769 -5942003
$$ packed form
4307a0577967K712096J068562l25937j267148q78471J273525L407618L606139
4299i81583K455167J427771K53176j727322l195549k574053r93276q22875j838408
4290g996952j422188J392384M172063L936225N95493k943707l673766j348397
4282g288845J495009K407713J412021M7432r20847j509206j211572L14304J822248
4273c431743J865761J132526J137466J240013k37990k405501k594615o76148Q51858
4264c118373J153722J657531K109195L85553k820050l736296j592947l42662k014420
4255h318747k983396n1563L978325M698638K571237Q73570J27812j075409k071035
4246b250568j365417j35737l52357r75121l6056J113343K3125j698981k64234
$$ plain form
4237 -5942003 -2193114 3231556 5585126 2909341 -3279277 -10541991 -16312207 -17846830
4229 -17846830 -14333038 -8378368 -3238532 535854 3664242 4910591 2555041 -1514389
4221 -1514389 -2835330 -138939 3050165 3717526 3251166 4122763 5430412 4781022 2850815
4212 2850815 2334644 2851850 884114 -4380108 -8911038 -9495263 -8208156 -8401173 -9179701
4203 -9179701 -7842207 -5655094 -6184469 -8726237 -8923998 -6483272 -6625864 -11822002 -17259718
4194 -17259718 -17778543 -14935379 -13193609 -12718845 -10717045 -7521045 -6367706 -8084491
4186 -8084491 -10143385 -10597700 -9723027 -8309525 -7160006 -7547128 -9577607 -10982859 -9806057
4177 -9806057 -7038989 -4552525 -2345638 -124580 829050 35354 -658881 -732046 -2726173
$$ packed form
4237e942003L748889N424670K353570k675785o188618p262714n770216j534623
4229a7846830L513792N954670N139836L774386L128388J246349k355550m069430
4221a514389j320941K696391L189104O67361m66360Q71597J307649o49390j930207
4212B850815n16171N17206j967736n264222m530930n84225J287107j93017p78528
4203i179701J337494K187113n29375k541768j97761K440726j42592n196138n437716
4194a7259718n18825K843164J741770M74764K001800L196000J153339j716785
4186h084491k058894m54315Q74673J413502J149519l87122k030479j405252J176802
4177i806057K767068K486464K206887K221058R53630p93696o94235p3165j994127
$$ plain form
4168 -2726173 -6894683 -8241036 -3646610 2026990 2625974 -231248 -1146781 -346331 -1659932
4159 -1659932 -4165776 -4031982 -2427637 -3250869 -5044322 -3896624 -2219179 -5030433 -9609344
4150 -9609344 -9614775 -7699934 -11875783 -20476714 -24271218 -23090389 -25218680 -29977991 -28582431
4141 -28582431 -24218100 -30544044 -45488815 -51147821 -49950790 -72205733 -125759680 -163552870
4133 -163552870 -134798512 -55365576 7855176 18520410 2747239 -2041563 5681454
4126 5681454 8814615 6399933 8903126 15786315 18734339 18238649 20494145 23858983
4118 23858983 21900913 15388059 10054338 6380259 1304217 -3620841 -4722406 -3600021
4110 -3600021 -3965243 -4288583 -1318887 2094509 563568 -4583919 -6996513 -4831939 -1899187
$$ packed form
4168b726173m168510j346353M594426N673600N98984k857222r15533Q00450j313601
4159a659932k505844J33794J604345q23232j793453J147698J677445k811254m578911
4150i609344n431J914841m175849q600931l794504J180829k128291m759311J395560
4141b8582431M364331o325944j4944771n659006J197031k2254943n3553947l7793190
4133a63552870K8754358P9432936O3220752J0665234j5773171m788802P723017
4126E681454L133161k414682K503193O883189K948024m95690K255496L364838
4118B3858983j958070o512854n333721l674079n076042m925058j101565J122385
4110c600021l65222l23340K969696L413396j530941n147487k412594K164574K932752
$$ plain form
4101 -1899187 -307071 1704205 4803389 6801802 6241393 4087351 2085997 2035563 5261926
4092 5261926 10251181 12885281 11606245 9673871 9692257 9510007 6972686 4701546 5554492
4083 5554492 6937378 4925842 1153813 104990 1918590 3457015 4518957 7192311
4075 7192311 10425098 11029265 9365307 8661586 9165082 8109020 5244456 3481252 4013161
4066 4013161 5262510 6475869 7947549 8011808 4541155 -539910 -2820193 -1572481 124461
4057 124461 1270376 3785331 7036291 7099910 3146904 -382250 -191205 1561120 1757924
4048 1757924 1208830 2123796 3768418 3684115 1265783 -2213239 -5426781 -6994713 -5483214
4039 -5483214 -1346887 2531422 3855204 3278566 2614643 2151691 1055432 -810239 -2728382
$$ packed form
4101a899187J592116K011276L099184J998413n60409k154042k001354n0434L226363
4092E261926M989255K634100j279036j932374J8386j82250k537321k271140Q52946
4083E554492J382886k011536l772029j048823J813600J538425J061942K673354
4075G192311L232787O04167j663958p03721N03496j056062k864564j763204N31909
4066D013161J249349J213359J471680O4259l470653n081065k280283J247712J696942
4057A24461J145915K514955L250960O3619l953006l529154J91045J752325J96804
4048A757924n49094R14966J644622q4303k418332l479022l213542j567932J511499
4039e483214M136327L878309J323782n76638o63923m62952j096259j865671j918143
$$ plain form
4030 -2728382 -3913899 -3698241 -1984175 -115155 -47424 -1902528 -3408871 -2493838 369970
4021 369970 2812087 2805288 171202 -3254401 -4932602 -3921950 -1708612 -107941 827270
4012 827270 1715724 1860120 240070 -2248352 -3526784 -2846917 -898756 1725374 4262030
4003 4262030 5117781 3886478 2907490 4054285 5198005 3312217 66637 34812 3531571
3994 3531571 5867871 4424674 1833094 626126 -741049 -4045023 -7304758 -7765328
3986 -7765328 -6147482 -4973203 -4745625 -4443338 -4054824 -4191667 -4597892 -4976993 -5786813
3977 -5786813 -6632125 -5849129 -3438836 -2100872 -3097314 -3403123 140822 5668854 8482671
3968 8482671 7232650 4838692 4027983 4916051 6542397 7869486 7272807 3729903 -1057102
$$ packed form
4030b728382j185517K15658J714066J869020O7731j855104j506343R15033K863808
4021C69970K442117o799k634086l425603j678201J010652K213338J600671R35211
4012H27270Q88454J44396j620050k488422j278432O79867J948161K624130K536656
4003D262030Q55751j231303r78988J146795J143720j885788l245580l1825L496759
3994C531571K336300j443197k591580j206968j367175l303974l259735m60570
3986g765328J617846J174279K27578L02287L88514j36843m06225l79101q09820
3977e786813q45312P82996K410293J337964r96442l05809L543945N528032K813817
3968H482671j250021k393958q10709Q88068J626346J327089n96679l542904m787005
$$ plain form
3959 -1057102 -3787952 -3129146 -516200 2377658 4895611 6225005 5539820 4067521 4746376
3950 4746376 8400715 11790029 11094171 6562412 2234161 1338926 3319395 5590006 6921360
3941 6921360 7988626 9160420 9430780 8195012 6745630 6607896 7130127 6349015 3853810
3932 3853810 988436 -1622180 -4609029 -7656410 -9097956 -8568791 -7819334 -7580272 -5752282
3923 -5752282 -616981 5753752 9440583 9140889 6989726 5778492 6857920 9733331
3915 9733331 11986993 10602998 5393868 397742 -254307 2566502 4170144 2159541
3907 2159541 -914849 -1412194 982278 3756743 5054756 5222479 5273659 4992429 3181032
3898 3181032 -352188 -3848301 -5385214 -5051015 -4055784 -2229064 1282377 4675811 4118699
$$ packed form
3959a057102k730850O58806K612946K893858K517953J329394o85185j472299O78855
3950D746376L654339L389314o95858m531759m328251q95235J980469K270611J331354
3941F921360J067266J171794K70360j235768j449382j37734N22231p81112k495205
3932C853810k865374k610616k986849l047381j441546N29165P49457K39062J827990
3923e752282N135301O370733L686831k99694k151163j211234J079428K875411
3915I733331K253662j383995n209130m996126o52049K820809J603642k010603
3907B159541l074390m97345K394472K774465J298013J67723N1180k81230j811397
3898C181032l533220l496113j536913L34199R95231J826720L511441L393434n57112
$$ plain form
3889 4118699 -475589 -3264468 781954 8861600 13651884 12495834 9310380 7678084
3881 7678084 6537354 3947167 1030502 -480583 -1829663 -5148666 -9163559 -10058597
3873 -10058597 -6452389 -1143509 2483892 3996829 5101410 6605790 7485106 6710692
3865 6710692 4888410 3502156 3017453 2584499 1652801 962028 1389536 2440276 2559690
3856 2559690 650413 -3052428 -7050573 -9211951 -8226823 -5039693 -1986652 -71028
3848 -71028 1564598 2858266 1722379 -2478577 -6415612 -6640810 -4631254 -4649856 -7291192
3839 -7291192 -8991533 -8056098 -6966653 -7441017 -7254670 -4359601 -784878 625520 696356
3830 696356 1665799 2526852 675675 -2871669 -4193161 -2459976 -1273886 -3166092 -6344345
$$ packed form
3889D118699m594288k788879M046422Q079646M790284j156050l185454j632296
3881G678084j140730k590187k916665j511085j349080l319003m014893q95038
3873a0058597L606208N308880L627401J512937J104581J504380Q79316p74414
3865F710692j822282j386254m84703m32954r31698o90773M27508J050740J19414
3856B559690j909277l702841l998145k161378R85128L187130L053041J915624
3848g1028J635626J293668j135887m200956l937035k25198K009556j8602k641336
3839g291192j700341R35435J089445m74364J86347K895069L574723J410398P0836
3830F96356R69443Q61053j851177l547344j321492J733185J186090j892206l178253
$$ plain form
3821 -6344345 -8390231 -9866591 -11899081 -12810380 -10247636 -5250604 -1274871 117661
3813 117661 -41504 -1092696 -3278778 -5137625 -3719985 1118712 5276766 5355339 3168891
3804 3168891 2967980 5580456 8119620 8855367 9247724 10647733 11710636 10475850 7242262
3795 7242262 3906241 1522092 -290239 -2256430 -4591176 -6552128 -6497683 -3544329 431552
3786 431552 2036544 414766 -1620198 -1587988 -558511 -695455 -1494350 -943138 905584
3777 905584 2403932 3623774 6075680 9098864 9677492 6767686 3184424 1774384 1721717
3768 1721717 291354 -3158347 -6594113 -8036862 -7537219 -6653907 -6716753 -7478092 -7288720
3759 -7288720 -4965173 -1360519 1572530 2978257 3368812 3120584 2254086 1664478 2774315
$$ packed form
3821f344345k045886j476360k032490r11299K562744M997032L975733J392532
3813A17661j59165j051192k186082j858847J417640M838697M158054P8573k186448
3804C168891k00911K612476K539164P35747L92357J400009J062903j234786l233588
3795G242262l336021k384149j812331j966191k334746j960952N4445K953354L975881
3786D31552J604992j621778k034964L2210J029477j36944p98895N51212J848722
3777I05584J498348J219842K451906L023184N78628k909806l583262j410040n2667
3768A721717j430363l449701l435766j442749M99643Q83312o2846p61339J89372
3759g288720K323547L604654K933049J405727L90555k48228q66498n89608J109837
$$ plain form
3750 2774315 5487316 8026977 9314356 9955868 10300631 9282822 6287392 2750476 593624
3741 593624 -77547 -735668 -2610655 -5748839 -9079040 -10967444 -10642133 -9312619 -8707508
3732 -8707508 -8522113 -7120729 -4870730 -4149913 -5061846 -4003964 1396779 8134683 11168699
3723 11168699 9457003 6255043 4645642 5205047 6975421 8062946 6055607 660965
3715 660965 -4459757 -5272947 -2721453 -1776913 -4919619 -9212635 -10436343 -7649942 -2815857
3706 -2815857 1746704 4293212 3985054 1769930 -248825 -1222843 -2116839 -3339976 -3665129
3697 -3665129 -2605034 -2057847 -3878653 -7043135 -9067329 -9497843 -10090373 -11703174 -12840902
3688 -12840902 -11879019 -9507274 -7864182 -7560032 -6748695 -3896377 -726326 -685054 -4083010
$$ packed form
3750B774315K713001K539661J287379O41512L44763j017809k995430l536916k156852
3741E93624o71171o58121j874987l138184l330201j888404L25311J329514O05111
3732h707508J85395J401384K249999P20817r11933J057882N400743O737904L034016
3723A1168699j711696l201960j609401N59405J770374J087525k007339n394642
3715F60965n120722q13190K551494R44540l142706m293016j223708K786401M834085
3706b815857M562561K546508l08158k215124k018755r74018q93996j223137l25153
3697c665129J060095N47187j820806l164482k024194m30514n92530j612801j137728
3688a2840902R61883K371745J643092L04150Q11337K852318L170051M1272l397956
$$ plain form
3679 -4083010 -6785722 -5443659 -2442827 -2971935 -7898348 -12772897 -14151492 -13498537 -13522057
3670 -13522057 -13863352 -12847046 -11177070 -10975321 -12409269 -13863910 -14545831 -14469503 -12682143
3661 -12682143 -8233309 -2649627 1162013 2621929 3787724 5814147 7531384 8014299
3653 8014299 8069761 8176467 7209411 4631574 2117468 1396953 1892004 1992853 1335444
3644 1335444 203164 -1936766 -5109026 -6900060 -4387074 1871717 7801899 10245605
3636 10245605 9840677 8968138 8398056 7018513 4010174 256951 -2269471 -2281538 -610289
3627 -610289 347191 -682273 -2096456 -1617589 42067 -274255 -3473261 -6374043 -6111623
3618 -6111623 -4408310 -4997817 -7957589 -9626732 -8122421 -5875594 -5530211 -5841864 -3811615
$$ packed form
3679d083010k702712J342063L000832n29108m926413m874549j378595O52955k3520
3670a3522057l41295J016306J669976K01749j433948j454641o81921P6328J787360
3661a2682143M448834N583682L811640J459916J165795K026423J717237M82915
3653H014299N5462J06706r67056k577837k514106p20515M95051J00849o57409
3644A335444j132280k139930l172260j791034K512986O258791N930182K443706
3636A0245605m04928q72539n70082j379543l008339l753223k526422j2067J671249
3627f10289R57480j029464j414183M78867J659656l16322l199006k900782K62420
3618f111623J703313n89507k959772j669143J504311K246827L45383l11653K030249
$$ plain form
3609 -3811615 430706 3284977 2177251 -1410344 -4033212 -4339431 -4146468 -5801878 -9301402
3600 -9301402 -12379251 -13035568 -11278623 -8404702 -5567483 -3607919 -3197342 -3852006 -3490163
3591 -3490163 -660153 2948164 3972953 1608314 -1276050 -1637666 755331 4276300
3583 4276300 7394645 8718245 7042025 2969436 -714084 -1544009 811508 5820062
3575 5820062 12989336 20131054 23249670 20728175 15916823 13002719 11957051 10318568
3567 10318568 7979057 6369983 4400489 -38960 -4932249 -5548463 -1669719 1508440
3559 1508440 1125179 381976 2218058 4201848 3478107 2660219 5767169 10821741 11926487
3550 11926487 7964269 4350957 5580396 9852446 12263677 10549932 6328495 2473938
$$ packed form
3609c811615M242321K854271j107726l587595k622868l06219J92963j655410l499524
3600i301402l077849o56317J756945K873921K837219J959564M10577o54664L61843
3591c490163K830010L608317J024789k364639k884364l61616K392997L520969
3583D276300L118345J323600j676220m072589l683520q29925K355517N008554
3575E820062P169274P141718L118616k521495m811352k914104j045668j638483
3567A0318568k339511j609074j969494m439449m893289o16214L878744L178159
3559A508440l83261p43203J836082J983790p23741q17888L106950N054572J104746
3550A1926487l962218l613312J229439M272050K411231j713745m221437l854557
$$ plain form
3542 2473938 520642 -105503 -811855 -1655276 -1071538 1756901 5540033 8746961 11107282
3533 11107282 11949191 9331466 3215413 -2529581 -4401795 -4048864 -5416666 -8487684
3525 -8487684 -9886402 -8883225 -8102747 -8060742 -5882545 -864097 3136429 3171413 1469467
3516 1469467 1608163 3355022 4080261 2913442 647828 -2607859 -6785797 -10120419 -10680191
3507 -10680191 -8907098 -6646184 -4541444 -2276323 -464574 -287396 -1756643 -3891902
3499 -3891902 -6060628 -7919479 -8893396 -8975184 -9117971 -9671537 -9537831 -8021024 -6157414
3490 -6157414 -4957590 -3947129 -2978227 -3678452 -7051571 -11163731 -13349029 -13308699 -12002689
3481 -12002689 -9341958 -5643906 -3480033 -4541514 -5880887 -3128560 3068218 7613646
$$ packed form
3542B473938j953296o26145p06352q43421N83738K828439L783132L206928K360321
3533A1107282Q41909k617725o116053n744994j872214L52931j367802l071018
3525h487684j398718J003177P80478M2005K178197N018448M000526L4984j701946
3516A469467J38696J746859P25239j166819k265614l255687m177938l334622n59772
3507a0680191J773093K260914K104740K265121J811749J77178j469247k135259
3499c891902k168726j858851r73917q1788j42787n53566J33706J516807J863610
3490f157414J199824J010461R68902p00225l373119m112160k185298M0330J306010
3481a2002689K660731L698052K163873j061481j339373K752327O196778M545428
$$ plain form
3473 7613646 7794460 5652896 3353678 449391 -3056510 -4933136 -4169898 -3223383 -4597376
3464 -4597376 -7424076 -9342866 -9713300 -9154085 -7834278 -6076687 -5003297 -4923792 -4634269
3455 -4634269 -3642356 -3169550 -3538807 -2957483 -943631 -518193 -4057951 -8766328 -9662755
3446 -9662755 -6177847 -2488495 -1596525 -2227458 -1927579 -394816 1223197 2231231 2431582
3437 2431582 1569752 -369131 -2954257 -5569500 -7306578 -7169167 -5521839 -4608283 -5962325
3428 -5962325 -7907108 -7706634 -5796950 -5262663 -6906850 -7769708 -5696163 -2712368 -1916515
3419 -1916515 -3032898 -3466529 -2528927 -2003074 -2848112 -3701119 -3029225 -987144 1511208
3410 1511208 4215618 7177922 9817819 11229725 11117146 9907987 8160633 6211139
$$ packed form
3473G613646J80814k141564k299218k904287l505901j876626P63238R46515j373993
3464d597376k826700j918790l70434N59215J319807J757591J073390P9505K89523
3455d634269R91913M72806l69257N81324K013852M25438l539758m708377q96427
3446i662755L484908L689352Q91970o30933K99879J532763J618013J008034K00351
3437B431582q61830j938883k585126k615243j737078J37411J647328R13556j354042
3428e962325j944783K00474J909684N34287j644187q62858K073545K983795P95853
3419a916515j116383m33631R37602N25853q45038q53007O71894K042081K498352
3410A511208K704410K962304K639897J411906j12579j209159j747354j949494
$$ plain form
3402 6211139 4228687 2315909 596476 -713534 -1483412 -1997428 -2869403 -4406079 -6134583
3393 -6134583 -7120659 -6728334 -4982654 -2288079 933412 4097459 6018261 5098160 630375
3384 630375 -5820715 -10825481 -11620604 -8469117 -4250119 -1699378 -1397643 -2317166 -3383969
3375 -3383969 -3928463 -3421076 -1931419 -621697 -581606 -1055911 -69478 2716979 5027836
3366 5027836 4803051 3025568 2386240 3619191 4614835 3256130 -27721 -2916251 -3732015
3357 -3732015 -3109983 -3530081 -6943919 -12232081 -15436509 -13560378 -7955379 -2857425 -776229
3348 -776229 -689470 -657345 -287130 78142 865215 2631427 4907193 6772616 7794743
3339 7794743 7562865 5448907 2138597 396358 2460728 6911330 9788700 9048248 6555571
$$ packed form
3402F211139j982452j912778j719433j310010p69878n14016q71975j536676j728504
3393f134583r86076L92325J745680K694575L221491L164047J920802r20101m467785
3384F30375o451090n004766p95123L151487M218998K550741L01735r19523j066803
3375c383969n44494N07387J489657J309722M0091m74305R86433K786457K310857
3366E027836k24785j777483o39328J232951R95644j358705l283851k888530q15764
3357c732015O22032m20098l413838n288162l204428J876131N604999N097954K081196
3348g76229Q6759L2125L70215L65272P87073J766212K275766J865423J022127
3339G794743k31878k113958l310310j742239K064370M450602K877370p40452k492677
$$ plain form
3330 6555571 5242641 5507839 5345969 3412672 823774 -375108 119844 552714 -410961
3321 -410961 -1763905 -1597569 62894 1273662 1159153 1364861 3614581 6781867 7547306
3312 7547306 3796668 -3093257 -9039220 -10287487 -6577951 -1591655 737758 683829 2263889
3303 2263889 7845134 14829844 18807667 18522987 16165068 13891718 11984078 10003469
3295 10003469 8123478 7212929 8273837 11248239 13918482 13406862 9869687 7074619
3287 7074619 7607974 9108205 7545058 2878849 -1352271 -3150356 -3548090 -3319882 -1699259
3278 -1699259 991657 2516304 1729533 78783 -878181 -1235084 -1145408 64268 1883824
3269 1883824 2018246 -536045 -3649674 -4891167 -4536123 -4217136 -4263771 -4111010 -3813070
$$ packed form
3330F555571j312930K65198j61870j933297k588898j198882M94952M32870r63675
3321d10961j352944J66336J660463J210768j14509K05708K249720L167286P65439
3312G547306l750638o889925n945963j248267L709536M986296K329413n3929J580060
3303B263889N581245O984710L977823k84680k357919k273350j907640j980609
3295A0003469j879991r10549J060908K974402K670243n11620l537175k795068
3287G074619N33355J500231j563147m666209m231120j798085l97734K28208J620623
3278a699259K690916J524647p86771j650750r56964l56903Q9676J209676J819556
3269A883824J34422k554291l113629j241493L55044L18987m6635J52761K97940
$$ plain form
3260 -3813070 -3312326 -1624126 1264511 2992114 1598729 -1210189 -1972513 -226720 891921
3251 891921 -1183178 -5551312 -9208054 -9789637 -7103070 -3552822 -2879236 -6541394 -11094776
3242 -11094776 -11007018 -4665139 3949329 9993173 12280521 12210785 10408525 6721720 2598917
3233 2598917 858549 2577502 5817869 8075822 8751902 8556894 7823022 6604148 5471379
3224 5471379 4722606 3440728 1006591 -940620 -232509 2119205 2561629 214942 -1278784
3215 -1278784 1077130 5103729 6730445 5790017 5107407 5090947 3368602 -191530 -2244734
3206 -2244734 -988610 1019857 916094 -330418 -5793 2093363 3730415 3419518 1832823
3197 1832823 753491 1599375 4101218 6040088 5684294 4552673 5511371 7885843 7663111
$$ packed form
3260c813070N00744J688200K888637J727603j393385k808918p62324J745793J118641
3251H91921k075099m368134l656742n81583K686567L550248O73586l662158m553382
3242a1094776Q7758O341879Q614468O043844K287348o9736j802260l686805m122803
3233B598917j740368J718953L240367K257953O76080j95008p33872j218874j132769
3224E471379p48773j281878k434137j947211P08111K351714M42424k346687j493726
3215a278784K355914M026599J626716r40428o82610j6460j722345l560132k053204
3206b244734J256124K008467j03763j246512L24625K099156J637052l10897j586695
3197A832823j079332Q45884K501843J938870l55794j131621R58698K374472k22732
$$ plain form
3188 7663111 3683372 -14413 -299143 125198 -2725602 -7550453 -9986249 -9436471 -8997683
3179 -8997683 -9472862 -8281248 -4645633 -1506955 -1062549 -1881121 -1871499 -1185664 -684196
3170 -684196 -158259 199731 -1176101 -4726000 -7940797 -8052740 -5540748 -3220358 -2505329
3161 -2505329 -2146871 -459718 2466623 4972116 5569930 4239884 2180173 497076 -549551
3152 -549551 -987419 -548710 812819 2419788 3511136 3806132 3030564 1111502 -283253
3143 -283253 1858048 7909725 13209482 12348609 5678665 -931760 -3027385 -1862396 -1255079
3134 -1255079 -2673491 -4918374 -6916873 -8779304 -10406187 -10455358 -7368688 -1579461 3533799
3125 3533799 4019119 -396135 -5254750 -5819852 -1896348 3057832 6500695 8300485 8412331
$$ packed form
3188G663111l979739l697785k84730M24341k850800m824851k435796N49778M38788
3179h997683m75179J191614L635615L138678M44406q18572R622O85835N01468
3170f84196N25937L57990j375832l549899l214797j11943K511992K320390P15029
3161b505329L58458J687153K926341K505493N97814j330046k059711j683097j046627
3152e49551m37868M38709J361529J606969J091348K94996p75568j919062j394755
3143b83253K141301O051677N299757q60873o669944o610425k095625J164989O07317
3134a255079j418412k244883j998499j862431j626883m9171L086670N789227N113260
3125C533799M85320m415254m858615n65102L923504M954180L442863J799790J11846
$$ plain form
3116 8412331 6116818 2286704 -12719 1387775 5316883 8793619 9991960 9122560
3108 9122560 7448685 6159324 5631736 5362579 4707855 3306521 675131 -3278847 -6599785
3099 -6599785 -6087412 -1522368 2787826 3135976 1301057 1214209 2541378 1866976 -712980
3090 -712980 -1307374 1064039 2529338 594305 -2247337 -3152569 -2949331 -3004748 -2013347
3081 -2013347 911933 3150416 1959110 -1536897 -4804339 -7884759 -11655980 -14410123
3073 -14410123 -13879846 -11139736 -8985968 -7615551 -5234066 -1920627 503802 1814108
3065 1814108 3329533 4832608 4574162 2365592 18259 -1394638 -2396661 -3244843 -3470123
3056 -3470123 -3387026 -3981566 -5042067 -5142790 -3756848 -2091339 -1774070 -3526258 -6503552
$$ packed form
3116H412331k295513l830114k299423J400494L929108L476736J198341q69400
3108I122560j673875j289361n27588k69157o54724j401334k631390l953978l320938
3099f599785N12373M565044M310194L48150j834919q6848J327169o74402k579956
3090g12980n94394K371413J465299j935033k841642r05232K03238n5417R91401
3081b013347K925280K238483j191306l496007l267442l080420l771221k754143
3073a4410123N30277K740110K153768J370417K381485L313439K424429J310306
3065A814108J515425J503075k58446k208570k347333j412897j002023q48182k25280
3056c470123Q3097n94540j060501j00723J385942J665509L17269j752188k977294
$$ plain form
3047 -6503552 -8131997 -5954141 -1004946 2239040 1107958 -1764004 -2464159 -1453764
3039 -1453764 -2053372 -4737362 -6835112 -7433138 -8532689 -10817188 -11930614 -10216358 -7267334
3030 -7267334 -5327590 -4426561 -3411551 -1919241 -80449 2169994 4378646 5359411 4470409
3021 4470409 2212212 -539154 -2688595 -2647574 123975 3236079 3243987 -4063 -2830463
3012 -2830463 -2203396 1061393 4212510 5756270 5835302 5247614 5319129 7312738 10660495
3003 10660495 12792086 11820097 8624931 5475060 3445541 2095519 1011062 626921
2995 626921 1530997 3408420 4931831 5092814 4757822 6028411 9388044 12452841 12642653
2986 12642653 10210297 7392356 5596270 4987936 5678995 7131519 7257982 4698754 1605735
$$ packed form
3047f503552j628445K177856M949195L243986j131082k871962p00155J010395
3039a453764n99608k683990k097750n98026j099551k284499j113426J714256K949024
3030g267334J939744R01029J015010J492310J838792K250443K208652R80765q89002
3021D470409k258197k751366k149441M1021K771549L112104P908l248050k826400
3012b830463O27067L264789L151117J543760P9032n87688P1515J993609L347757
3003A0660495K131591r71989l195166l149871k029519j350022j084457l84141
2995F26921R04076J877423J523411J60983l34992J270589L359633L064797J89812
2986A2642653k432356k817941j796086o08334O91059J452524J26463k559228l093019
$$ plain form
2977 1605735 1496267 4337921 6354465 4939144 1235679 -2475772 -5242860 -6538943
2969 -6538943 -5538643 -2712323 -404368 -656100 -3496632 -7500406 -10482456 -9992148 -5597239
2960 -5597239 -791396 118094 -2474361 -3814932 -1227996 2842989 5165942 5747753 5889711
2951 5889711 5404948 4070796 3260363 3721691 3943486 3003075 2696867 4195867 4884716
2942 4884716 1889450 -2865360 -4831425 -3355791 -2416467 -4748892 -8552381 -10931703
2934 -10931703 -11819769 -12761891 -13531383 -12099549 -7789105 -2956527 -763805 -1723279 -3325851
2925 -3325851 -3148050 -1213001 1243067 3721113 5590073 4840611 499688 -4385106 -5404971
2916 -5404971 -2582413 -289475 -841592 -1656489 -25139 2780280 4124328 3621012 1836610
$$ packed form
2977A605735j09468K841654K016544j415321l703465l711451k767088j296083
2969f538943J000300K826320K307955k51732k840532m003774k982050M90308M394909
2960e597239M805843R09490k592455j340571K586936M070985K322953N81811J41958
2951E889711m84763j334152q10433M61328K21795r40411l06208J499000O88849
2942D884716k995266m754810j966065J475634R39324k332425l803489k379322
2934a0931703q88066r42122p69492J431834M310444M832578K192722r59474j602572
2925c325851J77801J935049K456068K478046J868960p49462m340923m884794j019865
2916e404971K822558K292938n52117q14897J631350K805419J344048n03316j784402
$$ plain form
2907 1836610 -1686056 -6297524 -8625786 -6350581 -2015853 -172018 -1925708 -4799850
2899 -4799850 -6660190 -7196685 -6562320 -4951935 -2868001 -289557 3114083 5811478 4925964
2890 4925964 735135 -2339412 -1820267 -954104 -2916762 -4761431 -2159574 2574268 3356341
2881 3356341 -179331 -2655278 -2249499 -3140994 -7193714 -9713355 -6697800 -1242587 1195249
2872 1195249 300139 -263500 1020345 2367336 2270859 1046981 -528319 -1816184 -2079473
2863 -2079473 -1342835 -928645 -1937083 -3942976 -6035395 -7944933 -9172287 -8399356 -5098689
2854 -5098689 -678468 3175719 6377604 9612950 12557708 13994889 13092862 9946226
2846 9946226 5684613 2506403 2380431 4836755 6936569 6206265 2961313 -577943 -2498072
$$ packed form
2907A836610l522666m611468k328262K275205M334728J843835j753690k874142
2899d799850j860340n36495O34365J610385K083934K578444L403640K697395q85514
2890D925964m190829l074547N19145Q66163j962658j844669K601857M733842P82073
2881C356341l535672k475947M05779q91495m052720k519641L015555N455213K437836
2872A195249q95110n63639J283845J346991r6477j223878j575300j287865k63289
2863b079473P36638M14190j008438k005893k092419j909538j227354P72931L300667
2854e098689M420221L854187L201885L235346K944758J437181r02027l146636
2846I946226m261613l178210j25972K456324K099814p30304l244952l539256j920129
$$ plain form
2837 -2498072 -2232068 -581500 797774 883880 475490 847777 1381382 191650 -2765675
2828 -2765675 -5181680 -5524734 -4801095 -4516232 -4822697 -5571409 -7162278 -9047440 -9190458
2819 -9190458 -6551562 -2722166 193410 1796505 2222252 734237 -2396508 -4211069
2811 -4211069 -2059952 2287481 4175193 1846828 -1558216 -2351361 -634206 848504
2803 848504 734503 214446 564190 1135929 448284 -1664023 -4040672 -5971275 -7712479
2794 -7712479 -9061131 -8799429 -6391533 -3222722 -1257064 -1374272 -3724761 -8135780 -12742221
2785 -12742221 -13978041 -10369267 -5285705 -3305203 -4552127 -5391187 -4089466 -2450001
2777 -2450001 -1883244 -1524153 -1034262 -1785504 -3874908 -5087362 -4541242 -4575063 -7109562
$$ packed form
2837b498072K66004J650568J379274Q6106m08390L72287N33605j189732k957325
2828b765675k416005l43054P23639K84863l06465p48712j590869j885162j43018
2819i190458K638896L829396K915576J603095M25747j488015l130745j814561
2811d211069K151117M347433J887712k328365l405044p93145J717155J482710
2803H48504j14001n20057L49744N71739o87645k112307k376649j930603j741204
2794g712479j348652K61702K407896L168811J965658j17208k350489m411019m606441
2785a2742221j235820L608774N083562J980502j246924q39060J301721J639465
2777b450001N66757L59091M89891p51242k089404j212454N46120l3821k534499
$$ plain form
2768 -7109562 -10670142 -13060136 -14602522 -16394370 -17377642 -15703481 -11638460 -6971436
2760 -6971436 -2802978 208823 869258 -1217996 -4485660 -7289826 -9621337 -11358509
2752 -11358509 -10726798 -6840865 -2243867 -259258 -766617 -1025319 160318 1549194 2093376
2743 2093376 1980645 1242784 -508650 -2834078 -4566149 -5280241 -5673106 -6742546 -9148321
2734 -9148321 -12417891 -14242005 -12277170 -7659053 -4634017 -5193053 -6357303 -4752315
2726 -4752315 -1347151 1030408 2370704 4131246 5257240 3773686 1179076 873834
2718 873834 2578806 2456771 -1155562 -6045132 -10300396 -14102615 -16731243 -16006579 -12258092
2709 -12258092 -9286317 -9485532 -10824868 -10317953 -7846570 -4961465 -2532592 -1390475
$$ packed form
2768g109562l560580k389994j542386j791848r83272J674161M065021M667024
2760f971436M168458L011801O60435k087254l267664k804166k331511j737172
2752a1358509O31711L885933M596998J984609n07359k58702J185637J388876N44182
2743B093376j12731p37861j751434k325428j732071p14092l92865j069440k405775
2734i148321l269570j824114J964835M618117L025036n59036j164250J604988
2726d752315L405164K377559J340296J760542J125994j483554k594610l05242
2718H73834J704972j22035l612333m889570m255264l802219k628628P24664L748487
2709a2258092K971775j99215j339336N06915K471383K885105K428873J142117
$$ plain form
2701 -1390475 -2829417 -6352850 -8828013 -7883956 -4707550 -2029776 -1088665 -2043287 -5283815
2692 -5283815 -10134321 -13782853 -13888050 -11499395 -9516141 -8941031 -8467772 -7316382 -6618974
2683 -6618974 -7689269 -9976035 -11222407 -9595012 -5772613 -2638077 -2259525 -3584450
2675 -3584450 -4152767 -3455161 -2840185 -2573294 -1537208 -145224 -758843 -4011687 -7077057
2666 -7077057 -7144590 -4687604 -1735689 1163343 4341424 6983495 7901525 7394173 6469427
2657 6469427 5019392 2570552 247481 148002 2730609 5949982 7039434 4784403 656288
2648 656288 -1959385 -745258 2706824 4127174 1220718 -4163252 -8937790 -11960352
2640 -11960352 -13345785 -12769679 -10380612 -7985714 -7323162 -7911932 -8050756 -7093301 -5575441
$$ packed form
2701a390475j438942l523433k475163R44057L176406K677774R41111r54622l240528
2692e283815m850506l648532j05197K388655J983254N75110M73259J151390O97408
2683f618974j070295k286766j246372J627395L822399L134536L78552j324925
2675c584450n68317O97606O14976K66891J036086J391984o13619l252844l065370
2666g077057o7533K456986K951915K899032L178081K642071R18030n07352r24746
2657F469427j450035k448840k323071r9479K582607L219373J089452k255031m128115
2648F56288k615673J214127L452082J420350k906456n383970m774538l022562
2640a1960352j385433N76106K389067K394898O62552n88770j38824R57455J517860
$$ plain form
2631 -5575441 -4233182 -4021723 -5682008 -8103688 -8909520 -8077137 -8705614 -12077791 -14414276
2622 -14414276 -11665632 -5611459 -1427957 -422316 590518 3025600 4135631 1856728
2614 1856728 -1772409 -3830974 -4376865 -5185607 -6608670 -7479979 -6981205 -5433553 -4055204
2605 -4055204 -4229269 -5807103 -6302137 -3662609 249413 1403169 -955118 -3530133 -4410965
2596 -4410965 -5866938 -9789844 -13468277 -12975333 -8816415 -4998026 -3587773 -3248091 -2533353
2587 -2533353 -1550799 -312044 1720945 3909756 4762213 4769212 6465222 10276393 12510650
2578 12510650 9687945 3551607 -742370 -988331 41436 -783056 -2920755 -4133305
2570 -4133305 -4266645 -4596991 -4639814 -2681566 553350 1917074 570502 -104931 2834882
$$ packed form
2631e575441J342259K11459j660285k421680q05832Q32383o28477l372177k336485
2622a4414276K748644O054173M183502J005641J012834K435082J110031k278903
2614A856728l629137k058565n45891q08742j423063q71309M98774J547652J378349
2605d055204j74065j577834m95034K639528L912022J153756k358287k575015q80832
2596d410965j455973l922906l678433M92944M158918L818389J410253L39682P14738
2587b533353R82554J238755K032989K188811Q52457O999J696010L811171K234257
2578A2510650k822705o136338m293977k45961J029767q24492k137699j212550
2570d133305j33340l30346m2823J958248L234916J363724j346572o75433K939813
$$ plain form
2561 2834882 7665719 10766965 11621447 12114823 12386040 10945572 8208276 6084102 4038093
2552 4038093 -428999 -6540245 -9549612 -7136980 -2892820 -918247 -151405 2704653
2544 2704653 7158621 9709611 9212402 7652922 6185314 3971499 982015 -1274127
2536 -1274127 -2289467 -3110437 -3857118 -3306476 -1665991 -1237732 -3204213 -5903949 -7556671
2527 -7556671 -8753911 -10674457 -12351122 -11567503 -7816020 -2974053 662566 2148222
2519 2148222 2046360 1569020 1491370 1679482 1729056 1639115 1350442 408722 -820052 -543301
2509 -543301 2064668 4721604 4823279 3832083 5450804 9054620 9032903 2579723 -5622951
2500 -5622951 -9562191 -9605680 -10053987 -11304273 -9597778 -4154828 523476 883583 -994371
$$ packed form
2561B834882M830837L101246Q54482M93376K71217j440468k737296k124174k046009
2552D038093m467092o111246l009367K412632M244160J974573P66842K856058
2544B704653M453968K550990m97209j559480j467608k213815k989484k256142
2536a274127j015340q20970p46681N50642J640485M28259j966481k699736j652722
2527g556671j197240j920546j676665P83619L751483M841967L636619J485656
2519B148222j01862m77340p7650J88112M9574q9941k88673r41720j228774K76751
2509e43301K607969K656936J01675r91196J618721L603816k1717o453180q202674
2500e622951l939240m3489m48307j250286J706495N442950M678304L60107j877954
$$ plain form
2491 -994371 -1031128 1257422 3095663 2601447 410953 -1864786 -3007760 -2549662 -1163805
2482 -1163805 -441580 -1273227 -2610325 -2534492 -430950 2351880 3901160 3561958 2433213
2473 2433213 2052905 2647751 3152947 2942775 2371854 1108396 -2318902 -7758365 -11809232
2464 -11809232 -11384459 -7972696 -5711379 -5897091 -6448799 -6402950 -7173989 -8810239 -8837840
2455 -8837840 -6215413 -2982687 -398873 2913224 6879448 8001297 4769030 1615730
2447 1615730 3289111 7814665 9581024 7524675 5318500 4596712 3388787 1301762
2439 1301762 902648 2655952 3110701 174628 -3482206 -4474108 -3127028 -1758280 -1250029
2430 -1250029 -1527531 -3018573 -5272764 -6155117 -4808511 -3700837 -5246681 -7752794 -7326174
$$ packed form
2491i94371l6757K288550J838241m94216k190494k275739j142974M58098J385857
2482a163805P22225q31647j337098P5833K103542K782830J549280l39202j128745
2473B433213l80308N94846N05196k10172n70921j263458l427298n439463m050867
2464a1809232M24773L411763K261317j85712n51708M5849p71039j636250k7601
2455h837840K622427L232726K583814L312097L966224J121849l232267l153300
2447A615730J673381M525554J766359k056349k206175p21788j207925k087025
2439A301762l99114J753304M54749k936073l656834r91902J347080J368748N08251
2430a250029k77502j491042k254191q82353J346606J107674j545844k506113M26620
$$ plain form
2421 -7326174 -3076122 1909200 4412814 3946454 1970980 63853 -974270 -1494963 -2762199
2412 -2762199 -5613648 -9363047 -12480174 -14060491 -14267603 -13856480 -13638714 -13812528 -13511209
2403 -13511209 -11674937 -8478532 -5046660 -1917560 864449 2346616 1427692 -675299
2395 -675299 -1073622 840725 2448540 2011798 1116875 1382998 1518058 118379 -1131820
2386 -1131820 -255123 1048346 -13981 -2137156 -1564430 1491554 2492091 -648264 -4474419
2377 -4474419 -5282014 -4071278 -3967252 -5338852 -6207288 -5932019 -5781151 -6328754 -6349749
2368 -6349749 -4426161 -558092 3762162 6530649 6822924 5952372 6229020 7847785 7991630
2359 7991630 4177617 -2209209 -7069942 -7986443 -6202889 -4328190 -3522578 -3554735 -4495407
$$ packed form
2421g326174M250052M985322K503614m66360j975474j907127j038123n20693j267236
2412b762199k851449l749399l117127j580317k07112M11123K17766j73814L01319
2403a3511209J836272L196405L431872L129100K782009J482167r18924k102991
2395f75299l98323J914347J607815m36742q94923K66123J35060j399679j250199
2386a131820Q76697J303469j062327k123175N72726L055984J000537l140355l826155
2377d474419q07595J210736J04026j371600q68436K75269J50868n47603k0995
2368f349749J923588L868069M320254K768487K92275q70552K76648J618765J43845
2359G991630l814013o386826m860733r16501J783554J874699Q05612l2157r40672
$$ plain form
2350 -4495407 -6990902 -10785614 -13899297 -14017381 -10742741 -6188680 -3221878 -3095297 -4560245
2341 -4560245 -5020559 -2795383 1179797 3873691 2993399 -473874 -3047149 -2281346 950851
2332 950851 3720390 3799545 1015429 -3044449 -5997693 -6174558 -4019841 -1626814 -581272
2323 -581272 -1021069 -2919937 -6639022 -11197390 -13626503 -11885814 -7580325 -4112022 -2884634
2314 -2884634 -3055794 -4121715 -6276578 -8409969 -8420075 -6264099 -4608766 -5411489 -7462380
2305 -7462380 -8363999 -7550446 -6193191 -5317568 -5349899 -6637658 -8888670 -10452061 -9627510
2296 -9627510 -6906633 -4821128 -5031889 -6297313 -6119884 -4060805 -2291559 -2485538 -3325270
2287 -3325270 -2327726 563270 3014023 3826229 4263100 5254083 5613854 4467539 3249268
$$ packed form
2350d495407k495495l794712l113683j18084L274640M554061K966802J26581j464948
2341d560245m60314K225176L975180K693894q80292l467273k573275P65803L232197
2332I50851K769539P9155k784116m059878k953244j76865K154717K393027J045542
2323e81272m39797j898868l719085m558368k429113J740689M305489L468303J227388
2314b884634j71160j065921k154863k133391j0106K155976J655333q02723k050891
2305g462380r01619Q13553J357255Q75623l2331j287759k251012j563391Q24551
2296i627510K720877K085505k10761j265424J77429K059079J769246j93979q39732
2287c325270R97544K890996K450753Q12206M36871R90983L59771j146315j218271
$$ [...]
##END NTUPLES=NMR SPECTRUM
##END=
