##TITLE=31Pdec_DE-77_ORG_d6AW
 aceton-d6, 64 sc
 26.11.2024
##JCAMPDX= 6.0         $$ Bruker NMR JCAMP-DX V2.0
##DATA TYPE= NMR SPECTRUM
##DATA CLASS= NTUPLES
##ORIGIN= UXNMR, Bruker Analytische Messtechnik GmbH
##OWNER= root
$$ XWIN-NMR		Version 3.5
$$ Tue Nov 26 15:34:58 2024 Russian Standard Time (UT+4h)  she@DPX200
##.OBSERVE FREQUENCY= 81.013821
##.OBSERVE NUCLEUS= ^31P
##.ACQUISITION MODE= SIMULTANEOUS
##.ACQUISITION SCHEME= undefined
##.AVERAGES= 64
##.DIGITISER RES= 17
##SPECTROMETER/DATA SYSTEM= spect
##.PULSE SEQUENCE= zgpg30
##.SOLVENT NAME= D2O
##.SHIFT REFERENCE= (INTERNAL, D2O, 0, 198.062)
##AUDIT TRAIL= $$ (NUMBER, WHEN, WHO, WHERE, WHAT)
$$ ##TITLE= Audit trail, XWIN-NMR		Version 3.5
$$ ##JCAMPDX= 5.01
$$ ##ORIGIN= Bruker BioSpin GmbH
$$ ##OWNER= she
$$ F:/spectra/data/she/nmr/P31/2/pdata/1/auditp.txt
$$ ##AUDIT TRAIL=  $$ (NUMBER, WHEN, WHO, WHERE, WHAT)
(   1,<2024-11-26 15:32:43.35 +0400>,<she>,<DPX200>,
      <continue with go, POWCHK disabled, PULCHK disabled
       configuration hash MD5:
       00 E9 B6 7A A2 85 ED C7 34 08 36 98 17 FE 4E 26
       data hash MD5: 32K
       81 14 CC D3 FC 41 64 DF BC 67 3B 76 49 F4 B8 EE>)
(   2,<2024-11-26 15:32:47.06 +0400>,<she>,<DPX200>,
      <Start of raw data processing
       efp BC_mod = 2 LB = 1.5 FT_mod = 6 PKNL = 1 PHC0 = 2320.305 PHC1 = -58.31174 SI = 64K 
       data hash MD5: 64K
       0D 74 C0 98 6A F7 BF EC B4 DC 1F 9F 78 AD 9F 32>)
(   3,<2024-11-26 15:33:04.56 +0400>,<she>,<DPX200>,
      <pk PHC0 = 12.30348 PHC1 = 0 
       data hash MD5: 64K
       9E 24 8B A8 64 BC CF 99 E2 CE 17 38 BD 5D 50 F8>)
(   4,<2024-11-26 15:33:07.53 +0400>,<she>,<DPX200>,
      <abs ABSG = 5 
       data hash MD5: 64K
       B7 13 6C 24 70 F1 CB 6B 91 DE A5 B6 36 04 F7 DF>)
$$ ##END=
$$ 
$$ hash MD5
$$ 03 B0 B2 83 F3 C8 6A B7 1A 4F 24 7F 71 16 BF 1D
##$RELAX= 
##$RELAX= 
##$RELAX= 
##$RELAX= 
##$RELAX= 
##$RELAX= 
##$RELAX= 
##$RELAX= 
$$ Bruker specific parameters
$$ --------------------------
##$DU= <F:/spectra>
##$EXPNO= 2
##$NAME= <P31>
##$PROCNO= 1
##$TYPE= <nmr>
##$USER= <she>
##$AMP= (0..31)
100 100 100 100 100 100 100 100 100 100 100 100 100 100 100 100 100 100 
100 100 100 100 100 100 100 100 100 100 100 100 100 100 
##$AQSEQ= 0
##$AQ_mod= 1
##$AUNM= <au_zg>
##$AUTOPOS= <>
##$BF1= 81.014009
##$BF2= 200.13
##$BF3= 200.13
##$BF4= 200.13
##$BF5= 200.13
##$BF6= 200.13
##$BF7= 200.13
##$BF8= 200.13
##$BYTORDA= 1
##$CFDGTYP= 0
##$CFRGTYP= 5
##$CHEMSTR= <none>
##$CNST= (0..31)
1 1 145 1 1 1 1 1 1 1 1 1 1 1 1 1 1 1 1 1 1 1 1 1 1 1 1 1 1 1 1 1 
##$CPDPRG= <waltz16>
##$CPDPRG1= <>
##$CPDPRG2= <waltz16>
##$CPDPRG3= <>
##$CPDPRG4= <mlev>
##$CPDPRG5= <mlev>
##$CPDPRG6= <mlev>
##$CPDPRG7= <mlev>
##$CPDPRG8= <mlev>
##$CPDPRGB= <>
##$CPDPRGT= <>
##$D= (0..31)
0 1 0 0 0 0 0 0 0 0.06 0 0.03 2e-05 3e-06 0 0 0.0002 0 0 0 0 0 0 0 0 0 
0 0 0 0 0 0 
##$DATE= 1732620681
##$DBL= (0..7)
120 120 120 11 120 120 24 19 
##$DBP= (0..7)
150 150 150 150 150 150 150 150 
##$DBP07= 0
##$DBPNAM0= <>
##$DBPNAM1= <>
$$ [...]
##$SUBNAM3= <"">
##$SUBNAM4= <"">
##$SUBNAM5= <"">
##$SUBNAM6= <"">
##$SUBNAM7= <"">
##$SUBNAM8= <"">
##$SUBNAM9= <"">
##$SW= 400.765351723535
##$SWIBOX= (0..15)
0 1 3 0 0 0 0 0 0 0 0 0 0 0 0 0 
##$SW_h= 32467.5324675325
##$TD= 32768
##$TD0= 1
##$TE= 0
##$TE2= 300
##$TE3= 300
##$TEG= 300
##$TL= (0..7)
0 120 53 12 22 120 120 120 
##$TP= (0..7)
150 150 150 150 150 150 150 150 
##$TP07= 0
##$TPNAME0= <>
##$TPNAME1= <>
##$TPNAME2= <>
##$TPNAME3= <>
##$TPNAME4= <>
##$TPNAME5= <>
##$TPNAME6= <>
##$TPNAME7= <>
##$TPOAL= (0..7)
0.5 0.5 0.5 0.5 0.5 0.5 0.5 0.5 
##$TPOFFS= (0..7)
0 0 0 0 0 0 0 0 
##$TUNHIN= 0
##$TUNHOUT= 0
##$TUNXOUT= 0
##$USERA1= <user>
##$USERA2= <user>
##$USERA3= <user>
##$USERA4= <user>
##$USERA5= <user>
##$V9= 5
##$VALIST= <valist>
##$VCLIST= <CCCCCCCCCCCCCCC>
##$VD= 0
##$VDLIST= <DDDDDDDDDDDDDDD>
##$VPLIST= <PPPPPPPPPPPPPPP>
##$VTLIST= <TTTTTTTTTTTTTTT>
##$WBST= 1024
##$WBSW= 4
##$XGAIN= (0..3)
0 0 0 0 
##$XL= 0
##$YL= 0
##$YMAX_a= 3610
##$YMIN_a= -7155
##$ZGOPTNS= <>
##$ZL1= 120
##$ZL2= 120
##$ZL3= 120
##$ZL4= 120
##$ABSF1= 198.0616
##$ABSF2= -202.7028
##$ABSG= 5
##$ABSL= 3
##$ALPHA= 0
##$AQORDER= 0
##$ASSFAC= 0
##$ASSFACI= 0
##$ASSFACX= 0
##$ASSWID= 0
##$AUNMP= <proc_1d>
##$AZFE= 0.1
##$AZFW= 0.5
##$BCFW= 0
##$BC_mod= 2
##$BYTORDP= 0
##$COROFFS= 0
##$CY= -3
##$DATMOD= 1
##$DC= 0
##$DFILT= <>
##$DTYPP= 0
##$F1P= 0
##$F2P= 0
##$FCOR= 1
##$FTSIZE= 65536
##$FT_mod= 6
##$GAMMA= 0
##$GB= 0
##$INTBC= 1
##$INTSCL= 9.790993e-09
##$ISEN= 30
##$LB= 1.5
##$LEV0= 0
##$LPBIN= 0
##$MAXI= 10000
##$MC2= 0
##$MEAN= 0
##$ME_mod= 0
##$MI= 50
##$NCOEF= 0
##$NC_proc= -8
##$NLEV= 6
##$NOISF1= 182.463
##$NOISF2= 159.3651
##$NSP= 0
##$NTH_PI= 0
##$NZP= 0
##$OFFSET= 198.0616
##$PC= 4
##$PHC0= 2332.608
##$PHC1= -58.31174
##$PH_mod= 1
##$PKNL= yes
##$PPARMOD= 0
##$PSCAL= 0
##$PSIGN= 0
##$REVERSE= no
##$SF= 81.0140089999434
##$SI= 65536
##$SIGF1= 159.3651
##$SIGF2= -187.1042
##$SINO= 113.3802
##$SIOLD= 16384
##$SREGLST= <1H.CDCl3>
##$SSB= 0
##$STSI= 65536
##$STSR= 0
##$SW_p= 32467.5324675325
##$SYMM= 0
##$S_DEV= 0
##$TDeff= 32768
##$TDoff= 0
##$TI= <>
##$TILT= no
##$TM1= 0
##$TM2= 0
##$TOPLEV= 0
##$USERP1= <user>
##$USERP2= <user>
##$USERP3= <user>
##$USERP4= <user>
##$USERP5= <user>
##$WDW= 1
##$XDIM= 65536
##$YMAX_p= 360362549
##$YMIN_p= -57838966
$$ End of Bruker specific parameters
$$ ---------------------------------
##NTUPLES= NMR SPECTRUM
##VAR_NAME=  FREQUENCY,     SPECTRUM/REAL,   SPECTRUM/IMAG
##SYMBOL=    X,             R,               I
##VAR_TYPE=  INDEPENDENT,   DEPENDENT,       DEPENDENT
##VAR_FORM=  AFFN,          ASDF,            ASDF
##VAR_DIM=   65536,         65536,           65536
##UNITS=     HZ,            ARBITRARY UNITS, ARBITRARY UNITS
##FACTOR=    0.49542278885378, 1,            1
##FIRST=     16045.7642231865, 0,            0
##LAST=      -16421.768244346, 0,            0
##MIN=       -16421.768244346, -57838966,    0
##MAX=       16045.7642231865, 360362549,    0
$$ Real data points
##PAGE= N=1
##DATA TABLE= (X++(R..R)), XYDATA
$$ [...]
9572 -4987878 -4428187 -4324191 -2599400 -501352 -999331 -3633627 -4244968 -720187 3813500
9563 3813500 5096506 2821414 -238679 -2398628 -4143269 -6052018 -7715309 -8382247
9555 -8382247 -7330353 -4146178 138306 2953782 2700842 834851 127911 1401922 3334797
9546 3334797 4894248 6307633 7842973 9178552 10012731 10089317 8808559 6144412 3737614
9537 3737614 3487463 4962447 5798846 4970438 3986839 4168335 4429842 3130503 916978
9528 916978 -113017 311517 119389 -1816887 -3450543 -1954841 2382456 6263404 7434580
9519 7434580 7060559 7340898 8252229 8181893 6840992 5454441 4181045 1572450 -2636320
9510 -2636320 -6047061 -6240863 -3701844 -747178 1524419 3615054 5397246 5275726 2173665
9501 2173665 -2529777 -5830821 -5906029 -3858469 -2434993 -3004261 -4355416 -4854808 -4880601
9492 -4880601 -5944224 -8054616 -9633715 -9772411 -8677287 -6080381 -1758344 2009659
9484 2009659 1664750 -2408768 -4856441 -2061823 2548765 3113526 -541708 -3251601 -2219143
9475 -2219143 -191766 -333065 -1663684 -1331905 1268134 4703285 7986185 10718033 11801044
9466 11801044 10065790 6077836 2064884 -49039 -19539 920276 1010114 -901305 -4378235
9457 -4378235 -7505747 -8367313 -6527203 -3122525 165981 2142760 2608065 2345992 2545052
9448 2545052 3842079 5680919 6677329 5929679 4114582 2910896 3027550 3380992 2922967
9439 2922967 2543544 3740708 5796654 6231708 4303884 1987538 793166 -174990 -1803779
9430 -1803779 -2921189 -2542505 -2117298 -3133595 -4217373 -3510017 -2579749 -4467916 -8372565
9421 -8372565 -10021995 -7800998 -4998164 -4704556 -5562123 -4575975 -1810466 239776 747242
9412 747242 1567979 4249373 7750388 9711553 9248790 7832087 7292293 7432686 6522765
9403 6522765 4217507 2458036 2508758 2742417 1215726 -977539 -1584778 -1538462 -4034514
9394 -4034514 -9038659 -12130948 -10183801 -5480462 -2387670 -2007151 -2106230 -856697 1398025
9385 1398025 3277371 3567720 1738390 -1429768 -3895420 -3865041 -1280820 2164970 3970629
9376 3970629 2217086 -2538222 -6710069 -6674497 -2752789 1261241 2866509 3351382 4946051
9367 4946051 7476537 9021791 8314767 5269018 505398 -4366862 -7149025 -7008732 -5311406
9358 -5311406 -3773087 -2723508 -1711714 -575485 686097 1775557 1343613 -1986501
9350 -1986501 -7136863 -10785229 -10870372 -8354090 -5041187 -1731639 812051 1588094 1223660
9341 1223660 1641060 2579452 1287066 -2548998 -4678752 -1780659 3575148 6515831 6041643
9332 6041643 4179393 1221927 -3788658 -8941819 -10393930 -7629681 -4155908 -2563862
9324 -2563862 -2070256 -1313088 -387888 700400 2780773 5570658 7128664 6248744 3807566
9315 3807566 1248469 -702160 -1670504 -1777134 -2259042 -4113884 -6061287 -5793678 -3362556
9306 -3362556 -1344566 -1481466 -3084756 -4843060 -6136548 -6402019 -5315388 -3874098 -3298459
9297 -3298459 -2762700 -415410 3219677 5261165 4209776 1330053 -1913677 -5130115
9289 -5130115 -7317279 -6966008 -4920751 -4335700 -6384167 -8470361 -8064427 -5848661 -3584382
9280 -3584382 -1430339 735841 1721709 992839 292812 1015013 1610114 -126886 -3650570
9271 -3650570 -6819836 -9129332 -11377202 -13147389 -13154574 -11604322 -10009216 -8945411 -7874072
9262 -7874072 -6880505 -6784078 -7652520 -8653521 -9066878 -8197251 -5123382 -333108 3152547
9253 3152547 2682006 -69920 -510039 2855643 6027774 4529285 -708747 -4338114 -2990067
9244 -2990067 1053765 3013122 1188360 -1699080 -2201105 330470 4251101 8063483
9236 8063483 10989730 12151530 11135005 9203697 8251963 8556504 9136600 10049791 12111849
9227 12111849 14235636 13703692 9953085 5637763 2836035 802236 -1007563 -601613
9219 -601613 3204021 7347970 7699326 4484241 1533406 973375 1715560 2679507 4127850
9210 4127850 5435754 4673382 1648026 -862454 -245885 3114173 7159465 10751092 13531475
9201 13531475 14245003 11045292 3864731 -4340733 -9524924 -10069904 -8069583 -6524591
9193 -6524591 -5653273 -3321765 898485 4254012 4492360 3011891 2411296 2442270 847970
9184 847970 -2650494 -5749250 -6633067 -5410638 -2746991 647065 3281024 4036087 4207374
9175 4207374 6077563 9225192 10722107 9471250 7720275 7380891 7483105 6633470 5489732
9166 5489732 4981669 4333457 3079409 3059260 5616799 8181915 6879317 2195786 -1035227
9157 -1035227 215709 3638466 5090374 3359011 112804 -2888651 -4585705 -3986167
9149 -3986167 -1129648 1745585 2311268 1652553 3448975 8770946 13702363 13727998 8984263
9140 8984263 3219330 -1210066 -4693875 -7321858 -7725022 -5791266 -3850407 -3628874 -3989084
9131 -3989084 -3225558 -1791131 -996128 -692983 -327070 -807062 -2878648 -4721658 -3889843
9122 -3889843 -1106389 592700 355811 433445 2310386 4540727 5191127 4140902 2005563
9113 2005563 -1054480 -4124316 -4969006 -2387113 1904643 5109277 6325210 6621931 6893973
9104 6893973 6770868 5331164 2196329 -1769277 -4563361 -4605388 -2684306 -1563858 -2978036
9095 -2978036 -5649808 -6978080 -6127759 -4598710 -3975767 -4022692 -3385817 -1752918 -504752
9086 -504752 -765962 -1470332 -653557 1351022 1728003 -1030365 -4816457 -6693684 -6392646
9077 -6392646 -5247169 -3231076 344611 4089958 5374142 3768092 1211034 -1021027
9069 -1021027 -2951362 -3830648 -2581322 -596494 -862074 -3492705 -5251166 -4533047 -3543750
9060 -3543750 -3951304 -3714419 -712572 3137047 4303733 2424430 -16715 -1498399 -2530986
9051 -2530986 -3894744 -5925407 -8783338 -11779362 -13386386 -13322991 -13290214 -14160386 -14139887
9042 -14139887 -11653660 -8356721 -6911210 -7167810 -7126369 -6598186 -7180764 -9184038 -11102058
9033 -11102058 -11857375 -11472916 -9910462 -7199190 -4273955 -1982364 -78213 1099814
9025 1099814 -533093 -5663867 -10578177 -10709035 -6784126 -4058186 -5239165 -7417432
9017 -7417432 -6779292 -3494276 -625841 -180991 -1397556 -1760562 654686 4835622 7353623
9008 7353623 6670003 5636396 7205055 9096576 6662396 520669 -3407903 -2315170
9000 -2315170 -185426 -1008977 -2707099 -1095521 3420929 6957799 7842903 7473871 6793005
8991 6793005 5471077 4071658 3839086 4226043 3191221 343926 -2176999 -2430427 -876295
8982 -876295 496541 333221 -825334 -863111 1819545 5879519 7620564 5041662 359330
8973 359330 -2714443 -3170410 -2668947 -2412946 -2229883 -2289337 -3290939 -4488501 -3524171
8964 -3524171 675271 5883223 8384138 6410995 1448129 -3398835 -6001746 -6490545
8956 -6490545 -6277523 -6064326 -5228667 -3150338 -340882 2173667 3976978 5371264 6935190
8947 6935190 9104029 11264183 11233262 7250135 1015449 -3219464 -3807362 -3912229 -6645448
8938 -6645448 -9961248 -9387405 -4818687 -1148297 -1924989 -5422663 -7934353 -8421094 -8409645
8929 -8409645 -9038449 -9831090 -9593641 -7604050 -4580409 -2782999 -4043686 -7370837 -9835761
8920 -9835761 -10167064 -9778276 -9622081 -8129287 -3797000 1817499 5645063 6636026 5892331
8911 5892331 4217596 1851622 272627 1568845 5196620 7455149 5651674 1549110
8903 1549110 -829973 -44867 1756485 2355697 2048719 2008950 1702533 -281649 -3267873
8894 -3267873 -4319348 -1773779 2367573 4793924 4841235 4622374 5472603 5966109 4088015
8885 4088015 182832 -3243582 -4119906 -2473589 61123 1673320 1606934 719795 811900
8876 811900 2870118 5915575 7919327 7856509 6602546 5874159 6570459 8124972 9187975
8867 9187975 8790080 6920307 4231658 1622788 273354 1373628 4779210 8034864
8859 8034864 8049061 4421085 183192 -1668812 -1642870 -2546376 -5270469 -7434796 -6701586
8850 -6701586 -4076843 -2704564 -3867124 -5440731 -4603072 -1197971 2306249 3787659
8842 3787659 3411944 2470426 1404677 -42567 -1375513 -1525845 -582726 22502 -489368
8833 -489368 -1373551 -2128376 -3555455 -5698806 -6170948 -2768429 2820030 6347648 6286785
8824 6286785 5592997 7517334 11634526 15104501 16126687 14681170 11252598 6681164
8816 6681164 2623871 522036 281339 984462 2385554 4591942 6862264 8055380 7981473
8807 7981473 7253076 6291999 5552527 5890140 7127986 6971299 3387198 -2129975 -5640968
8798 -5640968 -5128094 -1963399 1757266 4982679 6696910 5954022 3870875 3115072 4294344
8789 4294344 5331470 5601190 7541204 11896216 14494736 11389281 5111072 1595145
8781 1595145 1966809 1923590 -771477 -3004524 -2002382 -105268 -1050231 -4277289 -6087561
8772 -6087561 -4989205 -3055504 -2592059 -3703019 -4913397 -4544516 -1837149 1822149 3369350
8763 3369350 1454758 -1133378 -472060 3212737 5620528 4267471 1806110 1881218 3771174
8754 3771174 3875212 1622060 566439 2825368 5400102 4321574 646145 -760704
8746 -760704 1957434 5175720 5025288 2439959 1122017 2344286 4225646 5351868 6604441
8737 6604441 9104412 12089380 13511781 11965925 7915213 3662444 1780882 2648175
8729 2648175 3811189 2642123 -868208 -4804314 -7766399 -9101897 -7799076 -3611355
8721 -3611355 919680 2080856 -795089 -4551396 -5969669 -4513155 -1286660 2312442
8713 2312442 4336062 3234997 276847 -1111678 309172 1873761 886696 -1865075
8705 -1865075 -3908378 -4174212 -2505648 1530155 6694257 8840555 4978141 -2146544
8697 -2146544 -6533772 -5819372 -3036914 -1513415 -807059 1394381 5474547 9392230 11006241
8688 11006241 9956622 7634899 5638373 4078341 1719513 -1841378 -4919786 -5617567
8680 -5617567 -4383848 -3583890 -4783500 -7362684 -9533935 -9973415 -8798959 -7505017 -7377328
8671 -7377328 -7623784 -6158437 -2748143 189310 927971 855461 2040168 3987201 4730274
8662 4730274 3858989 2498159 1449928 1222240 2423228 3930118 2399505 -3439522 -9419204
8653 -9419204 -10356066 -6967268 -4609537 -5519824 -6438546 -4418833 -938101 1170897 1518962
8644 1518962 1118413 138033 -1578432 -3642283 -5937084 -8578080 -10463611 -9945982 -7438489
8635 -7438489 -5073966 -3401549 -1025272 2142818 4349253 5282167 6467699 7547517
8627 7547517 6026567 2184478 168400 1980491 4235946 3529457 1182365 -518234
8619 -518234 -2936699 -7835003 -12758191 -14370184 -13972023 -14893508 -16360431 -15060109 -11419223
8610 -11419223 -8955457 -8057915 -5901363 -2588233 -1699444 -3561854 -3316413 1997906 8799510
8601 8799510 12163965 12150837 11888816 12061234 10691622 7024013 2710156 -445573 -2062888
8592 -2062888 -2821130 -3670810 -4983592 -5862485 -5025854 -2736415 -785248 -253090 -637202
8583 -637202 -1567729 -3688737 -6931533 -9336775 -8797391 -5311781 -946277 1795381 1589992
8574 1589992 -571390 -1920863 -929204 490767 -356572 -2401751 -1657745 2830893 6791785
8565 6791785 6015881 1568642 -2102101 -2516140 -845984 256986 -1267647 -5800795 -11309969
8556 -11309969 -14520387 -14054591 -11521556 -8809125 -6042730 -3288018 -1931952 -2328628
8548 -2328628 -2203635 -146145 1018454 -2281863 -8450813 -12006170 -10773627 -8143576
8540 -8143576 -7312954 -6862413 -4162649 -458131 555532 -1755094 -3706682 -1892888 2848023
8531 2848023 6853728 7863254 6750293 5479591 4523743 2793100 -483288 -4570325
8523 -4570325 -7818304 -8896361 -7635769 -5403773 -4521287 -6291719 -9414529 -11286418
8515 -11286418 -11009134 -9969188 -9321300 -8600936 -7560529 -7553229 -9599374 -12392291 -13875970
8506 -13875970 -13815913 -13189111 -12028459 -9807751 -7246982 -5624843 -4630442 -2922647 -631382
8497 -631382 796011 1268892 2364602 4473825 5601016 3835284 -402710 -5095923 -8174882
8488 -8174882 -7987307 -4067998 1601764 5438667 5318579 2095771 -1885896 -4349939 -3381903
8479 -3381903 1311924 6698249 8533274 6584971 5328219 7605204 10136306 8194827
8471 8194827 2793177 -523703 624597 2738717 1903436 -1334829 -3919815 -4636629 -4665007
8462 -4665007 -5184551 -6052720 -6254455 -4782994 -1733283 957504 841128 -2244194 -5561446
8453 -5561446 -6379049 -4722390 -2609999 -1488972 -1367551 -1777633 -2423719 -2977102 -2988522
8444 -2988522 -2143260 -481166 1418642 2615518 2870598 3440866 5667484 8558522 9234092
8435 9234092 6533570 2763328 655259 -155227 -1957474 -5122885 -7425876 -7131552 -5083141
8426 -5083141 -3376065 -3133917 -3940773 -4653532 -4542109 -4001636 -3764083 -3075840 -15160
8417 -15160 5033604 7805337 4788476 -1190173 -3323886 731445 6010289 7116506 4783997
8408 4783997 3339762 4368005 6101471 7393339 8661398 9385293 8024043 4821826
8400 4821826 2076392 1040224 695375 41850 -531045 -671003 -717303 -312668 1379350
8391 1379350 3214726 2301098 -1838228 -5623895 -5918486 -4179599 -3732650 -4610719 -4173047
8382 -4173047 -1949045 -453487 -984323 -1674287 -613260 1670886 4049139 6707490 9454000
8373 9454000 10108557 7049762 2353604 -181731 -77873 -990710 -5820670 -12672173 -16807920
8364 -16807920 -15764674 -11471977 -7640268 -6027644 -5588921 -4806516 -4006307 -4662817 -6644586
8355 -6644586 -7493388 -5360553 -1686639 601900 1126206 2296403 5243648 7718180 7366744
8346 7366744 5380781 4879229 6582293 8227646 7997480 6481814 5088149 4399269 4571141
8337 4571141 5603730 6514514 5876814 4067764 3401932 4920097 6618061 6334262 4917435
8328 4917435 4600393 5447445 5857613 5921031 7421251 10270283 11698659 10020464 6904206
8319 6904206 4497043 2402267 -450546 -2625920 -1732468 1366891 2854635 1149242
8311 1149242 -674637 815408 4472457 6109529 4166769 1409062 708752 1398845 1094646
8302 1094646 -489465 -1492835 -986614 -78821 126422 -79665 -87906 158303 1070008 3615290
8292 3615290 7411353 9830161 8549277 4392977 292927 -2157262 -3808650 -5818855
8284 -5818855 -7640272 -7405644 -3862953 1894424 6512381 7212675 5155520 4636881 7792113
8275 7792113 11527363 11419189 7325944 2881846 527158 -142494 269251 1881318 3509597
8266 3509597 2955390 336959 -1571598 -1373354 -721348 -772828 13237 2573269 4525509
8257 4525509 3466305 877850 -263985 -294232 -2000434 -5581781 -7620093 -5468138 -440391
8248 -440391 3913157 5246864 3864156 1826566 731038 -130459 -2742299 -7047332 -10220077
8239 -10220077 -10388945 -9164507 -8588022 -7634296 -4582780 -1125399 -401971 -1891389 -2387792
8230 -2387792 -1828373 -3552820 -7915825 -10369013 -8090563 -4367605 -3275417 -3546464 -1782917
8221 -1782917 878032 331206 -3226672 -4702374 -1549629 2539559 3250771 1463174 740427
8212 740427 1517665 1245267 -747558 -2109193 -1532515 -882796 -1853746 -2845595 -1376636
8203 -1376636 1750886 3232144 1847089 -155195 -588935 24749 324766 639947 2021074
8194 2021074 3995191 5028531 4647397 3752688 3287725 3604671 4407885 4275115 1344401
8185 1344401 -3941114 -7794656 -6909034 -2843381 -409508 -1751821 -4173268 -4145600 -1486520
8176 -1486520 1127443 1287444 -1161616 -4175600 -5269880 -4130581 -3156683 -4201001 -5602744
8167 -5602744 -4469601 -1132331 1449757 2349110 3319221 4472316 3202106 -1145398 -5211735
8158 -5211735 -6487298 -6975031 -9187553 -11348707 -10031451 -5492939 -790917 2876297
8150 2876297 6271370 8694961 8398026 6072984 4249608 3132938 571257 -3415886
8142 -3415886 -5625610 -4274176 -1550918 -189493 -141350 -243432 -839391 -2741380 -5123793
8133 -5123793 -6279941 -5669121 -4171696 -3165155 -3840668 -6145201 -7963048 -6889604 -3217429
8124 -3217429 604297 3620209 6857487 9600723 8696531 3606211 -1017826 -807492 2662779
8115 2662779 4931846 5151755 5537482 5951617 3944690 56477 -1721980 153469 2552153
8106 2552153 2931775 3090322 5486896 9018890 11077295 11291164 10598345 8813129 5944570
8097 5944570 4045754 4692402 6028175 5343015 3371768 2832754 3715605 3644891 2498833
8088 2498833 2821659 5241002 7051761 6340507 4436394 3125157 2212766 1022370 -334761
8079 -334761 -2251594 -5319271 -7532304 -5142776 1677013 7203214 6867143 2902661 430016
8070 430016 565215 979444 1075013 2233992 3919557 3760929 1497882 -597604 -1261932
8061 -1261932 -1107634 -71020 2754329 6487369 8653978 8376417 6813157 4622485 1998966
8052 1998966 930909 3659315 8482601 10858556 9500821 7746076 7993963 8752122 8519821
8043 8519821 8451722 9205174 9148191 8071038 8744143 11992584 14129948 12620116 10449119
8034 10449119 10864029 11475333 8623070 4640391 4919149 9431598 13016342 13245512 12190480
8025 12190480 10594347 6448316 460760 -2760225 -1149449 1837744 2949134 3506939
8017 3506939 5388616 6715371 5093493 2100051 737446 492575 -1392551 -5082296
8009 -5082296 -8062170 -9140677 -9327715 -9007148 -7303570 -4668151 -3502148 -5236598 -8521627
8000 -8521627 -11160464 -12447267 -12770521 -12225951 -10907797 -9841099 -10093002 -10812375 -9444899
7991 -9444899 -4819986 635738 3092502 1795093 -46171 473380 2217411 2114628 102029
7982 102029 -356536 2898065 7295684 8204259 4050659 -2460138 -7737335 -10493556 -11238466
7973 -11238466 -9965027 -6116248 -1098989 1114626 -2055919 -7845940 -10523186 -7984946
7965 -7984946 -3623063 -1009734 339487 2249322 3940702 3747088 2626012 2536314 2768027
7956 2768027 1518946 118523 1681605 5805592 8527752 7791995 5217485 2150816
7948 2150816 -1845987 -5626340 -5953935 -2327191 1397873 2365061 2245240 3128613 3573029
7939 3573029 1915855 282785 1319788 3169115 1887171 -2368203 -5484854 -5196723
7931 -5196723 -3281532 -2093077 -1959102 -2265673 -2604723 -2443394 -1499870 -521545 -188989
7922 -188989 279511 1718030 2895058 1893206 -830279 -2886246 -3257115 -3223798 -4155872
7913 -4155872 -6092376 -8174330 -8865985 -6533710 -1860323 1204251 -458105 -4613763
7905 -4613763 -6155392 -3855077 -1400423 -1494284 -2627183 -2924364 -3501505 -5487044 -6521680
7896 -6521680 -3604038 1874496 5147509 3976573 1017438 -41403 1431943 3677275
7888 3677275 5650848 7890851 10843203 13923670 16606796 19134089 21077482 20235643
7880 20235643 15027218 8047060 4847022 7738215 12432530 12684604 7188293 -16716
7872 -16716 -4913746 -6757223 -6455066 -4740281 -2762586 -2130590 -2961113 -3330708 -1836300
7863 -1836300 460789 1738094 2042137 2922148 4877524 6272204 4959710 706647 -3959764
7854 -3959764 -5480573 -2405905 3050823 6911570 6804161 3324962 -1091691 -3757939
7846 -3757939 -3035139 296283 3091035 2805829 603287 151150 3109893 7190026 9081056
7837 9081056 7962349 5481391 3427044 2314430 1591268 449003 -1413801 -3576639
7829 -3576639 -5429631 -6492678 -6000622 -3293988 393668 1832588 -632400 -4192298
7821 -4192298 -4426815 -583130 4288287 7916124 10422177 11287275 8540185 2625144 -2058082
7812 -2058082 -1892052 1775911 5292396 7435647 9048224 9851314 8734052 6276837 4091601
7803 4091601 2105626 -855845 -4065025 -5198470 -3875375 -2414147 -2527177 -3500214 -4329214
7794 -4329214 -5311377 -6194283 -4844010 33884 5782876 7630237 3823687 -2513209 -7055619
7785 -7055619 -8599658 -8882243 -9023108 -7908147 -4633615 -1059210 -135966 -1975166 -3580548
7776 -3580548 -3161593 -2790097 -5147906 -9087799 -10901732 -9541898 -7767542 -7431111 -6366757
7767 -6366757 -1957416 4054940 7128604 5776348 3109530 2122547 2075342 972701 -577907
7758 -577907 -369152 1736184 3752345 4781773 5651637 6251858 5120717 2610904 1648443
7749 1648443 3537128 5365520 3947425 496895 -1320817 -594299 544697 825205 764589
7740 764589 232596 -1363303 -2427493 -526199 2788370 2391798 -3299470 -8997176 -8942254
7731 -8942254 -4080552 19101 439158 -1027551 -1828662 -1388642 -154994 1339712 2122955
7722 2122955 1428795 7233 -598976 -41674 852101 1758988 2992666 4167083 4369930
7713 4369930 3774601 3615555 4307329 4847012 4400662 3431171 2941004 3433995 4788077
7704 4788077 6334133 6932686 5800627 3488756 1374527 1873 -1457308 -3799652
7696 -3799652 -6246225 -6700917 -3784677 1191224 4612657 3790789 -6112 -2618224 -1462732
7687 -1462732 1943831 4348937 4524104 3804535 3792192 4653489 5354480 4870468 3402779
7678 3402779 2537142 3494300 5291905 5939453 5454114 5685696 6659195 5697180 1703559
7669 1703559 -2184530 -2660021 -1071109 -1312673 -4145008 -6671680 -6874634 -5665867 -4433270
7660 -4433270 -3197590 -1552672 646725 3676403 7150949 9080649 7895417 5213271
7652 5213271 4188577 5140417 5399239 3645909 1555182 494207 -559497 -2622099 -4700112
7643 -4700112 -5584272 -5571020 -5069282 -3479649 -827173 1502038 3276617 6753187 13420954
7634 13420954 20737437 24194211 21926521 15739739 8473253 2075449 -2311787 -4152312
7626 -4152312 -3602707 -1160765 2302190 4788139 3899860 -293164 -4157463 -3991621 -163879
7617 -163879 3725105 5379913 5815870 6831896 8222311 8332263 6448385 3663532 1491906
7608 1491906 244581 -856273 -2081774 -2387389 -802335 1773601 3133713 2124958
7600 2124958 -445392 -3206709 -5365563 -6361369 -5904168 -5005966 -5550894 -7744242 -9086547
7591 -9086547 -7238382 -3267715 -695734 -1511981 -4234415 -5922075 -5198654 -3076236 -1460545
7582 -1460545 -1295656 -1993659 -2244804 -1089699 1547336 4610270 6037386 4258862 404925
7573 404925 -1981820 -699371 2387450 3648043 1767924 -2031253 -6449464 -10120628
7565 -10120628 -10251938 -5115725 1806517 4117641 350639 -3910841 -3504895 152007
7557 152007 2708687 3135232 2825764 1322067 -2519710 -6459023 -6448455 -2119136 2948596
7548 2948596 6311779 8416948 9202987 7005152 2084825 -2202904 -3676056 -4206856 -6430258
7539 -6430258 -9655250 -11062385 -9444016 -5905411 -2086891 568864 883223 -846294
7531 -846294 -2383874 -2010006 -928892 -1585906 -4018587 -5769679 -5457452 -4482676 -4526692
7522 -4526692 -5069324 -4680860 -3630420 -3532419 -4785968 -6006143 -6166156 -5794378 -5474254
7513 -5474254 -4617994 -2835343 -1287197 -1043907 -880075 1255937 4669863 5913236 2975016
7504 2975016 -2151009 -5866686 -6539688 -4902486 -2406941 -441400 -101272 -1338279 -2778217
7495 -2778217 -3152547 -2288736 -296650 2883844 6225125 7398934 5393906 2377445 1304901
7486 1304901 2254896 2621074 501682 -3490440 -7457045 -9919773 -10410408 -9399676 -7669246
7477 -7669246 -5384592 -2371445 443204 1233152 -209179 -1579662 -946137 813618 1889689
7468 1889689 2431392 3708235 5520006 6407970 5596564 3052058 -1172942 -5709166 -7424404
7459 -7424404 -4744213 -344192 2031466 2264919 2537960 2770008 1267648 -874469 -596631
7450 -596631 1582373 1378205 -2687619 -6721668 -7269710 -5826619 -5210526 -4985028 -3526477
7441 -3526477 -1866233 -2065666 -3513632 -3916585 -2793755 -1392847 -207516 1005173 1684739
7432 1684739 1215161 397321 176972 -96711 -1074025 -1206985 1378103 5593035 8509197
7423 8509197 9249508 9206758 8768684 6771595 3568088 1781603 2802591 4639377 4686260
7414 4686260 3148325 2275428 3177230 4785209 5505401 4799044 3321749 2336674 2916904
7405 2916904 5004540 7123809 7566114 6150675 4464087 4010203 4486055 4560074 4101098
7396 4101098 4371650 5597831 5884217 3967839 1970763 3339826 8294057 13312046 15267725
7387 15267725 14179541 11689221 9101272 7684523 8580319 10889437 11572865 8886243
7379 8886243 4628227 1549788 -117974 -1901218 -4011690 -4908285 -3343266 559197
7371 559197 5567203 9409901 9590214 5880735 1469932 19079 1892138 4546418 6000460
7362 6000460 6322453 6105499 5258165 3583375 1446211 -415128 -1312984 -1141352 -749506
7353 -749506 -921743 -640219 2138416 7081988 10605048 9955893 6684255 4253460 3737148
7344 3737148 4100364 5200373 7425366 9114591 7742120 3931320 1342571 1861612 3422272
7335 3422272 3476925 2260637 1315039 677608 -796673 -3245739 -5151813 -4600090 -988711
7326 -988711 3895566 6775953 5991294 3423662 1968824 1606634 41604 -2973187 -4650749
7317 -4650749 -3194462 -261829 1866156 3299126 4997378 6232256 5923885 5194618 5925494
7308 5925494 7241134 6149664 2165851 -1131106 -618549 1928536 2036587 -1419576 -4780895
7299 -4780895 -4768941 -2716934 -1848426 -2200065 -1212555 1437951 3244016 3502188 4648970
7290 4648970 7336174 8040744 4572485 677040 1060412 4126951 4348382 490421 -3597075
7281 -3597075 -5919727 -8547232 -11984644 -12729669 -8953305 -4457972 -3841183 -6534375 -8483651
7272 -8483651 -7548963 -4680858 -1685850 -389385 -2512570 -7902324 -13713714 -17042220
7264 -17042220 -17457981 -15873810 -12574975 -7865837 -3073548 721134 3646993 5560936
7256 5560936 5340827 2955511 303764 -1451941 -3298317 -5607558 -6477225 -4925377 -3267139
7247 -3267139 -3773006 -5270753 -5826030 -6341399 -8064462 -8803048 -5921031 -1677361 -945678
7238 -945678 -4058285 -6332827 -4866447 -1599569 968613 2985148 4914148 5753275 5453070
7229 5453070 6113147 8665964 10625229 9140239 4644508 -168935 -3564434 -5483660
7221 -5483660 -6264279 -6043011 -4794988 -2294515 1211974 4142784 4631746 2696888 177819
7212 177819 -1402276 -1435993 865607 5796787 11209237 13814960 13208305 12304230 12970988
7203 12970988 13647530 12383016 9731677 7049475 4175211 709663 -2286566 -3902770
7195 -3902770 -5177515 -7361105 -9713776 -10877994 -11102315 -11116597 -10083035 -7034228 -3566524
7186 -3566524 -2603249 -4444062 -5971728 -4216504 337951 4107076 3532053 -1605695 -7386369
7177 -7386369 -9085737 -5957704 -1696095 266062 93181 -659847 -2011350 -4155168 -5322281
7168 -5322281 -4114207 -2647100 -4147561 -8142896 -11179743 -11784002 -11344264 -10369260 -7788806
7159 -7788806 -4510799 -3554975 -4997031 -4482909 688928 6939021 8851159 6100895 2775735
7150 2775735 1322703 676255 -179279 -326601 750568 1634125 1028640 -232686 -328217
7141 -328217 1288243 3384634 4065210 2194869 -1526934 -4816075 -5875814 -5166888 -4344723
7132 -4344723 -3821594 -2647436 -569348 1440625 2865640 4096116 4751140 3499729 565147
7123 565147 -1513602 -1269057 -850409 -2973399 -6392370 -7104356 -3889124 77956 1821977
7114 1821977 2319023 4148616 7157802 8519158 6503315 2507581 -683868 -1578023 -835854
7105 -835854 -204021 -715860 -1691893 -1769692 -1003846 -1050167 -2668123 -4095663 -3173073 -401572
7095 -401572 1728221 2246550 2704111 4173335 4981563 2799614 -1867183 -5803996 -6719421
7086 -6719421 -5642531 -5258484 -6545417 -7769599 -6670697 -3004902 1278381 3893519
7078 3893519 3903954 2076810 223628 -166463 544253 276194 -2112614 -4745460 -4924482
7069 -4924482 -3230057 -3050841 -5348793 -6664325 -4278728 -963496 -1600168 -6509612 -11435714
7060 -11435714 -13436058 -13353076 -12612868 -11276751 -9945900 -10050481 -10936416 -9953494 -7150117
7051 -7150117 -6588323 -10503550 -15072596 -15191784 -11226002 -7378980 -4994969 -1759978 2835381
7042 2835381 5591260 4249975 724512 -1931888 -3262745 -4314106 -4846271 -3954835 -2470342
7033 -2470342 -2444326 -4162861 -5294538 -3614369 338467 4033808 5861240 6292215 6124603
7024 6124603 4894065 2152295 -567135 -1021161 456801 1049981 -388608 -1365728 565957
7015 565957 3914713 5091213 2971420 -468092 -3136337 -4223859 -3392356 -1165962 83967
7006 83967 -1846423 -5662601 -7509528 -5694589 -2434584 -542348 -643160 -2303259 -5403808
6997 -5403808 -8954376 -10494103 -8482891 -4279181 -548389 1346405 1592441 929819 464114
6988 464114 1241451 2891708 3751651 3249234 2872786 3694299 4347401 2927951 -257957
6979 -257957 -3388771 -5517777 -6567080 -5862144 -2800804 1176969 3135486 1576675 -2114762
6970 -2114762 -5090153 -5072121 -1487035 4073000 8562882 9822287 8398409 6477177 5453697
6961 5453697 5407799 6147352 7054883 6197570 1785904 -4689137 -8515393 -6462825 -626857
6952 -626857 3888209 4818472 4700686 6613370 9608131 10037985 6790754 2928825 1422705
6943 1422705 1363589 209623 -1792527 -2121674 -243824 1744139 3014520 5352069 9357972
6934 9357972 12263844 11640499 9030475 7504793 7414857 7142047 6529786 6603472 6832613
6925 6832613 5761959 4008446 3663429 4657771 4566046 2480836 438711 176581 796357
6916 796357 714866 -19283 -521585 -605888 -382954 459821 2000407 3616840 4816108 5701365
6906 5701365 6329696 6521518 6305111 5501356 3314369 -76394 -2208202 -1116400 917148
6897 917148 -293778 -4274787 -5524228 -1445579 3162504 2692703 -1160677 -2036403 1945715
6888 1945715 6160242 6487170 4221088 2831817 3055679 3183620 2296056 1177960 803349
6879 803349 1359497 2509555 3741362 4547153 4719761 4426036 3883597 3156188 2297409
6870 2297409 1503755 1099327 1315432 1805355 1518313 -243455 -2588764 -3756108 -3203506
6861 -3203506 -1768948 517459 4897841 10950502 15024523 13919232 9373969 6529148
6853 6529148 7819938 10321352 9668583 5171436 256665 -1481047 -134029 576161 -2509583
6844 -2509583 -7873444 -10516297 -7747619 -2195060 2045514 4262692 6009137 7009160
6836 7009160 5600434 2678705 1685584 4183189 8248276 11657058 13764467 13782940 10696321
6827 10696321 6240631 4598834 7025801 9688368 9245739 7677942 8358218 9827912
6819 9827912 7792245 2252372 -1803702 -1239681 1400277 2054668 184339 -1979239 -3056184
6810 -3056184 -3445916 -3748749 -3897117 -3556328 -2548230 -1068208 286173 1146906 2020873
6801 2020873 3618666 5644720 7157134 8009209 8757743 9066202 7552541 3756773 -715691
6792 -715691 -3532692 -3537253 -1407059 590306 -195851 -4085201 -7337506 -5250504 1985367
6783 1985367 8440474 9028044 5315537 2708426 3154746 3548706 1218966 -2119007 -3256988
6774 -3256988 -2142532 -1413395 -2132112 -2278813 34075 3498916 5091667 3992895 2452222
6765 2452222 2327236 2178748 -716979 -6053046 -10181038 -10613930 -9013046 -8404620 -8967834
6756 -8967834 -8721751 -7592910 -8029856 -11050593 -14145314 -14594999 -13107880 -12169018 -11876469
6747 -11876469 -9884550 -5501384 -1561512 -1177066 -3993774 -6861020 -7397427 -5711430
6739 -5711430 -3149562 -867385 90869 -1383201 -5369050 -9812611 -11502471 -8846123
6731 -8846123 -3646665 329415 892576 -503248 -463692 2570487 6533839 7904220 5488995
6722 5488995 1761679 342707 2280284 5034710 5277787 2516991 -533471 -1283038 -150063
6713 -150063 739437 1129341 3133204 7555874 11387372 10747769 5788164 862599 -313063
6704 -313063 1882774 4678135 6253365 6264643 4541286 1223826 -2211713 -3847313 -3485838
6695 -3485838 -2709063 -2656535 -3045835 -3640322 -5060758 -7158199 -7897893 -5419667 -684220
6686 -684220 3333700 4913113 4826713 4434702 3960064 3069927 2035162 1597433 2244033
6677 2244033 3929559 5863508 6435980 4394975 602138 -2336275 -2798769 -1599388 -192504
6668 -192504 1203778 2581283 2629028 152110 -3602011 -5854751 -5321262 -2909891 -45620
6659 -45620 1837617 874765 -3384833 -7632307 -7322836 -2524369 1420758 383428 -3956537
6650 -3956537 -7565115 -9334903 -10512605 -11283260 -11086801 -10754771 -11075955 -10329421 -6617994
6641 -6617994 -1991587 -649375 -2937852 -4456085 -1730716 3979241 8974807 10501004
6633 10501004 7591073 1727937 -2548575 -900459 5589401 11101208 11997422 10160058
6625 10160058 8525971 7121131 5531917 5450587 7566722 8933064 6921233 3372512
6617 3372512 1325861 67875 -2416223 -4102021 -1030056 5929225 11093011 10897697
6609 10897697 6874451 1767976 -3013909 -5601409 -3819617 1252398 5389251 6405274
6601 6405274 6140624 6163064 5156138 2365211 9342 -263070 -245270 -1763359 -3230162
6592 -3230162 -2767869 -2311491 -4812171 -8863727 -10007285 -6877228 -2599686 -48196 1167291
6583 1167291 2357988 3006271 1640597 -1861663 -5775688 -7952497 -7838346 -7437119 -9393742
6574 -9393742 -13374057 -15670712 -13690669 -9307938 -5876597 -3538084 -305320 3317212
6566 3317212 4420760 2446994 298916 -244932 -972996 -3422269 -5486245 -4414280 -1382178
6557 -1382178 -187051 -1990002 -3810744 -2367390 2434213 8175365 12497316 14271216
6549 14271216 13419802 10880928 8560345 8231512 9895016 11582717 11327479 9169078 6652285
6540 6652285 4603863 2504876 190235 -1360824 -1826686 -2651729 -4766788 -6392071 -5319381
6531 -5319381 -2739169 -2129904 -4182204 -5582644 -3799370 -524369 1280482 1584975 2300517
6522 2300517 3656382 4210555 3722118 3319971 2853016 684688 -3149977 -5818290 -5118838
6513 -5118838 -2562166 -1393529 -2276172 -2538489 317627 5579967 10152144 11641254 10109177
6504 10109177 7196497 4309187 1998036 626410 645544 1704647 2186114 706947 -1952904
6495 -1952904 -3466389 -2826770 -1638052 -1962851 -3813677 -5702253 -6830926 -7288175 -6451829
6486 -6451829 -3063166 2507012 7451004 9014725 7119006 3817741 929386 -979980
6478 -979980 -2052213 -2742815 -3599091 -4403118 -3795539 -704992 4066105 8523026 11348147
6469 11348147 12164433 10672571 7192842 3818399 3100145 5180128 7775291 9298110
6461 9298110 10222398 10879126 10042977 6944355 2896522 -559312 -3504948 -5945074 -5956723
6452 -5956723 -2075387 3336148 5829092 4031543 865736 -607465 -396030 4822 359932
6443 359932 1476467 3378362 5103234 5993649 6248750 6160456 5358631 3190089 -90506
6434 -90506 -2934437 -4042439 -4198730 -5422894 -8068117 -10332794 -11391271 -13011058 -16314463
6425 -16314463 -18710117 -16708756 -10886734 -5295490 -2386262 -1325286 -1078186 -1862506
6417 -1862506 -3041700 -2957227 -2182453 -3888960 -9027840 -13704283 -13740509 -9983663 -6650546
6408 -6650546 -5824849 -6087580 -5653983 -4386722 -3049339 -2613215 -4113484 -7413549 -10237416
6399 -10237416 -10080994 -7181570 -4328699 -3740800 -5164534 -6778157 -6762932 -4184326 375291
6390 375291 4880914 7362630 7407912 5777670 3292106 1012279 660277 3236584 7282723
6381 7282723 9779778 8984473 5737399 2235213 232045 19571 338702 -349214 -1958822
6372 -1958822 -2939732 -2884428 -3440526 -5298224 -6024538 -3275527 1048512 2854066 1591530
6363 1591530 664951 1820137 2597411 767371 -1781197 -1948511 -113008 772352 -394247
6354 -394247 -1977450 -2741240 -3413195 -4701494 -5611702 -4678427 -1928643 1135520 3039653
6345 3039653 3374420 2739909 2136775 2232426 2739478 2410556 116058 -3546778 -5957470
6336 -5957470 -4731654 -589877 3038322 4002550 3914928 5303567 7301766 6454662 1755240
6327 1755240 -3626963 -6576525 -7838552 -9970810 -13064667 -14619155 -13006094 -9088058
6319 -9088058 -4515065 -212583 3049935 4102562 2439405 -620335 -2545999 -1566799
6311 -1566799 1730479 4475057 3528630 -1832629 -9108879 -14802030 -17379348 -17697494 -16950731
6302 -16950731 -15273331 -12576934 -9679946 -7652130 -6393694 -4801730 -2448637 -282718
6294 -282718 793688 1352010 2512695 3880676 3749718 1879199 797444 3009781 7516147
6285 7516147 10662373 10384343 8040202 5797510 4048290 2400773 1507249 2026936 2689018
6276 2689018 1560260 -836887 -1716174 101382 2241550 1764030 -1151073 -3803035 -4491663
6267 -4491663 -4105361 -4565699 -6909900 -10710193 -14140618 -14658422 -11063573 -5330131 -1124240
6258 -1124240 198759 970036 3680776 7294148 8649735 6890054 4570649 4173099 5171673
6249 5171673 5325177 3728565 1541797 203515 -103209 -53921 289007 1941266 5384978
6240 5384978 8733706 9002864 6043319 3600984 4656321 7098361 6754151 3805122 2464722
6231 2464722 4084243 4870235 2145012 -1211193 -1529840 -151521 -602938 -2538403 -2962657
6222 -2962657 -1927790 -2282613 -4325524 -5292325 -4241758 -3067555 -2255817 -194885 2310141
6213 2310141 1588852 -2839366 -6067593 -4304554 128248 3092147 4206963 4662816 3037141
6204 3037141 -1975865 -6990303 -7278118 -3782484 -1931200 -3552125 -4693275 -2389607
6196 -2389607 758566 879840 -1412682 -2199171 324732 3696460 4007610 -72064 -5726976
6187 -5726976 -8369233 -6335069 -2824432 -1856838 -2936195 -1966264 2612380 7353853 8399057
6178 8399057 6116564 3627761 2577813 2173490 1095124 -1438540 -5513170 -9588246
6170 -9588246 -10471427 -6368194 -42505 2869693 -597466 -7869967 -13918658 -16166543
6162 -16166543 -15599064 -13980782 -11602188 -8115152 -4293470 -1645320 -499673 331274
6154 331274 1767834 3421285 4728464 5885465 6821206 6494871 4584686 2883170 3238432
6145 3238432 4707354 4746176 2969280 1498021 1409453 1316533 344710 61152 1728209
6136 1728209 3612072 3394740 2120916 3140611 7380661 12090373 14689638 15731311
6128 15731311 17062640 18719511 19075561 17107170 13139031 8015490 3026629 267668
6120 267668 1183590 4241117 5594732 3117797 -1224932 -4039834 -4504941 -4286375 -4353987
6111 -4353987 -4007205 -3016372 -2527108 -3102258 -3653590 -3311484 -2821234 -2985506 -3221069 -3001989
6101 -3001989 -3288467 -4827882 -6249547 -5792642 -3994283 -2581976 -1493065 532585 2709708
6092 2709708 2317313 -1318265 -5163441 -5878641 -3455855 -601701 437094 -218231 -565954
6083 -565954 1172528 4377471 6376763 5874827 5038997 6362841 8416141 7493607 3283747
6074 3283747 -262201 -344588 1447342 2482421 2758967 3477814 4461556 5133845 6148103
6065 6148103 7970299 9425744 9465390 8723029 7620982 5000451 796151 -2165566 -2006098
6056 -2006098 -1603283 -4956877 -10784771 -13640553 -11341563 -7536783 -6082339 -6156040 -4555020
6047 -4555020 -489527 3790668 5895632 5366447 3428650 1525562 -38837 -1952183
6039 -1952183 -4165885 -5213569 -4196992 -2377055 -1341752 -747757 205583 340839 -1738516
6030 -1738516 -4292889 -4030242 -771855 2732832 5531812 9159867 13084869 13834601 10482497
6021 10482497 7062882 6913876 7962350 6618325 3326067 726299 -1099879 -3433841
6013 -3433841 -4870755 -3053519 414038 1340834 -793448 -2285681 -1459197 -1115403 -3265629
6004 -3265629 -5475608 -5066463 -3870963 -5492390 -9533112 -11840083 -10078081 -6445636
5996 -6445636 -4492875 -4978499 -5583239 -3960736 -536677 1778015 810770 -2232539 -4160920
5987 -4160920 -3656061 -2401483 -2186792 -2650527 -2814785 -3194244 -4769100 -6873643 -7801204
5978 -7801204 -7055379 -5639206 -4496378 -3919187 -4152273 -5315058 -6841266 -7919317 -8173439
5969 -8173439 -7155496 -4037877 861669 5077589 6328939 5415034 4867602 5031054 3821269
5960 3821269 609261 -2201817 -2523536 -1363269 -792343 -841017 -161717 1398006 2682097
5951 2682097 3039571 2770141 2234155 1745746 1845457 2519460 2648524 1321654 -852176
5942 -852176 -2741311 -4153524 -5020893 -4133680 -648439 3563860 5150439 3068172 -418059
5933 -418059 -2605882 -2686151 -1213514 904143 2433765 2442228 1505626 1053418 1239449 920636
5923 920636 -43597 -306953 609750 1372216 1037693 316505 -314810 -1646957 -3438986
5914 -3438986 -3189574 636182 5603834 7757113 6064326 2470572 -1252054 -4304738
5906 -4304738 -5526790 -4152507 -1672669 -340848 103413 1662444 4140397 5041725 3943690
5897 3943690 3757890 6250025 9167335 9768971 8776938 8435606 8575237 7339221 4609862
5888 4609862 2042983 432260 -528825 -566828 474983 807989 -1413417 -4389418 -4146162
5879 -4146162 -417945 2292680 1031313 -1548213 -1923116 -1457419 -3587232 -7131501 -7178714
5870 -7178714 -2687869 1248336 209873 -3984792 -6548406 -5668226 -2727434 916995
5862 916995 4211192 5081787 2322017 -1796572 -3910387 -4230987 -5701426 -8675248 -10147807
5853 -10147807 -8986427 -7997529 -8922366 -9008236 -5612135 -1464341 -1395430 -5088288 -7041767
5844 -7041767 -3838107 1755010 4665365 3121514 -488541 -2625060 -1664947 869420
5836 869420 1759308 -335496 -3004216 -2991825 -341565 2182812 3145744 3303786 2595106
5827 2595106 -429293 -5129053 -7799201 -6131404 -2353055 191686 1534058 3618772
5819 3618772 6025578 6305145 3964022 1112901 -956193 -3155663 -5986182 -7931584
5811 -7931584 -7605309 -5737837 -3782429 -1914965 225081 1866392 1812554 435868 -529706
5802 -529706 -383147 -530696 -2618257 -6246651 -9290312 -10367814 -10261244 -10409008 -10415491
5793 -10415491 -8163863 -3031504 1805227 1768505 -4034737 -11266911 -14799061 -13896349 -11739518
5784 -11739518 -10450640 -8819400 -5617367 -2862941 -3506668 -6840932 -8847457 -7259134
5776 -7259134 -3879989 -1182451 939586 3448044 5269571 4515650 1573602 -1208353
5768 -1208353 -2323852 -1711528 636582 4348437 7391944 7614645 5614156 3877163 3161564
5759 3161564 2177702 767121 399279 1066026 836518 -632450 -1427709 -1410729 -3205243
5750 -3205243 -7093153 -8674278 -4726661 1790698 6180733 8499482 11309237 13589612
5742 13589612 12349494 8886048 7465295 7866092 5281868 -1157422 -5557821 -3463664
5734 -3463664 1974389 5161951 5250771 4580928 3565759 1550428 373245 2471217 6531087
5725 6531087 8930819 8729643 7585202 5465381 644497 -5728162 -9097165 -7045178
5717 -7045178 -2512377 104732 -115506 -1044942 -858204 856441 3934619 7544573 9675202
5708 9675202 8289321 3292811 -3155947 -8265140 -10417034 -9888733 -8275438 -7121981
5700 -7121981 -6993628 -7787735 -9300732 -10837329 -10824787 -7975326 -2863320 2442215 6163860
5691 6163860 7457990 5809855 1285934 -4533959 -9300344 -12033718 -13559264 -14661958
5683 -14661958 -14985412 -14015934 -11920045 -9043649 -5833979 -3620183 -3904701 -5988329 -6648216
5674 -6648216 -3451510 2324471 6989247 7974774 5404337 1157985 -2485787 -3930449
5666 -3930449 -3243681 -2066055 -1986087 -3143099 -4525525 -4981172 -3750607 -898158 2479783
5657 2479783 5348400 8046025 11181711 13334976 12083122 7968464 4942930 5438615
5649 5438615 7344340 7709618 6977690 6948955 6831216 4807294 2053614 1410065 2792883
5640 2792883 3623255 3319727 3414962 3356532 685419 -3741953 -5125354 -1161855 4574458
5631 4574458 7766042 8496028 8975714 9414147 9042484 8581558 8652805 7930658 5809617
5622 5809617 4736262 6618781 8794967 7209442 2368316 -1429337 -1962958 -763292
5614 -763292 488998 1799711 3272233 4841831 7560963 12207685 16711374 17965016
5606 17965016 16152450 14157410 12670133 9404741 3743608 -1400905 -3575980 -3570775 -2943978
5597 -2943978 -1761931 -349085 -435987 -2557351 -4585076 -4819257 -4603996 -6032142 -8836534
5588 -8836534 -11332837 -12734304 -12755449 -10639261 -6630242 -3093208 -2179190 -3314279 -4531104
5579 -4531104 -5112203 -5331564 -4858571 -3346358 -1799082 -1660924 -3096915 -5327209 -7717577
5570 -7717577 -9396158 -9085722 -6836672 -4730992 -4158029 -3439160 -60847 5378278 9214392
5561 9214392 8471229 3496922 -2512998 -5739887 -4601226 -1550418 -894492 -3725572 -6497026
5552 -6497026 -5895936 -3169833 -1642022 -1903887 -2288068 -2719158 -4744397 -8094216 -10260595
5543 -10260595 -9799527 -7705363 -5267994 -2699266 -187206 1622872 2680332 3687660
5535 3687660 5053333 6712960 8498746 9477492 7948962 3937390 622490 865690 3036294
5526 3036294 3004710 -105422 -3067175 -3393621 -1880480 253179 3540479 7933485 10599799
5517 10599799 8271194 1216585 -6238044 -9207702 -6657587 -2881344 -3468401 -8530957
5509 -8530957 -11558256 -7285428 972965 5264577 3142456 -488029 -1570705 -1989226
5501 -1989226 -4850516 -8974225 -10865183 -9408110 -6123838 -2827631 -994815 -1502221
5493 -1502221 -3307846 -4242166 -4301526 -5763480 -8812470 -10135287 -7887470 -5003146 -4850543
5484 -4850543 -6256684 -5979904 -3900154 -2296415 -1622315 -567307 756546 1160916 1304597
5475 1304597 2975970 5586268 6307956 3959483 513262 -1304511 -86640 4009811
5467 4009811 8861538 10764828 7756287 2403049 -1003658 -1712008 -2450785 -4478631 -5916207
5458 -5916207 -5557643 -5149336 -6352339 -7881403 -7572619 -5637550 -3955910 -3186458 -2350620
5449 -2350620 -708289 1516587 4001730 6421433 7591395 6070607 2470320 -10526
5441 -10526 1078306 4021695 4853814 2926667 1983682 4245804 6364985 4552219 1454383
5432 1454383 2905266 8442742 10927230 6927859 1658301 622818 1831172 863396
5424 863396 -1005050 223203 3284486 3318805 46479 -2236995 -2392439 -3721794 -7025013
5415 -7025013 -8742113 -7650108 -7489228 -10316940 -12448748 -10291213 -5865147 -2985513
5407 -2985513 -1698546 -286718 544802 -192250 18264 4141907 10015416 12093482 8338394
5398 8338394 1907152 -3523809 -6650063 -7068772 -4748882 -1747281 -1232753 -3417183 -4844603
5389 -4844603 -3091155 -29752 1327169 1490467 3560487 8163422 11757491 10842412 6363351
5380 6363351 2510704 1770699 2823015 3440991 3527235 4045617 4525699 3763209 2258143
5371 2258143 1550479 1254210 -632481 -3887367 -5191290 -2550317 1527714 3200885 2193673
5362 2193673 1556866 3463971 7125491 10379093 11711702 10925123 9087910 7707508 7121432
5353 7121432 6174027 4226564 2562506 2589672 3507938 3395483 2206604 1978493 3918569
5344 3918569 6679351 7988224 7104247 5209508 3844342 3283451 2420998 330788 -2291702
5335 -2291702 -3957435 -4605874 -5778694 -8114827 -10026420 -9827694 -7998811 -6180395 -5107312
5326 -5107312 -5009134 -6824804 -10768516 -14170053 -13270939 -7830712 -2213117 -978540 -4392073
5317 -4392073 -8821557 -10543175 -8507022 -4276726 -308642 1748368 1614006 -237770
5309 -237770 -3119180 -5837722 -6844355 -5832458 -4792631 -6156801 -9856384 -13381370
5301 -13381370 -14823439 -14542845 -13534659 -11705135 -8736868 -5473982 -3121042 -1731883
5293 -1731883 -763289 -549441 -1582324 -2471478 -684068 3794629 7309567 6780823 3994751
5284 3994751 3321882 5370028 5633172 559878 -7315278 -12310443 -12163763 -9248843 -6132650
5275 -6132650 -2920079 636293 3196619 3571185 2795623 2888260 4308215 5734339 5762005
5266 5762005 4018850 1198668 -1344071 -2557752 -2624538 -2262421 -1094430 1884726 5773314
5257 5773314 7450889 5065439 568448 -2603485 -3310828 -2733704 -1747165 -346830 718926
5248 718926 -73916 -2882029 -5760351 -6795932 -6200757 -5760732 -6679066 -8360162 -9149822
5239 -9149822 -8055787 -5598203 -2878268 -270545 2260860 4009365 4117795 3408952 3953644
5230 3953644 6210854 8223520 8472442 7739605 7007686 5595220 3231555 1950509 3230789
5221 3230789 4797900 3598308 1105431 1815534 6281380 9638370 8446845 5390603
5213 5390603 4763194 6225778 6410654 4911383 4682518 6659979 7739053 5420096 1713577
5204 1713577 299761 1397611 1811857 -502915 -4133618 -6537603 -6638280 -4490945 -368611
5195 -368611 4379550 7024538 5957005 2805877 301799 -1333919 -3782409 -6863886
5187 -6863886 -8151363 -6910514 -5765374 -7014405 -9343058 -9927398 -8273889 -6227630
5179 -6227630 -5369652 -6049227 -7888814 -9581888 -9241947 -6746856 -4844709 -6068329 -9254172
5170 -9254172 -10927300 -9453198 -5974039 -2026205 1479858 3299444 2353369 -482340
5162 -482340 -2939215 -3935408 -4019651 -3419643 -1654223 797493 2513480 3223449 4001168
5153 4001168 5000161 5066741 4248021 4519993 6875974 9569977 10658877 10642854 10860605
5144 10860605 10601860 8062583 3800252 1126880 2443454 6378921 9326283 9229731 7133096
5135 7133096 5190513 4024353 2640625 543840 -1109772 -832061 1442102 4396662
5127 4396662 6518074 6773743 4880702 1700619 -1069077 -2213407 -1708765 -134777 1506704
5118 1506704 1259343 -2524951 -8295914 -11646412 -10338784 -7292240 -6406408 -7127666 -6071103
5109 -6071103 -2685321 408725 2263962 4678147 7724743 8207136 4501719 -189943
5101 -189943 -1946186 -1262139 -1393265 -3091246 -3990392 -2878792 -1857908 -3390590 -6751887
5092 -6751887 -8624975 -6875156 -2913057 1205 440655 63323 1013154 3056524 4243787
5083 4243787 3799139 3077001 3684113 5597662 7168993 6373736 2386659 -3301282 -7643543
5074 -7643543 -8623244 -6735078 -3555791 48403 3465511 5517448 5690779 5300072 5915067
5065 5915067 7333237 8271822 7987243 6075854 2304620 -1859299 -3598589 -2706827 -2969017
5056 -2969017 -6862746 -11137104 -11108224 -7337342 -4064149 -2829914 -2239160 -2460210 -4490373
5047 -4490373 -5739947 -2366537 3692039 5906519 2294848 -2385244 -4748855 -6787301
5039 -6787301 -9557628 -9377820 -4249717 1190110 1689426 -1570403 -4069318 -4501046 -4078550
5030 -4078550 -2561748 593078 3585596 4805508 5796013 7936070 8482691 4061490 -3544166
5021 -3544166 -9024204 -9872593 -7778619 -4813993 -1443914 2264068 5920226 8906552
5013 8906552 10090794 8960795 7696687 9235296 12179263 11502780 6310084 2514210
5005 2514210 4691407 9477534 10922922 8566040 5897413 4359067 3487539 3763902 4611365
4996 4611365 2828566 -2044062 -4318389 202762 6552591 7051288 2539906 -5375
4988 -5375 1203215 1798920 421621 353586 1594957 -487964 -6661119 -11016965 -9316772
4979 -9316772 -4475018 -1352286 -1109644 -2765977 -5419547 -6796880 -4316729 136618
4971 136618 865103 -3997800 -9608431 -11319218 -10329101 -9976311 -10327093 -9590168 -8091270
4962 -8091270 -7823100 -9598521 -12414216 -14218574 -12615183 -6843723 370145 4983695
4954 4983695 5819491 4592170 2575704 240662 -661113 1459759 4756766 6019251 5846741
4945 5846741 7653300 11537635 13491353 11118709 6148035 1088391 -2559525 -2903464
4937 -2903464 986082 6184189 8751300 9245206 10775348 12359835 10061211 4516026
4929 4516026 837171 379799 -882354 -4673927 -7743694 -8550273 -10118667 -13944500 -16962967
4920 -16962967 -16867181 -14951894 -11878948 -6450029 -392129 1799395 -24963 -615476 2611303
4911 2611303 6357784 7967499 8832039 9571775 8402306 6066703 5762801 6786688 5275521
4902 5275521 2070167 1800756 3587766 2000423 -1951605 -1430078 3417205 5187242 3585455
4893 3585455 6582655 14202522 15920317 8832123 3010532 3257939 2203720 -1914279
4885 -1914279 581088 10128102 11907293 1805147 -3594952 3316453 6456942 -1029833
4877 -1029833 2310074 27146221 47226444 50483728 84923236 194983268 325924426
4870 325924426 360362549 262004904 123696446 49320305 41381579 39198078 19154318
4863 19154318 5139534 7840235 9323042 2087301 -103942 7360120 11643600 8153258
4855 8153258 7543531 13007226 13674016 5269125 -2442917 -3459118 -3633360 -6814807 -8291800
4846 -8291800 -6140389 -5451673 -7542772 -7065874 -2687666 602151 1662009 4512126 8267808
4837 8267808 7289147 2680151 1895162 5236364 4574728 -2343525 -8091078 -8676324 -8905118
4828 -8905118 -11646631 -13231634 -12951041 -15468922 -19606193 -16607858 -5150684 3301922
4820 3301922 939988 -5057032 -5292595 -2480894 -3846458 -7385370 -6199002 -1198006
4812 -1198006 714609 -1674986 -2777381 552055 5695692 9541446 11503219 11693938
4804 11693938 10330168 8513143 6686843 3473364 -1648563 -6290673 -7918839 -6749048
4796 -6749048 -4335437 -1782201 -653819 -2450738 -5660942 -6744738 -5419682 -5051165
4788 -5051165 -6477032 -6276784 -3228630 -1242484 -2851903 -4821329 -3900257 -2274107 -3127604
4779 -3127604 -4962316 -4765245 -3205576 -2275661 -1120583 1285821 2385732 -353559 -4546910
4770 -4546910 -6033724 -4767094 -3478264 -2633689 -899917 1155052 1790265 1148274 399850
4761 399850 -446236 -1141488 -92933 2335022 2394334 -1536180 -5000078 -3208384 1952625
4752 1952625 5091070 4962332 4162967 3398720 1311231 -1332928 -2251375 -1618259 -1199322
4743 -1199322 -715701 772132 1431913 -808211 -3799909 -4062419 -2615333 -2717482 -3318532
4734 -3318532 -882556 3060554 2956148 -1664407 -4662336 -2476469 1034625 1118100 -1682653
4725 -1682653 -4381031 -6070442 -6881464 -6184300 -4377373 -3319681 -3064378 -1455489 1395404
4716 1395404 2106442 -352080 -2013893 178438 3309115 2748575 -1230902 -4570467 -5114829
4707 -5114829 -3874535 -2119333 -320092 934742 1471795 2204257 3415154 3606867 1954835
4698 1954835 398544 966803 2269751 1231087 -2397157 -5708676 -6583842 -5852912 -5468471
4689 -5468471 -6153633 -7027765 -6479995 -3521324 863017 4065386 4393202 2823823 1554012
4680 1554012 1498744 1982476 2048179 1106302 -921064 -3053275 -3551663 -1856164 306530
4671 306530 693876 -1082485 -3747743 -6223691 -8295671 -9927596 -10902879 -10945473 -9661089
4662 -9661089 -6816864 -3126664 -72920 1583097 2388441 2887596 2842808 2534833 3590109
4653 3590109 7064860 11301582 13115743 11095381 6864707 3222593 1777271 2266088
4645 2266088 3428627 4295764 4778175 5087591 5027366 4485940 4224917 4987156 5930989 5522598
4635 5522598 4321898 5041575 8712904 12291054 11769457 7045861 2273059 1588157 5417151
4626 5417151 10634289 13412950 12104341 8131615 4183885 1437220 -999750 -3878121
4618 -3878121 -6161016 -6338333 -4633039 -2923877 -2672019 -3521686 -3891872 -2717700 -652253
4609 -652253 654192 642207 464293 897214 903924 -179224 -397609 2178201 5382565 5118143
4599 5118143 1708086 -2090 1961000 3620312 1845019 -89897 2157472 6350097
4591 6350097 6533933 1872511 -2704512 -4298750 -5276945 -7808121 -9827191 -8600318 -5094409
4582 -5094409 -2506688 -2449616 -4232180 -6293608 -7249789 -7146262 -8275815 -12572835 -17531621
4573 -17531621 -17639516 -11569700 -5219193 -4946665 -9645054 -12516985 -9760882 -4482207
4565 -4482207 -2008183 -3974254 -7855825 -10463921 -10634903 -9372771 -8554480 -9493421 -12096333
4556 -12096333 -14912051 -15903633 -13658652 -8616137 -3223350 -203123 -250550 -1693669 -2466845
4547 -2466845 -1994697 -1156238 -947887 -1264312 -715406 1938670 5636515 7147719 4625699
4538 4625699 342066 -1873588 -1433375 -968713 -1663615 -1575646 506302 2557860 2633257
4529 2633257 2197922 3467726 5121731 3758258 -1069613 -6150062 -8857160 -9529817 -9359452
4520 -9359452 -8444074 -6957473 -6287431 -7432942 -9163134 -9154406 -6912407 -4794007 -5682917
4511 -5682917 -9578292 -12980255 -12571193 -9334246 -7354836 -8077148 -8171959 -4965510 -1612792
4502 -1612792 -3343409 -9577831 -13925413 -12504252 -8315364 -5813490 -4838206 -2743202
4494 -2743202 212485 1275831 -259575 -2360826 -3723057 -4833859 -5435250 -3948702
4486 -3948702 -471759 1982013 723623 -3511835 -7753836 -9747935 -8735116 -4881834
4478 -4881834 333893 4083861 4418724 2389486 639860 210071 180842 146790 996079
4469 996079 2749419 3583822 2232191 -60378 -1402593 -1892984 -2623444 -2987147 -1363729
4460 -1363729 1636261 3172209 2187037 1106770 2068096 3389728 1950235 -2107165 -5443304
4451 -5443304 -5845515 -4200615 -2190362 -364734 908175 745443 -771146 -1968075 -1739183
4442 -1739183 -1126124 -1412547 -1729863 -232894 2924604 5521364 6145641 5640320 5286979
4433 5286979 4707298 2420715 -1747002 -5306081 -4623618 1505184 9654449 14155520 12531349
4424 12531349 7831909 4662841 3883935 2877860 406336 -1244910 387672 4362745
4416 4362745 7373488 7347135 4991020 2571333 2107202 4078848 6902212 8044338 6404004
4407 6404004 3281140 627100 -868156 -1367897 -717831 1020628 2565168 2453310 929506
4398 929506 -442583 -955033 -1360398 -2308409 -3335300 -3613276 -2875211 -1582035 -829222
4389 -829222 -1576836 -2929712 -2032759 2437187 7217323 7444757 2839470 -1916652 -3683520
4380 -3683520 -4460482 -6689648 -8367620 -6334962 -2253340 -959373 -3398454 -5296701
4372 -5296701 -3427604 355804 2538593 2350923 1110289 -331047 -1468472 -1294863 389582
4363 389582 1985887 2054642 1237553 900142 1161552 1817729 3815892 7659963 11147422
4354 11147422 10941176 6344805 -84036 -5505336 -8920031 -10617879 -11191150 -11309388 -11311824
4345 -11311824 -10911669 -10028984 -9381061 -9191096 -8114136 -5083823 -1700353 -860098 -3107532
4336 -3107532 -6179519 -8185134 -9260501 -9723631 -8641615 -5284684 -724066 2938881
4328 2938881 4220920 2911312 93721 -2360926 -3437195 -4104322 -5611713 -7050828
4320 -7050828 -6467220 -4195131 -2708606 -2876302 -2975147 -2162773 -2076837 -3496394 -4099828
4311 -4099828 -1721142 2266470 5167180 6794767 8556267 10131816 9832716 7475836
4303 7475836 4452025 1603510 -706475 -1303664 340188 1959961 738763 -2401306
4295 -2401306 -3638135 -1626601 840242 1175675 124856 -670266 -1591168 -3575819 -5484191
4286 -5484191 -5033739 -1680896 2757227 5815852 5956019 3321657 -157600 -2083983 -1742091
4277 -1742091 -458577 366048 636836 778655 872109 1090431 1736051 2229859 1355617 -765178
4267 -765178 -2285693 -2164092 -1847097 -3303114 -6331443 -8866628 -9178513 -7047922 -3797996
4258 -3797996 -1867252 -3000503 -5886658 -7033438 -5165855 -3139321 -3899494 -6213327
4250 -6213327 -6599778 -4168472 -1013278 1161811 1910995 264238 -4432110 -9687898 -11425099
4241 -11425099 -9450153 -8125100 -9910511 -11434385 -8727961 -3849786 -2553621 -6400394
4233 -6400394 -10959051 -12090090 -10713098 -10120793 -11113733 -11733711 -10452129 -7758015 -5056720
4224 -5056720 -3335395 -2769056 -2687072 -1908263 287280 3453493 6430849 8263451 8551468
4215 8551468 7428240 5537314 3565528 1466214 -1336676 -4656767 -7148804 -7707570
4207 -7707570 -6623390 -4883856 -3198113 -2369511 -3487110 -6445979 -9047057 -9048936 -6721454
4198 -6721454 -4131064 -2537496 -1983643 -2640477 -4390082 -5465893 -4046002 -1419197 -1044845
4189 -1044845 -3837144 -6854261 -7609602 -7169610 -7546634 -8368920 -8078455 -6645222 -5135829
4180 -5135829 -3977478 -3352431 -3944685 -5681161 -7079503 -7254679 -6998562 -6627152 -5004909
4171 -5004909 -2461317 -2094741 -5628153 -10256819 -12448603 -12660445 -13144465 -13384729 -11584699
4162 -11584699 -8890056 -7988932 -8765926 -9229035 -9375630 -10166202 -10315682 -8539982 -7257973
4153 -7257973 -9183938 -12193249 -13176355 -14784570 -21417744 -30316681 -34784425 -35139963 -37288083
4144 -37288083 -41002005 -40495518 -37376745 -40537279 -50369169 -56641934 -56446082 -57838966
4136 -57838966 -56777374 -29308255 34569717 102139934 126936656 102769276 67177672
4129 67177672 51551539 50372461 44691644 33155177 26077120 24401299 21195280 16399653
4121 16399653 15961829 19931472 22511885 21882176 21105507 20877678 19002513 15970280 14531730
4112 14531730 14533749 13634982 12182118 12472249 14160888 14770074 13665120 11745951 8862847
4103 8862847 5350278 4024797 6379084 8790956 7111828 3298310 2699938 6145589
4095 6145589 9613335 10732252 10616365 9748449 7016609 3144930 878186 1301402 3335968
4086 3335968 6637982 11423804 15779869 16940990 15147845 12767541 10090094 5827142
4078 5827142 1222015 -725416 -44873 688081 1816914 6761796 15713278 23712395 26631097
4069 26631097 25269230 22208855 18577379 15477794 14522632 14765724 12751237 7935681
4061 7935681 4621062 5961868 9314575 10383310 8955340 7316724 5743764 3424681
4053 3424681 1920369 3523550 6917153 8187353 6109852 3263443 1661383 363518
4045 363518 -1540110 -2169725 859831 6412372 9989790 8244607 2483404 -2812975 -4488114
4036 -4488114 -3038322 -861920 302501 -237779 -2419892 -4579689 -3918186 -68784 3021151
4027 3021151 1633629 -2030376 -2125446 2849306 8018965 8935727 6717975 4719133 3574650
4018 3574650 2230842 1232057 1825482 3327095 4137235 4350826 5102233 6362160 7480711
4009 7480711 8761583 10275924 10291690 7533227 4341166 4839202 9847710 15673795 18029247
4000 18029247 15511518 9598248 3315102 -56070 922918 4319143 6560051 5825588
3992 5825588 2709552 -1845897 -7252842 -11955504 -13689468 -11935485 -8588963 -5473911
3984 -5473911 -2644042 113867 1766955 1484350 545381 1104384 3319535 5151820 5240470
3975 5240470 4835914 6181242 9541571 12699816 13439925 11796356 9346837 6835809 3606241
3966 3606241 -416101 -3354568 -3133507 -290581 2142791 1997489 464497 482541 2912120
3957 2912120 5370637 5424800 4086164 4718619 8468408 12495899 13764864 13155016 14010317
3948 14010317 17405699 21061913 22833157 22867404 21680135 18490256 13093862 7729017
3940 7729017 5012834 4744185 4563197 3462958 2895057 4157872 6159361 6613579 4813753
3931 4813753 2424674 1561914 2599213 4198734 5210768 5715244 5864209 4726825 1514402
3922 1514402 -2481522 -4659815 -3995186 -1967661 -400880 426588 1175711 2173838 3342312
3913 3342312 4472925 5068894 4673369 3633261 2712530 1860475 428955 -1270858 -1857601
3904 -1857601 -601265 1808322 4246746 5750690 5461305 3663734 2565144 3860036
3896 3860036 5727110 5000081 2409990 2182539 5492563 8147899 6775756 3641987 2406652
3887 2406652 2386047 904121 -1070320 -103121 4003784 7781016 8955966 8240828 6651615
3878 6651615 4582615 3501203 5078853 8225462 10033713 9967678 9995993 10265514 8318200
3869 8318200 3829489 640987 1896523 5644083 7556377 6236517 3665544 1786341
3861 1786341 925760 895845 1539535 2127868 1710127 497975 108794 1936120 5460807
3852 5460807 8526993 9495767 8854494 8111130 7405468 5544119 2513524 -22287 -1647203
3843 -1647203 -4344256 -8802092 -11640073 -9195398 -2853525 2399219 3929764 2918880
3835 2918880 694529 -2557660 -5261191 -4506069 101719 5489965 8994231 10550420
3827 10550420 10479045 8434445 5758951 5421236 7651335 8695676 6226320 3194954 3552734
3818 3552734 6495111 8135194 7275241 6259763 6930533 8684206 10263916 11005859 10311189
3809 10311189 7910751 4859658 2874034 2671351 3848899 5735745 7224279 6696480
3801 6696480 3793119 754103 385290 2878636 5885560 7416689 7524203 7579920 9098082
3792 9098082 12738863 17069056 18706330 15326187 8684357 3389388 2318098 4072045
3784 4072045 5203011 4206993 2806104 3436730 5910597 7251810 5320990 1852692 561607
3775 561607 2461930 4726794 4474283 2004701 -363287 -1109578 -318060 967225 1363984
3766 1363984 380324 -366744 1377942 5268792 8401630 9293391 9607653 10716753 10926095
3757 10926095 8093037 3193207 -795870 -2201164 -1179679 1368988 3560451 3026423
3749 3026423 -134941 -2593847 -2233145 -1431948 -3125454 -5505870 -4295791 804016 5750268
3740 5750268 7826918 8043975 7903001 7381721 6701135 6885511 7701925 7697005 6850300 6473662
3730 6473662 6007974 3100526 -2050563 -5574249 -4925559 -2427641 -1771279 -3089938 -3855858
3721 -3855858 -3210618 -2874564 -4167182 -6112445 -6793676 -5535307 -3376323 -1712191 -733062
3712 -733062 446091 2062318 3076358 2919920 2596518 2716911 1828827 -1207008 -4362037
3703 -4362037 -4711773 -2833941 -1765030 -1853267 -339632 3368664 5840255 4640676 1963638
3694 1963638 1158097 2271876 3276605 3486408 3413732 3035085 2485550 2964863 4790520
3685 4790520 5953784 4819474 3048803 3538833 6270056 8316883 7444819 3893501 -910423
3676 -910423 -5721293 -9782306 -12923112 -15044944 -15087800 -11784925 -6149844 -1388647 926774
3667 926774 2678292 5637110 8321115 8732712 8119177 8864320 10063813 8693406 4533235
3658 4533235 540886 -1530764 -2719512 -4014757 -5117611 -6417873 -9009927 -11849069
3650 -11849069 -11859026 -8185463 -3823248 -1648952 -1216588 -1024787 -1556646 -3844339 -6719020
3641 -6719020 -7954193 -7382636 -6880092 -7571202 -8498351 -7862964 -4707743 113138 3936050
3632 3936050 4142628 885610 -2951734 -5282471 -6957993 -9317409 -11404741 -11683514 -11048763
3623 -11048763 -11279482 -11235932 -8021455 -2324033 887025 -1293776 -5389420 -5957546 -2409972
3614 -2409972 1293107 2424405 1753981 442612 -1847412 -4802834 -6286675 -5063520
3606 -5063520 -2823029 -1808869 -1923408 -1742101 -803201 984515 4531574 9568418 12752172
3597 12752172 11054095 6566293 4386639 5458866 5348115 1379862 -2946196 -3320365
3589 -3320365 -1184819 -1177019 -3900730 -5423932 -3562730 -784166 -93480 -1114282 -1651053
3580 -1651053 -964639 83995 780342 1037320 904096 612682 655978 1266745 2291835
3571 2291835 3786364 5944113 8123477 8779250 6849538 2648195 -2796314 -8446045
3563 -8446045 -12999291 -15021117 -14280462 -12493116 -11796117 -12414184 -12441929 -10286945 -7041751
3554 -7041751 -5714481 -7691690 -10706377 -11573044 -10620918 -11393295 -15346914 -19197072 -19268035
3545 -19268035 -16384401 -13767318 -11748179 -8334207 -4452813 -4172415 -8508494 -12890090
3537 -12890090 -13047673 -10413839 -9001778 -9411573 -9177383 -7355716 -5156542 -2713760 1259851
3528 1259851 6402924 10271023 11569653 11351256 10447900 8315335 5385827 3909081 4714695
3519 4714695 5280641 3163356 -331635 -2401258 -3407663 -6152038 -10689006 -13208941
3511 -13208941 -11305864 -7723362 -6787382 -8790661 -10299520 -9119545 -6347225 -3584916
3503 -3584916 -827277 1894978 2957242 1001071 -2786893 -5820770 -6768780 -5756751
3495 -5756751 -2981692 949079 3947982 4093494 2472592 2104004 3465140 3465609 158871
3486 158871 -3760602 -4404823 -2239640 -1486253 -4336933 -8439730 -10747931 -11505776 -12778786
3477 -12778786 -14449826 -13912860 -9838530 -4596061 -1976526 -3132174 -5664968 -6580442
3469 -6580442 -5285934 -3475554 -2931170 -4116173 -6296242 -8021617 -7792563 -5482358 -3209029
3460 -3209029 -3547071 -6404197 -8772798 -8197624 -5393906 -2610800 -618222 1268903 3036455
3451 3036455 3752629 3500906 3851872 5830812 8547325 10491850 11351101 11801274 12016975
3442 12016975 11156471 8320529 3720545 -1078419 -4045296 -4082857 -1794857 1045500 2666459
3433 2666459 2060032 -707465 -4287648 -6476173 -5734554 -2569768 944899 3112107 3900464
3424 3900464 4505987 5953688 7920559 8730714 7085304 4232419 3469233 6307717 9837235
3415 9837235 9668639 5442203 1462785 1262170 3442363 4271178 2874162 1710400 2345395
3406 2345395 2961861 839208 -3988865 -8643388 -10522271 -9656153 -7995585 -7101073 -6979479
3397 -6979479 -6806914 -5987257 -4267154 -1559470 1591950 3739400 3639063 1666150 -549260
3388 -549260 -1828764 -2054635 -1329272 221865 1653615 1643054 432089 139443 2205327
3379 2205327 5511909 8075910 9655207 11306222 12997623 13306384 11529659 8813440
3371 8813440 6789512 5766261 4487015 1420925 -3416812 -7660533 -8404634 -5511563
3363 -5511563 -2183544 -1186044 -1537360 -526871 1916230 3120533 1647703 -1029842 -3086440
3354 -3086440 -4220386 -4366360 -3046577 -1317722 -2058708 -6273098 -10670597 -11098928 -7355191
3345 -7355191 -2558919 1257953 4485730 7413654 9248654 10157639 11726597 14097566
3337 14097566 14658189 11481624 6841133 4990907 6611977 7726790 5074430 816129
3329 816129 -18458 3928010 8667672 10129768 8720012 7073702 5385234 1940469 -2585011
3320 -2585011 -4974700 -4288320 -3586404 -5216327 -7115782 -6142338 -2972587 -868657 -882536
3311 -882536 -1176775 -432611 860823 2356315 4580700 7534605 10517729 13243311 15243189
3302 15243189 14766341 10902642 6518266 5882745 8867329 10657534 8260509 4157576
3294 4157576 1873246 1012671 -713904 -2872138 -2886921 -178828 3008977 4480978 3677080
3285 3677080 848710 -3251588 -6872289 -8165865 -6908090 -4441103 -2107422 -486897
3277 -486897 392004 1004898 1952320 2917482 2824677 1615956 463215 -647022 -3494598
3268 -3494598 -8041710 -10438845 -7566930 -2205424 -159607 -2708413 -5611925 -5945208
3260 -5945208 -5933108 -8292565 -11204633 -10896898 -7253527 -3642317 -1870608 -358977 2224409
3251 2224409 4082974 2714752 -1001128 -3159374 -1445397 2179180 4331837 4430768 4196536
3242 4196536 3654130 602117 -4990458 -8975203 -7911233 -4130756 -2893616 -5419735
3234 -5419735 -7973649 -7660344 -5737780 -4472760 -3832932 -2756826 -1228589 590113 3267391
3225 3267391 6421542 7948917 6816792 5073447 5047654 5915682 5395569 3846259 3917601
3216 3917601 6245392 8091624 6932695 3443741 37805 -1979613 -2711905 -2423200 -1507281
3207 -1507281 -1180909 -2709604 -5663160 -7853061 -7465860 -4761017 -1327855 1713301 4077759
3198 4077759 5373120 4983183 3135713 1133451 16322 -361460 -673894 -1531651 -3912118
3189 -3912118 -8658604 -14351628 -16987578 -13630080 -5875226 1791755 6455929 8090671
3181 8090671 7495631 5415890 3466331 3357468 4739336 5787399 6092854 6840500 8121198
3172 8121198 8818836 9578046 12608014 17162721 18390583 13061761 4215693 -2257988 -3901908
3163 -3901908 -2454847 -368645 715949 -453940 -3665130 -6447954 -6858504 -6281641 -7023106
3154 -7023106 -8099408 -6501930 -2254369 1106689 1521108 823045 1136234 1506956 -167428
3145 -167428 -3580198 -6149952 -5912028 -3113493 462829 2851384 3008532 1367752 -639105
3136 -639105 -1753367 -1609426 -688740 48839 -122062 -893631 -1233522 -697883 406391
3127 406391 2312825 5562420 8678902 8308959 3703862 -799198 -590830 3116584 5165401
3118 5165401 3671181 1695698 1655095 2056924 1124928 158364 1043716 2959230 3990317
3109 3990317 4260383 5146355 6660742 7740692 8156668 8175726 7194181 4711757 2069849
3100 2069849 1234306 2147435 3148213 3832944 5446253 8099824 9616013 8236710 5133716
3091 5133716 2843032 1913492 589495 -2250593 -5283313 -6515486 -5854254 -4823184 -4268819
3082 -4268819 -3691249 -2724966 -1725575 -548803 1541271 3885362 4154265 1628048 -814580
3073 -814580 -162278 2376423 3055613 988790 -1105429 -1589138 -2045372 -3548151 -3690171
3064 -3690171 362584 7326191 12450663 12334442 7995547 3629595 2915042 5785532 8430628
3055 8430628 7417384 3909613 2248047 4106179 6339521 5746927 3589284 3231855 4993118
3046 4993118 6038187 4719426 2472591 1330274 1689661 3095117 5537237 8907062
3038 8907062 11947687 12808731 10912074 8101890 7435195 10071512 13354274 12994489 7662905
3029 7662905 622005 -3710403 -4011923 -2359757 -1279677 -1441806 -1793788 -1194110 -1017
3020 -1017 -81225 -2724055 -6771247 -9819362 -11008745 -11142752 -10295851 -7556309 -3618035
3011 -3618035 -1237258 -1939637 -4180150 -5761887 -5972808 -4384528 -387047 4259471 5320555
3002 5320555 1264061 -3778454 -5127198 -3407804 -2048469 -1320596 726028 2955617
2994 2955617 1945331 -2041976 -4715846 -4008733 -2215180 -960380 1329205 5070365
2986 5070365 6974705 4755866 1197248 539646 3172007 6520273 8939904 9999978
2978 9999978 8984245 6152556 3986761 4234592 4864424 2766621 -1515529 -4593096 -4941400
2969 -4941400 -3789705 -1766233 2092402 7574895 12304355 14388020 14093337 12344617
2961 12344617 9471793 6012430 2917784 338863 -2138641 -3693820 -2764034 -10225
2953 -10225 1469923 117584 -2016051 -2768942 -3271940 -5406353 -7542730 -6213905 -1752630
2944 -1752630 1120659 -674226 -4633476 -6333008 -4883759 -2563641 -610530 1615151
2936 1615151 3611941 3172010 157256 -1668374 965874 5830354 7407432 4109137
2928 4109137 494924 1131965 4684507 6465166 5337153 4770710 6981940 9446226 8995065
2919 8995065 6794248 6348964 7854237 7929019 5097574 2280204 2430483 4247009 4447921
2910 4447921 2686897 1578468 2412802 3366947 2303454 -572692 -3526371 -5418448 -6338094
2901 -6338094 -7001938 -7963730 -8761707 -7865988 -4460133 -255758 1726066 440632 -2236457
2892 -2236457 -3989119 -4162855 -3201531 -1658060 -501908 -997963 -3324575 -6233580 -8546939
2883 -8546939 -9853518 -9589959 -7303690 -4360594 -3134958 -3448002 -2289999 1257483 3507930
2874 3507930 1266858 -2795562 -3430772 -160838 2600585 2444074 1924864 3783267 6772704
2865 6772704 8073511 7347200 6293455 5702098 4869874 3231118 1187740 -394948 -813859
2856 -813859 29900 1493951 2816420 3764110 4235315 3848260 2825014 2441641 3213496
2847 3213496 3557534 2192547 1004177 2881915 7039801 9503712 8555063 6594693 5783678
2838 5783678 5034365 2858510 203422 -1748443 -4106337 -7945964 -11278939 -11185041 -7980900
2829 -7980900 -4794516 -3591586 -3661630 -3425821 -1807627 1612600 5885197 8578149 8161425
2820 8161425 6020064 4323345 2639306 -870557 -5084110 -5712291 -670756 6422837
2812 6422837 9880851 8021952 3994766 1122900 -621922 -2939880 -5618599 -6479343
2804 -6479343 -4752551 -2585532 -2204158 -3089487 -3612837 -4232250 -6577942 -9811647 -10822065
2795 -10822065 -8588745 -5576846 -3607442 -1001271 4146942 9827119 11697428 7939448
2787 7939448 781515 -6018972 -9815126 -10221883 -9148721 -8918269 -9336004 -7885871 -3832987
2778 -3832987 -166932 318941 -1011787 -909173 1180647 3481266 5393708 7409887 8334862
2769 8334862 6142725 1799896 -854514 216439 3089763 5085147 5977107 7122578
2761 7122578 8996590 10460011 9690088 5912634 1094733 -929023 1377696 4790695
2753 4790695 4912275 1249528 -3504034 -7889487 -12058176 -14591480 -13192345 -9037370
2745 -9037370 -6479594 -7254583 -8551408 -8159027 -7714517 -8702537 -8833526 -5543834 -543683
2736 -543683 2460612 2969707 3571502 5674819 8090390 9283390 8844394 7188101 5489770
2727 5489770 5220594 6226179 6237691 3870302 933485 -81461 335255 -348426 -3045096
2718 -3045096 -6497754 -9574888 -11769806 -11977313 -9333658 -5343016 -3016485 -3654696 -6154739
2709 -6154739 -9264022 -12367373 -13981532 -11961077 -6262925 50263 3490118 2888795
2701 2888795 -634386 -4858643 -7184534 -5962480 -2217343 1065439 2254997 2603839
2693 2603839 3622059 4277187 2463291 -1338474 -3767505 -2475296 828558 2060561
2685 2060561 -971432 -6676894 -11682413 -13666433 -12108312 -7709985 -2409891 843208
2677 843208 298041 -2388259 -3763968 -2787347 -1674642 -1962425 -1991582 95602 2916402
2668 2916402 3896713 3413503 3957049 5739378 6297972 4767776 3483370 4163906 5067615
2659 5067615 3715461 645923 -1458592 -1244203 458886 2434365 4059303 4957957 5189519
2650 5189519 5588517 6699822 7588080 6880307 4805730 2954587 2039942 1197028 -268544
2641 -268544 -1691588 -2104695 -1420261 28718 2049250 3821984 3624997 749142 -2822996
2632 -2822996 -4247341 -3318996 -2560114 -3466153 -4406754 -3331265 -1089049 -350243 -1994277
2623 -1994277 -4306018 -5336945 -4315581 -1086496 3553739 6655878 4792329 -1689859
2615 -1689859 -7967957 -9989479 -8984166 -8895917 -10639227 -11474691 -9697042 -7220968 -6716938
2606 -6716938 -8133720 -9347595 -9156642 -8304886 -7875295 -7712395 -6760748 -4637548 -2414811
2597 -2414811 -1514961 -2078784 -3175748 -4606665 -7244925 -10996452 -13809455 -14022580 -12674414
2588 -12674414 -11888241 -11772177 -10855648 -9122978 -8312400 -8978770 -9420931 -8261987 -6313885
2579 -6313885 -4975221 -4290316 -3578748 -2679600 -1584949 -94758 1045007 -150995 -4581434
2570 -4581434 -10036573 -12800428 -11135731 -6544324 -2064891 56108 -346960 -1595902
2562 -1595902 -2049907 -2035447 -3086255 -5094174 -5836039 -4277338 -2613463 -3244094 -4994074
2553 -4994074 -4623400 -1511363 1496575 1874819 -105977 -2865574 -5218718 -5957637 -4035046
2544 -4035046 -589409 981614 -1145388 -4339914 -4371479 -664522 3114990 3686021 1623437
2535 1623437 -259143 -416161 692939 2433135 4925598 7865149 9474409 7646228
2527 7646228 2275093 -3954052 -7493694 -6838462 -3588984 -712333 139121 -427595 -951646
2518 -951646 -867829 -527280 -9134 1013846 1900487 616082 -4070056 -10227754 -13957057
2509 -13957057 -13312339 -10013165 -6833474 -4572627 -2627682 -1358584 -1970066 -4199300
2501 -4199300 -5909743 -5576387 -4044321 -3281175 -4299280 -6694742 -9132762 -9715432 -7166727
2492 -7166727 -2774052 -121760 -1433621 -4826212 -6742697 -6552672 -6664291 -8095021 -8577753
2483 -8577753 -6421486 -4067115 -5259354 -9540363 -12331362 -10870250 -7633293 -6557411
2475 -6557411 -7771563 -8252499 -6811964 -5788645 -7279944 -9928284 -11014622 -10403953 -10327600
2466 -10327600 -11568326 -12015121 -9737517 -5881718 -3218098 -2775435 -3358228 -3834250 -4201025
2457 -4201025 -4335837 -3403116 -1272490 716917 1472220 1861523 3613373 6878725 9832126
2448 9832126 10520314 8445344 4747682 1703041 1564650 4569536 8062688 8874129 6884345
2439 6884345 5076288 5610145 7127099 6911657 4778916 3471186 5411395 10083192 14680803
2430 14680803 16679454 15737060 13615162 12378962 12525135 13020186 13089794 13108374 13250309
2421 13250309 12338701 9310309 5262967 2506673 1625834 964301 -802600 -3198149 -5517019
2412 -5517019 -7975173 -10024807 -9258188 -4243819 2293611 5618654 4551232 2766236
2404 2766236 3866081 7131124 9324996 8905735 6644244 3410234 -276839 -2952839
2396 -2952839 -2889823 -496249 1765700 2359136 2013774 1764885 1565990 1562029 2644282 4434930
2386 4434930 4709678 2640307 788253 1482901 2719995 721307 -4193779 -7709272 -7608248
2377 -7608248 -6394754 -6883917 -8228222 -7922751 -5269086 -1058320 3960132 8239962 9094195
2368 9094195 5716318 1182585 -992599 -1146506 -1826257 -3039036 -2351083 591277 2989503
2359 2989503 2981610 1878816 1135367 -310496 -3775516 -7746873 -9358405 -8256149 -7092521
2350 -7092521 -8192899 -10996299 -12946370 -12109475 -8818808 -5322647 -3883123 -4745279 -5823973
2341 -5823973 -4696160 -1151774 2251524 2393321 -1368531 -6355060 -9100957 -8788614 -7657421
2332 -7657421 -7847262 -8625359 -7373122 -2763744 3750559 9177507 11088771 9167275 5694313
2323 5694313 4123334 6040175 9458093 10741035 8077122 2719051 -2467965 -4982761
2315 -4982761 -4180032 -1970845 -1276013 -2582848 -2999106 -243097 3605484 4623508 2546387
2306 2546387 994060 2356258 5386471 8272441 10961198 13199661 13172468 10181818 6667300
2297 6667300 5362808 5741458 5161771 2498690 -1008859 -3558400 -3977415 -2201349 -12687
2288 -12687 -29344 -2199909 -2628194 1745878 8128514 10316384 6262970 638530 -1047884
2279 -1047884 1158106 2660418 556375 -3032229 -4178355 -2460119 -1663441 -4932531
2271 -4932531 -10555347 -14024358 -13574918 -11513240 -10050720 -8590070 -6251883 -4238188
2263 -4238188 -3393008 -1794625 2019531 5079407 3185622 -2433777 -5861973 -4482928
2255 -4482928 -2084441 -2301304 -2987860 -365607 4176740 5789800 3439276 980147 725009
2246 725009 260885 -2606127 -5410284 -4608143 -1276441 395224 -794027 -2250202 -2728859
2237 -2728859 -4202114 -7370130 -9115713 -6959946 -3189764 -1501388 -1763105 -1559197 -1079011
2228 -1079011 -2221880 -3808446 -2497918 1209247 2596025 -286325 -3518007 -3216914
2220 -3216914 -680500 959382 1730908 3231257 4785941 4709829 3484218 2476359 1229153
2211 1229153 -829184 -1732026 423250 3501401 3570954 305664 -3234408 -5416697 -7047308
2202 -7047308 -8080654 -7116772 -4387523 -1921864 -363891 1491800 3885220 5707213
2194 5707213 6887324 8105630 8208748 5304510 618672 -2198316 -1942996 -571182 1066801
2185 1066801 4031150 7272510 7588596 5206099 4728612 8071691 10770447 8389381 2746635
2176 2746635 -1700717 -4085913 -5729353 -5691158 -2582053 1127295 1420521 -1592898 -4534841
2167 -4534841 -6439101 -9195759 -12605379 -13496598 -10541537 -6131183 -2319543 1663923
2159 1663923 6251858 8929560 7229660 2641874 -764097 -1007199 112187 -259183 -2892939
2150 -2892939 -6389036 -9400826 -11891468 -13825002 -13796884 -10765114 -6875688 -6072294 -8995922
2141 -8995922 -11682817 -10961241 -8813920 -8965555 -11102977 -11656660 -9241861 -6048781 -4201028
2132 -4201028 -3765739 -4311701 -5507879 -5959196 -4277496 -1748171 -1183429 -2527571 -2447539
2123 -2447539 716281 4427858 5899950 5952042 6780312 7871336 6757979 2921251 -1396046
2114 -1396046 -4040694 -4807132 -4424648 -3271876 -1654266 -391779 -282645 -1072791 -1475564
2105 -1475564 -563691 1023716 1766282 1093311 -258756 -1759498 -3684345 -5774609 -6941803
2096 -6941803 -7253430 -8273656 -9842788 -8796269 -3659018 1319935 697497 -4540532 -8182973
2087 -8182973 -7461336 -5760281 -5820969 -5403145 -2247106 1177660 1671359 748026 1881224
2078 1881224 4633763 5926197 5653326 6431462 8249432 7930984 4597459 1763286 2501513
2069 2501513 5350759 6568611 4407698 -9227 -4161091 -5365883 -2360353 3074422
2061 3074422 7388483 9040061 9607977 10581521 11155812 10497249 10020709 11196984 12555608
2052 12555608 11477325 8339935 6271706 6655062 7228153 5421537 1746294 -1225913
2044 -1225913 -1941675 -750977 1363505 3706173 5924520 8032821 10069889 11239870
2036 11239870 10269142 7615143 6356819 9077555 14097080 16782840 15012831 11387847
2028 11387847 9029778 7080468 2318775 -5719477 -13344156 -16363633 -13663310 -7336714
2020 -7336714 -878898 2670320 2529823 866964 606952 2047903 2655599 570999 -2935470
2011 -2935470 -5161468 -4956125 -3143740 -967357 826016 1987695 2845326 4019321 5407898
2002 5407898 5961351 5097991 3750942 3284705 3898392 4776297 5228813 4968542 3920555
1993 3920555 2617279 2153853 2808446 3331447 2669342 1721622 1964724 2784120 2001802
1984 2001802 -688911 -2535275 -955565 3057667 5964485 5864674 4634164 5372862 8129220
1975 8129220 9237863 5752956 -121053 -2810288 14497 4528639 5759284 3683917
1967 3683917 2068627 2510483 2825412 1313226 -728224 -1938803 -3437656 -6239229 -8119714
1958 -8119714 -5854134 24267 5040552 5561596 2318034 -979163 -1462391 475531 1758493
1949 1758493 -219283 -4396749 -6677253 -4728769 -1223706 -657398 -3652004 -6649097
1941 -6649097 -7087142 -6186522 -5822361 -5342890 -3388208 -882425 302493 617192 2154954
1932 2154954 4983981 6686022 5970031 4483558 4018979 3782748 1989624 -1016961 -3023474
1923 -3023474 -2968083 -2215982 -2682944 -4769358 -7522074 -10080782 -12310692 -14103977 -14536334
1914 -14536334 -12299150 -7414605 -2220641 339778 -184058 -1158828 -22594 2665170
1906 2665170 4226493 3352500 1356978 100666 1975 443905 952309 1192102 613678
1897 613678 -895028 -2339433 -2525040 -1615193 -989395 -1365051 -1827885 -1271515 -219945
1888 -219945 -260274 -1726033 -3037114 -2874757 -2088227 -2457285 -4209381 -6105009 -7662321
1879 -7662321 -9562170 -11555141 -11829578 -9531761 -6505819 -5233032 -6197034 -8641515 -12519667
1870 -12519667 -17410066 -20253939 -17144252 -8241329 1054881 5103964 3286080 -349823
1862 -349823 -1654963 153869 2786305 3726902 2811461 1987611 2385130 2462536 197040
1853 197040 -3567921 -5802713 -5265862 -3849024 -3530277 -3882857 -3494380 -2311186 -1510182
1844 -1510182 -2059274 -4018937 -6256036 -6772252 -4949359 -3476312 -5589094 -9862027 -10817632
1835 -10817632 -6260880 -941591 -469115 -4269633 -7638804 -8394901 -7668795 -5850218 -2311853
1826 -2311853 1369208 2393605 1327816 1730632 4529560 6676422 6428767 5904606 6599580
1817 6599580 6306016 3211370 -204651 -613814 1276877 2557511 2724279 2898335 2197915
1808 2197915 -884182 -4205692 -3494702 1309422 5099845 4310030 1343445 448342 1807096
1799 1807096 2173554 -230909 -3960996 -6802154 -7855537 -7230184 -5311130 -2783747 -553060
1790 -553060 683483 530463 -1151399 -3860007 -6235576 -6792333 -4923714 -1128335 3361580
1781 3361580 7038029 8878146 9095040 8616896 7586476 5334585 2359106 929798 2291965
1772 2291965 4293757 3787677 955885 -975266 -347860 1160738 2114183 3836576 7396594
1763 7396594 10410111 9872588 6946253 5502256 6088808 4996473 459730 -3496967 -1900875
1754 -1900875 4397119 9551600 9586542 6020738 2773692 1671597 1653066 900037 -1181464
1745 -1181464 -3385179 -3520304 -312029 5039242 9451468 10458458 8290125 5765164
1737 5765164 6114770 10178176 15286810 17626432 16293587 14094803 13445417 12827269 9337371
1728 9337371 4008876 1722057 5079303 10755242 13462685 11883982 8942824 7514925
1720 7514925 8058407 9889366 12371281 14335156 14136651 11358099 7583072 4746076 3326602
1711 3326602 2593656 1768358 267209 -2351238 -5603304 -7709918 -7192062 -4750744 -2473017
1702 -2473017 -1128668 505054 3230423 5647119 5773537 3583419 769467 -1456032
1694 -1456032 -3069286 -4099400 -4257188 -3850500 -3776319 -4165294 -4065060 -2977259 -1851349
1685 -1851349 -1997535 -3600463 -5600227 -6415865 -4754616 -738737 3502037 5446038 4797238
1676 4797238 3515973 3086622 3158786 3177867 3425987 3528790 1947218 -1467856 -4132182
1667 -4132182 -3906719 -2298508 -2357537 -4391293 -6019643 -5791232 -4451686 -3000357 -1685009
1658 -1685009 -764164 -273691 786642 3119417 5265504 5060741 2639859 -32022 -2064001
1649 -2064001 -3686303 -4117939 -2574431 -1169440 -3068615 -7143362 -8300020 -4541369
1641 -4541369 -72057 646608 -1413529 -2634555 -2166225 -1435815 -601312 798210 1229480
1632 1229480 -1145251 -4836159 -6340111 -4877541 -2971812 -2325305 -1827185 -74169 2445271
1623 2445271 4439773 5461891 5805738 5775845 5286751 3554901 -226457 -4893518 -7018580
1614 -7018580 -4417811 672317 3945589 4245053 4320651 6402609 9313325 10631336 9794495
1605 9794495 7960367 6077678 4274798 2569115 1292915 807466 949016 798013 -542410
1596 -542410 -2661612 -4023091 -3887044 -3142193 -2601455 -1718981 -76609 1176176 905784
1587 905784 -97182 -500703 -683721 -1720859 -3113701 -3639078 -3511563 -3344362 -1900922
1578 -1900922 2249779 7375718 9959360 9258495 7375261 4957986 669013 -4470634
1570 -4470634 -6473690 -4127690 -1818544 -3922613 -8977504 -12193034 -11690264 -9395494
1562 -9395494 -7319808 -5918391 -5269508 -5198604 -4574739 -2560008 -198853 935078 1035057
1553 1035057 1269686 1493402 786458 -281440 -74247 1679043 3899806 6382318 9789570
1544 9789570 13343314 14871005 13852487 12378744 12039022 11581565 8990113 4490745 -121686
1535 -121686 -4174671 -8155450 -11258214 -11012015 -6419063 -282110 3099031 2405372 333126
1526 333126 50339 1836035 3826126 4868314 5282059 5395581 4972380 4236000 4116507
1517 4116507 4961186 5858591 5653938 4072640 1824948 305006 923856 3595704 6019889
1508 6019889 5864873 3738962 2506324 3514856 5215657 5844535 5503288 4877690 3917567
1499 3917567 2869995 2691710 3096750 2017838 -1460592 -5342823 -7451412 -8032444 -7806480
1490 -7806480 -5621966 -820277 3776279 4634829 2454731 1068208 1877407 2830475 2930616
1481 2930616 3982652 6774601 8855833 8005729 5534583 4183036 4448004 4744575 3863046
1472 3863046 1735419 -1003796 -2797323 -1787726 1715638 4486074 3915340 1520402
1464 1520402 932415 2756448 3692638 1356104 -1960307 -1931146 2130894 6033375 5661545
1455 5661545 1943042 -497189 742729 3026956 2415861 -1377054 -5156977 -6262144
1447 -6262144 -4628471 -1504548 1887205 4507913 6091849 7543531 9148892 8934952
1439 8934952 5217578 426509 -991174 893240 926374 -3216811 -6455504 -3253958 3771726
1430 3771726 7051073 4517774 1491913 1762810 2305569 -566252 -4243778 -3412616 1567357
1421 1567357 4605509 2220644 -2021550 -2835873 -81827 2101533 1506925 358681 1389207
1412 1389207 3600278 3334970 -1165354 -7476717 -11253250 -10112409 -5317401 -311260
1404 -311260 2117711 1650296 -49601 -1399128 -2339055 -3766450 -6042373 -8545142 -10385015
1395 -10385015 -10901166 -9657213 -6843742 -3809037 -2293125 -2667257 -3472338 -3026149 -1003024
1386 -1003024 1693690 3831828 4324158 2760184 126586 -1785491 -2467189 -3472860 -6174078
1377 -6174078 -9369622 -10450202 -8867665 -7214897 -8355808 -12061919 -14951575 -13728462
1369 -13728462 -8533259 -3143218 -1539115 -4142807 -7878487 -9922435 -10373172 -10821691
1361 -10821691 -11657203 -12026574 -11527195 -10420738 -8661957 -6136111 -3445172 -1044470 1856382
1352 1856382 5781912 8888835 8704242 6027481 4527648 5670989 6497831 3872742 -1041110
1343 -1041110 -4249592 -3369993 936121 6432249 10407585 10681402 7605884 4211488 2598242
1334 2598242 1226964 -2376248 -7631400 -12127811 -15602598 -19488766 -23063069 -23642155
1326 -23642155 -20993941 -18220443 -17337827 -16899698 -14981080 -11644576 -7431791 -2558181
1318 -2558181 1078542 662706 -2646531 -3169048 1927258 7868456 8477515 4298441 292798
1309 292798 -2053211 -5030610 -8531092 -9376619 -6864836 -3678022 -774921 3243993 6724840
1300 6724840 4979242 -1683745 -5543751 -1117448 7110298 11021516 9297923 6541559
1292 6541559 4843019 2071783 -2512551 -6366740 -7537920 -6176905 -2181815 4424639
1284 4424639 10472733 11465074 7731180 5018261 7266722 11919121 14116107 12618808
1276 12618808 9445031 6066382 2556979 -750572 -2888038 -3137218 -1471778 1051622
1268 1051622 2133083 115661 -3502157 -5342094 -4513787 -3512055 -3982566 -4249043 -2574784
1259 -2574784 -361168 3593 -1571369 -3930470 -7050924 -10840388 -13192261 -12078904
1251 -12078904 -8561652 -5143847 -2172986 1332411 4198442 3779147 126430 -3513134
1243 -3513134 -4845526 -4721229 -4808128 -5524896 -6860950 -8852659 -10318938 -9161908 -4949869
1234 -4949869 377654 4970353 8452514 10378204 9564254 6066012 1910776 -1240577
1226 -1240577 -3357957 -4135489 -2328301 1421306 3700550 2749883 1577356 3492288 6203760
1217 6203760 4431311 -1927057 -6429641 -4101548 2488223 7099771 7374176 6172558
1209 6172558 6792200 9263240 11129114 10225177 6547735 2287051 1634 263560 1374764
1200 1374764 1575112 625271 -1212545 -4292923 -8292642 -10823771 -9291523 -4094570 1473854
1191 1473854 4625745 5298338 5172630 5817085 7770706 10064862 10584486 8387181 5781178
1182 5781178 6334893 10372155 14288731 15035961 13236700 10763113 7621881 3413474 -22476
1173 -22476 -408451 1340386 2176533 1390059 1243069 2932992 4704168 4830079 4035492
1164 4035492 3683386 3560609 2960847 2401200 2684716 3347951 3419962 2898194 2405270 2225010
1154 2225010 2510471 3362199 3878508 2545862 -278886 -1795756 -223001 2541057 3506750
1145 3506750 2510940 1353943 221751 -2110273 -4848517 -5075290 -1810364 2322107 4679864
1136 4679864 5938969 8432668 12509376 16072475 17147702 15783276 13600197 12042111
1128 12042111 10945658 8818605 4977968 1150483 -50943 1715584 3953875 4127566
1120 4127566 1997737 -1052748 -3835740 -5913150 -7204363 -7631236 -6737509 -3764605 993998
1111 993998 5144993 6035591 3975020 2164322 2894013 5250292 7212276 8356219 9320975
1102 9320975 9982737 9672048 8449779 6993588 5821078 5393651 6042138 6974125 6578708
1093 6578708 4802959 3907503 5462769 7876863 8584557 7485398 6254701 5380701 4248822
1084 4248822 3266501 3122648 2435090 -666606 -4436242 -4411607 439329 5556571 6594722
1075 6594722 4778602 4090131 5144796 4814549 1067918 -4503452 -8940477 -10747234 -10371984
1066 -10371984 -9289441 -8657736 -8016801 -5865342 -2430193 -612947 -2429521 -5652597
1058 -5652597 -6465824 -4772274 -3824285 -4532461 -3651411 1015442 6695091 9273740 8662141
1049 8662141 7788104 7631365 6344037 3021395 -461404 -1977880 -1506994 -238434 1037455
1040 1037455 1708295 770383 -2259881 -6235697 -8948227 -8801603 -5859300 -1637862 1951520
1031 1951520 3741052 3557185 1538588 -2054296 -5996667 -8174563 -7657463 -5898397 -4493127
1022 -4493127 -2670566 899987 4507891 4701394 1658549 -32542 2350482 5533088
1014 5533088 5052698 1890182 703745 2627639 3932524 2144437 -375465 -540861 825140
1005 825140 853107 -862573 -2270853 -2360722 -2089438 -2114995 -1985435 -1936451 -3425456 -6956621
995 -6956621 -10848772 -13148295 -13516719 -12155334 -8286848 -1650724 5208477 8535681 7593449
986 7593449 5297232 3978300 2628293 -340731 -3774917 -5645284 -6808611 -9748409
978 -9748409 -13853231 -15271062 -12364325 -8447262 -7427665 -8915911 -9658465 -8123245 -5315340
969 -5315340 -2105263 1659056 5423714 7407191 6454257 3409436 329646 -1191431 -1155710
960 -1155710 -1103134 -2429081 -4391351 -4749588 -2890588 -873886 -429511 -681593 -439826
951 -439826 -878875 -3439137 -6413537 -6719916 -4610025 -3563532 -5336160 -7927137 -9030324
942 -9030324 -8939064 -9080392 -9765509 -10476300 -10871189 -10710490 -9902943 -8828119 -7515692 -5064537
932 -5064537 -1533573 698362 206203 139802 4637195 11788228 14884840 11756689 7963065
923 7963065 8403902 10536127 9571316 6318128 4968956 5730168 4968511 1658738 -1131022
914 -1131022 -1203483 251841 1477760 2237465 2597655 2281097 1614622 984975 -493899
905 -493899 -3505111 -6138176 -5652781 -2524773 -75927 12400 -678357 -160648 2038054
896 2038054 5791369 10480436 14035416 14634265 13620194 13991823 15884483 16698327 15919364
887 15919364 15941805 17067042 15865233 10809977 5944048 5753460 8916271 10467674 8458746
878 8458746 5193973 2944511 1735723 1259051 2153521 4584293 7072911 7488727 4868937
869 4868937 453211 -2980941 -3723627 -3251453 -4280964 -6419420 -6056531 -1746447 2869275
860 2869275 3785297 2231328 2567560 5786763 8383780 7509108 4276428 1420268 100231
851 100231 -5300 774406 2250871 3898738 5024494 5146718 4227053 2956079 2396855
842 2396855 2621353 2210831 38039 -2901248 -4365521 -3176558 -18149 3184656 3920579
833 3920579 596947 -5116749 -8874932 -8533641 -7007888 -7764248 -9021998 -6261036 -4669
824 -4669 3466532 407419 -5381267 -8038131 -6830408 -5044146 -4428438 -4351599 -4875133
815 -4875133 -6746114 -8572144 -7392410 -2671623 2751210 6266082 7855686 8347458 7700307
806 7700307 6150755 4982275 4634068 3716781 1590216 361766 2094889 5120463 5874363
797 5874363 4123531 3349651 5239765 6838590 5125215 1979494 1573083 4079979 5492837
788 5492837 3783859 1852079 3025199 6356760 8467589 8176478 6942843 5895521 4877595
779 4877595 3901968 3259501 2327186 348608 -1655527 -1897575 -836352 -815274 -2242962
770 -2242962 -2761458 -1308463 -273881 -1606605 -3183635 -1955879 970656 1952408 752528
761 752528 766657 2692697 2210339 -3549046 -10425986 -11861078 -7535425 -3358456 -3035056
752 -3035056 -3790337 -1871387 1398110 2092331 -11201 -1330956 -57978 1848330 2854340
743 2854340 4535722 7994786 10181775 7021821 -607556 -7114196 -8863831 -8189023 -9577465
734 -9577465 -13658968 -16774154 -15778187 -11506224 -7276373 -5152440 -4296654 -2444211 1615799
725 1615799 6864658 10826151 11391615 8302851 3327830 -943902 -2822707 -2424729 -1069624
716 -1069624 34949 388279 -150986 -1571017 -3387972 -4799781 -5600091 -6367697 -7196790
707 -7196790 -6898442 -4433052 -769364 1841757 2418054 1921547 1292718 260282 -1209242
698 -1209242 -1694865 -14107 2550843 3298141 1307591 -1726536 -3914476 -4979416 -5280176
689 -5280176 -4683308 -3558210 -3587156 -5826441 -8577075 -9084637 -7234929 -5520553 -4969581
680 -4969581 -3435470 696320 5112498 6192832 3993992 2089179 2626297 3968885 3733320
671 3733320 2027237 628360 516098 1397307 2600419 3376719 3086617 1934196 965309
662 965309 955905 2045981 4437227 7998905 10993563 11149274 8677721 6124700 4324505
653 4324505 1190704 -3719260 -6438800 -3610448 1860071 4103856 2117023 154307
645 154307 693445 1462281 236665 -1584016 -1936420 -1251518 -630343 321959 1719171
636 1719171 1903356 -61146 -2493217 -3760472 -4732309 -6424424 -7469218 -6595139 -5555504
627 -5555504 -6456138 -7828801 -6818811 -4080513 -2821015 -3707254 -4570105 -4876693 -6350619
618 -6350619 -8717614 -9092907 -6935852 -5633449 -7078598 -8256316 -5987573 -2057188 -279473
609 -279473 -723055 -553823 850442 1544501 1160521 1506506 2745864 2597149 363351
600 363351 -1435316 -1044381 -343239 -1586584 -3419452 -2761345 602583 3972599 5689530
591 5689530 6525108 7061392 6221218 3347500 -139623 -2473562 -3677849 -4609571 -4781930
582 -4781930 -2856659 754531 3309005 2543581 -553366 -2605050 -1548414 1055282 1892591
573 1892591 -84926 -2363478 -2085671 297167 1869719 1378512 692196 1610935 2988765
564 2988765 2405708 -463732 -3780396 -6122388 -7423346 -7718067 -6837947 -5570758 -5492018
555 -5492018 -7008901 -8595655 -8412003 -6005899 -2541181 -263245 -1177197 -4578735 -6329026
546 -6329026 -3041648 2776910 4688156 622941 -3714352 -2002646 4586227 9560167
538 9560167 9773223 8164941 8168472 9109212 8262474 4859093 567162 -2464692 -3068311
529 -3068311 -1851142 -1102130 -2482709 -4418064 -3596474 305305 3543298 3227254 1256570
520 1256570 1354437 3739154 5282295 4263408 2320279 1447417 1360599 836674 80702
511 80702 320212 1588904 2080021 -46033 -4529293 -8869000 -10459198 -8958517 -6328099
502 -6328099 -4459444 -3345680 -1998268 -380371 650993 987571 1511799 2421068 2485049
493 2485049 758248 -1597384 -2033082 956556 6515974 12259788 15904640 16237744 13235033
484 13235033 7877522 1988575 -2201351 -3210389 -1641039 -18211 -484418 -2602014
476 -2602014 -4117730 -3890624 -3039216 -2861626 -2921351 -2278225 -1578124 -2157288 -3362679 -2734582
466 -2734582 591823 4316142 5794091 5096529 3972067 2909763 1047641 -1526282 -3374509
457 -3374509 -3772153 -3457586 -2919062 -1608323 386638 1530638 995460 352728 1472251
448 1472251 3514631 3823702 1549990 -1376707 -3007064 -3363704 -3118286 -1999863 104106
439 104106 1487054 -74789 -4152518 -7117687 -5681682 -650692 3581440 3429474 -426865
430 -426865 -4204674 -5116929 -3612580 -1785994 -761717 -239645 358943 1498880 3905610
421 3905610 7952905 12322398 14310698 12344134 7971457 4736808 4829835 6983663 7977148
412 7977148 6332282 3989398 3573614 4493449 3465164 -640219 -4515018 -4624926 -2146887
403 -2146887 -1266980 -3350675 -5675662 -5996571 -5292777 -4953930 -4101296 -1706491 724433
394 724433 1028950 -290386 -974473 -449508 -30512 -109747 412837 1689410 2183443 1192695
384 1192695 382205 1654169 4528812 6653193 6307769 3703635 317550 -2380211 -3743222
375 -3743222 -3898946 -2961784 -676335 2622365 5197693 5318975 3612119 2767873 4353974
366 4353974 6869557 7595054 5563919 2064260 -968290 -2209990 -1339258 702614 2130857
357 2130857 1988511 1308605 1786020 3409706 4375771 3491588 1708702 773246 1066512
348 1066512 1516755 1297944 767925 587449 575768 -24560 -1346879 -2512349 -2598918 -1660313
338 -1660313 -542465 69471 135230 7611 78844 541520 1060243 756395 -934714 -3300294
328 -3300294 -4772947 -4530912 -3223519 -1911998 -900383 -76205 182376 -672860 -2211748
319 -2211748 -3027076 -2248908 -628287 327892 195861 212466 1767260 4418038 5844982
310 5844982 4178862 199418 -3364223 -4783416 -4883844 -5316448 -6095483 -5823747 -4060348
301 -4060348 -2284229 -2066965 -2974737 -2933272 -581674 3053078 5315456 4444720 1435049
292 1435049 -883659 -912704 -40234 -694510 -2993216 -4461782 -3269072 -557538 1139716
283 1139716 860397 -387049 -1503882 -2324423 -2930135 -3132904 -2934530 -2751303 -2913875
274 -2913875 -3428271 -4230486 -5043486 -5016942 -3403824 -893994 525443 -402287 -2747624
265 -2747624 -4368122 -4020383 -2290764 -822072 -787022 -1713420 -1773634 204060 3057515
256 3057515 4451172 3698460 2221374 995573 -736898 -3225902 -4475830 -2776393 9624
247 9624 117419 -3171672 -6432595 -6497473 -4090812 -2128582 -1939127 -2534720 -2643968 -1878719
237 -1878719 -111259 2909477 6798217 10020624 10828805 8923822 6022531 4403502 4770417
228 4770417 5917416 6553259 6607106 6256527 4821771 1881315 -1357207 -3426495 -4780780
219 -4780780 -6763925 -8869514 -9409158 -8863191 -9652903 -11767753 -11660012 -7308796 -1798570
210 -1798570 583631 -186298 -993507 -477037 385933 1526158 4068664 7417335 9202797
201 9202797 8599887 7067480 5442063 3077284 475520 -192534 1598225 3598906 4451456
192 4451456 5818973 8890022 11302158 10316491 7268218 5772213 6503430 6866105 5546983
183 5546983 4422212 5502856 8378903 11342028 13056937 12497693 9228769 4796852 2260472
174 2260472 3110016 5619015 7002899 6131203 3520617 181798 -2401849 -2586004 -450037
165 -450037 1623652 1880644 1805599 3878376 7428027 9203615 8087893 6548573 6524464
156 6524464 6471347 4313999 1227935 -162447 -184172 -1702879 -5436705 -8611821 -9090774
147 -9090774 -8300589 -8566024 -9546045 -9322859 -7683578 -6040972 -4724829 -2685070 -3704
$$ [...]
##END NTUPLES=NMR SPECTRUM
##END=
