##TITLE=31Pdec_DE-77W-b_TFA
 DMSO-d6, 24 sc
 25.11.2024
##JCAMPDX= 6.0         $$ Bruker NMR JCAMP-DX V2.0
##DATA TYPE= NMR SPECTRUM
##DATA CLASS= NTUPLES
##ORIGIN= UXNMR, Bruker Analytische Messtechnik GmbH
##OWNER= root
$$ XWIN-NMR		Version 3.5
$$ Mon Nov 25 15:43:56 2024 Russian Standard Time (UT+4h)  she@DPX200
##.OBSERVE FREQUENCY= 81.013821
##.OBSERVE NUCLEUS= ^31P
##.ACQUISITION MODE= SIMULTANEOUS
##.ACQUISITION SCHEME= undefined
##.AVERAGES= 24
##.DIGITISER RES= 17
##SPECTROMETER/DATA SYSTEM= spect
##.PULSE SEQUENCE= zgpg30
##.SOLVENT NAME= DMSO
##.SHIFT REFERENCE= (INTERNAL, DMSO, 0, 198.062)
##AUDIT TRAIL= $$ (NUMBER, WHEN, WHO, WHERE, WHAT)
$$ ##TITLE= Audit trail, XWIN-NMR		Version 3.5
$$ ##JCAMPDX= 5.01
$$ ##ORIGIN= Bruker BioSpin GmbH
$$ ##OWNER= she
$$ F:/spectra/data/she/nmr/P31/2/pdata/1/auditp.txt
$$ ##AUDIT TRAIL=  $$ (NUMBER, WHEN, WHO, WHERE, WHAT)
(   1,<2024-11-25 15:42:48.64 +0400>,<she>,<DPX200>,
      <created by zg, POWCHK disabled, PULCHK disabled
       configuration hash MD5:
       00 E9 B6 7A A2 85 ED C7 34 08 36 98 17 FE 4E 26
       data hash MD5: 32K
       4A 36 5D FE 41 52 B2 B0 73 47 2F 3B CB DF C2 6F>)
(   2,<2024-11-25 15:42:50.95 +0400>,<she>,<DPX200>,
      <Start of raw data processing
       efp BC_mod = 2 LB = 1.5 FT_mod = 6 PKNL = 1 PHC0 = 2265.201 PHC1 = 83.48821 SI = 64K 
       data hash MD5: 64K
       E0 37 6C C1 24 31 C7 06 FE 22 81 0C 30 46 78 E6>)
(   3,<2024-11-25 15:43:15.45 +0400>,<she>,<DPX200>,
      <pk PHC0 = 58.26089 PHC1 = -154 
       data hash MD5: 64K
       65 B8 28 37 45 E4 60 5D C6 CF A9 AC C3 24 31 DF>)
(   4,<2024-11-25 15:43:19.76 +0400>,<she>,<DPX200>,
      <abs ABSG = 5 
       data hash MD5: 64K
       A1 69 98 66 EF 69 6A CB A4 E1 B1 32 56 E5 43 59>)
$$ ##END=
$$ 
$$ hash MD5
$$ 5C 02 0D 78 6A 92 02 57 CF F7 12 44 D1 D6 F7 DE
##$RELAX= 
##$RELAX= 
##$RELAX= 
##$RELAX= 
##$RELAX= 
##$RELAX= 
##$RELAX= 
##$RELAX= 
$$ Bruker specific parameters
$$ --------------------------
##$DU= <F:/spectra>
##$EXPNO= 2
##$NAME= <P31>
##$PROCNO= 1
##$TYPE= <nmr>
##$USER= <she>
##$AMP= (0..31)
100 100 100 100 100 100 100 100 100 100 100 100 100 100 100 100 100 100 
100 100 100 100 100 100 100 100 100 100 100 100 100 100 
##$AQSEQ= 0
##$AQ_mod= 1
##$AUNM= <au_zg>
##$AUTOPOS= <>
##$BF1= 81.014009
##$BF2= 200.13
##$BF3= 200.13
##$BF4= 200.13
##$BF5= 200.13
##$BF6= 200.13
##$BF7= 200.13
##$BF8= 200.13
##$BYTORDA= 1
##$CFDGTYP= 0
##$CFRGTYP= 5
##$CHEMSTR= <none>
##$CNST= (0..31)
1 1 145 1 1 1 1 1 1 1 1 1 1 1 1 1 1 1 1 1 1 1 1 1 1 1 1 1 1 1 1 1 
##$CPDPRG= <waltz16>
##$CPDPRG1= <>
##$CPDPRG2= <waltz16>
##$CPDPRG3= <>
##$CPDPRG4= <mlev>
##$CPDPRG5= <mlev>
##$CPDPRG6= <mlev>
##$CPDPRG7= <mlev>
##$CPDPRG8= <mlev>
##$CPDPRGB= <>
##$CPDPRGT= <>
##$D= (0..31)
0 1 0 0 0 0 0 0 0 0.06 0 0.03 2e-05 3e-06 0 0 0.0002 0 0 0 0 0 0 0 0 0 
0 0 0 0 0 0 
##$DATE= 1732534967
##$DBL= (0..7)
120 120 120 11 120 120 24 19 
##$DBP= (0..7)
150 150 150 150 150 150 150 150 
##$DBP07= 0
##$DBPNAM0= <>
##$DBPNAM1= <>
$$ [...]
##$SUBNAM3= <"">
##$SUBNAM4= <"">
##$SUBNAM5= <"">
##$SUBNAM6= <"">
##$SUBNAM7= <"">
##$SUBNAM8= <"">
##$SUBNAM9= <"">
##$SW= 400.765351723535
##$SWIBOX= (0..15)
0 1 3 0 0 0 0 0 0 0 0 0 0 0 0 0 
##$SW_h= 32467.5324675325
##$TD= 32768
##$TD0= 1
##$TE= 0
##$TE2= 300
##$TE3= 300
##$TEG= 300
##$TL= (0..7)
0 120 53 12 22 120 120 120 
##$TP= (0..7)
150 150 150 150 150 150 150 150 
##$TP07= 0
##$TPNAME0= <>
##$TPNAME1= <>
##$TPNAME2= <>
##$TPNAME3= <>
##$TPNAME4= <>
##$TPNAME5= <>
##$TPNAME6= <>
##$TPNAME7= <>
##$TPOAL= (0..7)
0.5 0.5 0.5 0.5 0.5 0.5 0.5 0.5 
##$TPOFFS= (0..7)
0 0 0 0 0 0 0 0 
##$TUNHIN= 0
##$TUNHOUT= 0
##$TUNXOUT= 0
##$USERA1= <user>
##$USERA2= <user>
##$USERA3= <user>
##$USERA4= <user>
##$USERA5= <user>
##$V9= 5
##$VALIST= <valist>
##$VCLIST= <CCCCCCCCCCCCCCC>
##$VD= 0
##$VDLIST= <DDDDDDDDDDDDDDD>
##$VPLIST= <PPPPPPPPPPPPPPP>
##$VTLIST= <TTTTTTTTTTTTTTT>
##$WBST= 1024
##$WBSW= 4
##$XGAIN= (0..3)
0 0 0 0 
##$XL= 0
##$YL= 0
##$YMAX_a= 3577
##$YMIN_a= -3475
##$ZGOPTNS= <>
##$ZL1= 120
##$ZL2= 120
##$ZL3= 120
##$ZL4= 120
##$ABSF1= 198.0616
##$ABSF2= -202.7028
##$ABSG= 5
##$ABSL= 3
##$ALPHA= 0
##$AQORDER= 0
##$ASSFAC= 0
##$ASSFACI= 0
##$ASSFACX= 0
##$ASSWID= 0
##$AUNMP= <proc_1d>
##$AZFE= 0.1
##$AZFW= 0.5
##$BCFW= 0
##$BC_mod= 2
##$BYTORDP= 0
##$COROFFS= 0
##$CY= -3
##$DATMOD= 1
##$DC= 0
##$DFILT= <>
##$DTYPP= 0
##$F1P= 0
##$F2P= 0
##$FCOR= 1
##$FTSIZE= 65536
##$FT_mod= 6
##$GAMMA= 0
##$GB= 0
##$INTBC= 1
##$INTSCL= 9.790993e-09
##$ISEN= 30
##$LB= 1.5
##$LEV0= 0
##$LPBIN= 0
##$MAXI= 10000
##$MC2= 0
##$MEAN= 0
##$ME_mod= 0
##$MI= 50
##$NCOEF= 0
##$NC_proc= -9
##$NLEV= 6
##$NOISF1= 182.463
##$NOISF2= 159.3651
##$NSP= 0
##$NTH_PI= 0
##$NZP= 0
##$OFFSET= 198.0616
##$PC= 4
##$PHC0= 2323.462
##$PHC1= -70.51179
##$PH_mod= 1
##$PKNL= yes
##$PPARMOD= 0
##$PSCAL= 0
##$PSIGN= 0
##$REVERSE= no
##$SF= 81.0140089999434
##$SI= 65536
##$SIGF1= 159.3651
##$SIGF2= -187.1042
##$SINO= 113.3802
##$SIOLD= 16384
##$SREGLST= <1H.CDCl3>
##$SSB= 0
##$STSI= 65536
##$STSR= 0
##$SW_p= 32467.5324675325
##$SYMM= 0
##$S_DEV= 0
##$TDeff= 32768
##$TDoff= 0
##$TI= <>
##$TILT= no
##$TM1= 0
##$TM2= 0
##$TOPLEV= 0
##$USERP1= <user>
##$USERP2= <user>
##$USERP3= <user>
##$USERP4= <user>
##$USERP5= <user>
##$WDW= 1
##$XDIM= 65536
##$YMAX_p= 428289621
##$YMIN_p= -414582765
$$ End of Bruker specific parameters
$$ ---------------------------------
##NTUPLES= NMR SPECTRUM
##VAR_NAME=  FREQUENCY,     SPECTRUM/REAL,   SPECTRUM/IMAG
##SYMBOL=    X,             R,               I
##VAR_TYPE=  INDEPENDENT,   DEPENDENT,       DEPENDENT
##VAR_FORM=  AFFN,          ASDF,            ASDF
##VAR_DIM=   65536,         65536,           65536
##UNITS=     HZ,            ARBITRARY UNITS, ARBITRARY UNITS
##FACTOR=    0.49542278885378, 1,            1
##FIRST=     16045.7642231865, 0,            0
##LAST=      -16421.768244346, 0,            0
##MIN=       -16421.768244346, -414582765,   0
##MAX=       16045.7642231865, 428289621,    0
$$ Real data points
##PAGE= N=1
##DATA TABLE= (X++(R..R)), XYDATA
$$ [...]
42575C105229M108745l282567q392174o928168r06881M939144P088086M065581
42567C796995k705079q209013p578520j979328K109938R38532k127824k152393
42559a7906692M62855J616975q2359k082782k081314k18386K495602M954684N286369
42550g555048K380301j562306k713130m08446K273216L243347L762503M902598
42542D323035M772821J655469k319685l534175j792994k01748o28245j761421
42534E13057j786577q52581k24704m33540j009518j202514m42658J322904L330948
42525g85183M322794L407200P16170k455586m205406l565621j861704j492634
42517e919970k575823j991162K675963Q913659J1060666O693263l54923m225055
$$ plain form
42575 3105229 7213974 3931407 -4460767 -11388935 -12295816 -7356672 -268586 3796995
42567 3796995 1091916 -7117097 -14695617 -16674945 -14565007 -13626475 -15754299 -17906692
42559 -17906692 -17443837 -15826862 -15909221 -17992003 -20073317 -20291703 -17796101 -12841417 -7555048
42550 -7555048 -5174747 -6737053 -9450183 -9858629 -7585413 -4342066 -579563 4323035
42542 4323035 9095856 10751325 8431640 4897465 3104471 2902723 2274478 513057
42534 513057 -1273520 -2126101 -2350805 -2784345 -3793863 -4996377 -5439035 -4116131 -785183
42525 -785183 3537611 6944811 7660981 5205395 999989 -2565632 -4427336 -5919970
42517 -5919970 -8495793 -10486955 -7810992 1102667 12163333 18856596 18501673 14276618
42509A4276618l222664p17317n06513k679984m378052l551649q92287J640314
42501c1534K814969K171475m72598m060051n719973l272330J665259N029418N028870
42492C153505L417045J720451q18856l992547m495066k99907M808715N036915
42484H530255K82851l790743l501333j114231j35909m64978l01814K56076L18705
42475G8879O43917J954214K400024j21154m043166n676565m208004k043057m34369
42466a1449281J622528L674082L017000n76473k913656r34720K623210L366340
42458a570970J608807O28933N08911j262482l797627l151041N01733J802556j309928
42449f041108l542723n20673L712529K780621k019767m093539j828947K38094
$$ plain form
42509 14276618 11053954 10336637 9830124 7150140 2772088 -779561 -1671848 -31534
42501 -31534 2783435 4954910 4482312 422261 -5297712 -8570042 -6904783 -1875365 3153505
42492 3153505 6570550 8291001 7472145 3479598 -1015468 -1315375 3493340 8530255
42484 8530255 8813106 5022363 1521030 406799 270890 -194088 -495902 -239826 78879
42475 78879 722796 2677010 5077034 4955880 912714 -4763851 -8971855 -11014912 -11449281
42466 -11449281 -9826753 -6152671 -3135671 -3712144 -6625800 -7560520 -4937310 -1570970
42458 -1570970 37837 666770 1175681 -86801 -3884428 -7035469 -6533736 -4731180 -6041108
42449 -6041108 -9583831 -10104504 -6391975 -3611354 -5631121 -9724660 -11553607 -11315513
42441a1315513j58486l67724O98536K78216j915979j421592L538288P750926O232927
42432C319599J230870k321845m094213o000829o280164k204818L369927M508827
42424h472646O31974l096575l548753k433697j253751R00523L457799L630663
42416a0184463J510532J142163M038801N910332K970203k090249m079783k587686
42408c370150j316231j693423j220404J803333N091948N054534J204882l091855
42400B462634m092426j675079N49135l48794k889584l375453j106657J075806
42392i400418J474141J711578L138185L985469K214551q57704k137722p34193
42384f06113J661750L441585M254539M109679K939902R33426j556380m083199
$$ plain form
42441 -11315513 -11473999 -11841723 -11143187 -10864971 -12780950 -14202542 -10664254 -2913328 3319599
42432 3319599 4550469 2228624 -1865589 -7866418 -14146582 -16351400 -12981473 -8472646
42424 -8472646 -7840672 -10937247 -14486000 -16919697 -18173448 -17272925 -13815126 -10184463
42416 -10184463 -8673931 -7531768 -3492967 2417365 5387568 3297319 -782464 -3370150
42408 -3370150 -4686381 -6379804 -7600208 -5796875 -704927 4349607 5554489 2462634
42400 2462634 -1629792 -3304871 -2755736 -3104530 -5994114 -9369567 -10476224 -9400418
42392 -9400418 -7926277 -6214699 -3076514 908955 3123506 2265802 128080 -606113
42384 -606113 1055637 4497222 8751761 12861440 15801342 16734768 15178388 11095189
42376A1095189n759169n729748m319242k614357q38669J302796K755744J979373
42368b128083L3389p0659J967335K888052J206523q6209J360826K792202N56345
42359H519721l725964n232011k636162J083494L402209M075636L062614M09548
42351H959085k107484k531235j528841p42449M43695K825971L612658k09468n453065
42342C268867n629943q18200J696320j491017m654123k313982K146369K569462
42334e226247J06092O34143M657080O582889L593545p38864k431945j773858p69473
42325D633362k6181K30780n75771j501774m58596J969326K020104j947052o249141
42316a904943o393269k825583L59652J008966N77885J010853K450504L948569
$$ plain form
42376 11095189 5336020 -393728 -4712970 -7327327 -8165996 -6863200 -4107456 -2128083
42368 -2128083 -2094694 -2165353 -198018 2690034 3896557 3810348 5171174 7963376 8519721
42359 8519721 4793757 -438254 -3074416 -1990922 1411287 5486923 8549537 8959085
42351 8959085 6851601 4320366 2791525 2049076 2492771 5318742 8931400 8721932 3268867
42342 3268867 -2361076 -3179276 -1482956 -2973973 -7628096 -9942078 -7795709 -5226247
42334 -5226247 -5120155 -4486012 171068 6753957 10347502 9608638 7176693 5402835 4633362
42325 4633362 4607181 4837961 4262190 2760416 2301820 4271146 6291250 4344198 -1904943
42316 -1904943 -8298212 -11123795 -10764143 -9755177 -9177292 -8166439 -5715935 -1767366
42308a767366M566114L707330J694500j69384j166770k103709l403571l442125
42300b084981j008386J411972q5148m949162p692955m651027J307162M674782
42292a3077743L851926J541313K50256K27340J166747L020126M724828M411667
42284F116460J761231j282399k770925k581174j673775q01361l40918j95107M44186
42275a323782J904247K431780k56082m979697o818899k777636L659348O064829
42267b095892K733451j592985k024883P26769K318087R95095m21549J094832M325901
42258F058826N136326J585827l821828p111577o660408l581885J06240K456279
42250e832200K120719j19600j078825J407208N009128N133688Q36476l773654
$$ plain form
42308 -1767366 2798748 6506078 8200578 8031194 6864424 4760715 1357144 -2084981
42300 -2084981 -3093367 -1681395 -1766543 -6715705 -14408660 -19059687 -17752525 -13077743
42292 -13077743 -9225817 -7684504 -7434248 -7206908 -6040161 -3020035 1704793 6116460
42284 6116460 7877691 6595292 3824367 1243193 -430582 -1231943 -1572861 -1767968 -1323782
42275 -1323782 580465 3012245 2756163 -2223534 -9042433 -11820069 -8160721 -2095892
42267 -2095892 637559 -955426 -2980309 -2253540 64547 1059642 638093 1732925 6058826
42258 6058826 11195152 12780979 8959151 1847574 -4812834 -8394719 -8288479 -5832200
42250 -5832200 -3711481 -3831081 -4909906 -3502698 1506430 6640118 7476594 3702940
42242C702940m643983k085658R12620K431505K271483Q11374r37538j378850k0938
42233A062955J759371K605720K551749J727941l16847k731568l113786j113541
42225B431994j9994k147626m705921l551975M95688K865429J862596M9979q02310
42216c522140j869464l567660l740526j355336J161327J384107K22913k45908
42208a1532687j23745o39647j444578j250252n0117J326643K957464N162189O788809
42199A194079O122687L232483k16607l192452n624024o621486m463549P09820
42191h859049N658019P018313N045720K924420K280819J092295k742014p123524
42183E294999p524052l095598J594393K173941l95085k207702k020837j701873
$$ plain form
42242 3702940 -941043 -3026701 -2114081 317424 2588907 3400281 2462743 1083893 1062955
42233 1062955 2822326 5428046 7979795 9707736 9390889 6659321 3545535 2431994
42225 2431994 2412000 264374 -4441547 -7993522 -7497834 -4632405 -2769809 -2719830 -3522140
42216 -3522140 -5391604 -8959264 -12699790 -14055126 -12893799 -11509692 -11286779 -11532687
42208 -11532687 -11656432 -12296079 -13740657 -14990909 -15041026 -13714383 -10756919 -5594730 1194079
42199 1194079 7316766 10549249 10332642 7140190 1516166 -5105320 -9568869 -8859049
42191 -8859049 -3201030 3817283 8863003 11787423 14068242 15160537 12418523 5294999
42183 5294999 -2229053 -5324651 -3730258 -1556317 -1951402 -4159104 -6179941 -7881814
42175g881814k197360k249572j068578N74517K300379M542394O348505N311732
42167E680203R62126l653619n080835k923035M88930K539792J968383l56327j744922
42158b119304l17920K268552K454111n13731l524621l778593j753675P85059L251339
42149c248783N301874N617287L465243J48275k395547l267295k363331l42669
42141B915054O72065j072157l555009k479992K334720N455130L112713j311457
42133F071067k385695l74128K54420j849699l674228l255670k009244j323510
42125h546687m39950J335688K921366K916348J176876j296308k813740j943920
42117f690327N56516J896531J037664N34301K185766L207016N68219k871265j818720
$$ plain form
42175 -7881814 -10079174 -12328746 -13397324 -12822807 -10522428 -5980034 368471 5680203
42167 5680203 6642329 2988710 -2092125 -5015160 -4526230 -1986438 -18055 -374382 -2119304
42158 -2119304 -2437224 -168672 2285439 1771708 -1752913 -5531506 -7285181 -6500122 -3248783
42149 -3248783 2053091 7670378 11135621 11283896 8888349 5621054 3257723 2915054
42141 2915054 3587119 2514962 -1040047 -3520039 -1185319 4269811 7382524 6071067
42133 6071067 3685372 3311244 3565664 1715965 -1958263 -5213933 -7223177 -8546687
42125 -8546687 -8986637 -7650949 -4729583 -1813235 -636359 -1932667 -4746407 -6690327
42117 -6690327 -6133811 -4237280 -3199616 -2665315 -479549 2727467 3295686 424421 -1394299
42108a394299K656935L809327m96559m269385k617662J000687O68106l037015
42100c679865m690403k092002J865878M041171L759107J464718j722276l362464
42092d416136j730862J475579L000155K339974J616871J547440P11360r37089
42084C607292j234594L33769J002346j108017l666898l504591j547135j351967
42076g469795l448855m354862j753464K100950L638461K708187K033653K912644
42068c633081L681365K589284M39791m87615P25729K694755L356984K072506O9906
42059A1509624j149922j648209k643410m156650m353163k286648l8412j89693
42051d956483j910455j992527M14866K846242L615670L750481L726345J665139
$$ plain form
42108 -1394299 1262636 5071963 4575404 306019 -2311643 -1310956 -642850 -3679865
42100 -3679865 -8370268 -10462270 -8596392 -4555221 -796114 668604 -1053672 -4416136
42092 -4416136 -6146998 -4671419 -1671264 668710 2285581 3833021 4544381 3607292
42084 3607292 2372698 2706467 3708813 2600796 -1066102 -4570693 -6117828 -7469795
42076 -7469795 -10918650 -15273512 -17026976 -14926026 -11287565 -8579378 -6545725 -3633081
42068 -3633081 48284 2637568 3077359 2589744 3315473 6010228 9367212 11439718 11509624
42059 11509624 10359702 8711493 6068083 1911433 -2441730 -4728378 -4766790 -4956483
42051 -4956483 -6866938 -8859465 -8444599 -5598357 -1982687 1767794 5494139 7159278
42043G159278k811008n793263l645004J227817K813521p43703n067213n472928
42035a2332503k186147J184529K312636K071649K660575M576171N612004L512161
42027G411075l64457j772530J113929N107430O217558M275807J278135k395094
42019B0871853o840047r633203q030888l421194P7673R79538J033132J307586
42011c655550J510557K414944M523137M805646p2005p016495q630927l378467
42003i499160J979509K279429P09954K332222N873384O487490L134902j287370
41995A2010360m628219o298452n635513l200400j737329k454478k517993L29079
41987a4132945L184546K193064q10276o24736L556965P344549P535269N043856
$$ plain form
42043 7159278 4348270 -1444993 -5089997 -3862180 -1048659 -1792362 -6859575 -12332503
42035 -12332503 -14518650 -13334121 -11021485 -8949836 -6289261 -1713090 3898914 7411075
42027 7411075 7046618 5274088 6388017 11495447 17713005 21988812 23266947 20871853
42019 20871853 14031806 4398603 -3632285 -7053479 -6975806 -5996268 -4963136 -3655550
42011 -3655550 -2144993 269951 4793088 9598734 9526729 2510234 -6120693 -9499160
42003 -9499160 -7519651 -5240222 -4530268 -2198046 3675338 10162828 13297730 12010360
41995 12010360 7382141 1083689 -4551824 -7752224 -9489553 -11944031 -14462024 -14132945
41987 -14132945 -10948399 -8755335 -9565611 -10190347 -6633382 711167 8246436 13290292
41979A3290292J761295j423573l395355l264368k202678j722680o05850K970718
41971E407801O958957P334537M243597J663468O81581j768991o213734p984236
41963A0322980m073371J609426L340684Q69492j871061k875090l143623l186958
41955I92479k211950n07742K67909n72879k021601k942825k810071j180664J832614
41946i154730M535086M655027J839718j717469l392543k354126J81825K200663
41938c206549K356563P71287j376492l037417l828158l476573j578886J482929
41930a1893296L964879M096647K081714M8199l52763K05685j16964j653765k814981
41921f434645k654375k486638l672760m842938l402155M96898L823462M800832
$$ plain form
41979 13290292 15051587 13628014 10232659 6968291 4765613 3042933 2437083 5407801
41971 5407801 12366758 19701295 23944892 25608360 26289941 24520950 18307216 10322980
41963 10322980 6249609 7859035 11199719 12069211 10198150 7323060 4179437 992479
41955 992479 -1219471 -1727213 -1459304 -2032183 -4053784 -6996609 -9806680 -10987344 -9154730
41946 -9154730 -4619644 35383 1875101 157632 -3234911 -5589037 -5407212 -3206549
41938 -3206549 -849986 -78699 -1455191 -4492608 -8320766 -11797339 -13376225 -11893296
41930 -11893296 -7928417 -3831770 -1750056 -1701857 -2054620 -1848935 -1965899 -3619664 -6434645
41921 -6434645 -9089020 -11575658 -15248418 -20091356 -23493511 -22996613 -19173151 -14372319
41913a4372319M733494M973609M684417K993131Q75698q26383k764778m451599
41905d154730l146128J663463N320267L403528j850756m655928l554826j555502
41897h530612K19697L298545O446363N716690J358486j111592P78896K421910
41889A0598383j33349l249002j295698M215751O529645L148995j503592k740739
41881A5570394r57840J84028j910235o741211j0954003j0500158m482149L042567
41873a6748607O719771N364107K372487J009678J118564P67335n18251j252503
41865a167419k93176J153571N38265k607468n073131l312946J821827N620809
41857c319668N099191K011050k97261p24487N12J224155K167085J732242K41959
$$ plain form
41913 -14372319 -9638825 -4665216 19201 3012332 3888030 3061647 296869 -4154730
41905 -4154730 -7300858 -5637395 -317128 3086400 1235644 -3420284 -6975110 -8530612
41897 -8530612 -8310915 -5012370 1433993 7150683 8509169 7397577 8176473 10598383
41889 10598383 10465034 7216032 5920334 10136085 16665730 19814725 18311133 15570394
41881 15570394 14612554 14796582 12886347 6145136 -4808867 -15309025 -19791174 -16748607
41873 -16748607 -10028836 -4664729 -2292242 -1282564 -164000 603335 85084 -1167419
41865 -1167419 -1460595 -307024 231241 -2376227 -7449358 -10762304 -8940477 -3319668
41857 -3319668 1779523 3790573 3493312 2768825 2769337 3993492 6160577 7892819 8134778
41848H134778l59410M04951K91170k013011m298094m323067l599753m460859n160256
41839a5383551j938033M520764Q554324O206146j66911m746240m037157M20567
41831f570091L792524K637387j176043k450941K17917J761178k121746p548084
41823a1457899o955510L7503N689137M736261P52230k57862J794392K611339O14399
41814b436010j348066o12528J827526K766817M47183l396910n007937k634156
41806a0394081J246616K875735J750580K84844m16532j508166l046588l084262
41798a2291854j162034M76658O68010J267471L396120M718079K943239m76552
41790d60863k782648l706528m037645k788681P46389L998758M020713K061595
$$ plain form
41848 8134778 7775368 8180319 8471489 6458478 2160384 -2162683 -5762436 -10223295 -15383551
41839 -15383551 -17321584 -12800820 -4246496 1959650 1792739 -2953501 -6990658 -6570091
41831 -6570091 -2777567 -140180 -1316223 -3767164 -3549247 -1788069 -3909815 -11457899
41823 -11457899 -18413409 -18375906 -12686769 -7950508 -7198278 -7456140 -5661748 -3050409 -2436010
41814 -2436010 -3784076 -4396604 -2569078 197739 644922 -2751988 -7759925 -10394081
41806 -10394081 -9147465 -6271730 -4521150 -4236306 -4652838 -6161004 -9207592 -12291854
41798 -12291854 -13453888 -12977230 -12309220 -11041749 -7645629 -2927550 15689 -460863
41790 -460863 -3243511 -6950039 -10987684 -13776365 -13029976 -9031218 -5010505 -2948910
41782b948910J379936J649753r890l013816l425276p60110M40756k147991m367247
41773a3202795j677609L956466P013199N887032L528456K008546M48171j755500
41765F205966l105636k337870m07820P29692J01735j698472k790594j242570K487595
41756b057974M879925L114649q24892k237549j6859J862958N0837l644991n075160
41747c949056l036540K01765K170399K117498P93931m4130R57668K503088J548408
41738C263031j788046k615074K275857Q308243P919808Q27033n399485n674657
41730G116710l276162l246177m637138l282341Q01418L441961K535320J48145
41722c98264j367160j837905j480726K72008L061143M869553M246482K020415
$$ plain form
41782 -2948910 -1568974 80779 70889 -2942927 -6368203 -7128313 -6687557 -8835548 -13202795
41773 -13202795 -14880404 -10923938 -3910739 1976293 5504749 7513295 7961466 6205966
41765 6205966 3100330 762460 354640 1084332 1186067 -512405 -3302999 -4545569 -2057974
41756 -2057974 2821951 5936600 5111708 2874159 2857300 4720258 4771095 1126104 -3949056
41747 -3949056 -6985596 -6783831 -4613432 -2495934 -1702003 -1746133 -788465 1714623 3263031
41738 3263031 1474985 -1140089 1135768 9444011 17363819 18190852 12791367 7116710
41730 7116710 3840548 594371 -4042767 -7325108 -6523690 -3081729 -546409 -398264
41722 -398264 -1765424 -3603329 -5084055 -4812047 -1750904 3118649 7365131 9385546
41714I385546J1624r56269j192115j198342j226914j261404j004564r3840J474610
41705C938332L078643L574282K147959k98752j350398q4815R20103r60229l487685
41696G477440j991029K588494K987897m134523j1772140j1147646l487689K447857
41688a7031339K556552P58933Q65452J805186J995359K296283K473429J42712
41680d137433m001807m811702L8044N516952N783678J932269p03330k70724O37279
41671a6774o9195j762709k798830j821084J306604M006645K792444j348483k674645
41662b386027J199436M719617K335580k583125k746591J663685L650054N41233
41654F393862k847019k807318j351520l28679K232043O615033Q271352M539535
$$ plain form
41714 9385546 9397170 8440901 7248786 6050444 4823530 3562126 2557562 2463722 3938332
41705 3938332 7016975 10591257 12739216 12440464 11090066 11005251 11925354 10965125 7477440
41696 7477440 5486411 8074905 11062802 6928279 -4843861 -15991507 -19479196 -17031339
41688 -17031339 -14474787 -13715854 -12850402 -11045216 -9049857 -6753574 -4280145 -4137433
41680 -4137433 -8139240 -12950942 -12912898 -7395946 -1612268 320001 -383329 -654053 -16774
41671 -16774 -85969 -1848678 -4647508 -6468592 -5161988 -1155343 1637101 288618 -2386027
41662 -2386027 -1186591 3533026 5868606 3285481 538890 2202575 5852629 6393862
41654 6393862 3546843 739525 -611995 -940674 1291369 7906402 16177754 20717289
41646B0717289l07136j460131r12559l127924o759890o807433l081627k59021
41638a998432j52229m972J221129R90507q29216p6068M512673P329626L583877
41629A4576895k850027m620636j492936L52170j209079j265346K949767O210789
41621A2651597K906780l781044n822989j495226K920850K331602j370143l712739
41613D628688l381655j595296N56759J664177j01289l870385n379540k325982
41605i804523J830029K651616J167436J514018L699894L641959L25647k026716
41597B999360l64575K678608K894523J18713k637205l472848k682358j069842
41589a535624O77171J742275J735617Q44286j106794m288492o939609n883840
$$ plain form
41646 20717289 20410153 18950022 18037463 14909539 8149649 1342216 -1739411 -1998432
41638 -1998432 -2150661 -2155633 -934504 56003 -773213 -849281 3663392 10993018 14576895
41629 14576895 11726868 7106232 5613296 5965466 4756387 3491041 6440808 12651597
41621 12651597 15558377 11777333 5954344 4459118 7379968 9711570 8341427 4628688
41613 4628688 1247033 -348263 208496 1872673 1771384 -2099001 -7478541 -9804523
41605 -9804523 -7974494 -5322878 -4155442 -2641424 1058470 4700429 5026076 2999360
41597 2999360 2634785 5313393 8207916 8326629 5689424 2216576 -465782 -1535624
41589 -1535624 -858453 883822 2619439 3463725 2356931 -1931561 -8871170 -14755010
41581a4755010m00377O048873R337958Q413222M492437j096720o255062p558409
41573a773088l572359K123437M104113J231944k480495k991386l31158K326155
41565a362837K083108j067965l849978k586216K182737N162686K424424l121152
41557a35193n170338k277129P39907m4239k551762k282014J562892N547406O149799
41548A539329K824313k077439n142886m357470p15673K950061M872860N267293
41540E160388M627300K881902O38960o02031m52850l77063j374548k192403j074787
41531G234868J456323K625382J66721m897677q050406n158372J974760N727608
41523A079207J482152n067891m262969L985533R175390M799808k541913l178786
$$ plain form
41581 -14755010 -15155387 -9106514 231444 8644666 13137103 12040383 5785321 -1773088
41573 -1773088 -5345447 -3222010 882103 2114047 -366448 -3357834 -3688992 -1362837
41565 -1362837 720271 -347694 -4197672 -6783888 -4601151 561535 2985959 -135193
41557 -135193 -5305531 -7582660 -6842753 -6886992 -9438754 -11720768 -10157876 -4610470 1539329
41548 1539329 4363642 2286203 -2856683 -7214153 -7929826 -4979765 -106905 5160388
41540 5160388 9787688 12669590 13308550 12706519 12253669 11876606 10502058 8309655 7234868
41531 7234868 8691191 11316573 11483294 6585617 -1464789 -6623161 -4648401 1079207
41523 1079207 2561359 -2506532 -6769501 -2783968 6391422 11191230 8649317 5470531
41515E470531K121670N332503L904386K191767J805914o78778n306871o134651
41507H706471m66043N499163M683201j415258n589589m324654l83241K033300
41499H743350J264621j548798l739813l497164k137598k366447l749080k882805
41491i913734R25844L944583L753627K554002K287107J060183k006213l096655
41483d91256K46477L622137K192863j099400o12232J804192p7424n267341o316370
41474e998354j932111O24102j980600l409996J317731P122150P039304K685817
41466E468043l6170o20366k169191l581366j190536L488343M799970J509286j771411
41457E896602k067007j449438k003774k353927j009887O63673Q42970j08287r87101
$$ plain form
41515 5470531 7592201 12924704 16829090 19020857 20826771 20147993 14841122 8706471
41507 8706471 8240428 13739591 18422792 17007534 11417945 7093291 6710050 8743350
41499 8743350 10007971 8459173 4719360 1222196 -915402 -3281849 -7030929 -9913734
41491 -9913734 -8987890 -5043307 -1289680 1264322 3551429 4611612 2605399 -491256
41483 -491256 -244779 3377358 5570221 4470821 3858589 5662781 5585357 318016 -5998354
41474 -5998354 -7930465 -7306363 -9286963 -12696959 -11379228 -4257078 2782226 5468043
41466 5468043 5431873 4811507 2642316 -939050 -2129586 1358757 6158727 7668013 5896602
41457 5896602 3829595 2380157 376383 -1977544 -2987431 -2323758 -1480788 -1589075 -2576176
41448b576176j571294j864124j415884l71899M80186J327227L134181N156880
41440B299097M710243P49651l785530m858588k074497Q24496N23223j648510j294729
41431d555144K938906O609488M934601k17368k421033J32324K082358o63215m588353
41422D252564m289046p18694J047500l72526k229036l131997l581945k357503
41414a1380683J749004N196798L063824k426490l375065K118464O318766K998647
41406D263265l739468o189869l730772j407756j191763n31362J813676L847056
41398f866993M241637L957889L377587J189603k742253n703696m665924L78516
41390f833634O033759P960647M190653k929378q211470p940984k992995K326258
$$ plain form
41448 -2576176 -4147470 -6011594 -7427478 -7799377 -7319191 -5991964 -2857783 2299097
41440 2299097 7009340 7758991 3973461 -885127 -2959624 -2135128 -1611905 -3260415 -4555144
41431 -4555144 -1616238 4993250 9927851 9710483 7289450 7421774 9504132 8840917 4252564
41422 4252564 -36482 -755176 292324 -80202 -2309238 -5441235 -9023180 -11380683
41414 -11380683 -9631679 -4434881 -1371057 -3797547 -7172612 -5054148 1264618 4263265
41406 4263265 523797 -5666072 -9396844 -10804600 -11996363 -12527725 -10714049 -6866993
41398 -6866993 -2625356 1332533 4710120 5899723 3157470 -2546226 -7212150 -6833634
41390 -6833634 -799875 7160772 11351425 8422047 210577 -7730407 -10723402 -8397144
41382h397144M183346K188929o55988r92683J230278K655319J005232j603307
41374c86018j774247J35675J127750O83747Q13146J275659n68916m354534n973697
41365i021435l942491j802158j842698j208409K471610O060660N699689K890270
41357f94962J282059N93034j432963l719064l634353j983295j167831k90574K620411
41348h427538N272638L894546K33088m71488J930851K457821j38660j320526Q96909
41339D327641K302543J8255k415858j347923O87899n11669l941492n638286m741126
41330a1260016k819608J50016M286738O361754L259541j913878k519987K380789
41322b074651O345064M463908m25945k815811k041370j152268q28268R34607L597008
$$ plain form
41382 -8397144 -4213798 -2024869 -2680857 -3673540 -2443262 212057 1217289 -386018
41374 -386018 -2160265 -2024590 -896840 -213093 600053 1875712 1306796 -3047738 -9021435
41365 -9021435 -12963926 -14766084 -16608782 -17817191 -15345581 -9284921 -3585232 -694962
41357 -694962 587097 1180131 -252832 -3971896 -7606249 -9589544 -10757375 -11047949 -8427538
41348 -8427538 -3154900 739646 972734 501246 2432097 4889918 4751258 3430732 4327641
41339 4327641 6630184 6648439 4232581 2884658 3572557 3060888 -880604 -6518890 -11260016
41330 -11260016 -14079624 -13929608 -9642870 -3281116 -21575 -1935453 -4455440 -2074651
41322 -2074651 4270413 8734321 8308376 5492565 3451195 2298927 1470659 2405266 6002274
41313F002274L297816j087382m887149l581424Q30964L154322K845578L604224
41305A0179223N508241L584326l572757r290872p308332q35025K172118J72412
41297F09334j441442L17939K532669K551977J644804Q83202j258232m679327n614411
41288d453487j999474K639025L860154K045155M66411K78443O52279J611165L209281
41279H308952L513875R18493k540594l423448j763272o28514j251829j775193
41271A358470j042068o07236j913841l680046l501619q23202K786556N500296
41263a922690O393276N220922K135383j991721n478508o857424o193249m766841
41255a3460852l215287j000809J662610K867833J577210j69701J49086J665257
$$ plain form
41313 6002274 9300090 8212708 3325559 -255865 575099 3729421 6574999 10179223
41305 10179223 15687464 19271790 15699033 6408161 -900171 -1735196 436922 609334
41297 609334 -832108 -514169 2018500 4570477 6215281 7098483 5840251 1160924 -4453487
41288 -4453487 -6452961 -3813936 46218 2091373 2557784 2836227 3488506 5099671 8308952
41279 8308952 11822827 12741320 10200726 6777278 5014006 4385492 3133663 1358470
41271 1358470 316402 -290834 -2204675 -5884721 -9386340 -10209542 -7422986 -1922690
41263 -1922690 4470586 9691508 11826891 9835170 4356662 -2500762 -8694011 -13460852
41255 -13460852 -16676139 -17676948 -16014338 -13146505 -11569295 -11738996 -11589910 -9924653
41247i924653J542648k92901r95413O37448K758743M023324N006738N233446K645389
41238A0634769k247672n308888m199776j719879j233458j838582j054111N18598
41230f448999P76090K28857Q70354K388725K919290K412654K035349J320990p35882
41221E767428k568840j532805J630374K965618L70628l793678n509109l031719
41213e702103J693761M364525K107501k738796m322262n20444L730685K939863
41205A552730j404852l356301q25531K719904L943590K907455R17408j119533
41197E334870k109785j756296j875320l644373m454634j447073K634807K102788
41189e215016k924272n664254k040251L836266N827278L407527L97822p64559
$$ plain form
41247 -9924653 -8382005 -8674906 -9670319 -9032871 -6274128 -2250804 2755934 7989380 10634769
41238 10634769 8387097 3078209 -1121567 -2841446 -4074904 -5913486 -6967597 -6448999
41230 -6448999 -5672909 -5444052 -4573698 -2184973 734317 3146971 5182320 6503310 5767428
41221 5767428 3198588 1665783 3296157 6261775 6632403 2838725 -2670384 -5702103
41213 -5702103 -4008342 356183 2463684 -275112 -4597374 -5117818 -1387133 1552730
41205 1552730 147878 -3208423 -4033954 -1314050 2629540 5536995 6454403 5334870
41197 5334870 3225085 1468789 -406531 -4050904 -8505538 -9952611 -7317804 -5215016
41189 -5215016 -8139288 -13803542 -15843793 -12007527 -6180249 -2772722 -2374900 -3139459
41181c139459m79715K49546Q84656J205643J536490K183481K332381J115080l82760
41172E505343n05759r9943j173057k793538k164062J78221Q21329k54661P93013
41163C06886M248330M800967J05731m214579k766258J120726Q63570k812762l328207
41154a675596J262930N530223M623627j9455l743200l709654k40192L781061M470104
41145A0279848O16989m128134n202598k785230p00662m46146N781J577711K390764
41136A608323J629740J278795K263515K155262q48158m120149l670277L11534
41128F08585L742522M063384K839558K476397K531260R92318j810401k991323
41120A2452300j402211Q2471j471808m380077m617152k118518r68006k615090
$$ plain form
41181 -3139459 -3619174 -3369628 -2484972 -1279329 257161 2440642 4773023 5888103 5505343
41172 5505343 4999584 4899641 3726584 933046 -1231016 -1052795 -231466 -486127 306886
41163 306886 4555216 9356183 9461914 5247335 2481077 3601803 4465373 1652611 -1675596
41154 -1675596 -412666 5117557 9741184 9721729 5978529 2268875 2028683 5809744 10279848
41145 10279848 10896837 6768703 1566105 -1219125 -1919787 -2365933 -2360152 -782441 1608323
41136 1608323 3238063 4516858 6780373 8935635 8087477 3967328 297051 608585
41128 608585 4351107 8414491 11254049 13730446 16261706 17254024 15443623 12452300
41120 12452300 11050089 11132560 9660752 5280675 663523 -1454995 -2423001 -5038091
41112e038091l090347O58651N223127N135800N87378l102925k606774L36491K452548
41103E55858K408843P94938q87064j172857k86582k52631j888748l132594k260915
41094f121752p55985l21052O69859M077592P344307O475108K491988J12385N87244
41085A4559694Q00167o73826j813164j835354k377509l145640j685330J302462
41077E131500J923092j4515N2135L248079M298705L15264l674072k877840p15228
41068G687120k403688n328775l355543K227701M112373L48644l161716k051940
41060a925824J063000J765028q79568n454920r818042j0454933m999591L103005
41052b7601845O912671M599085J440417J614893K769640J361171j148530j201933
$$ plain form
41112 -5038091 -8128438 -7469787 -2246660 2889140 3476518 373593 -2233181 -1896690 555858
41103 555858 2964701 3759639 2872575 1699718 1413136 1160505 -728243 -3860837 -6121752
41094 -6121752 -6877737 -7198789 -6528930 -2451338 4892969 11368077 13860065 13972450 14559694
41085 14559694 15359861 14686035 12872871 11037517 8660008 5514368 3829038 5131500
41077 5131500 7054592 7040077 7092212 10340291 14638996 14954260 11280188 8402348 7687120
41068 7687120 5283432 -45343 -3400886 -1173185 2939188 3287832 126116 -1925824
41060 -1925824 -862824 902204 22636 -5432284 -15250326 -25705259 -30704850 -27601845
41052 -27601845 -20689174 -16090089 -14649672 -13034779 -10265139 -8903968 -10052498 -11254431
41044a1254431J044273K754725L069068L160237L172044K218590M60803j108119
41036C517190j910507j351153R55618L086215J777152k353059l879087M774M568589
41027D415732M262878J031900L27054J493071o20758n339076n641888L86820N301929
41018E617662L197066j629177j966086J474729K573461k89658l232077l960455
41010A785465l743075k918712j55038L407427M287921J903341o00396j641280
41002B325653l030568n300216n659455k718608O90553J951156K389109L742998
40994e609378M324988K304242M218O37693K555822J312260l192997o003486l946839
40985g613477M64309K901609K040261n93336l072447l941675k458718N28357K832380
$$ plain form
41044 -11254431 -10210158 -7455433 -4386365 -1226128 1945916 4164506 4625309 3517190
41036 3517190 1606683 255530 1211148 4297363 6074515 3721456 -157631 -152857 4415732
41027 4415732 8678610 9710510 10037564 11530635 10909877 5570801 -71087 315733 5617662
41018 5617662 8814728 7185551 5219465 6694194 9267655 8977997 5745920 1785465
41010 1785465 -1957610 -4876322 -5031360 -1623933 2663988 4567329 3966933 2325653
41002 2325653 -704915 -6005131 -11664586 -14383194 -13692641 -11741485 -9352376 -5609378
40994 -5609378 -1284390 1019852 1024070 1661763 4217585 5529845 2336848 -3666638 -7613477
40985 -7613477 -7149168 -4247559 -2207298 -2800634 -5873081 -9814756 -12273474 -11745117 -8912737
40976h912737K934718J293888l40844k34461K113422M825466M577004N30339l475265
40967C311530l166317K62909J628823p79171k893620j224940K075880K858423
40959B073517Q37461j155195j820159k037956j918942m73307J805532K755561
40951F6512J554127j5103r695J301864K126920J240364j070297l406620m232455
40942b444383l015447p74033P73452Q45099L90185J188739L853563O505854O107008
40933A3430037J998043k512395l603207j639494l58514j251031j469087J366935
40925E961287M822361M583104L25899l986368n225403m173808l250581l036991
40917c980500k081030L98532K481327J141799l466396o486943l404171L661649
$$ plain form
40976 -8912737 -5978019 -4684131 -5024975 -5259436 -3146014 1679452 6256456 6786795 3311530
40967 3311530 145213 408122 2036945 1257774 -1635846 -2860786 -784906 2073517
40959 2073517 2910978 1755783 -64376 -2102332 -4021274 -4494581 -2689049 66512
40951 66512 1620639 1605536 1595841 2897705 5024625 6264989 5194692 1788072 -2444383
40942 -2444383 -5459830 -6233863 -5460411 -4615312 -4225127 -3036388 817175 7323029 13430037
40933 13430037 15428080 12915685 9312478 7672984 7314470 6063439 4594352 5961287
40925 5961287 10783648 15366752 15692651 11706283 6480880 2307072 -943509 -3980500
40917 -3980500 -6061530 -5662998 -3181671 -2039872 -5506268 -11993211 -15397382 -11735733
40909a1735733P764117N902093K430117J987464K957387J366922j974675k965518
40901E732174j057509L14437m04791j133954l99474O60291Q94909K37621j810730
40892C032974n100920o449468k743602L311382N376437K233259p79009m57126
40884a576073j28057k665704m820182k780406J227863K836058K378142K659681
40876b868678K896985N55025k772028l081913n45232J018379O49911R01052K087391
40867a159108J386304j438147k481528L80346M114301M953975K862544q694k146109
40858F463884k351769L84964M794726P411570O261071K600190j593209n321581
40850A8649846p305722o277895l560369k134782k062511l77214L163866M413142
$$ plain form
40909 -11735733 -3971616 1930477 4360594 6348058 9305445 10672367 8697692 5732174
40901 5732174 4674665 4989102 4584311 3450357 3050883 3711174 4606083 4843704 3032974
40892 3032974 -2067946 -8517414 -11261016 -7949634 -2573197 -339938 -1118947 -1576073
40884 -1576073 -1704130 -4369834 -9190016 -11970422 -10742559 -7906501 -5528359 -2868678
40876 -2868678 28307 583332 -2188696 -5270609 -5815841 -4797462 -4147551 -3246499 -1159108
40867 -1159108 227196 -1210951 -3692479 -3312133 802168 5756143 8618687 8609993 6463884
40858 6463884 4112115 4497079 9291805 16703375 22964446 25564636 23971427 18649846
40850 18649846 11344124 5066229 1505860 -628922 -2691433 -3068647 95219 4508361
40842D508361J247126k364346j894646J481048L601073L319140K104527K83114
40834A2285397k302157l900207l023094j327673q12471k20530J932449L193917
40826E825631Q51262k300135j489172K055019K770865j84978k155357j533288
40818C839847j921667m070468l062486K849827P243903M551584j139356k381742
40810E909442L56993N60111l146512m761865m21298N624653O768410K285869k528410
40801A0647393k879776M51525K315097p20943n828659p047004l173733M22892
40793e813208m99284l047733k211997J206692K522478J161172J113872L754082
40785a813926N791876N217153M030116L427183J330497k705024m777338k438113
$$ plain form
40842 4508361 5755487 3391141 1496495 2977543 6578616 9897756 12002283 12285397
40834 12285397 9983240 6083033 3059939 1732266 919795 699265 2631714 5825631
40826 5825631 6676893 4376758 2887586 4942605 7713470 7528492 5373135 3839847
40818 3839847 1918180 -2152288 -5214774 -2364947 4878956 9430540 8291184 5909442
40810 5909442 6266435 6826546 3680034 -1081831 -1503129 4121524 10889934 13175803 10647393
40801 10647393 7767617 8219142 10534239 9813296 3984637 -3062367 -6236100 -5813208
40793 -5813208 -6312492 -9360225 -11572222 -10365530 -7843052 -6681880 -5568008 -1813926
40785 -1813926 3977950 9195103 13225219 16652402 17982899 15277875 10500537 8062424
40777H062424N80641k50227l003396k411861J320025K282281k163479p027166
40769b610758o454484j554995J534429l6887k483619p75484M663317Q352620O506431
40760G140570J552728j191745m6618K010938K433219K191104K571529J738015
40752A8399740k576465q209640r753729n054492J922887N761875N331434L466913
40744I288523K268486R08271j738740m202112l740763j50840L312743L403315
40736I348883K80400l275420n087297m962750l696795k137604p89220R44452M395449
40727d979902Q918700J0669408O792448K38057l076425k151760j969028n387506
40719I053992q340375o093715o68721K174019J031925o16978o93463n03641n31354
$$ plain form
40777 8062424 8643065 8392838 5389442 2977581 4297606 6579887 4416408 -2610758
40769 -2610758 -9065242 -10620237 -9085808 -9122695 -11606314 -12381798 -7718481 634139 7140570
40760 7140570 8693298 7501553 7454935 9465873 11899092 14090196 16661725 18399740
40752 18399740 15823275 7613635 -2140094 -7194586 -5271699 490176 5821610 9288523
40744 9288523 11557009 12465280 10726540 6524428 2783665 2632825 5945568 9348883
40736 9348883 9629283 6353863 1266566 -3696184 -7392979 -9530583 -10319803 -9375351 -4979902
40727 -4979902 3938798 14608206 21400654 21638711 18562286 16410526 14441498 9053992
40719 9053992 713617 -5380098 -6048819 -3874800 -2842875 -3459853 -4153316 -4656957 -5188311
40710e188311J052376M382440O160506L954007k68136k779666k481243j020388
40702C811585J8768L62573K04642n30458j952928l449114l339510l80735L629611
40693a625566M415902M15223m005142l451554J246900M292179L234355J805605
40685F327902L416722O052946N981907L144432l1902k558747m554606n044525
40677A2734129l304711j035699k62789k22674Q67573K182763J624790j26770m75325
40668A1981287M47462k52685l081409m649068k788856l954L98782q72319r06188
40659B73052M46557P04895n75585o35650J925364M123573K405648j962604m146828
40650B558422k204200O46380J194743P59187K125171M207365L421617m60896l790106
$$ plain form
40710 -5188311 -4135935 246505 6407011 10361018 10092882 7313216 4831973 3811585
40702 3811585 3830353 4192926 4397568 3867110 1914182 -1534932 -4874442 -5255177 -1625566
40693 -1625566 2790336 3205559 -799583 -4251137 -3004237 1287942 4522297 6327902
40685 6327902 9744624 15797570 21779477 24923909 24892007 22333260 17778654 12734129
40677 12734129 9429418 8393719 8130930 7908256 8775829 10958592 12583382 12456612 11981287
40668 11981287 12428749 12176064 9094655 4445587 1656731 1652777 2051559 1179240 273052
40659 273052 719609 1424504 848919 213269 2138633 6262206 8667854 6705250 2558422
40650 2558422 354222 1000602 2195345 2954532 5079703 9287068 12708685 12247789 8457683
40641H457683m600442m696865n117931l736970K66711L383240K668267O66757
40633b709550J421829L879321L881943J282318k2507J140761J516821o97093k974797
40624F719046l149150k786454l457186l176500K71364M825134O238492L524703
40616I009449l33331k493567k928467l153607l808714l804376j655029K052756
40608g114886M215921K807199K43049M80368K955230L124721j74444k365642m11560
40599C759956K048821P56834j821883n83076L339130M136674R45718p49788J698633
40590A3531019L853624J771532j620387j728833K40455j28036k973463m407569
40582H538342l207791k269288l009826k818066K37641L626827L826604J441852
$$ plain form
40641 8457683 3857241 -839624 -5957555 -9694525 -9427814 -6044574 -3376307 -2709550
40633 -2709550 -1287721 2591600 6473543 7755861 7733354 8874115 10390936 9693843 6719046
40624 6719046 3569896 783442 -2673744 -5850244 -5578880 -753746 5484746 9009449
40616 9009449 8676118 6182551 3254084 100477 -3708237 -7512613 -9167642 -7114886
40608 -7114886 -2898965 -91766 151283 631651 3586881 6711602 6537158 4171516 3759956
40599 3759956 5808777 6565611 4743728 4160652 7499782 11636456 12582174 11832386 13531019
40590 13531019 17384643 19156175 17535788 15806955 16047410 15919374 12945911 8538342
40582 8538342 5330551 3061263 51437 -2766629 -2528988 1097839 4924443 6366295
40574F366295J29879J391521K988875K511876L87992j314122j574235r56540m03593
40565I527948m83960j248496j902347j120854J244426L190651K657986M69474
40557A2334828m28180J098855L003416L309029K704108K511759K114342O91013
40549B7339170r3137J752123M458987M162801R32927n06716K540874O614092O857689
40540E4058810L247884p14709l380416n539928o830437n463945j809420J052517
40532C4620356J328469M31055k24745j721981m977600p563116n910480j66833
40524A5815125N388355O959269M694431J340067r49953j669429j062023M07506
40516C0923348J802252J931328K46553k661113n393518o312001m241772K64473
$$ plain form
40574 6366295 6496174 7887695 10876570 13388446 13776438 12462316 10888081 9931541 9527948
40565 9527948 9043988 7795492 5893145 4772291 6016717 9207368 11865354 12334828
40557 12334828 11906648 13005503 16008919 19317948 22022056 24533815 26648157 27339170
40549 27339170 27246033 28998156 33457143 37619944 38552871 38046155 40587029 47201121 54058810
40540 54058810 57306694 56591985 53211569 47671641 40841204 35377259 33567839 34620356
40532 34620356 35948825 36379880 36155135 34433154 29455554 21892438 15981958 15815125
40524 15815125 21203480 28162749 32857180 34197247 33247294 31577865 30515842 30923348
40516 30923348 32725600 34656928 34903481 32242368 26848850 20536849 16295077 16559550
40508A6559550M156001L850555o76830m667264l469651J374346L273962j156743
40500A9243926p174884p435705j200918M756825M467234o26407m413564l494508
40492D121999k0365J929463Q54332j617140l424908m194093m579664m360469k334566
40483a3625411J593841N294132O448002N246283L919182L741983L656140K022836
40475A8296988j163184m083024m665232k529062K41938R91834k05154n09770J080762
40466G456096J154766l035499p469951n165039L501209R484293O525174o29028
40458A1822021l267519l74475J769351m18632l764193m112779j350493K229850
40450B533131M753577M843574K119996j194902j986928n73009m55337k680626
$$ plain form
40508 16559550 20715551 24566106 23889276 19222012 15752361 17126707 20400669 19243926
40500 19243926 12069042 4633337 3432419 8189244 12656478 12030071 7616507 4121999
40492 4121999 4101634 6031097 6885429 5268289 1843381 -2350712 -6930376 -11290845 -13625411
40483 -13625411 -12031570 -6737438 -289436 4956847 8876029 12618012 16274152 18296988
40475 18296988 17133804 13050780 8385548 5856486 6098424 7090258 6885104 6375334 7456096
40466 7456096 8610862 5575363 -1894588 -7059627 -3558418 5925875 12451049 11822021
40458 11822021 8554502 8180027 9949378 9530746 5766553 1653774 303281 2533131
40450 2533131 7286708 12130282 14250278 13055376 11068448 10495439 10040102 7359476
40442G359476l642330m31061M350586N643159K130020k786946n054039l352903
40434D215962M69423K953567K000779p56652j736008k5633J692505J427925M38590
40425A0680458K56430J09945o55929m94072J262177J872330q43572m138685l812477
40416D236605n31316J458621R77622Q38698K310392L200509K319712J757148L066189
40407A9634180M468439L775762J584273k56409j321601k050606k098416q22139
40399B2913483J489434L639990L976257J083596m260230q214454p452864l601590
40391I573622j311455j826167j927175J32641J788187J023243M1123J204346K621800
40382A1320165J276583j841059l264668k048154p6301J138272J076782p13727
$$ plain form
40442 7359476 3717146 3286085 7636671 13279830 15409850 12622904 7568865 4215962
40434 4215962 4685385 7638952 9639731 8883079 7147071 7121438 8813943 10241868 10680458
40425 10680458 10936888 11046833 10390904 9896832 11159009 13031339 12187767 8049082 4236605
40416 4236605 3705289 5163910 6141532 6980230 9290622 12491131 14810843 16567991 19634180
40407 19634180 24102619 27878381 29462654 29206245 27884644 25834038 23735622 22913483
40399 22913483 24402917 28042907 32019164 33102760 28842530 20628076 13175212 9573622
40391 9573622 8262167 6436000 4508825 4641466 6429653 7452896 7494019 8698365 11320165
40382 11320165 12596748 10755689 7491021 5442867 5366566 6504838 7581620 6867893
40374F867893l153902l033906P07381L870965K110713k379305l849499j572912
40366d32572j44267j379712j775769O39670K590647J383780m22968J80621J164830
40357A804260p99430l867475l185179J651237N771982N583769K431188o29074
40349H761278k337145k559495j046600J386527K316602L15452k666327l136588
40341A033704l16077K489735J393049l365481o938903m899999J461368O142174
40333c000430N163306Q63412j615821o56075J035726J100860L40765N02007J638272
40324E372022K831362L727517L889604K115558j660371m728280m148145p87872
40316F611395J388230M46320j311260j237779j77287m30326j613366j393816L22469
$$ plain form
40374 6867893 3713991 680085 1387466 5258431 7369144 4989839 1140340 -432572
40366 -432572 -576839 -1956551 -3732320 -3092650 -502003 881777 458809 639430 1804260
40357 1804260 1004830 -2862645 -6047824 -4396587 1375395 6959164 9390352 8761278
40349 8761278 6424133 3864638 2818038 4204565 6521167 6836619 4170292 1033704
40341 1033704 717627 3207362 4600411 1234930 -5703973 -10603972 -9142604 -3000430
40333 -3000430 2162876 3026288 1410467 754392 1790118 2890978 3231743 3733750 5372022
40324 5372022 8203384 11930901 15820505 17936063 16275692 11547412 7399267 6611395
40316 6611395 7999625 8445945 7134685 5896906 5719619 5289293 3675927 2282111 2604580
40307B604580J065738k0784p51399J85693P86239p18961k279679q53939K703884
40298B721372M693004L719998J701807Q3511j588277k978398k317897K44441J637514
40289G917075J47205j672734o34205K316801L445690J311493j788821k970224
40281H072280j519574J092588K395663O24080l134067m919309j791264M298631
40273E119028Q027666O232033Q04035l821900m862819k865341l79411O41932M87552
40264I382775O07309J047367M09276j105620r45458J558852K545925j316018o534364
40255E650044o101898P75970O973921O897721L083879P59693K14734j162079k615445
40246A4476540j403593J116780P56507k092618k257948J456621L140331j214144
$$ plain form
40307 2604580 3670318 3649534 2898135 3083828 3870067 3151106 871427 17488 2721372
40298 2721372 7414376 11134374 12836181 12919692 11331415 8353017 6035120 6279561 7917075
40289 7917075 8064280 6391546 5757341 8074142 11519832 12831325 11042504 8072280
40281 8072280 6552706 7645294 10040957 10665037 7530970 2611661 820397 5119028
40273 5119028 13146694 19378727 20182762 16360862 11498043 8632702 8253291 8895223 9382775
40264 9382775 9990084 11037451 11446727 10341107 9395649 10954501 13500426 12184408 5650044
40255 5650044 -451854 324116 7298037 14195758 17279637 18039330 18254064 17091985 14476540
40246 14476540 13072947 14189727 14946234 12853616 10595668 12052289 15192620 13978476
40238A3978476o514487n408044J012901N274954M633883L589164M954226N045293
40230B6566366O43759m505834m709199p52858J471799n76193l406537l168821
40222A1562482l55354J854004J381996j253213l449237k531846R85929K817132
40214A1011893m182m279144m338568k79310J859422q95935l934632k082132K860837
40205h1751N219735L200019m16194l244020m740461l921018k1670M662343O360853
40196G017836M610697K391050J429455O39831n41230q80459l33351q56643k760112
40187A0717074l344963j012659K061768L454890M018431N207656N218094J406803
40179B7727094m380461o546375k404990M307820P504395M881433o49172m475228
$$ plain form
40238 13978476 7463989 2055945 3068846 8343800 12977683 16566847 21521073 26566366
40230 26566366 27210125 22704291 17995092 17242234 18714033 18137840 14731303 11562482
40222 11562482 11207128 13061132 14443128 13189915 9740678 7208832 8194761 11011893
40214 11011893 11007711 6728567 2389999 2110689 3970111 3074176 -860456 -2942588 -81751
40205 -81751 5137984 8338003 7921809 4677789 -62672 -3983690 -4005360 656983 7017836
40196 7017836 11628533 14019583 15449038 16088869 15547639 14667180 14333829 13477186 10717074
40187 10717074 7372111 6359452 8421220 11876110 15894541 21102197 26320291 27727094
40179 27727094 23346633 16800258 14395268 18703088 26207483 31088916 30439744 25964516
40171B5964516m398958j796072N39108J285269J080753N57453p90340l139556
40163A9302173m913849m174434j044539K393153M450020N034629M534966K715146
40155B8297265n30607l826507m719621k039448K329832M810458L693087Q08278
40147B8822737q13369j58057J698351L645702N001643M638730J961878j155658
40139D3641957j723998M81345K546157K680350K466846L563990M624459L635165
40131F1916271J421379K56984K16925m71041k168229l476641l816379l908247
40123D9971022l706769k249925J8595R48508m65327k551848l082205j621928Q37336
40114C8097459L210183M449982L615491J025155j300090j429663M39152K398611
$$ plain form
40171 25964516 21565558 19769486 20308594 21593863 22674616 23232069 22441729 19302173
40163 19302173 14388324 10213890 9169351 11562504 16012524 21047153 25582119 28297265
40155 28297265 27766658 23940151 19220530 17181082 19510914 24321372 28014459 28822737
40147 28822737 28009368 27851311 29549662 33195364 38197007 42835737 44797615 43641957
40139 43641957 41917959 42399304 44945461 47625811 50092657 53656647 58281106 61916271
40131 61916271 63337650 63594634 63811559 63340518 61172289 57695648 53879269 49971022
40123 49971022 46264253 44014328 44032923 44981431 44516104 41964256 38882051 37260123 38097459
40114 38097459 41307642 45757624 49373115 50398270 49098180 47668517 48107669 50506280
40106E0506280L015279K374324J038334j063318l925053o007997m873307k43281
40098D0821261M349744M618381M22494l749586l659639N40072N460253Q217968
40090E7020948Q148539O298814M581911M459270N394532N684245N626135P999153
40082A05213547J3798692J9483114K1076169J9736530K0287771K4837956L0913309
40075B55347088L5737907L8882942L9644282L4874148K1807133J996121j8992805
40068D09296816l5224951m3254340m2822006l6383141k7884823k0875896j6809019
40061A86042640j4591143j1916410p801733l901485k475553l288692m155133m444832
40053A33467659n467009o910472o411710m257147m509459q477500j1092213q170633
$$ plain form
40106 50506280 53521559 55895883 56934217 55870899 51945846 45937849 41064542 40821261
40098 40821261 45171005 49789386 50211880 46462294 42802655 43342727 48802980 57020948
40090 57020948 65169487 71468301 76050212 80509482 85904014 91588259 97214394 105213547
40082 105213547 119012239 138495353 159571522 179308052 199595823 224433779 255347088
40075 255347088 291084995 329967937 369612219 404486367 426293500 428289621 409296816
40068 409296816 374071865 330817525 287995519 251612378 223727555 202851659 186042640
40061 186042640 171451497 159535087 151733354 147831869 145356316 142067624 137912491 133467659
40053 133467659 128000650 121090178 114678468 110421321 105911862 97434362 86342149 78171516
40045G8171516l622667l636250o588708n881658j232585R41509j512393l523497
40037E3115267k422917k090218m267240l988587J257264N170695K067778l206754
40029D5635288k329155L776063P126151M877061J526113L04145j72696q64586
40021E9878384p31722p70282l503922p322925o852014p17128N542960O142381
40013E1665732J195819m908368q045491o559293k167365P85863n7121j405559
40005C0504217J248157O235699P452068L400893r03391j916226j752976k526114
39997D1742327k160781R91713M163780M484023L363167K974512K151956j39008
39989E7571689q14126K804008O927822N291965j696137o934076o128957k977126
$$ plain form
40045 78171516 74548849 70912599 64323891 58442233 57209648 58151157 56638764 53115267
40037 53115267 50692350 48602132 44334892 40346305 41603569 46774264 48842042 45635288
40029 45635288 43306133 47082196 54208347 59085408 60611521 60915666 60742970 59878384
40021 59878384 59146662 58376380 54872458 47549533 40697519 39980391 45523351 51665732
40013 51665732 52861551 47953183 39907692 33348399 31181034 31966897 31909776 30504217
40005 30504217 31752374 37988073 45440141 48841034 47937643 46021417 44268441 41742327
39997 41742327 39581546 40573259 44737039 49221062 52584229 55558741 57710697 57571689
39989 57571689 56757563 59561571 66489393 71781358 70085221 63151145 57022188 54045062
39981E4045062l428949p869525j1059529q593330j917681L145475K598702j558275
39973B5361950m224284l545626k061653j566346l59105K781387N334382M645524
39965B6366229K146511O36150m06676k887073n215387m036417k63081J434521
39957A7774777k35668j125029J642403M963678M496690J106598p63647N62900
39949B8422702K653651L260625K696014J647899l53782k961071l902773k030438
39941B9432827J02561n39207k455753j246876L342656N943559L188812r34281
39933C6834298j132915P71858j049232o211703p580019k138454L789193L367658
39925B6650684j625159m698034l955195k628115k604999k451768j133855M62098
$$ plain form
39981 54045062 50616113 42746588 31687059 23093729 21176048 24321523 26920225 25361950
39973 25361950 21137666 17592040 15530387 13964041 13604936 16386323 21720705 26366229
39965 26366229 28512740 29148890 28742214 25855141 20639754 16603337 16340256 17774777
39957 17774777 17539109 16414080 18056483 23020161 27516851 28623449 27859802 28422702
39949 28422702 31076353 34336978 37032992 38680891 38327109 35366038 31463265 29432827
39941 29432827 29535388 28996181 26540428 25293552 28636208 34579767 37768579 36834298
39933 36834298 35701383 36473241 35424009 29212306 21632287 19493833 23283026 26650684
39925 26650684 25025525 20327491 16372296 13744181 11139182 8687414 7553559 8015657
39917H015657J627946K266438J553137r12822l094574k566982j37356J417127
39909H168571J628290K248704L426077L507439K622337K747765L614038K220530
39901C0183751k188659n803444m828470k30169L784379M385350J865318j689594
39893B5478462m033387m062418k625029j561375j615678j946077j542277j83995
39885G908226J584957K323704M58207l115128m371454p36271M465581N377153
39877A3894975J243420k854191l252696j787724j328481j181937M13784K159803
39869G306953J390333j547373l499618k617296k74781Q92330l30568k652081l294310
39860d626411r01029K338669K904549N62687j263250m27224J084315O76990q74123
$$ plain form
39917 8015657 9643603 11910041 13463178 12550356 9455782 6888800 6751444 8168571
39909 8168571 9796861 12045565 15471642 18979081 21601418 24349183 27963221 30183751
39901 30183751 27995092 22191648 17363178 17133009 20917388 25302738 27168056 25478462
39893 25478462 21445075 17382657 14757628 13196253 11580575 9634498 8092221 7908226
39885 7908226 9493183 11816887 12275094 9159966 4788512 4052241 8517822 13894975
39877 13894975 15138395 12284204 9031508 7243784 5915303 4733366 5147150 7306953
39869 7306953 8697286 7149913 3650295 1032999 758218 1650548 1319980 -1332101 -4626411
39860 -4626411 -5527440 -3188771 -284222 278465 -984785 -1412009 -327694 349296 -524827
39851e24827j222516m33873m94510j735153k266497q24476J741064L853841M615472
39842B708525L768783J504501j342675l478829l796076k082470L70578J275946
39834a071717k34396j879716p63248K200040K804330n61961m138320l793479o25237
39825h063704J067979L149r64742L43172K371559K478591P81369k8428J841752
39816a69303M989940O309497M529625J607374J26798Q6132n01476k295265l676573
39807A1006749l226536j473944J75645P65514q7090j675543j789033J030159M583421
39798I309342M824211J087792l046710m675661m371127l271778j000182J806639
39790F62526K495019M00826j347182p25804k42270k191268l761707j178986L710897
$$ plain form
39851 -524827 -1747343 -2181216 -2675726 -4410879 -6677376 -7501852 -5760788 -1906947 2708525
39842 2708525 6477308 7981809 6639134 3160305 -635771 -2718241 -2347663 -1071717
39834 -1071717 -1306113 -3185829 -3949077 -1749037 1055293 493332 -3644988 -7438467 -8063704
39825 -8063704 -6995725 -6992576 -7957318 -7614146 -5242587 -2763996 -1982627 -2011055 -169303
39816 -169303 4820637 11130134 15659759 17267133 17393931 17480063 16978587 14683322 11006749
39807 11006749 7780213 6306269 6481914 7247428 7160338 5484795 3695762 4725921 9309342
39798 9309342 14133553 15221345 12174635 7498974 3127847 -143931 -1144113 662526
39790 662526 3157545 3558371 2211189 1485385 1243115 -948153 -4709860 -5888846 -2177949
39781b177949N733692L720350Q91304r88955k947730m638557l788248n74384J605455
39772c165022R56297m16579j19358J441882K510762K086233K780k781354l791738
39763c276097j477764J883003K520599M97379m38979J350571L217263K760262
39755G036237J116819J58625n72359k057310l232808k476956l19547J130422P82102
39746A565225m24120o44693Q92720K494863J354364k510304n082324l356929k5246
39737e736444J84423k225767k223524J804246N410727M552737O16197k638492
39729b55897l544473k215101P96236L527880L344059N98544j152391j64092J238987
39720B173752R19575Q2923L31056R61362J255063K044035K913121J581374j578589
$$ plain form
39781 -2177949 3555743 7276093 8167397 7178442 4230712 -407845 -4196093 -4770477 -3165022
39772 -3165022 -2208725 -2625304 -2744662 -1302780 1207982 3294215 3296995 515641 -3276097
39763 -3276097 -4753861 -2870858 -350259 147120 -291859 1058712 4275975 7036237
39755 7036237 8153056 8311681 7739322 5682012 2449204 -27752 -347299 783123 1565225
39746 1565225 1141105 496412 1389132 3883995 5238359 2728055 -2354269 -5711198 -5736444
39737 -5736444 -5552021 -7777788 -10001312 -8197066 -2786339 1766398 2382595 -255897
39729 -255897 -3800370 -6015471 -5219235 -1691355 1652704 2251248 1098857 934765 2173752
39720 2173752 3093327 3176250 3507306 4468668 5723731 7767766 10680887 12262261 10683672
39711A0683672k545183n1585J491237q47557l126719j159401J881612O42678l102214
39702C866540l395306j45081J267464m66579j003869J324241K932234K197798
39694F577442K324507M463721M360709m31712n239414m587407p7015K377319N38118
39685A0306268k828138m651284m081006j711425P48223J114852o29202j597244
39677c328956P2029K166325J550863j214065k912867k072051R3624J980232K500041
39668a164825Q99556j827218k514127M24611L801570L244650p12625l392562k466527
39659c707497j05679J522446K940256M357638L827293P08155k052659j875522
39651E614431m42277o39371j593191l49828K694575M049306K666286J283864J544675
$$ plain form
39711 10683672 8138489 8086904 9578141 8730584 5603865 4444464 6326076 6968754 3866540
39702 3866540 471234 326153 1593617 1127038 123169 1447410 4379644 6577442
39694 6577442 8901949 13365670 17726379 17294667 12055253 7467846 7390831 9768150 10306268
39685 10306268 7478130 2826846 -1254160 -2965585 -2217362 -1102510 -1731712 -3328956
39677 -3328956 -3256927 -1090602 460261 -753804 -3666671 -5738722 -5645098 -3664866 -1164825
39668 -1164825 -265269 -2092487 -4606614 -4182003 -380433 2864217 2151592 -1240970 -3707497
39659 -3707497 -3813176 -2290730 649526 5007164 8834457 9542612 7489953 5614431
39651 5614431 5172154 4532783 2939592 2589764 5284339 9333645 11999931 13283795 14828470
39642A4828470J612211K56755k74279J882039M289993L488238L58409j222670
39634B5219166Q2314K461049N178602R412650J4578541J7771867J8067005J7750330
39626A10521524J7446571J3498163L149906j0064298j9354844k1693679j9026056
39619G4477287j4028985q238397l816454l242011o080120q603702p928887m932542
39611A7606189k299975j304739j374262j389673m85600J253340K154743L56117
39603A4516140l264619n053240k927948M54071Q25481k093231m462628l789111
39595e795085j789625o38659Q52111M411181P395740N008225k144514p012718
39587B86656m920450J03567J315732j200061j813170J215238L363267J657834
$$ plain form
39642 14828470 16440681 16697436 16423157 18305196 22595189 26083427 26441836 25219166
39634 25219166 25301480 27762529 32941131 42353781 56932322 74704189 92771194 110521524
39626 110521524 127968095 141466258 144616164 134551866 115197022 93503343 74477287
39619 74477287 60448302 52209905 48393451 45151440 39071320 30467618 22538731 17606189
39611 17606189 15306214 14001475 12627213 11237540 10751940 12005280 14160023 14516140
39603 14516140 11251521 6198281 3270333 3724404 4549885 2456654 -2005974 -5795085
39595 -5795085 -7584710 -8223369 -7371258 -2960077 4435663 9443888 7299374 286656
39587 286656 -4633794 -4530227 -3214495 -4414556 -6227726 -5012488 -1649221 8613
39579H613o78221L3936J943561J090527k082674l504592j257714K630901N287279
39570C471616N367002L152279L18615j222012j638695k881047m912971m798702
39562c143915j449745J793498K229439K284489M929382P435506M923839j511850
39554A7490643n826825n566492l882338l034210j641488N99347J114123n42772
39546a290012q34955J918579M137582K539420m65444m30942K623721M712429L250239
39537A6160617p38377m516809n786290m238374k331209k862778m791026l907124
39529a3011370R95348N521607N324648J694031r52822p84827R02831K692902L608577
39520E990925K351754j006144l738933l551447j892643j720572l102472l612586
$$ plain form
39579 8613 -669608 -635672 1307889 2398416 315742 -3188850 -4446564 -1815663 3471616
39570 3471616 8838618 11990897 12309512 11087500 9448805 6567758 1654787 -3143915
39562 -3143915 -4593660 -2800162 -570723 1713766 6643148 14078654 19002493 17490643
39554 17490643 11663818 6097326 2214988 -819222 -2460710 -1861363 -747240 -1290012
39546 -1290012 -2124967 -206388 3931194 6470614 6005170 5574228 8197949 12910378 16160617
39537 16160617 15422240 10905431 5119141 880767 -1450442 -4313220 -9104246 -13011370
39529 -13011370 -12016022 -6494415 -1169767 524264 -428558 -1213385 -310554 2382348 5990925
39520 5990925 8342679 7336535 3597602 46155 -1846488 -3567060 -6669532 -10282118
39512a0282118k149010J68269K081457K821170J597898j063437k436941p60011
39504a0022723J498121N47745k885572l898909j45271M650000N306578J488259
39496c461772k222363j884804J393957L031790P18751k474515k037788J684353
39488e252391L773880J672698j354672j303787J052267K278174J412155m4846
39480B233478j301658k216736j661884P64908K776784K483184J987124M112764
39472I177964O821411N395584k09779m760657m846617k405089n58783o6575q34446
39463G713013k817547m032370j685250K875765M168963p5962m985188m795588
39455c634164k87727L071585K353518m83646k142181j224197J367265L375788
$$ plain form
39512 -10282118 -12431128 -12262859 -10181402 -7360232 -5762334 -6825771 -9262712 -10022723
39504 -10022723 -8524602 -7976857 -10862429 -14761338 -14906609 -10256609 -4950031 -3461772
39496 -3461772 -5684135 -7568939 -6174982 -3143192 -2424441 -4898956 -6936744 -5252391
39488 -5252391 -1478511 194187 -1160485 -2464272 -1412005 866169 2278324 2233478
39480 2233478 931820 -1284916 -2946800 -2181892 594892 3078076 5065200 9177964
39472 9177964 15999375 21394959 21185180 16424523 11577906 9172817 8614034 8547459 7713013
39463 7713013 4895466 863096 -822154 2053611 6222574 6146612 1161424 -3634164
39455 -3634164 -3921891 -850306 1503212 1019566 -1122615 -2346812 -979547 2396241
39447B396241L086078J194932l25202j485532l983211o964463o586326j854078
39439a4521561K594129K684580Q21349J592886M086994L514027p38875m023547
39431c990018l509658j351856J50465J751488L758738L813772J123647p31705
39423A014873J068663L338542J111243m337193o386960k168223L466870M524735
39415A632550J146237j895886j694234M21125J871437J724593Q39044Q83300K999098
39406G927264N960738O255124K026316l468731n047518k498087j023435l438649
39398F693022n554414k562773K848269L720946p80777l848613j201188K531285
39390A845757J039613m025546n644095j768571K357943K389276L39996j141J025044
$$ plain form
39447 2396241 5482319 6677251 6352049 4866517 883306 -6081157 -12667483 -14521561
39439 -14521561 -11927432 -9242852 -8421503 -6828617 -2741623 772404 33529 -3990018
39431 -3990018 -7499676 -8851532 -8701067 -6949579 -3190841 622931 1746578 1014873
39423 1014873 2083536 5422078 6533321 2196128 -4190832 -6359055 -2892185 1632550
39415 1632550 2778787 882901 -811333 -390208 1481229 3205822 4044866 4928166 7927264
39406 7927264 13888002 20143126 22169442 18700711 13653193 11155106 10131671 6693022
39398 6693022 1138608 -1424165 1424104 5145050 4364273 515660 -685528 1845757
39390 1845757 2885370 -1140176 -6784271 -8552842 -6194899 -3805623 -3465627 -3466768 -2441724
39381b441724Q71196j06291N44089K475181K425217n09356k795426j211305K610352
39372A861933M347186K344519j119760l203172l278221k427046j648421j020072
39364d143054m9182J291814J878143N41001j829664k608800q20776J216611J142556
39355c381351K7119M28881K123938K534841Q73929j067790k078427k393539j444051
39346d376450J665534M919091M629847J168713p66519M05668Q1834m715370q867413
39337e855065n774912K308914O501912K949864l219655n755094m066331j056376
39329a3966743J471870L189068L876641L585364K643142Q82989j634289l404782
39321c356740l041992j468976j35651J852816N448772P650102M506892j942684
$$ plain form
39381 -2441724 -1570528 -1676819 -1132730 1342451 3767668 3258312 462886 -748419 1861933
39372 1861933 6209119 8553638 7433878 4230706 952485 -1474561 -3122982 -4143054
39364 -4143054 -4192236 -2900422 -1022279 -481278 -2310942 -4919742 -5740518 -4523907 -3381351
39355 -3381351 -3354232 -2925351 -801413 1733428 2607357 1539567 -538860 -2932399 -4376450
39346 -4376450 -2710916 2208175 6838022 8006735 7240216 7645884 7727718 3012348 -5855065
39337 -5855065 -11629977 -9321063 -2819151 130713 -3088942 -8844036 -12910367 -13966743
39329 -13966743 -12494873 -9305805 -5429164 -1843800 799342 1682331 48042 -3356740
39321 -3356740 -6398732 -7867708 -8003359 -6150543 -701771 6948331 11455223 9512539
39313I512539m993301k519323M44859J64064m94079J484782K966068l4515m619510
39304A911584m505202P23499N386550N831962L677973J165517j692874m406829
39296H092180m824305k536820l95231p04773k078403j741877P11088L322303M181305
39287D025467K619738p06044l616140l440312J24536L776753L835955N92295k079938
39278E132310j676151O8198K60002q54688q71645L42120L58685j110429p49693
39269H98709K874269N486535K595752l134762m789217r79132K396167J083786
39261F432107j935331k239823q40484j328336l148844k328058K083968O142017
39253B837216N757144Q94221m988527p924667o190659j682010J773230K553421
$$ plain form
39313 9512539 4519238 1999915 2444774 2608838 2114759 3599541 6565609 6531094 1911584
39304 1911584 -2593618 -1870119 3516431 9348393 13026366 14191883 12499009 8092180
39296 8092180 3267875 731055 335824 -368949 -2447352 -4189229 -3478141 -155838 4025467
39287 4025467 6645205 5939161 2323021 -1117291 -992755 2783998 6619953 7212248 5132310
39278 5132310 3456159 3524357 3784359 2929671 2058026 2400146 2758831 1648402 898709
39269 898709 3772978 9259513 11855265 8720503 3931286 2952154 5348321 6432107
39261 6432107 4496776 2256953 1416469 88133 -3060711 -5388769 -3304801 2837216
39253 2837216 8594360 9488581 4500054 -3424613 -9615272 -11297282 -9524052 -6970631
39245f970631K763393M482861O132617M717934N46679k838876l093049j223453
39237D517475N89160J274551P08065r54074k976669l981587k880374J30111L385885
39228a87457M701835L267748P58997l14033M98654J351610P48855r27492k553408
39219G345309l355225k856925j466080r08206k014282k652577p16000J596845
39211e027141N97142k137614j307419K910775L667249j761844o496212m055173
39203a3610237J917917L982192K167284J734142L171997K489546k05261m84871
39195A162709K120937K995693M71707j600555p31257P35222P78111Q39734J733623
39186H505924J420350p61046k046307q69998L33709o75584k393555k491525j316495
$$ plain form
39245 -6970631 -4207238 275623 6408240 11126174 11672853 8833977 5740928 4517475
39237 4517475 5106635 6381186 7089251 6135177 3158508 -823079 -3703453 -3573342 -187457
39228 -187457 4514378 7782126 8541123 8227090 8725744 10077354 10826209 9898717 7345309
39219 7345309 3990084 1133159 -332921 -1241127 -3255409 -5907986 -6623986 -5027141
39211 -5027141 -4429999 -6567613 -7875032 -4964257 -1297008 -3058852 -9555064 -13610237
39203 -13610237 -11692320 -7710128 -5542844 -3808702 -636705 1852841 1647580 1162709
39195 1162709 3283646 6279339 6751046 5150491 4419234 5154456 5932567 6772301 8505924
39186 8505924 9926274 9165228 7118921 6248923 6582632 5907048 3513493 1021968 -294527
39177b94527n01523o79846j964344m028172m820751k317298J687949L051390J282615
39168h584507N0015P68335M57213k157665l381555m81293L288167L248157k21454
39159g014587l221175l833487k878606j199863R46196L197833N535130P704090
39151g64469P520280K923173l298439n085286j367180J815401J88616k634924
39143g02828j806711P92163O25181j227609k58002L149381M040483R29854k208227
39134C333685k231624k65690J641026K964088L100851J221075j359854k034714
39126F368843r69232j116408l279675m411476k316003P58998J265109p82938k182128
39117f664910q72615J872613L477113L068310J938428J442065J329408O70988
$$ plain form
39177 -294527 -796050 -1475896 -3440240 -7468412 -12289163 -14606461 -12918512 -9867122 -8584507
39168 -8584507 -8534492 -7766157 -7308944 -9466609 -12848164 -13329457 -10041290 -6793133 -7014587
39159 -7014587 -10235762 -14069249 -16947855 -18147718 -17201522 -14003689 -8468559 -764469
39151 -764469 6755811 9678984 6380545 1295259 -71921 1743480 1932096 -702828
39143 -702828 -2509539 -1717376 -1092195 -2319804 -2577806 571575 4612058 5541912 3333685
39134 3333685 1102061 836371 2477397 5441485 8542336 9763411 8403557 6368843
39126 6368843 5399611 4283203 1003528 -3407948 -5723951 -4964953 -3699844 -4482782 -6664910
39117 -6664910 -7537525 -5664912 -2187799 880511 2818939 4261004 5590412 6261400
39109F261400l96788j090159j519227k015635j409643J420055M182360K616844
39101H049207l463600q583164q000686l269095O24094J442547P75688P70091K111679
39092i543239M112364N166701M168488K189578J036464J0737k916393o286129
39084b061429n590913q867N462219O586728M429463J414278k031454m267715j879327
39075B052983L611137M589362j764558p532772n582025q19899j389488m259601
39067a1094861o69922P479053R311746K682093k418985m14682J862733j600046
39059E137129n476670k819220K912806L669979o83789l487378j787278J047391
39051a487030J655548K90649j156376r67596J783109N770294P717629O029493
$$ plain form
39109 6261400 5864612 4774453 3255226 1239591 -170052 1250003 5432363 8049207
39101 8049207 4585607 -3997557 -11998243 -15267338 -14643244 -13200697 -12425009 -11654918 -9543239
39092 -9543239 -5430875 -264174 3904314 6093892 7130356 7141093 4224700 -2061429
39084 -2061429 -7652342 -7661209 -2198990 4387738 8817201 10231479 8200025 3932310 2052983
39075 2052983 5664120 10253482 8488924 956152 -4625873 -5445772 -6835260 -11094861
39067 -11094861 -11764783 -4285730 5026016 7708109 5289124 4874442 6737175 5137129
39059 5137129 -339541 -3158761 -245955 3424024 2740235 -747143 -2534421 -1487030
39051 -1487030 168518 459167 -697209 -1664805 118304 5888598 13606227 19635720
39043A9635720K509689o79876l083219l798137j100545L463047M463386n98372
39035B0811693o893868q116013m206739P5119J899512J993791J280849k97682
39027F546662k143998k960376k176045l3296K742925M385863L075893k16441j981997
39018G239190o95161J180096J168685J43906j86615n24648k276472m588912n378547
39009c918478l945337j151194J381829J535647j410405m508277l847246k49712
39001a6113173J467201j82946j328024M34317K337922K040506J618506K720791
38993g004900K997849J233220P15970K992426L750584L22925k342496J41691K908185
38984E715454m09461n739217m184884L175654O694404L580017J169112L558070
$$ plain form
39043 19635720 22145409 21465533 18382314 14584177 13483632 16946679 21410065 20811693
39035 20811693 13917825 5801812 1595073 1670192 3569704 5563495 6844344 6546662
39027 6546662 4402664 1442288 -733757 -767053 1975872 6361735 9437628 9221187 7239190
39018 7239190 6544029 7724125 8892810 9036716 8850101 8325453 6048981 1460069 -3918478
39009 -3918478 -7863815 -9015009 -7633180 -6097533 -7507938 -12016215 -15863461 -16113173
39001 -16113173 -14645972 -14828918 -16156942 -15722625 -13384703 -11344197 -9725691 -7004900
38993 -7004900 -4007051 -2773831 -2057861 934565 4685149 5008074 2665578 2807269 5715454
38984 5715454 5305993 -433224 -4618108 -1442454 5251950 8831967 10001079 13559149
38976A3559149N364492K124867k221364k910172j910095k699957l642861k044197
38968E619862N3919m54525k049913j583014J44089M60403j90868J76798Q90626
38959C067377M10184K58325K504209M799974K905455k195664m517715j320735
38951E911410K910712K693943j145718l171215j078062J332150k08005m049519
38943C195696m588360l03043L600002K466029r22111n05458L765192N726011K112557
38934A4546515l119141n075506l993684k510452q71044J541245K787134O71839
38926C976906k940938l945699j694123L22018m65754k689978l590936k373916
38918a3402420j42463K024541L797575M912199M623948K285425j384846m075594
$$ plain form
38976 13559149 18923641 21048508 18827144 15916972 14006877 11306920 7664059 5619862
38968 5619862 5673781 5219256 3169343 1586329 1730418 2190821 1999953 2176751 3067377
38959 3067377 3477561 3735886 6240095 11040069 13945524 11749860 7232145 5911410
38951 5911410 8822122 11516065 10370347 7199132 6121070 7453220 7245215 3195696
38943 3195696 -1392664 -1695707 1904295 4370324 3448213 2942755 6707947 12433958 14546515
38934 14546515 11427374 6351868 2358184 -152268 -1023312 517933 3305067 3976906
38926 3976906 1035968 -2909731 -4603854 -4281836 -4747590 -7437568 -11028504 -13402420
38918 -13402420 -13544883 -11520342 -7722767 -2810568 1813380 4098805 2713959 -1361635
38910a361635l799374j072037J597690K360426J372357j50321r78177k84748J448919
38901h66900K206694Q50530o65405K00557K228544J755334j349336k778755k77025
38892A304238K741962K558218O89928N06467J003110j377237n824336p009409
38884e407059k631061K905371M247082J720180k10457N86242J751168N38557k355615
38875A144408m189246l988380l179772k729229j676340O59454K748225K771815
38867h439065J379700O45822J017403J311139J121786R11556J49400j881767l462631
38858g246657j752891K599013N234111L737963P69554l0961J209510J791792M33006
38849F744440j688265k461344m98723K968126L663714j146668p080698o094008
$$ plain form
38910 -1361635 -5161009 -6233046 -4635356 -2274930 -902573 -1052894 -2031071 -2315819 -866900
38901 -866900 1339794 2190324 1524919 1725476 3954020 5709354 4360018 1581263 1304238
38892 1304238 4046200 6604418 7294346 7800813 8803923 7426686 1602350 -5407059
38884 -5407059 -8038120 -5132749 -885667 834513 624056 1210298 2961466 3500023 1144408
38875 1144408 -3044838 -7033218 -10212990 -12942219 -14618559 -13959105 -11210880 -8439065
38867 -8439065 -7059365 -6413543 -5396140 -4085001 -2963215 -2051659 -1902259 -3784026 -7246657
38858 -7246657 -8999548 -6400535 -1166424 2571539 3341093 3310132 4519642 6311434 6744440
38849 6744440 5056175 2594831 2096108 5064234 8727948 7581280 500582 -5593426
38841e593426K442623R023487O220197q85368k127216L121973N909848J419569
38833A9531687m641574n087291o66464K827846K712421R10050l78309j016752
38825A4191614j683273k562821l181189k645493p36648P82011o18443m746677
38817a200919p830452o543766j916060K261794M159545N094769O041511N317039
38809E383461J437053l090187l704210j1187K790909O88803l352987l631487L792
38800c486040K656544K618113L390715O085548N841279l83599p351164q053677
38792A317719l302467O61097J509020J710142J813918l10145l591168l734578
38784c926462l45980J757654J47422j792251j350786j004477l095739m760265
$$ plain form
38841 -5593426 -3150803 5872684 12092881 11207513 9080297 12202270 18112118 19531687
38833 19531687 14890113 9802822 9136358 11964204 14676625 15586675 15208366 14191614
38825 14191614 12508341 9945520 6764331 4118838 3382190 4164201 3545758 -1200919
38817 -1200919 -9031371 -15575137 -17491197 -15229403 -11069858 -5975089 66422 5383461
38809 5383461 6820514 3730327 26117 14930 2805839 3494642 141655 -3489832 -3486040
38800 -3486040 -829496 1788617 5179332 11264880 17106159 16722560 9371396 1317719
38792 1317719 -1984748 -1323651 185369 1895511 3709429 3399284 -191884 -3926462
38784 -3926462 -4272442 -2514788 -2367366 -4159617 -5510403 -6514880 -9610619 -14370884
38776a4370884k471302J865803L852056L100436K399770K240352P40392j787060
38768d430437k511328n75986J521417J732787J018722J282918K696399L904306
38760D638798L643334J695315q15196j938451o24350J983395L665580L424803
38752A5673228K034414N46639r56907k956367n117904n691756l137408J090184
38744A484123K718920m86836m953158n132541q63530K472654J667763l52066N2456
38735c392215J846025K313697J980067K576797K711677J83536k997038k825109
38727B397437Q4210J027179j412010l350091k023929L80411J119776Q33204O31441
38718c12372o91788l157981k896740K511873Q352745P669955J024744l886429
$$ plain form
38776 -14370884 -16842186 -14976383 -11124327 -8023891 -5624121 -3383769 -2643377 -4430437
38768 -4430437 -6941765 -7517751 -5996334 -4263547 -3244825 -1961907 734492 4638798
38760 4638798 8282132 9977447 9162251 7223800 6599450 8582845 12248425 15673228
38752 15673228 17707642 18254281 17297374 14341007 9223103 3531347 393939 1484123
38744 1484123 4203043 3716207 -1236951 -6369492 -7233022 -4760368 -3092605 -3444671 -3392215
38735 -3392215 -1546190 767507 2747574 5324371 8036048 8219584 5222546 2397437
38727 2397437 2481647 3508826 2096816 -1253275 -3277204 -2896793 -1777017 -943813 -312372
38718 -312372 -1004160 -4162141 -7058881 -4547008 3805737 11475692 12500436 8614007
38710H614007k790183K36049K32435j329215n07637J636795Q56473k683455m266274
38701a005k234615l22744q26494o92686K368608M511612J447531l682257m178767
38692c610817n4562K109560l00077k388617p15790R07118j379340m195182k588093
38683a2215800J109246R36954k379231k157132L247982P269806M914035k52603
38675D73257k184923q23124l35516j953714l052736k077635m07211O55811J676262
38666h029529L176661M006112K665332o33400l895503n084208l820087j506582
38658a3121204K00637Q13909O82475j6254r54859r94210N23784K095826J591435
38649i178461m55186j160964P27042L307684M499539M212001K896309O86166r35015
$$ plain form
38710 8614007 5823824 6059873 6292308 4963093 4455456 6092251 6948724 4265269 -1005
38701 -1005 -2235620 -2558364 -3384858 -4077544 -1708936 2802676 4250207 567950 -3610817
38692 -3610817 -3665379 -1555819 -1855896 -4244513 -4960303 -4053185 -5432525 -9627707 -12215800
38683 -12215800 -11106554 -10169600 -12548831 -14705963 -11457981 -4188175 725860 473257
38675 473257 -1711666 -2534790 -2870306 -4824020 -7876756 -9954391 -10361602 -9705791 -8029529
38666 -8029529 -4852868 -846756 1818576 1185176 -2710327 -7794535 -11614622 -13121204
38658 -13121204 -12920567 -12106658 -11424183 -11440437 -12395296 -13389506 -12865722 -10769896 -9178461
38649 -9178461 -9633647 -10794611 -10067569 -6759885 -2260346 1951655 4847964 5534130 4599115
38640D599115K22527K979991K833160j254707l844420r56917K444947r66718q725845
38631b668867j0574831l341259L914227L030321j751627j243047M524347P187355
38623i23381L313857j117986p28761J593274N58221k927981l911207j397881R92618
38614d549227J528054K442786M697197N234679J878172k495485l989315l450666
38606A296195m162623n233878k341760M441769Q607221N443169j576647n931057
38598E42389o428171o299386o273815l868435Q83617M221927M224075L209751
38590i788048L042355K154299m85934k273436j025515Q47136j04337k744935l094644
38581a3473059l29608K715943M221142M762372M304145J706124k095893l803699
$$ plain form
38640 4599115 4821642 7801633 10634793 9380086 5535666 4578749 7023696 6056978 -2668867
38631 -2668867 -13243698 -16584957 -12670730 -9640409 -11392036 -12635083 -8110736 -923381
38623 -923381 2390476 1272490 543729 2137003 2695224 -232757 -4143964 -5541845 -4549227
38614 -4549227 -3021173 -578387 4118810 9353489 11231661 8736176 4746861 1296195
38606 1296195 -2866428 -8100306 -10442066 -6000297 2606924 8050093 6473446 542389
38598 542389 -5885782 -12185168 -18458983 -22327418 -21443801 -17221874 -12997799 -9788048
38590 -9788048 -6745693 -4591394 -5077328 -7350764 -8376279 -7529143 -7633480 -10378415 -13473059
38581 -13473059 -13802667 -11086724 -6865582 -2103210 2200935 3907059 1811166 -1992533
38573a992533j934802J220769K907667K885704K066606N38562j469691k447092
38565A775190j192724J361825L054642K534681O736k907810l794267j526447J770323
38556A082149K539698K26463j908593j207231J088690K099815J031928p69429
38548D183490j910164j678462j25438J257453M67327k019242k868784k03466L313273
38539D15987L688343N59010l090860m944208m887035l523454j475386K75766J122220
38530a1859617J440415J389151M92341l30604J285809M875481N607645Q10831
38522C711452m302658k592898M376400P535213K686656m142067n694792k439173
38514h61867P11689J998285K650330K277718m82557l945074m474383j597414J350466
$$ plain form
38573 -1992533 -3927335 -2706566 201101 3086805 5153411 5691973 4222282 1775190
38565 1775190 582466 1944291 4998933 7533614 7540350 4632540 838273 -688174 1082149
38556 1082149 3621847 3848310 1939717 732486 1821176 3920991 4952919 4183490
38548 4183490 2273326 594864 469426 1726879 2194206 174964 -2693820 -2897286 415987
38539 415987 4104330 4663340 1572480 -3371728 -8258763 -11782217 -13257603 -12981837 -11859617
38530 -11859617 -10419202 -9030051 -8537710 -8868314 -7582505 -2707024 2900621 3711452
38522 3711452 -591206 -3184104 1192296 8727509 11414165 7272098 1577306 -861867
38514 -861867 -150178 1848107 4498437 6776155 6293598 2348524 -2125859 -3723273 -2372807
38505b372807J947388J285367J349536K063214J856511l1921k387810k815056
38497H94422k23495L065413L172851k29572k588376m48501L052422K134319k992494
38488E836989n742459k350935K588720K450686k304690m998801j843104L419052
38480b944542M862942J783890j245102o35315K132212L148230J228870j080789
38472G250396j346696m38122r14317l082171m230656k138373J817308M091897
38464A009266L120223Q81527P6112Q06820J019007k70578j463556m12511K798115
38455G564425N515063M701743l05814o546077r347806o764581j935955M54513
38447f664489k23652p13720M94334J143051n386k61243K317870M748428L502065
$$ plain form
38505 -2372807 -425419 859948 2209484 4272698 6129209 6097288 3709478 894422
38497 894422 670927 3736340 6909191 6679619 4091243 3642742 6695164 8829483 5836989
38488 5836989 94530 -2256405 332315 2783001 478311 -4520490 -6363594 -2944542
38480 -2944542 1918400 3702290 2457188 1821873 3954085 7102315 8331185 7250396
38472 7250396 5903700 5465578 4551261 1469090 -2761566 -4899939 -3082631 1009266
38464 1009266 4129489 5011016 5087128 5893948 6912955 6642377 5178821 4766310 7564425
38455 7564425 13079488 17781231 17475417 10929340 1581534 -5183047 -7119002 -6664489
38447 -6664489 -6888141 -7601861 -7107527 -5964476 -5969862 -6231105 -3913235 835193 4337258
38438D337258L68463o34047o8734j460049m236122m316667j456627K51232k43503
38429g458796M41696K788148K554122j136975k816563L66864L328276J655345
38421b77883p60693J057350M012739K596512q79044m52766K245239O15053m346709
38412C809798m328467K314753O556479K085293n375090o833753j952637K837859
38404h85765L564079J152860k077936l978359k884260J54109J444126m12135k072951
38395e996232n56557J949526J569212j263799k801488j522758N63346J372934
38387f685816Q89389K99271P91395K606237M129850L128319p2086k275600j466866
38378A344093O55941J455329O45289o17239j834542k734099k670655j966290j899620
$$ plain form
38438 4337258 4705721 4071674 4002940 2542891 -1693231 -6009898 -7466525 -7215293 -7458796
38429 -7458796 -7017100 -4228952 -1674830 -2811805 -5628368 -5261504 -1933228 -277883
38421 -277883 -1038576 18774 4031513 6628025 5748981 5296215 7541454 8156507 3809798
38412 3809798 -518669 1796084 8352563 10437856 5062766 -1770987 -3723624 -885765
38404 -885765 2678314 3831174 1753238 -2225121 -5109381 -4955272 -3511146 -3923281 -5996232
38395 -5996232 -6552789 -4603263 -3034051 -4297850 -7099338 -8622096 -8058750 -6685816
38387 -6685816 -5796427 -5497156 -4705761 -2099524 2030326 5158645 5086559 2810959 1344093
38378 1344093 2000034 3455363 4100652 3483413 1648871 -1085228 -3755883 -5722173 -7621793
38369g621793k168297q10496K071116L490594K180287P36909J023003J013700
38361h4977q80421k012610Q3987K573894J172603l015118n042719l054843M74315
38352i785889L129727M176083K999201j10088k587108k523777j632885j988293
38344h323029k081917j99367J056906j075800l458481j567163K126530J901516
38336a1620805n76504J549567P370185P617061l39568o893964m527132J273616
38328f147544K055323m68952L80210L916982M324681J541810O17252K092442J849675
38319A0161879j80738K53535K875516K115017k974589n774832k265904K534177
38311F744061K481384p67273j678972K35114P50574j933241n182798o294682n093903
$$ plain form
38369 -7621793 -9790090 -10600586 -8529470 -5038876 -2858589 -2121680 -1098677 -84977
38361 -84977 -965398 -2978008 -2894021 -320127 852476 -2162642 -7205361 -10260204 -9785889
38352 -9785889 -6656162 -2480079 519122 409034 -2178074 -4701851 -6334736 -8323029
38344 -8323029 -10404946 -10604313 -9547407 -10623207 -14081688 -15648851 -13522321 -11620805
38336 -11620805 -12197309 -10647742 -3277557 4339504 3999936 -2894028 -7421160 -6147544
38328 -6147544 -4092221 -4561173 -4180963 -263981 4060700 5602510 6219762 8312204 10161879
38319 10161879 9981141 10234676 13110192 15225209 12250620 6475788 4209884 6744061
38311 6744061 9225445 8458172 6779200 7014314 7764888 5831647 648849 -5645833 -10739736
38302a0739736k350789J366142M892376O582241N787325L396637J066707K49161
38294A0250064R62836J063214j658940n814833o912130l072936J792238K794412
38286e96075L23766j361743n78221K72289n01677j196540l7967J615167J340248
38277g20753p21171k196341j639665J00392J259724Q59857p06278k087596k183399
38268h035230j239930l27710K35294R45940J542909J022943r968J106013N421197
38259F61458R596790R134906L852921k107339n393371n992274m688307j340275
38251C724509K856532M429397J659917k313188l331523j905694j887378m171270
38243i38698n452435l682669j031807J39288R32473L039835M886745L991972J580047
$$ plain form
38302 -10739736 -13090525 -11724383 -6832007 -249766 5537559 8934196 10000903 10250064
38294 10250064 11212900 12276114 10617174 4802341 -2109789 -5182725 -3390487 -596075
38286 -596075 -272309 -1634052 -2212273 -1939984 -2441661 -3638201 -3676168 -2061001 -720753
38277 -720753 -1441924 -3638265 -5277930 -5177538 -3917814 -3057957 -3764235 -5851831 -8035230
38268 -8035230 -9275160 -9602870 -9367576 -8421636 -6878727 -5855784 -5865752 -4759739 661458
38259 661458 10258248 19393154 23246075 21138736 15745365 9753091 5064784 3724509
38251 3724509 6581041 11010438 12670355 10357167 7025644 5119950 3232572 -938698
38243 -938698 -6391133 -10073802 -11105609 -10966321 -10033848 -6994013 -2107268 1884704 3464751
38234C464751J128410K837032L276972R78928j263127j125107n54977k338082
38226F404800n174175n369850k393899M52378R21505N34725J591361L712369M741839
38217E421053L698988J513167l08301p09399L91597J565667O59583k581396n169240
38208D481719l646702J649387O236170N871980P75139m705348o189625l047072
38200A425648J341150K886751N96073k906172m560932l862973k272119p41442
38192h094016P74419J845475J433483l01243j439068m43247J828493K971912J604532
38183A80740j208356k842280j534826J586266L216556J442997j792986k995946
38175c947835j492419K26154M78225M67032J634189L121602L352989K503151J711661
$$ plain form
38234 3464751 4593161 7430193 10707165 11686093 10422966 9297859 8742882 6404800
38226 6404800 1230625 -4139225 -6533124 -6080746 -5159241 -4624516 -3033155 679214 5421053
38217 5421053 9120041 10633208 10324907 9615508 10007105 11572772 12232355 9650959 4481719
38208 4481719 835017 2484404 8720574 14592554 15367693 10662345 4472720 1425648
38200 1425648 2766798 5653549 6249622 3343450 -1217482 -5080455 -7352574 -8094016
38192 -8094016 -7319597 -5474122 -4040639 -4341882 -5780950 -6224197 -4395704 -1423792 180740
38183 180740 -1027616 -3869896 -5404722 -3818456 -601900 841097 -951889 -3947835
38175 -3947835 -5440254 -5214100 -4735875 -4268843 -2634654 486948 3839937 6343088 8054749
38166H054749J088294J96429n45846p35174j344674l231818m854741l611372M72322
38157d511831M129557M312412J168348k535768m035533k710684m73868J27003
38149d530364j259391k497666k067017j106284j098518j044171Q69336L738122
38141h995953M667810K818652L30712r45658j431496k083215k614878k201936
38133a0455962p37048R41693J247565j106049m832932n864045j746123M359345
38125a8193556O795900M327660J084331O05476K120617L204811K794912O14372
38117C354523l051131n571991l286804L294060Q378935P382523K377150j103598
38109A1773667o98157J511199K544495J168861j614395l116500j534054R90719
$$ plain form
38166 8054749 9143043 9339472 8793626 8058452 6713778 3481960 -1372781 -4984153 -4511831
38157 -4511831 -382274 3930138 5098486 2562718 -1472815 -4183499 -4657367 -4530364
38149 -4530364 -5789755 -8287421 -10354438 -11460722 -12559240 -13603411 -12734075 -8995953
38141 -8995953 -4328143 -1509491 -1178779 -2124437 -3555933 -5639148 -8254026 -10455962
38133 -10455962 -11193010 -10251317 -9003752 -10109801 -14942733 -20806778 -22552901 -18193556
38125 -18193556 -11397656 -7069996 -5985665 -5380189 -3259572 -54761 2740151 3354523
38117 3354523 303392 -5268599 -8555403 -5261343 3117592 10500115 12877265 11773667
38109 11773667 11075510 12586709 15131204 16300065 14685670 11569170 10035116 11025835
38101A1025835K95759l623147n702237l159415O4656l96380k225860m30963M049004
38092a02748N378022J620724k815638l821305k077276r9068J208841J764728J227156
38083B283436K1848p64753j162416k040029l095786l265219k675016j815472K27811
38074a2285596L630701N191295K034543k811429l511677m1109J844292L489r91363
38065f936854J586256L379718M96175l167480j907251K252068K533554j886677
38057c650491m637183j735472L163148M595452K164062n76224j299734o42140
38049b618582j37604l39903q00065j020905j176536j722348k340586k033745n72553
38040a2762827J101982K323536L297965L709564K411760l61060k095212q89530
$$ plain form
38101 11025835 11321594 7698447 1996210 -1163205 -1098549 -1494929 -3720789 -4151752 -102748
38092 -102748 5275274 6895998 4080360 259055 -1818221 -1917289 -708448 1056280 2283436
38083 2283436 2305284 1540531 378115 -1661914 -4757700 -8022919 -10697935 -12513407 -12285596
38074 -12285596 -8654895 -3463600 -1429057 -4240486 -7752163 -7793272 -5948980 -5945491 -6936854
38065 -6936854 -5350598 -1970880 -1474705 -4642185 -6549436 -4297368 -1763814 -3650491
38057 -3650491 -8287674 -10023146 -6859998 -2264546 -100484 -676708 -1976442 -2618582
38049 -2618582 -2756186 -3096089 -3896154 -4917059 -6093595 -7815943 -10156529 -12190274 -12762827
38040 -12762827 -11660845 -9337309 -6039344 -2329780 81980 -279080 -2374292 -3263822
38032c263822J959985L726086L391385J590423j131472m094528n680971m859683
38024h362597k842004j464793o88364N50905J840345J676805j4214j458146j000057
38015a1762120J508955M628726N849406L571424l43547j814790J85597J827960
38007C651611j911k853703k578778J87959J500811O19323M07919J642005J698120
37998D273356l53916j672527k05542K076519K233592J03367k311875l045734j047320
37989D9920K775230M962192K700757j887789l619774r39492K476936L332104K168406
37980A2018490L72648j951163l515126j823222J903754K227081k856339p939458
37972a563335p682693m198457k380870j785061R18647M304495L943679N64734
$$ plain form
38032 -3263822 -1303837 2422249 5813634 7404057 6272585 2178057 -3502914 -8362597
38024 -8362597 -11204601 -12669394 -13357758 -12806853 -10966508 -9289703 -9303917 -10762063 -11762120
38015 -11762120 -10253165 -5624439 224967 3796391 3452844 1638054 1823651 3651611
38007 3651611 3649700 795997 -1782781 -1594822 -94011 525312 933231 2575236 4273356
37998 4273356 3919440 2246913 2041371 4117890 6351482 6454849 4142974 1097240 49920
37989 49920 2825150 7787342 10488099 8600310 4980536 4041044 6517980 9850084 12018490
37980 12018490 12391138 10439975 6924849 5101627 7005381 9232462 6376123 -1563335
37972 -1563335 -9246028 -13444485 -15825355 -17610416 -16691769 -12387274 -8443595 -7878861
37964g878861n09908J801474K778789L44956j423088L64147K462726J443230l78235
37955i94770N97497K623407J461819k478612m921709m490498l748278l517138
37947a5468282j095471M150202P426329M132058k938189n671702m20830O936436
37939b949449P676009Q08924n708663m919227O81293L094316l78900m097203k314057
37930h106957L256026O443858M772220J435966P2360O90535J197613N42531q06094
37921I498058k072522k675644k263367j170360m16328n67546r89570r17910q79748
37912b454937k003959l853667m196006j816532J294536K030891K62617q55054
37904a1592111P87579L265846L267472N57397j918836j848558K33295K399846
$$ plain form
37964 -7878861 -8388769 -6587295 -3808506 -3463550 -4886638 -4522491 -2059765 -616535 -994770
37955 -994770 -397273 2226134 3687953 1209341 -3712368 -8202866 -11951144 -15468282
37947 -15468282 -16563753 -12413551 -4987222 -855164 -3793353 -9465055 -9885885 -2949449
37939 -2949449 4726560 5535484 -173179 -5092406 -4411113 -1316797 -1695697 -5792900 -8106957
37930 -8106957 -4850931 1592927 6365147 7801113 7873473 8564008 9761621 10304152 9498058
37921 9498058 7425536 4749892 2486525 1316165 899837 332291 -657279 -1575189 -2454937
37912 -2454937 -4458896 -8312563 -12508569 -14325101 -13030565 -10999674 -10737057 -11592111
37904 -11592111 -10804532 -7538686 -4271214 -3713817 -5632653 -7481211 -7247916 -4848070
37896d848070L395394L026920J813990O64978J20716j19048l00902J83589J649515
37887E587082K897971K629149J401305M62510n31052k361781l630939k319581
37879D134664L21232Q88586r29236j966727j079336p43804j754706j122830K035900
37870b16257L312618j74849l968050k578713J635913K166778j105156k064092
37862b991808J272702L618403J142250k900860l952227k476133j273564n68234
37854h129471O53406J420764M02368j265991j625336p27314L50794J476833K460702
37845d983245K129237M66714l54817R29587K724260L578726M386335N222072L208060
37836A7306929k942959q961453r756316o123103k547709l47532K012801L366286
$$ plain form
37896 -4848070 -1452676 1574244 3388234 4053212 4173928 4054880 3753978 3937567 5587082
37887 5587082 8485053 11114202 12515507 12978017 12446965 10085184 6454245 4134664
37879 4134664 4455896 5344482 4415246 2448519 1369183 625379 -1129327 -2252157 -216257
37870 -216257 3096361 2921512 -1046538 -3625251 -1989338 177440 -927716 -2991808
37862 -2991808 -1719106 1899297 3041547 140687 -3811540 -6287673 -7561237 -8129471
37854 -8129471 -7476065 -6055301 -5652933 -6918924 -8544260 -9271574 -8920780 -7443947 -4983245
37845 -4983245 -2854008 -2387294 -2742111 -1812524 911736 4490462 8876797 14098869 17306929
37836 17306929 14363970 5402517 -4353799 -10476902 -13024611 -13372143 -11359342 -7993056
37828g993056P82248l899257m708322k74064L708507L161699J453827K905907
37820d862511N125393K987350k581761n535023l592468q62323q51391j557751
37812a1730485K17799L205707L806716K146408J988674M362346N063895P64725
37804I825785n071712o119366k080075P82334j144776l636596j478952L367609
37796e555749M968419K389846R2069J47720k49100k650255m069382k114524R07855
37787f133101J926272J676975K132011K239548l5958l281626m018437j730910
37779g225226O41257R13883k34576j177411j109393P0318J792882K725007K061788
37770a541471P47656K67010O80957R69876O91778J75314k98269n75433o53468
$$ plain form
37828 -7993056 -7210808 -11110065 -15818387 -16092451 -12383944 -9222245 -7768418 -4862511
37820 -4862511 262882 3250232 668471 -4866552 -8459020 -9321343 -10172734 -11730485
37812 -11730485 -11512686 -8306979 -4500263 -2353855 -365181 3997165 9061060 9825785
37804 9825785 4754073 -1365293 -3445368 -2663034 -3807810 -7444406 -8923358 -5555749
37796 -5555749 -587330 1802516 1894585 2042305 1793205 -857050 -4926432 -7040956 -6133101
37787 -6133101 -4206829 -2529854 -397843 1841705 1805747 -1475879 -5494316 -7225226
37779 -7225226 -6583969 -5670086 -5904662 -7082073 -8191466 -8121148 -6328266 -3603259 -1541471
37770 -1541471 -793815 -526805 154152 1124028 1815806 1991120 1692851 1117418 463950
37761D63950j163557k501740l097873q39969K882805L634722L41355k147542n1442
37752b479291K992367J062681m823792p941595n352341p61577K174682M024234
37744a1104632N874288O270527L977811L17321k950785n116933n045220j891459
37736i669082J710286J518369j599443j555097L695184P621686M003663l608577
37728B116989o473437k208249L494719N311180L291905j68139l400941m662217
37720b698190k312410K485023N725186M631939M22455l383742m154668j846030
37712a130437J075759J826835O34909P27003L443669N289750K564972k826982
37704A1605478n786603n008635l486733k841031j867797p12688j291979k547398
$$ plain form
37761 463950 -699607 -3201347 -6299220 -7139189 -4256384 -621662 -280307 -2427849 -2479291
37752 -2479291 513076 1575757 -3248035 -11189630 -16541971 -17303548 -15128866 -11104632
37744 -11104632 -5230344 1040183 5017994 5335315 2384530 -2732403 -7777623 -9669082
37736 -9669082 -7958796 -6440427 -8039870 -9594967 -5899783 1721903 5725566 2116989
37728 2116989 -4356448 -6564697 -3069978 2241202 5533107 5364968 1964027 -2698190
37720 -2698190 -5010600 -2525577 3199609 7831548 8254003 4870261 715593 -1130437
37712 -1130437 -54678 1772157 2407066 3134069 6577738 11867488 14432460 11605478
37704 11605478 5818875 810240 -2676493 -5517524 -7385321 -8098009 -9389988 -11937386
37696a1937386n78209M453044O713894L072830j714086k220233m18213j350009
37688c978368m170142l875421k20817J861047P45253M47639K903533M003928O13688
37679a669660l319658k217957K614803M839001K076849j666190k618750j912285
37671c873847k117591k593770j149119J454059J974434k80710j743042O07211
37663g722375M512744M923664Q32618k955935j913226K426211M791362L075551
37655G970614K37085o44634l66430j237701k734440j951310J900080N486625M836414
37646A3496303J19090m167595m198768j304578j54493k386379m120178j448944
37638d165542L515244N303200K960520J003733J838589K051638j088873l998987
$$ plain form
37696 -11937386 -12515595 -8062551 -1348657 1724173 10087 -2210146 -2628359 -3978368
37688 -3978368 -8148510 -12023931 -12244748 -10383701 -9638448 -9190809 -6287276 -2283348 -1669660
37679 -1669660 -4989318 -7207275 -4592472 246529 2323378 657188 -1961562 -3873847
37671 -3873847 -5991438 -8585208 -9734327 -8280268 -6305834 -6586544 -8329586 -7722375
37663 -7722375 -3209631 1714033 2546651 -409284 -2322510 103701 4895063 7970614
37655 7970614 8207699 7563065 7196635 5958934 3224494 1273184 3173264 8659889 13496303
37646 13496303 13615393 9447798 5249030 3944452 3789959 1403580 -2716598 -4165542
37638 -4165542 -650298 4652902 7613422 8617155 10455744 12507382 11418509 7419522
37630G419522k310100J294997Q79637k765481k971709J617408M111878L22574
37622G598726m248414l214072N73522L68614k872852k340988K465601L947410
37614B277547j540927p295978n855995N09082L904543J850070j173913j483400
37606h808971k31432M01499P34808J868685L099189K698272J81145k945641m128430
37597g130876j764220K670971N052442K779173j793997l879499k033758O72017
37589e427747J379392Q14438Q98637J363904P95652m06146n30879M00146L19368
37580c93235j771133m046206m011603j345100K161563M629591N203176L879467
37572D306520J476401l83534m25355Q79857J920701K115166K368843K909619K095252
$$ plain form
37630 7419522 5109422 6404419 7284056 4518575 1546866 3164274 7276152 7598726
37622 7598726 3350312 136240 709762 1078376 -1794476 -4135464 -1669863 2277547
37614 2277547 736620 -6559358 -12415353 -11906271 -8001728 -6151658 -7325571 -8808971
37606 -8808971 -9040403 -8638904 -7904096 -6035411 -2936222 -237950 -56805 -3002446 -7130876
37597 -7130876 -8895096 -6224125 -1171683 1607490 -186507 -4066006 -6099764 -5427747
37589 -5427747 -4048355 -3233917 -2335280 -971376 -175724 -581870 -1112749 -712603 -393235
37580 -393235 -2164368 -6210574 -10222177 -11567277 -9405714 -4776123 427053 4306520
37572 4306520 5782921 5399387 4974032 5853889 7774590 9889756 12258599 15168218 17263470
37563A7263470j225842n042642n771381k606587J222515J973188q65743m553005
37555C93973n754145l116023J542808M370351L107898k23179j720904o63468P3813
37546a988876r50220j400304M43972K057275N27131k215091j973275J019513K264150
37537b215725p2915k507873j624738J438173L607819M026701L476826K026334
$$ plain form
37563 17263470 16037628 10994986 5223605 2617018 3839533 5812721 4946978 393973
37555 393973 -5360172 -8476195 -6933387 -2563036 544862 321683 -1399221 -2062689 -1988876
37546 -1988876 -2939096 -4339400 -3895428 -1838153 -1311022 -3526113 -5499388 -4479875 -2215725
37537 -2215725 -2288640 -4796513 -6421251 -4983078 -1375259 2651442 6128268 8154602
$$ [...]
##END NTUPLES=NMR SPECTRUM
##END=
