##TITLE=31Pdec_DE-77Fk_TFAd6O
 DMSO-d6, 64 sc
 27.11.2024
##JCAMPDX= 6.0         $$ Bruker NMR JCAMP-DX V2.0
##DATA TYPE= NMR SPECTRUM
##DATA CLASS= NTUPLES
##ORIGIN= UXNMR, Bruker Analytische Messtechnik GmbH
##OWNER= root
$$ XWIN-NMR		Version 3.5
$$ Wed Nov 27 16:18:11 2024 Russian Standard Time (UT+4h)  she@DPX200
##.OBSERVE FREQUENCY= 81.013821
##.OBSERVE NUCLEUS= ^31P
##.ACQUISITION MODE= SIMULTANEOUS
##.ACQUISITION SCHEME= undefined
##.AVERAGES= 64
##.DIGITISER RES= 17
##SPECTROMETER/DATA SYSTEM= spect
##.PULSE SEQUENCE= zgpg30
##.SOLVENT NAME= D2O
##.SHIFT REFERENCE= (INTERNAL, D2O, 0, 198.062)
##AUDIT TRAIL= $$ (NUMBER, WHEN, WHO, WHERE, WHAT)
$$ ##TITLE= Audit trail, XWIN-NMR		Version 3.5
$$ ##JCAMPDX= 5.01
$$ ##ORIGIN= Bruker BioSpin GmbH
$$ ##OWNER= she
$$ F:/spectra/data/she/nmr/P31/2/pdata/1/auditp.txt
$$ ##AUDIT TRAIL=  $$ (NUMBER, WHEN, WHO, WHERE, WHAT)
(   1,<2024-11-27 16:16:43.71 +0400>,<she>,<DPX200>,
      <created by zg, POWCHK disabled, PULCHK disabled
       configuration hash MD5:
       00 E9 B6 7A A2 85 ED C7 34 08 36 98 17 FE 4E 26
       data hash MD5: 32K
       16 D1 30 53 13 E8 E6 56 D8 0D 6F 82 BA AF 17 92>)
(   2,<2024-11-27 16:16:48.39 +0400>,<she>,<DPX200>,
      <Start of raw data processing
       efp BC_mod = 2 LB = 1.5 FT_mod = 6 PKNL = 1 PHC0 = 2256.171 PHC1 = 170.0883 SI = 64K 
       data hash MD5: 64K
       87 91 CF 06 C3 98 9A 7B C7 83 37 17 D6 26 7D 1E>)
(   3,<2024-11-27 16:17:15.84 +0400>,<she>,<DPX200>,
      <pk PHC0 = -32.36823 PHC1 = 31.80001 
       data hash MD5: 64K
       31 76 96 64 B6 C4 16 BD 2C A5 F0 36 B1 78 68 76>)
(   4,<2024-11-27 16:17:37.45 +0400>,<she>,<DPX200>,
      <pk PHC0 = -31.2814 PHC1 = 70.60001 
       data hash MD5: 64K
       2D EA 16 EC AB 4B E9 19 12 78 0C 64 62 4A C0 2D>)
$$ ##END=
$$ 
$$ hash MD5
$$ 0D 77 45 DE C5 79 13 A6 BF A3 7B 2D 0C B6 BB 5E
##$RELAX= 
##$RELAX= 
##$RELAX= 
##$RELAX= 
##$RELAX= 
##$RELAX= 
##$RELAX= 
##$RELAX= 
$$ Bruker specific parameters
$$ --------------------------
##$DU= <F:/spectra>
##$EXPNO= 2
##$NAME= <P31>
##$PROCNO= 1
##$TYPE= <nmr>
##$USER= <she>
##$AMP= (0..31)
100 100 100 100 100 100 100 100 100 100 100 100 100 100 100 100 100 100 
100 100 100 100 100 100 100 100 100 100 100 100 100 100 
##$AQSEQ= 0
##$AQ_mod= 1
##$AUNM= <au_zg>
##$AUTOPOS= <>
##$BF1= 81.014009
##$BF2= 200.13
##$BF3= 200.13
##$BF4= 200.13
##$BF5= 200.13
##$BF6= 200.13
##$BF7= 200.13
##$BF8= 200.13
##$BYTORDA= 1
##$CFDGTYP= 0
##$CFRGTYP= 5
##$CHEMSTR= <none>
##$CNST= (0..31)
1 1 145 1 1 1 1 1 1 1 1 1 1 1 1 1 1 1 1 1 1 1 1 1 1 1 1 1 1 1 1 1 
##$CPDPRG= <waltz16>
##$CPDPRG1= <>
##$CPDPRG2= <waltz16>
##$CPDPRG3= <>
##$CPDPRG4= <mlev>
##$CPDPRG5= <mlev>
##$CPDPRG6= <mlev>
##$CPDPRG7= <mlev>
##$CPDPRG8= <mlev>
##$CPDPRGB= <>
##$CPDPRGT= <>
##$D= (0..31)
0 1 0 0 0 0 0 0 0 0.06 0 0.03 2e-05 3e-06 0 0 0.0002 0 0 0 0 0 0 0 0 0 
0 0 0 0 0 0 
##$DATE= 1732709803
##$DBL= (0..7)
120 120 120 11 120 120 24 19 
##$DBP= (0..7)
150 150 150 150 150 150 150 150 
##$DBP07= 0
$$ [...]
##$SUBNAM2= <"">
##$SUBNAM3= <"">
##$SUBNAM4= <"">
##$SUBNAM5= <"">
##$SUBNAM6= <"">
##$SUBNAM7= <"">
##$SUBNAM8= <"">
##$SUBNAM9= <"">
##$SW= 400.765351723535
##$SWIBOX= (0..15)
0 1 3 0 0 0 0 0 0 0 0 0 0 0 0 0 
##$SW_h= 32467.5324675325
##$TD= 32768
##$TD0= 1
##$TE= 0
##$TE2= 300
##$TE3= 300
##$TEG= 300
##$TL= (0..7)
0 120 53 12 22 120 120 120 
##$TP= (0..7)
150 150 150 150 150 150 150 150 
##$TP07= 0
##$TPNAME0= <>
##$TPNAME1= <>
##$TPNAME2= <>
##$TPNAME3= <>
##$TPNAME4= <>
##$TPNAME5= <>
##$TPNAME6= <>
##$TPNAME7= <>
##$TPOAL= (0..7)
0.5 0.5 0.5 0.5 0.5 0.5 0.5 0.5 
##$TPOFFS= (0..7)
0 0 0 0 0 0 0 0 
##$TUNHIN= 0
##$TUNHOUT= 0
##$TUNXOUT= 0
##$USERA1= <user>
##$USERA2= <user>
##$USERA3= <user>
##$USERA4= <user>
##$USERA5= <user>
##$V9= 5
##$VALIST= <valist>
##$VCLIST= <CCCCCCCCCCCCCCC>
##$VD= 0
##$VDLIST= <DDDDDDDDDDDDDDD>
##$VPLIST= <PPPPPPPPPPPPPPP>
##$VTLIST= <TTTTTTTTTTTTTTT>
##$WBST= 1024
##$WBSW= 4
##$XGAIN= (0..3)
0 0 0 0 
##$XL= 0
##$YL= 0
##$YMAX_a= 10413
##$YMIN_a= -8966
##$ZGOPTNS= <>
##$ZL1= 120
##$ZL2= 120
##$ZL3= 120
##$ZL4= 120
##$ABSF1= 0
##$ABSF2= 0
##$ABSG= 0
##$ABSL= 0
##$ALPHA= 0
##$AQORDER= 0
##$ASSFAC= 0
##$ASSFACI= 0
##$ASSFACX= 0
##$ASSWID= 0
##$AUNMP= <proc_1d>
##$AZFE= 0.1
##$AZFW= 0.5
##$BCFW= 0
##$BC_mod= 2
##$BYTORDP= 0
##$COROFFS= 0
##$CY= -3
##$DATMOD= 1
##$DC= 0
##$DFILT= <>
##$DTYPP= 0
##$F1P= 0
##$F2P= 0
##$FCOR= 1
##$FTSIZE= 65536
##$FT_mod= 6
##$GAMMA= 0
##$GB= 0
##$INTBC= 1
##$INTSCL= 9.790993e-09
##$ISEN= 30
##$LB= 1.5
##$LEV0= 0
##$LPBIN= 0
##$MAXI= 10000
##$MC2= 0
##$MEAN= 0
##$ME_mod= 0
##$MI= 50
##$NCOEF= 0
##$NC_proc= -8
##$NLEV= 6
##$NOISF1= 182.463
##$NOISF2= 159.3651
##$NSP= 0
##$NTH_PI= 0
##$NZP= 0
##$OFFSET= 198.0616
##$PC= 4
##$PHC0= 2192.521
##$PHC1= 272.4883
##$PH_mod= 1
##$PKNL= yes
##$PPARMOD= 0
##$PSCAL= 0
##$PSIGN= 0
##$REVERSE= no
##$SF= 81.0140089999434
##$SI= 65536
##$SIGF1= 159.3651
##$SIGF2= -187.1042
##$SINO= 113.3802
##$SIOLD= 16384
##$SREGLST= <1H.CDCl3>
##$SSB= 0
##$STSI= 65536
##$STSR= 0
##$SW_p= 32467.5324675325
##$SYMM= 0
##$S_DEV= 0
##$TDeff= 32768
##$TDoff= 0
##$TI= <>
##$TILT= no
##$TM1= 0
##$TM2= 0
##$TOPLEV= 0
##$USERP1= <user>
##$USERP2= <user>
##$USERP3= <user>
##$USERP4= <user>
##$USERP5= <user>
##$WDW= 1
##$XDIM= 65536
##$YMAX_p= 353691017
##$YMIN_p= -77785533
$$ End of Bruker specific parameters
$$ ---------------------------------
##NTUPLES= NMR SPECTRUM
##VAR_NAME=  FREQUENCY,     SPECTRUM/REAL,   SPECTRUM/IMAG
##SYMBOL=    X,             R,               I
##VAR_TYPE=  INDEPENDENT,   DEPENDENT,       DEPENDENT
##VAR_FORM=  AFFN,          ASDF,            ASDF
##VAR_DIM=   65536,         65536,           65536
##UNITS=     HZ,            ARBITRARY UNITS, ARBITRARY UNITS
##FACTOR=    0.49542278885378, 1,            1
##FIRST=     16045.7642231865, 0,            0
##LAST=      -16421.768244346, 0,            0
##MIN=       -16421.768244346, -77785533,    0
##MAX=       16045.7642231865, 353691017,    0
$$ Real data points
##PAGE= N=1
##DATA TABLE= (X++(R..R)), XYDATA
$$ [...]
$$ plain form
42589 -2863601 -3186749 -2105207 101904 1442716 1576933 838953 -1406491 -4508916 -5143286
42580 -5143286 -1376613 3841355 6256593 5519196 3891011 1922965 -864158 -2614756
42572 -2614756 -710014 3748692 6654667 5909774 2687802 -1542697 -5628727 -6988853
42564 -6988853 -3655330 1526433 3006002 -56564 -2442219 -438264 3168764 3884717
42556 3884717 1712502 -423072 -1613309 -2781474 -3320368 -1565381 1861168 4109926
42548 4109926 3661128 1806919 489492 265038 527760 464519 -446273 -2123034 -4011132
42539 -4011132 -5834523 -7793280 -9708639 -10655604 -9880346 -7544178 -4510657 -2157417
42531 -2157417 -1936198 -3493927 -3592426 577798 6653179 8608766 4218540 -1922274 -4650110
$$ packed form
42589b863601l23148J081542K207111J340812J34217p37980k245444l102425o34370
42580e143286L766673N217968K415238p37397j628185j968046k787123j750598
42572b614756J904742M458706K905975p44893l221972m230499m086030j360126
42564f988853L333523N181763J479569l062566k385655K003955L607028P15953
42556C884717k172215k135574j190237j168165n38894J754987L426549K248758
42548D109926m48798j854209j317427k24454K62722o3241r10792j676761j888098
42539d011132j823391j958757j915359r46965P75258K336168L033521K353240
42531b157417K21219j557729r8499M170224O075381J955587m390226o140814k727836
$$ plain form
42522 -4650110 -4491620 -4902199 -5924885 -4509797 92827 5020421 7568013 7270816 4648398
42513 4648398 882209 -1558916 -1063419 454353 130307 -778995 1804527 7804090 11444128
42504 11444128 8656977 2666466 -466105 670146 2799988 3677058 4447471 6569046
42496 6569046 9073057 9685151 7510351 4163763 2509276 3868066 6236572 6201995 3022526
42487 3022526 -528328 -2078784 -2665582 -4315010 -6194581 -5584714 -2161444 1080132
42479 1080132 1537144 -177048 -1785031 -2328253 -2606879 -3358104 -3997735 -3297436 -1033171
42470 -1033171 1298978 1779662 149696 -1990028 -3335715 -4318622 -5548468 -5778339 -3185580
42461 -3185580 1300258 3756105 1385647 -4058717 -8037108 -7882198 -4701962 -1136459
$$ packed form
42522d650110J58490m10579j022686J415088M602624M927594K547592k97197k622418
42513D648398l766189k441125M95497J517772l24046r09302K583522N999563L640038
42504A1444128k787151n990511l132571J136251K129842Q77070P70413K121575
42496F569046K504011O12094k174800l346588j654487J358790K368506l4577l179469
42487C022526l550854j550456n86798j649428j879571O09867L423270L241576
42479A080132M57012j714192j607983n43222k78626p51225o39631P00299K264265
42470a033171K332149M80684j629966k139724j345687r82907j229846k29871K592759
42461c185580M485838K455847k370458n444364l978391J54910L180236L565503
$$ plain form
42453 -1136459 1199486 1745849 244343 -2497830 -4003282 -2388366 642273 1119969
42445 1119969 -2015158 -4999600 -4068371 -535014 1222114 -275313 -2525599 -3571823
42437 -3571823 -4275987 -5231373 -4569889 -962443 3237650 4275612 1523695 -2047876 -3222377
42428 -3222377 -1017197 3209733 6643468 6887690 4408103 2212009 1843525 1218142 -1673718
42419 -1673718 -4691796 -4204475 -762815 1491518 942912 253477 1301719 2156129 796753
42410 796753 -1468356 -2693875 -3667936 -5736937 -7357917 -5998090 -2162388 1463712
42402 1463712 3795430 5184707 4555531 639738 -3943672 -3954259 1862504 8743408 11987163
42393 11987163 11948446 11109243 9488306 6094491 2534470 1307402 1549774 85160 -3583162
$$ packed form
42453a136459K335945N46363j501506k742173j505452J614916L030639M77696
42445A119969l135127k984442R31229L533357J757128j497427k250286j046224
42437c571823p04164r55386O61484L607446M200093J037962k751917l571571j174501
42428c222377K205180M226930L433735K44222k479587k196094l68484o25383k891860
42419a673718l018078M87321L441660K254333n48606o89435J048242Q54410j359376
42410G96753k265109j225519r74061k069001j620980J359827L835702L626100
42402A463712K331718J389277o29176l915793m583410j0587N816763O880904L243755
42393A1987163l8717q39203j620937l393815l560021j227068K42372j464614l668322
$$ plain form
42384 -3583162 -6594248 -7087800 -6068755 -4513004 -1841620 1670051 3925800 3993101 3555799
42375 3555799 3775405 3151483 441249 -2652488 -4080678 -4605974 -5623600 -5806469 -3354525
42366 -3354525 -221331 -160848 -2992778 -4726633 -3634428 -2332003 -2920215 -3815681 -3094354
42357 -3094354 -1711015 -1214060 -937674 209350 1461464 2078970 3302860 5681176 6396037
42348 6396037 2594877 -3720999 -7473294 -6778383 -4510809 -3845716 -5173203 -7492979
42340 -7492979 -9798342 -10347527 -7355589 -1761376 2723906 3627752 2196616 853133
42332 853133 -107971 -1880257 -4511561 -6511769 -6592349 -4869249 -2827786 -2516628 -4775314
42323 -4775314 -7663663 -7886081 -4760525 -1595394 -1716942 -3976447 -4007276 118959 5166918
$$ packed form
42384c583162l011086m93552J019045J555751K671384L511671K255749O7301m37302
42375C555799K19606o23922k710234l093737j428190n25296j017626j82869K451944
42366c354525L133194O0483k831930j733855J092205J302425n88212q95466P21327
42357c094354J383339M96955K76386J147024J252114O17506J223890K378316P14861
42348F396037l801160o315876l752295O94911K267574O65093j327487k319776
42340g492979k305363n49185K991938N594213M485282R03846j431136j343483
42332H53133r61104j772286k631304k000208q0580J723100K041463L11158k258686
42323d775314k888349k22418L125556L165131j21548k259505l0829M126235N047959
$$ plain form
42314 5166918 6373369 2792313 -2065305 -4645344 -5116741 -5945332 -7636091 -7872505 -5435251
42305 -5435251 -2980508 -4035240 -8332362 -12409418 -14307439 -15035563 -15292253 -13808069
42297 -13808069 -10225257 -6979195 -6211731 -6585569 -5353161 -2318283 428091 1704693
42289 1704693 1906016 1218213 -390794 -1710020 -1284486 6422 -246883 -2177677 -3079743
42280 -3079743 -1598262 -127345 -1351215 -4215829 -5485830 -4192088 -2210439 -874060
42272 -874060 557850 2656234 4215412 4100545 3277965 3491295 4672716 5231406 4640487
42263 4640487 4082387 4166180 3518117 676001 -3509814 -6524889 -6808633 -4751515 -1534260
42254 -1534260 1778479 4112213 4719956 4033496 3207158 2500259 1068686 -1338381 -3617889
$$ packed form
42314E166918J206451l581056m857618k580039m71397q28591j690759k36414K437254
42305e435251K454743j054732m297122m077056j898021p28124k56690J484184
42297a3808069L582812L246062P67464l73838J232408L034878K746374J276602
42289A704693K01323o87803j609007j319226M25534J290908k53305j930794r02066
42280c079743J481481J470917j223870k864614j270001J293742J981649J336379
42272h74060J431910K098384J559178j14867q22580K13330J181421N58690n90919
42263D640487n58100Q3793o48063k842116m185815l015075k83744K057118L217255
42254a534260L312739K333734O07743o86460q26338p06899j431573k407067k279508
$$ plain form
42245 -3617889 -4842228 -5484546 -6296459 -6856027 -6207196 -4328624 -2090303 -290078 487943
42236 487943 -286897 -2438981 -4781414 -6365100 -7506575 -8666092 -8992097 -7258764 -3866130
42227 -3866130 -613621 1345293 2161747 2128464 1174863 -408131 -1846922 -2615777 -2534042
42218 -2534042 -1528669 -421601 -1383990 -5780336 -11487025 -14148407 -11632695 -5925072
42210 -5925072 -419444 3010749 3978084 2823498 1071364 927424 2847191 4740650
42202 4740650 4761235 3649113 3063128 2930238 2063163 320686 -1611802 -3756898 -6360080
42193 -6360080 -8531323 -9178100 -8725425 -8068759 -6507947 -3091578 307858 152147 -3841911
42184 -3841911 -7502071 -7254119 -4388592 -2710190 -3521199 -4842417 -4703724 -3279844 -1886825
$$ packed form
42245c617889j224339o42318q11913n59568O48831J878572K238321J800225P78021
42236D87943p74840k152084k342433j583686j141475j159517l26005J733333L392634
42227c866130L252509J958914Q16454l3283r53601j582994j438791p68855Q1735
42218b534042J005373J107068r62389m396346n706689k661382K515712N707623
42210e925072N505628L430193R67335j154586j752134j43940J919767J893459
42202D740650K0585j112122n85985j32890q67075j742477j932488k145096k603182
42193f360080k171243o46777M52675O56666J560812L416369L399436j55711l994058
42184c841911l660160K47952K865527J678402q11009j321218J38693J423880J393019
$$ plain form
42175 -1886825 -1281875 -1263261 -1290685 -1261742 -1588501 -2073018 -1045110 2943866 8162408
42166 8162408 10121015 6273883 -715253 -5683294 -6142942 -3641810 -1069955 -302420
42158 -302420 -1800391 -4574887 -6488132 -5969931 -3503962 -625743 1831315 3362973
42150 3362973 2930425 523492 -1400227 -670336 996379 197637 -2633946 -3649913 -2018232
42141 -2018232 -1611469 -4444346 -6706421 -4574051 -396410 1173596 547288 1615652
42133 1615652 4287008 4304549 749859 -1688758 332312 4021795 5028850 3232219
42125 3232219 1139874 -600438 -2781006 -4577640 -4249828 -2156201 -451286 -168555
42117 -168555 -648472 -1399547 -2599446 -4034527 -5158140 -5907099 -6210823 -5425937 -3660305
$$ packed form
42175a886825O04950J8614k7424K8943l26759m84517J027908L988976N218542
42166H162408J958607l847132o989136m968041m59648K501132K571855P67535
42158c02420j497971k774496j913245N18201K465969K878219K457058J531658
42150C362973m32548k406933j923719P29891J666715p98742k831583j015967J631681
42141b018232M06763k832877k262075K132370M177641J570006o26308J068364
42133A615652K671356J7541l554690k438617K021070L689483J007055j796631
42125C232219k092345j740312k180568j796634L27812K093627J704915K82731
42117a68555m79917p51075j199899j435081j123613p48959l03724P84886J765632
$$ plain form
42108 -3660305 -2644931 -3498924 -4677582 -4350882 -3795461 -5519349 -8566186 -9230897 -6864026
42099 -6864026 -5192077 -6255257 -6560334 -2211088 4593273 7892842 5776459 2217249
42091 2217249 1078498 1779562 2053466 1914374 2479568 2719687 406205 -3967256 -6785140
42082 -6785140 -5601726 -2174704 -266819 -1556891 -4628324 -6979048 -6887878 -4033683
42074 -4033683 425852 4654213 7908332 10979568 13960808 14685356 11289724 5668450
42066 5668450 1881604 1031152 352055 -1931706 -3713216 -2630289 -143299 439427 -1565399
42057 -1565399 -4222924 -6436014 -8881029 -11937854 -14864442 -16816037 -16918756 -13878880
42049 -13878880 -7596993 -832048 2902728 3066648 1880278 805833 -469309 -1808308
$$ packed form
42108c660305J015374q53993j178658L26700N55421j723888l046837o64711K366871
42099f864026J671949j063180l05077M349246O804361L299569k116383l559210
42091B217249j138751P01064K73904j39092N65194K40119k313482m373461k817884
42082f785140J183414L427022J907885j290072l071433k350724R1170K854195
42074d033683M459535M228361L254119L071236K981240P24548l395632n621274
42066E668450l786846q50452o79097k283761j781510J082927K486990N82726k004826
42057a565399k657525k213090k445015l056825k926588j951595j02719L039876
42049a3878880O281887O764945L734776J63920j186370j074445j275142j338999
$$ plain form
42041 -1808308 -2200539 -2021408 -3050087 -5336839 -6507117 -5413000 -4243622 -5365428
42033 -5365428 -7736702 -8148655 -4966134 557568 5604569 7491108 5413757 1715400
42025 1715400 277006 2450922 5476978 5835823 3193133 248082 -207206 2651038
42017 2651038 7257527 10511651 10401330 8492938 8251683 10238729 11106724 8510090 4584321
42008 4584321 2614185 2458685 1846995 483184 -137471 29686 -429518 -1514901 -1684671
41999 -1684671 -658769 -33411 -960615 -3194275 -6355782 -10005428 -12438599 -11774635 -8784234
41990 -8784234 -6546683 -6488717 -6570106 -4457695 -1038469 646349 -639152 -2680991 -2440939
41981 -2440939 135680 1819427 363717 -1759508 -60496 5365957 8933325 6888715
$$ packed form
42041a808308l92231J79131j028679k286752j170278J094117J169378j121806
42033e365428k371274m11953L182521N523702N047001J886539k077351l698357
42025A715400j438394K173916L026056L58845k642690k945051m55288K858244
42017B651038M606489L254124j10321j908392k41255J987046Q67995k596634l925769
42008D584321j970136j55500o11690j363811o20655J67157m59204j085383j69770
41999a684671J025902O25358r27204k233660l161507l649646k433171O63964K990401
41990h784234K237551N7966q1389K112411L419226J684818j285501k041839K40052
41981b440939K576619J683747j455710k123225J699012N426453L567368k044610
$$ plain form
41973 6888715 2557715 1319812 2859509 2594120 -643049 -3334653 -3747674 -4668151 -8066685
41964 -8066685 -11161402 -10316691 -6017558 -1504321 1472743 3349116 4815178 6078312
41956 6078312 6861118 5973880 2457392 -1884689 -3228642 -468177 2808404 2715227 -457445
41947 -457445 -3767649 -5459733 -5251452 -2918934 784880 3298420 2851273 672106 -1558561
41938 -1558561 -4690480 -9699494 -13976959 -13766100 -9695452 -6265381 -5858234 -6671554 -6794668
41929 -6794668 -6680609 -6613562 -5176844 -1954596 981438 2081789 2401837 2853461 1951411
41920 1951411 -1087166 -3143240 -606396 4884668 7644771 5120607 749180 -1276352
41912 -1276352 -1204979 -1808773 -3483148 -4045521 -2558805 -575922 578578 1312909 1809034
$$ packed form
41973F888715m331000j237903J539697k65389l237169k691604m13021r20477l398534
41964h066685l094717Q44711M299133M513237K977064J876373J466062J263134
41956F078312P82806q87238l516488m342081j343953K760465L276581r3177l172672
41947d57445l310204j692084K08281K332518L703814K513540m47147k179167k230667
41938a558561l131919n009014m277465K10859M070648L430071M07147q13320j23114
41929f794668J14059O7047J436718L222248K936034J100351L20048M51624r02050
41920A951411l038577k056074K536844N491064K760103k524164m371427k025532
41912a276352P1373o03794j674375n62373J486716J982883J154500P34331M96125
$$ plain form
41903 1809034 867541 -1793764 -3973513 -3792215 -2694736 -3167003 -4388304 -3258714 272045
41894 272045 2265613 273881 -3222876 -4669660 -4222644 -4350404 -5656257 -6883414 -7783807
41885 -7783807 -9051912 -10071589 -9621049 -8671187 -9686908 -12756810 -14886119 -13830429
41877 -13830429 -10511755 -6887612 -3528085 -399673 1868736 3088987 4609145 7652438
41869 7652438 11130910 12384086 9887052 4502701 -1565218 -6342525 -8860113 -9052441
41861 -9052441 -7199409 -3747661 138824 2625722 2919357 2583248 3722536 5828455
41853 5828455 6007571 2794472 -1781500 -4685138 -5067652 -4056627 -2703140 -1484760
41845 -1484760 -908228 -1053875 -907041 486629 2277032 2400356 114453 -2932128 -4515692
$$ packed form
41903A809034r41493k661305k179749J81298J097479m72267j221301J129590L530759
41894B72045J993568j991732l496757j446784M47016j27760j305853j227157r00393
41885g783807j268105j019677M50540R49862j015721l069902k129309J055690
41877a3830429L318674L624143L359527L128412K268409J220251J520158L043293
41869G652438L478472J253176k497034n384351o067919m777307k517588j92328
41861i052441J853032L451748L886485K486898K93635l36109J139288K105919
41853E828455J79116l213099m575972k903638l82514J011025J353487J218380
41845a484760N76532j45647J46834J393670J790403J23324k285903l046581j583564
$$ plain form
41836 -4515692 -4181690 -3396068 -3584129 -4401844 -4195820 -2141168 525500 1763828 815558
41827 815558 -1506837 -4058214 -5850470 -5714782 -3083899 562467 2481119 1578606 -586033
41818 -586033 -2237612 -3356291 -4235730 -3637026 -273233 4454738 6994538 5100326 -137759
41809 -137759 -5458608 -7732726 -5680963 -766113 3566504 4650400 2756199 -148628
41801 -148628 -3208486 -6850510 -10532480 -12430074 -12050430 -11402820 -12352750 -14097109 -14720046
41792 -14720046 -14262809 -14329477 -14904848 -13654556 -9205530 -3704993 -775994 -1406445 -3001197
41783 -3001197 -2543578 94254 2250880 1508960 -1488903 -3115818 17359 7340480
41775 7340480 14016338 15158143 10470247 4040467 -321793 -2258475 -3127010 -2995415
$$ packed form
41836d515692L34002P85622j88061q17715K06024K054652K666668J238328r48270
41827H15558k322395k551377j792256J35688K630883L646366J918652r02513k164639
41818e86033j651579j118679q79439N98704L363793M727971K539800j894212n238085
41809a37759n320849k274118K051763M914850M332617J083896j894201k904827
41801a48628l059858l642024l681970j897594L79644O47610r49930j744359o22937
41792a4720046M57237o6668n75371J250292M449026N500537K928999o30451j594752
41783c001197M57619K637832K156626p41920k997863j626915L133177P323121
41775G340480O675858J141805m687896o429780m362260j936682q68535J31595
$$ plain form
41767 -2995415 -1065509 1911833 3852581 4080673 4039818 4716675 4922145 3148007 24393
41758 24393 -2343329 -3013977 -3090842 -4028661 -5828196 -7057650 -6322323 -3688751 -775555
41749 -775555 747713 834043 892650 1849218 2976749 3154549 2780624 3432411 5394056
41740 5394056 6401818 3898528 -1475891 -5850564 -6459988 -5062422 -5333508 -7285156
41732 -7285156 -6905949 -2262495 2831006 3687226 1336328 888725 4152423 7637459 8283993
41723 8283993 7499124 7917574 9084912 8675389 6256027 3764272 3222438 5203583 8305623
41714 8305623 9248446 5397702 -1466787 -5939713 -5276566 -2841833 -3196009 -5916245 -7157500
41705 -7157500 -5580353 -3256534 -1703781 -677757 -616705 -2710464 -6130399 -8254984
$$ packed form
41767b995415J929906K977342J940748K28092m0855O76857K05470j774138l123614
41758B4393k367722o70648p6865r37819j799535j229454P35327K633572K913196
41749g75555J523268Q6330N8607R56568J127531J77800l73925O51787J961645
41740E394056J007762k503290n374419m374673o09424J397566k71086j951648
41732g285156L79207M643454N093501Q56220k350898m47603L263698L485036O46534
41723H283993p84869M18450J167338m09523k419362k491755n41834J981145L102040
41714H305623R42823l850744o864489m472926O63147K434733l54176k720236j241255
41705g157500J577147K323819J552753J026024O1052k093759l419935k124585
$$ plain form
41697 -8254984 -8184973 -7274944 -5873354 -2751448 1417190 3378930 1744323 -658818 -686037
41688 -686037 1316057 3465802 5609122 8147531 9601845 8265559 5225448 3115192
41680 3115192 2491598 1780812 356412 -678936 -781743 -982105 -2212912 -4050374 -5426024
41671 -5426024 -5619554 -4635635 -3546247 -4067894 -6597615 -9058745 -9094746 -7157930 -5935561
41662 -5935561 -6832886 -8605084 -9511815 -9060372 -7158114 -3336725 1983076 6533114 7856040
41653 7856040 5752571 2455171 525657 755574 1674715 964175 -2035284 -5040641 -4876553
41644 -4876553 -1250488 2381327 2518737 -447331 -3033701 -3036626 -1724772 -1268077 -1284680
41635 -1284680 563642 4669268 7826345 6752519 2675513 725010 4124100 10117533
$$ packed form
41697h254984P0011R10029J401590L121906M168638J961740j634607k403141k7219
41688f86037K002094K149745K143320K538409J454314j336286l040111k110256
41680C115192o23594p10786j424400j035348j02807k00362j230807j837462j375650
41671e426024j93530R83919J089388n21647k529721k461130l6001J936816J222369
41662e935561q97325j772198r06731M51443J902258L821389N319801M550038J322926
41653G856040k103469l297400j929514K29917R19141p10540k999459l005357J64088
41644d876553L626065L631815J37410k966068k586370k925J311854M56695j6603
41635a284680J848322M105626L157077j073826m077006j950503L399090N993433
$$ plain form
41627 10117533 12846644 9838077 4439998 1753601 3233814 5863562 5967582 3000968
41619 3000968 -359881 -1180693 1106724 4742368 7506117 8055702 5991835 1871552
41611 1871552 -2415960 -4326496 -2761551 800894 3978295 5890595 7095909 7639992
41603 7639992 6565102 3576200 36667 -2270391 -2674643 -1550776 448271 2443377
41595 2443377 3201824 1760648 -1824676 -6492096 -10590805 -12343799 -10844406 -7124109
41587 -7124109 -3471523 -1090101 743748 2513431 2769950 274278 -3058725 -3833096
41579 -3833096 -1947402 -1099109 -3368385 -5726133 -4179776 298589 3001148 2030979
41571 2030979 307327 459145 960851 -701685 -3355487 -3361181 479243 5650205 9131744
$$ packed form
41627A0117533K729111l008567n398079k686397J480213K629748J04020k966614
41619C000968l360849q20812K287417L635644K763749N49585k063867m120283
41611A871552m287512j910536J564945L562445L177401J912300J205314N44083
41603G639992j074890k988902l539533k307058m04252J123867J999047J995106
41595B443377P58447j441176l585324m667420m098709j752994J499393L720297
41587g124109L652586K381422J833849J769683K56519k495672l333003p74371
41579c833096J885694Q48293k269276k357748J546357M478365K702559r70169
41571B030979j723652J51818N01706j662536k653802n694L840424N170962L481539
$$ plain form
41562 9131744 9739062 7554725 3467222 -249162 -1035660 1206432 3809633 4485021 3445458
41553 3445458 1856497 -19774 -1927370 -2473523 -664576 2295289 4354726 5119133
41545 5119133 5460321 5204599 3018648 -1424744 -6692521 -11142523 -13916395 -14267219 -11407956
41536 -11407956 -5817456 113064 3551218 3413598 1266789 229548 2287392 5971999
41528 5971999 7388496 4496504 -447704 -3981048 -5882394 -8406548 -11758943 -13232756
41520 -13232756 -11261353 -7600096 -4502289 -2289554 -1070311 -2176666 -5634859 -8323318
41512 -8323318 -7411543 -4289323 -2374499 -2130261 -1315244 398840 452106 -2526243 -6549147
41503 -6549147 -9049490 -9451894 -8109708 -5050394 -1040288 2144795 3921138 5582876
$$ packed form
41562I131744O07318k184337m087503l716384p86498K242092K603201O75388j039563
41553C445458j588961j876271j907596n46153J808947K959865K059437P64407
41545E119133L41188k55722k185951m443392n267777m450002k773872l50824K859263
41536a1407956N590500N930520L438154j37620k146809j037241K057844L684607
41528E971999J416497k891992m944208l533344j901346k524154l352395j473813
41520a3232756J971403L661257L097807K212735J219243j106355l458193k688459
41512h323318R11775L122220J914824K44238Q15017J714084N3266k978349m022904
41503f549147k500343m02404J342186L059314M010106L185083J776343J661738
$$ plain form
41495 5582876 7398535 6963508 2438895 -4052119 -8565615 -10006661 -10394678 -10922952 -10170124
41486 -10170124 -6722863 -1834958 1495406 1478015 -864203 -2815335 -2760753 -1889345 -2524838
41477 -2524838 -4883349 -6910314 -7536296 -7779063 -7485539 -3939891 3462921 9635446 9174806
41468 9174806 4224842 2154007 5252965 7911096 5676865 2024221 2635337 6890314
41460 6890314 9695964 9502550 9480846 11279478 12229920 9709394 4927268 935956 -922519
41451 -922519 -1324376 -1288698 -1316498 -1346154 -1017384 -495814 -759805 -2195792 -3587974 -3880337
41441 -3880337 -4142265 -5846726 -7865866 -7690071 -5408191 -3558792 -2627816 82399 5672831
41432 5672831 10640280 11014891 7629323 4808894 4986771 6939123 8552568 8891160 7667119
$$ packed form
41495E582876J815659m35027m524613o491014m513496j441046l88017n28274P52828
41486a0170124L447261M887905L330364j7391k342218j951132N4582Q71408o35493
41477b524838k358511k026965o25982k42767K93524L545648P402812O172525m60640
41468I174806m949964k070835L098958K658131k234231l652644O11116M254977
41460F890314K805650j93414k1704J798632R50442k520526m782126l991312j858475
41451i22519m01857L5678k7800k9656L28770N21570k63991j435987j392182k92363
41441c880337k61928j704461k019140J75795K281880J849399R30976K710215N590432
41432E672831M967449L74611l385568k820429J77877J952352J613445L38592j224041
$$ plain form
41423 7667119 4957684 2008597 594513 679110 -146320 -3847304 -9146416 -12562364 -12153856
41414 -12153856 -9270919 -6275513 -3668583 -801530 1252632 -6743 -4469990 -7988485
41406 -7988485 -7086339 -3563854 -1846875 -2842685 -3556027 -2397030 -1317668 -2065989 -3594744
41397 -3594744 -4340277 -4154232 -2762787 577108 4230824 4215516 -584164 -6124487 -8757771
41388 -8757771 -10128951 -13158697 -15912220 -14048589 -7945156 -2637237 -900000 -697046
41380 -697046 91164 483240 -751403 -2261397 -1914055 437571 3109837 4237172 3044136
41371 3044136 818687 117491 1253132 797200 -3522057 -7639504 -5180914 3294706
41363 3294706 9792371 8959317 4318344 2316955 4174568 6628529 7512363 7059592 5843505
$$ packed form
41423G667119k709435k949087j414084Q4597q25430l700984n299112l415948M08508
41414a2153856K882937K995406K606930K867053K054162j259375m463247l518495
41406g988485R02146L522485J716979r95810p13342J158997J079362p48321j528755
41397c594744p45533J86045J391445L339895L653716j5308m799680n540323k633284
41388h757771j371180l029746k753523J863631O103433N307919J737237K02954
41380f97046P88210L92076j234643j509994L47342K351626K672266J127335j193036
41371C044136k225449p01196J135641m55932m319257m117447K458590Q475620
41363C294706O497665q33054m640973k001389J857613K453961Q83834m52771j216087
$$ plain form
41354 5843505 4694113 5069672 6723613 6653152 3117732 -1043249 -2116472 -870889 -833767
41345 -833767 -2658385 -4097876 -4698922 -6172113 -8035098 -7283258 -3485117 -234577 286052
41336 286052 661269 3608262 6878634 6178908 1569078 -2622397 -3931761 -4532427 -7092563
41327 -7092563 -10474330 -11340897 -8733762 -5185206 -3572075 -4324979 -5866031 -6483531 -5238054
41318 -5238054 -2212639 1079651 2343373 869792 -1160366 -1060409 1073757 3099668
41310 3099668 4532946 7102842 11005978 13204639 11266868 7098366 4677597 5190816
41302 5190816 6530108 6770708 5861032 4297475 2476839 1421522 1963098 2846193 1683955
41293 1683955 -1587509 -4122803 -3880865 -2071980 -676650 675456 3330116 6187586
$$ packed form
41354E843505j149392L75559J653941p0461l535420m160981j073223J245583L7122
41345h33767j824618j439491o01046j473191j862985P51840L798141L250540N20629
41336B86052L75217K946993L270372o99726m609830m191475j309364o00666k560136
41327g092563l381767q66567K607135L548556J613131p52904j541052o17500J245477
41318e238054L025415L292290J263722j473581k030158R9957K134166K025911
41310C099668J433278K569896L903136K198661j937771m168502k420769N13219
41302E190816J339292K40600r09676j563557j820636j055317N41576Q83095j162238
41293A683955l271464k535294K41938J808885J395330J352106K654660K857470
$$ plain form
41285 6187586 6229322 2767947 -919400 -1408786 691463 1994250 1247582 1040405 4021412
41276 4021412 9080226 12719006 13207374 11601047 9209687 6276898 3366878 1781768
41268 1781768 1622618 1244076 -214732 -1382336 -986142 -2246 32170 -695476 -1382905
41259 -1382905 -2416308 -3965741 -4315679 -2260922 583 -515415 -2693357 -2460705 1128423
41250 1128423 4456697 4761717 3567405 3168235 2842598 1028595 -1028705 -820088 1257674
41241 1257674 1991956 -461166 -4435112 -6998229 -6946277 -5275317 -3717687 -3301061 -3915995
41232 -3915995 -4881346 -5712430 -6199282 -6137592 -5635191 -5403353 -5847271 -6079202 -4942351
41223 -4942351 -2842356 -1166135 66013 2175301 5071755 6515375 5199883 2925942
$$ packed form
41285F187586M1736l461375l687347m89386K100249J302787p46668k07177K981007
41276D021412N058814L638780M88368j606327k391360k932789k910020j585110
41268A781768j59150l78542j458808j167604L96194R83896L4416p27646o87429
41259a382905j033403j549433l49938K054757K261505n15998k177942K32652L589128
41250A128423L328274L05020j194312l99170l25637j814003k057300K08617K077762
41241A257674P34282k453122l973946k563117N1952J670960J557630M16626o14934
41232c915995r65351q31084m86852O1690N02401K31838m43918k31931J136851
41223d942351K099995J676221J232148K109288K896454J443620j315492k273941
$$ plain form
41215 2925942 2236771 3028658 3083972 1404375 -344904 295536 3804374 7573323 7720298
41206 7720298 3021624 -3036787 -5705787 -4605419 -3761088 -5433577 -6829611 -4934356
41198 -4934356 -1955392 -2620169 -7404741 -12038176 -13461431 -12836159 -12126968 -11054380 -9063469
41189 -9063469 -7683478 -8434753 -9711551 -8324462 -4042714 -496035 -791903 -3650985
41181 -3650985 -5275735 -4481955 -4118251 -6687003 -10263648 -10879246 -8386651 -7202372 -10312116
41172 -10312116 -14959913 -16213451 -13115957 -8889913 -6080222 -4310773 -2716824 -1737828
41164 -1737828 -1558073 -948765 853373 2396955 1585675 -1579345 -4843065 -5956934 -4445564
41155 -4445564 -1486187 1328849 3213791 4530782 5905742 7100167 7185058 5888035
$$ packed form
41215B925942o89171P91887N5314j679597j749279O40440L508838L768949J46975
41206G720298m698674o058411k669000J100368Q44331j672489j396034J895255
41198d934356K978964o64777m784572m633435j423255O25272P09191J072588J990911
41189i063469J379991p51275j276798J387089M281748L546679k95868k859082
41181c650985j624750P93780L63704k568752l576645o15598K492595J184279l109744
41172a0312116m647797j253538L097494M226044K809691J769449J593949R78996
41164a737828J79755O09308J802138J543582q11280l165020l263720j113869J511370
41155d445564K959377K815036J884942J316991J374960J194425Q4891j297023
$$ plain form
41147 5888035 4255356 3673243 4450656 5588085 5952250 5644304 5940727 7459194 8719760
41138 8719760 7657244 4719536 2930251 3968844 5657707 4847688 1602563 -1418156
41130 -1418156 -2876369 -3781150 -5047863 -6524574 -8460766 -11325812 -13708820 -13167580
41122 -13167580 -10245843 -8888151 -11004635 -13024413 -10423507 -4011052 1199752 2468985
41114 2468985 1678880 1447451 1961897 2384246 2729256 2841235 1391439 -2254631 -6201642
41105 -6201642 -7785682 -6723974 -5077460 -4320854 -3884100 -2749623 -1141583 77998
41097 77998 887466 2175382 4609445 7856837 10601622 11110377 8561318 4550052 2533316
41088 2533316 4464306 8202227 9680437 7716064 5026250 4012252 3578683 1632128
$$ packed form
41147E888035j632679n82113P77413J137429L64165l07946K96423J518467J260566
41138H719760j062516k937708j789285J038593J688863q10019l245125l020719
41130a418156j458213r04781j266713j476711j936192k865046k383008N41240
41122a3167580K921737J357692k116484k019778K600906O412455N210804J269233
41114B468985p90105k31429N14446M22349L45010J11979j449796l646070l947011
41105f201642j584040J061708J646514P56606M36754J134477J608040J219581
41097G7998Q09468J287916K434063L247392K744785N08755k549059m011266k016736
41088B533316J930990L737921J478210j964373k689814j013998m33569j946555
$$ plain form
41080 1632128 -1022879 -1825933 -821005 -1030371 -3945470 -7099330 -7502946 -5722842 -4663475
41071 -4663475 -5244174 -5398331 -3510017 -1151384 -1350323 -4702873 -8229173 -8370534 -4590607
41062 -4590607 540350 4457246 6693180 7710313 7222577 5041681 2633084 1991845
41054 1991845 3198806 4750287 6140970 8179494 10610457 11658548 10658692 8989803
41046 8989803 7334834 4268418 -749195 -5090454 -6087291 -4946245 -4806240 -5834318
41038 -5834318 -5307379 -2405890 182449 200959 -1214561 -1753505 -1117533 -549445 -666274
41029 -666274 -1313333 -2663979 -5060891 -8164917 -11156461 -13408912 -14440088 -13837550 -11809618
41020 -11809618 -9214151 -6640844 -4237308 -2737900 -3423453 -6255517 -9141526 -10082573
$$ packed form
41080A632128k655007q03054J004928k09366k915099l153860m03616J780104J059367
41071d663475n80699j54157J888314K358633j98939l352550l526300j41361L779927
41062d590607N130957L916896K235934J017133m87736k180896k408597o41239
41054A991845J206961J551481J390683K038524K430963J048091r99856j668889
41046H989803j654969l066416n017613m341259r96837J141046J40005j028078
41038e834318N26939K901489K588339J8510j415520n38944O35972N68088j16829
41029f66274o47059j350646k396912l104026k991544k252451j031176O02538K027932
41020a1809618K595467K573307K403536J499408o85553k832064k886009r41047
$$ plain form
41012 -10082573 -9259186 -8191853 -7861904 -8533751 -10035888 -10806124 -8109755 -1362486 5670929
41003 5670929 8427137 6915060 5121761 5261536 5453670 3606196 668261 -1363838
40995 -1363838 -2307235 -3017408 -3736387 -4863463 -7356204 -10358679 -10427719 -5796763 81979
40986 81979 2315631 971545 404767 2526222 4321855 2744534 -1164722 -4385075 -5470049
40977 -5470049 -4391046 -1188950 3129742 5957365 5459611 2795091 587686 116770
40969 116770 1134141 3132262 5240521 5893272 4192543 976511 -2457852 -5580310
40961 -5580310 -7604465 -7035867 -4057090 -1786622 -2831097 -5637094 -6546434 -4511668
40953 -4511668 -1444853 984598 2057696 518680 -4059886 -8598220 -8783172 -4453892
$$ packed form
41012a0082573Q23387J067333L29949o71847j502137p70236K696369O747269P033415
41003E670929K756208j512077j793299J39775J92134j847474k937935k032099
40995a363838r43397p10173p18979j127076k492741l002475o9040M630956N878742
40986H1979K233652j344086n66778K121455J795633j577321l909256l220353j084974
40977e470049J079003L202096M318692K827623m97754k664520k207405m70916
40969A16770J017371J998121K108259O52751j700729l216032l434363l122458
40961e580310k024155N68598K978777K270468j044475k805997r09340K034766
40953d511668L066815K429451J073098j539016m578566m538334j84952M329280
$$ plain form
40945 -4453892 553422 4189951 7843095 11333407 11064832 5962492 1319575 2773694
40937 2773694 8875622 13469498 13645785 11414357 8864803 6168511 4271135 5267625
40929 5267625 8973847 12332144 13488421 13829295 14779504 15203183 13703731 11357246 10099612
40920 10099612 9856939 9257079 8086239 7011124 5610289 2875981 -442130 -2056279
40912 -2056279 -1148460 586047 1688411 3062475 5829289 8238699 7108487 2497825
40904 2497825 -1395547 -1332062 768056 854270 -1229044 -1869039 46324 556995 -3655546
40895 -3655546 -9711343 -11987134 -9891837 -8537057 -11448145 -16018907 -17661737 -15771413
40887 -15771413 -13180415 -11282679 -8571306 -3917534 1097117 4045680 4469780 3768352
$$ packed form
40945d453892N007314L636529L653144L490312k68575n102340m642917J454119
40937B773694O101928M593876J76287k231428k549554k696292j897376R96490
40929E267625L706222L358297J156277L40874R50209M23679j499452k346485j257634
40920A0099612k42673n99860j170840j075115j400835k734308l318111j614149
40912b056279R07819J734507J102364J374064K766814K409410j130212m610662
40904B497825l893372O3485K100118Q6214k083314o39995J915363N10671m212541
40895c655546o055797k275791K095297J354780k911088m570762j642830J890324
40887a5771413K590998J897736K711373M653772N014651K948563M24100p01428
$$ plain form
40879 3768352 3064270 2345292 1521304 1189612 1852028 2951140 3289033 2226574 88385
40870 88385 -2321789 -4037096 -4027316 -1897879 1313169 3766435 4545375 4195981 3545894
40861 3545894 3027171 3433316 5797213 9293248 10503494 6836370 504869 -2888333
40853 -2888333 -403800 4973212 7949968 6632983 3429366 1157906 222663 3310
40845 3310 1192495 4934458 10080238 13303517 12768403 10319529 8814357 8377354 7020507
40836 7020507 4295889 2116883 1847394 2715414 3690408 4915055 6373671 7053363 6583702
40827 6583702 5915954 5135103 2576369 -2240980 -6799690 -8786585 -9189333 -9652855 -8634874
40818 -8634874 -3674974 3504240 7901958 7204541 3625827 -194724 -3713071 -6506774
$$ packed form
40879C768352p04082p18978q23988l31692O62416J099112L37893j062459k138189
40870H8385k410174j715307R780K129437L211048K453266P78940l49394o50087
40861C545894n18723M06145K363897L496035J210246l667124o331501l393202
40853b888333K484533N377012K976756j316985l203617k271460r35243k19353
40845C310J189185L741963N145780L223279n35114k448874j505172m37003j356847
40836G020507k724618k179006k69489Q68020R74994J224647J458616O79692m69661
40827F583702o67748p80851k558734m817349m558710j986895m02748m63522J017981
40818h634874M959900P179214M397718o97417l578714l820551l518347k793703
$$ plain form
40810 -6506774 -7344272 -6432841 -5719168 -5833522 -5402004 -4197574 -3799088 -4015469 -2298365
40801 -2298365 1429239 3107431 442010 -2976062 -2940310 -997989 -1303093 -3449929 -3480523
40792 -3480523 -934559 362565 -1184313 -2416056 -642761 2586808 4557179 4808291
40784 4808291 3638292 337666 -4623418 -8025267 -7225286 -3647736 -746061 277346
40776 277346 628072 1015124 1055869 1017149 1744970 2776548 2520756 744097 -705208
40767 -705208 -256811 1477844 2795724 3034932 2998580 3830252 5998104 8988881 11499115
40758 11499115 12109147 10238836 6663774 3089097 1013978 644626 849023 587994 487578
40749 487578 2286915 6276007 10119266 11253072 9953144 8716146 8750601 8628318 6789347
$$ packed form
40810f506774q37498R11431P13673j14354M31518J204430L98486k16381J717104
40801b298365L727604J678192k665421l418072L5752J942321l05104k146836l0594
40792c480523K545964J297124j546878j231743J773295L229569J970371K51112
40784D808291j169999l300626m961084l401849P99981L577550K901675J023407
40776B77346L50726L87052M0745l8720P27821J031578k55792j776659j449305
40767g05208M48397J734655J317880K39208l6352Q31672K167852K990777K510234
40758A1499115O10032j870311l575062l574677k075119l69352K04397k61029j00416
40749D87578J799337L989092L843259J133806j299928j236998L4455j22283j838971
$$ plain form
40740 6789347 3828987 1376965 6121 -498872 78944 1665904 2731188 1885377 395692
40731 395692 884757 3264026 4370431 2604575 521085 1002474 2920140 3248146 2221843
40722 2221843 3171625 7263817 11444182 12582274 11304381 10260274 10286353 10058626 8738980
40713 8738980 7361368 7499319 9203258 10431151 8900855 5174993 3294724 6681551
40705 6681551 13374244 17264421 14652292 7759553 1113182 -3195310 -5278039 -5130342
40697 -5130342 -3364093 -2724656 -5560412 -10003402 -11530920 -8704911 -4905751 -3632700
40689 -3632700 -4310085 -4085395 -2199544 -818734 -1938393 -4685151 -6012875 -3904252
40681 -3904252 256789 2960767 2493688 772356 507122 1628250 2152189 1807420 2404191
$$ packed form
40740F789347k960360k452022j370844n04993N77816J586960J065284q45811j489685
40731C95692M89065K379269J106405j765856k083490M81389J917666L28006j026303
40722B221843R49782M092192M180365J138092j277893j044107K6079k27727j319646
40713H738980j377612J37951J703939J227893j530296l725862j880269L386827
40705F681551O692693L890177k612129o892739o646371m308492k082729J47697
40697e130342J766249O39437k835756m442990j527518K826009L799160J273051
40689c632700o77385K24690J885851J380810j119659k746758j327724K108623
40681c904252M161041K703978m67079j721332k65234J121128N23939l44769N96771
$$ plain form
40672 2404191 4456171 5881990 5037579 2979252 1303550 -495031 -3561198 -6725255
40664 -6725255 -7290865 -4574077 -738270 2141611 4193494 6329011 8178472 8685963
40656 8685963 8083685 7916379 8960416 10054000 9512506 7238587 4860436 3953216 4669894
40647 4669894 6138610 7638045 9047355 10399271 11320728 10996531 8829005 5316021
40639 5316021 2038131 412760 735061 2800686 6613013 11235223 13717660 11514728
40631 11514728 6354533 3314621 4824482 7731449 8085676 6765002 7645123 11462077
40623 11462077 14640992 13984798 9707237 3691641 -2393294 -6473185 -6231627 -1523369
40615 -1523369 4860110 10003995 13258298 15101846 15228284 13065758 9237637 5375300
$$ packed form
40672B404191K051980J425819q44411k058327j675702j798581l066167l164057
40664f725255n65610K716788L835807K879881K051883K135517J849461N07491
40656H685963o02278j67306J044037J093584n41494k273919k378151r07220P16678
40647D669894J468716J499435J409310J351916R21457l24197k167526l512984
40639E316021l277890j625371L22301K065625L812327M622210K482437k202932
40631A1514728n160195l039912J509861K906967L54227j320674Q80121L816954
40623A1462077L178915o56194m277561o015596o084935m079891K41558M708258
40615a523369O383479N143885L254303J843548J26438k162526l828121l862337
$$ plain form
40607 5375300 2907084 2360967 3059237 3415192 2682035 2306887 3819478 5420154 3354090
40598 3354090 -2251248 -5669772 -2016352 6326095 12292840 12253546 9124606 7780221
40590 7780221 9743882 12810552 14126439 12817211 10440773 9350651 10230333 11273332
40582 11273332 10232716 7055475 3984842 3273044 5181376 7949471 9468667 9319792
40574 9319792 9117977 10215504 11469823 10734289 8376056 7084076 7624167 7402762 4801403
40565 4801403 2466970 3831553 8182223 12014680 13933221 15021706 15207022 12980226
40557 12980226 9034546 6743812 7846615 10329996 11908130 13173245 15607338 18546605
40549 18546605 20325694 21162910 22633039 24792765 25969659 25658847 25910783 28855560
$$ packed form
40607E375300k468216n46117O98270L55955p33157l75148J512591J600676k066064
40598C354090n605338l418524L653420Q342447N966745l9294l128940j344385
40590G780221J963661L066670J315887j309228k376438j090122Q79682J042999
40582A1273332j040616l177241l070633p11798J908332K768095J519196j48875
40574I319792k01815J097527J254319p35534k358233j291980N40091k21405k601359
40565D801403k334433J364583M350670L832457J918541J088485J85316k226796
40557A2980226l945680k290734J102803K483381J578134J265115K434093K939267
40549A8546605J779089Q37216J470129K159726J176894l10812K51936K944777
$$ plain form
40541 28855560 33649006 37039645 37081651 35400321 35049894 36685742 38219753 38389595 38933758
40532 38933758 42034843 46819328 50002614 49410152 45516522 40264466 36003201 34832514
40524 34832514 36747023 38486765 36380405 30718838 25542381 23793477 24493525 25090895
40516 25090895 24637544 23854348 23676553 24542183 25871531 25972166 24017346 22084628 22905566
40507 22905566 25309738 24913800 20471720 16339683 16560385 19506123 21291520 21775377
40499 21775377 23152467 24334351 21657889 15308486 10544282 10992357 14033557 14763668
40491 14763668 12039819 8521759 6650132 6959139 9276898 13176250 17218166 19359999
40483 19359999 18584307 15615528 12203910 10123746 10274203 11898515 12945735 11948215
$$ packed form
40541B8855560M793446L390639M2006j681330l50427J635848J534011J69842N44163
40532C8933758L101085M784485L183286n92462l893630n252056m261265j170687
40524C4832514J914509J739742k106360n661567n176457j748904P00048N97370
40516B5090895m53351p83196j77795Q65630J329348J00635j954820j932718Q20938
40507B2905566K404172l95938m442080m132037K20702K945738J785397M83857
40499B1775377J377090J181884k676462o349403m764204M48075L041200P30111
40491A4763668k723849l518060j871627L09007K317759L899352M041916K141833
40483A9359999p75692k968779l411618k080164J50457J624312J047220r97520
$$ plain form
40475 11948215 9435326 7045932 5670857 5191071 5641130 7431539 10063391 11463017
40467 11463017 9422542 3782844 -3021681 -7644382 -8186670 -5295380 -1295455 1719049
40459 1719049 3170588 3748781 4268391 4998109 5916852 7025918 7966130 7684664 5396628
40450 5396628 2206426 934719 3376347 7996051 11331359 11662684 10211165 8547433
40442 8547433 6356211 2887869 -492392 -992569 2474574 8253802 14096416 18870515
40434 18870515 21766278 21548620 17990119 13080011 9212454 6551643 3741148 1049568
40426 1049568 782555 3770714 7251303 7924566 6104591 4912110 5815636 7117796 6980367
40417 6980367 5672808 4066905 2209325 834045 2008311 5849273 8359528 5832392
$$ packed form
40475A1948215k512889k389394j375075m79786M50059J790409K631852J399626
40467A1463017k040475n639698o804525m622701n42288K891290L999925L014504
40459A719049J451539N78193N19610P29718R18743J109066R40212k81466k288036
40450E396628l190202j271707K441628M619704L335308L31325j451519j663732
40442H547433k191222l468342l380261n00177L467143N779228N842614M774099
40434A8870515K895763k17658l558501m910108l867557k660811k810495k691580
40426A049568k67013K988159L480589O73263j819975j192481R03526J302160j37429
40417F980367j307559j605903j857580j375280J174266L840962K510255k527136
$$ plain form
40409 5832392 681503 -727991 3704697 9389807 11826598 12019387 12946512 14175402
40401 14175402 13670106 12675860 14349607 18139233 19718946 17075874 13108896 11043157
40393 11043157 10419553 9414903 8538352 9567789 12260320 14381169 14386479 12561930 10195025
40384 10195025 8907262 9907729 12408658 13538875 11425861 7785162 5864355 6393904
40376 6393904 7376228 7410200 7000743 6538220 5391429 3759831 3290694 4691290 6550406
40367 6550406 7826267 9580021 12384374 13918889 12047499 9201626 10033935 14395687
40359 14395687 16378088 12181160 5916670 4536518 8693155 12202520 10340168 5240857
40351 5240857 1992422 2148174 3242657 3184232 2639172 3237893 5328427 7988437 10010861
$$ packed form
40409E832392n150889j409494M432688N685110K436791J92789R27125J228890
40401A4175402n05296r94246J673747L789626J579713k643072l966978k065739
40393A1043157o23604j004650q76551J029437K692531K120849N310j824549k366905
40384A0195025j287763J000467K500929J130217k113014l640699j920807N29549
40376F393904R82324L3972m09457m62523j146791j631598m69137J400596J859116
40367F550406J275861J753754K804353J534515j871390k845873Q32309M361752
40359A4395687J982401m196928o264490j380152M156637L509365j862352n099311
40351E240857l248435J55752J094483n8425n45060N98721K090534K660010K022424
$$ plain form
40342 10010861 10246822 7930955 3643286 -439835 -2264590 -1981105 -1452948 -1341093 296222
40333 296222 5399357 12554348 17899860 19416710 18530767 17042065 14764062 11618596
40325 11618596 9698262 10553350 12015024 11012356 8605482 8348015 9889310 8855738
40317 8855738 4269550 1328649 4060906 9217505 11119198 9340442 7377192 6409507
40309 6409507 5407729 5575229 8952467 13134881 13151175 9128606 6496854 7314246 7160106
40300 7160106 3091888 -953570 -679319 1281306 -398611 -5370865 -8720311 -8530945
40292 -8530945 -7321013 -6962720 -6843589 -6598174 -6323417 -4312367 1124867 7481666 9973138
40283 9973138 8081717 5954719 5675128 4908085 2722798 2658816 6890748 11497793 11573965
$$ packed form
40342A0010861K35961k315867m287669m083121j824755K83485N28157J11855J637315
40333B96222N103135P154991N345512J516850q85943j488702k278003l145466
40325A1618596j920334Q55088J461674j002668k406874k57467J541295j033572
40317H855738m586188k940901K732257N156599J901693j778756j963250r67685
40309F409507j001778J67500L377238M182414J6294m022569k631752Q17392j54140
40300G160106m068218m045458K74251J960625j679917m972254l349446J89366
40292h530945J209932L58293J19131K45415K74757K011050N437234O356799K491472
40283I973138j891421k126998k79591p67043k185287o3982M231932M607045P6172
$$ plain form
40274 11573965 8189344 6127789 6705955 7111081 5805071 4409385 4275410 4721080 5135087
40265 5135087 5960336 6946146 6709852 4620994 1397720 -2152047 -5061343 -5254801 -1355794
40256 -1355794 4316114 7321660 6468570 5093242 6011644 7758539 7384291 4791489 2412554
40247 2412554 2185618 4515688 8664050 12391451 12676748 8771905 3469523 -306425
40239 -306425 -2705993 -4802745 -5111518 -1470636 4467277 8205471 8146543 7285843 8510941
40230 8510941 11113102 13031444 13756534 13359620 11103465 7209183 4179543 3993670 5245894
40221 5245894 5408465 4935550 6467964 10256894 13008316 11853531 7575062 3201068
40213 3201068 870773 770352 1882383 2877385 2982175 2608381 2738144 3626707 4793132
$$ packed form
40274A1573965l384621k061555N78166M05126j306010j395686j33975M45670M14007
40265E135087Q25249R85810k36294k088858l223274l549767k909296j93458L899007
40256a355794N671908L005546q53090j375328R18402J746895l74248k592802k378935
40247B412554k26936K330070M148362L727401K85297l904843n302382l775948
40239c06425k399568k096752l08773L640882N937913L738194n8928q60700J225098
40230H510941K602161J918342P25090l96914k256155l894282l029640j85873J252224
40221E245894J62571m72915J532414L788930K751422j154785m278469m373994
40213C201068k330295j00421J112031R95002J04790l73794J29763Q88563J166425
$$ plain form
40204 4793132 6167069 8125453 10288225 11606431 12119578 13345878 16153826 19339945
40196 19339945 21264956 21991885 22685243 23482369 23092956 20352562 15533647 10462899 7766138
40187 7766138 9161158 13580695 17580766 18504734 16670486 13738255 10240337 6434581
40179 6434581 4494947 7007660 12907916 17411139 17274447 14483151 13392769 15539193
40171 15539193 18781097 20638197 20813297 20716485 21818556 24465889 27478049 29042934
40163 29042934 28578040 27292827 26434983 25891996 25406080 25987794 28443179 31229041 31822526
40154 31822526 30068571 28147930 27160054 26056158 24565888 24594866 27022379 29164138
40146 29164138 27920701 24456448 23141576 25890229 29825395 31124215 29308434 26733878
$$ packed form
40204D793132J373937J958384K162772J318206N13147J226300K807948L186119
40196A9339945J925011P26929O93358P97126l89413k740394m818915n070748k696761
40187G766138J395020M419537M000071R23968j834248k932231l497918l805756
40179F434581j939634K512713N900256M503223j36692k791296j090382K146424
40171A5539193L241904J857100J75100r6812J102071K647333L012160J564885
40163B9042934m64894j285213q57844n42987m85916N81714K455385K785862N93485
40154C1822526j753955j920641r87876j103896j490270K8978K427513K141759
40146B9164138j243437l464253j314872K748653L935166J298820j815781k574556
$$ plain form
40138 26733878 25306618 25183485 25973910 27537883 29345711 30282898 30017700 30187336 33220546
40129 33220546 39515186 46236772 49607714 48454886 45045954 42374835 41228038 40282148
40121 40282148 38531159 36721738 36089026 36150023 34627367 30216981 25073168 23243294
40113 23243294 26031585 30098047 31315628 29428317 27208137 26141454 25745976 26743951
40105 26743951 31097770 37590188 40931130 37990876 32529404 30756381 33940334 38436411
40097 38436411 41434292 43066936 43772260 43548589 43879748 46782984 51438727 54952985
40089 54952985 56877797 59623468 63816668 66953781 67800367 68375641 69909455 70619447
40081 70619447 69864849 70948845 76728690 85346135 93491851 101211674 110009644 118787902
$$ packed form
40138B6733878j427260j23133P90425J563973J807828R37187k65198J69636L033210
40129C3220546O294640O721586L370942j152828l408932k671119j146797r45890
40121D0282148j750989j809421o32712O0997j522656m410386n143813j829874
40113B3243294K788291M066462J217581j887311k220180j066683l95478R97975
40105B6743951M353819O492418L340942k940254n461472j773023L183953M496077
40097C8436411K997881J632644P05324k23671L31159K903236M655743L514258
40089E4952985J924812K745671M193200L137113Q46586N75274J533814P09992
40081G0619447p54598J083996N779845Q617445Q145716P719823Q797970Q778258
$$ plain form
40073 118787902 125851134 133014185 143205479 155208157 165380750 173933800 184730776
40066 184730776 198817965 212966364 225525205 239115374 255650893 272478574 285775754
40059 285775754 294966789 301688647 306754795 310028872 311158220 308671510 300345146 286142395
40051 286142395 268987796 251315679 233042397 214442062 198437454 187633703 180876782
40044 180876782 174960538 168111420 159786031 149155161 136710540 125867255 119661473
40037 119661473 116406596 111500236 103296615 94630347 88735722 86207171 85900201 86104058
40029 86104058 84466802 79472003 72955853 68936720 68822270 69683898 68447403 65864358
40021 65864358 64653282 65261095 65653156 64550239 62606311 60342694 57029924 52482767
$$ packed form
40073A18787902P063232P163051J0191294J2002678J0172593Q553050J0796976
40066A84730776J4087189J4148399J2558841J3590169J6535519J6827681J3297180
40059B85775754R191035O721858N066148L274077J129348k486710q326364j4202751
40051B86142395j7154599j7672117j8273282j8600335j6004608j0803751o756921
40044A80876782n916244o849118q325389j0630870j2444621j0843285o205782
40037A19661473l254877m906360q203621q666268n894625k528551l06970K03857
40029H6104058j637256m994799o516150m019133j14450Q61628j236495k583045
40021F5864358j211076O07813L92061j102917j943928k263617l312770m547157
$$ plain form
40013 52482767 48423132 46698130 46958445 47489068 47817250 48777984 50024122 49608650 47033004
40004 47033004 44819059 45282056 47134331 47527678 46466813 46360423 47443155 46858873 43164748
39995 43164748 38941210 37410867 38643846 40698429 42559257 44172779 45244853 45794855
39987 45794855 46412556 46363952 43330104 37147617 31928691 31654690 34959816 37263698 37111987
39978 37111987 37091861 38858371 40835549 41469103 41653505 42660567 43915386 44087646 42760694
39969 42760694 40181331 36946588 34595358 34742984 36729680 37703406 35989064 32985576
39961 32985576 30860107 29851569 29025904 28459268 29208546 31623786 34704297 36892530
39953 36892530 37089885 35456897 33649473 33671634 35966911 38921764 40456509 39886811 38329137
$$ packed form
40013E2482767m059635j725002K60315N30623L28182R60734J246138m15472k575646
40004D7033004k213945M62997J852275L93347j060865j06390J082732n84282l694125
39995D3164748m223538j530343J232979K054583J860828J613522J072074N50002
39987D5794855O17701m8604l033848o182487n218926k74001L305126K303882j51711
39978C7111987k0126J766510J977178O33554J84402J007062J254819J72260j326952
39969D2760694k579363l234743k351230J47626J986696R73726j714342l003488
39961C2985576k125469j008538q25665n66636P49278K415240L080511K188233
39953C6892530J97355j632988j807424K2161K295277K954853J534745n69698j557674
$$ plain form
39944 38329137 37521832 37868840 37516894 34460218 30092549 28881271 32882258 38204910
39936 38204910 39338013 35777245 31489271 28775436 26355572 23473187 21878216 22582504
39928 22582504 24024370 24930472 26020682 27401148 27367150 25687543 25068079 27020378 29053484
39919 29053484 28628862 27272140 27564432 28298789 26415944 22400380 19921845 20618393 22618555
39910 22618555 24060267 24954790 25495435 25453176 25597253 27067604 28854826 28330474 24859042
39901 24859042 20632290 17289603 13983958 9826054 6283211 5707535 8542239 12954065
39893 12954065 16481865 17617585 16715459 15755113 16356672 17818084 17993185 16151892 13962191
39884 13962191 13598596 15824813 19739182 23226591 23920308 21234364 17509289 15801350
$$ packed form
39944C8329137q07305L47008l51946l056676m367669j211278M000987N322652
39936C8204910J133103l560768m287974k713835k419864k882385j594971P04288
39928B2582504J441866R06102J090210J380466l3998j679607o19464J952299K033106
39919B9053484m24622j356722K92292P34357j882845m015564k478535O96548K000162
39910B2618555J441712Q94523N40645m2259J44077J470351J787222n24352l471432
39901B4859042m226752l342687l305645m157904l542843n75676K834704M411826
39893A2954065L527800J135720r02126r60346O01559J461412J75101j841293k189701
39884A3962191l63595K226217L914369L487409O93717k685944l725075j707939
$$ plain form
39876 15801350 16586126 18017169 19049912 20213598 21204341 20192655 16556596 12385632
39868 12385632 9993030 9388767 9411743 9951003 11496291 13393656 14158752 13310705 11810163
39859 11810163 10697104 9950782 8780625 6922375 5695612 7249809 11922673 16777269
39851 16777269 18156481 15714512 12488337 10848928 10087888 8508594 6091474 4075526
39843 4075526 3403553 4680571 8171931 12398268 14044053 11195123 6178530 3591081
39835 3591081 5632154 10440230 14602047 16043418 14722302 11927504 9327196 7971297
39827 7971297 7805241 8150954 8328777 7767240 6409679 5496285 6821070 10171344 12477588
39818 12477588 11017502 6932840 3862708 3178499 2480699 -414278 -3512160 -2254830
$$ packed form
39876A5801350P84776J431043J032743J163686R90743j011686l636059m170964
39868A2385632k392602o04263K2976N39260J545288J897365P65096q48047j500542
39859A1810163j113059p46322j170157j858250j226763J554197M672864M854596
39851A6777269J379212k441969l226175j639409p61040j579294k417120k015948
39843D075526o71973J277018L491360M226337J645785k848930n016593k587449
39835C591081K041073M808076M161817J441371j321116k794798k600308j355899
39827G971297j66056L45713J77823n61537j357561r13394J324785L350274K306244
39818A2477588j460086m084662l070132o84209o97800k894977l097882J257330
$$ plain form
39810 -2254830 5078355 14707927 20623238 20226125 16285395 13286509 12481625 11271984
39802 11271984 7221865 1397785 -3021937 -4603469 -4844116 -5575090 -6460175 -5928278 -4059126
39793 -4059126 -3222800 -5067218 -7514698 -6304914 -144234 6929203 9661586 7357871
39785 7357871 3921520 2521802 2368927 1272647 -706141 -1571450 -152408 2722539
39777 2722539 5028671 4748355 1470525 -2226265 -2434637 1518673 5460714 5236247 2073649
39768 2073649 638810 2374125 3830593 2107908 -1020481 -2046564 -646272 556876
39760 556876 36634 -1070582 -1221891 -366941 818282 2155725 3588997 4371490 3529141
39751 3529141 989456 -2203281 -4670964 -5448663 -4328867 -2055739 -58989 664959
$$ packed form
39810b254830P333185R629572N915311l97113l940730k998886q04884j209641
39802A1271984m050119n824080m419722j581532k40647p30974q85085N31897J869152
39793d059126Q36326j844418k447480J209784O160680P073437K732383k303715
39785G357871l436351j399718j52875j096280j978788q65309J419042K874947
39777B722539K306132k80316l277830l696790k08372L953310L942041k24467l162598
39768B073649j434839J735315J456468j722685l128389j026083J400292J203148
39760E56876n20242j107216j51309Q54950J185223J337443J433272P82493q42349
39751C529141k539685l192737k467683p77699J119796K273128J996750P23948
$$ plain form
39743 664959 528321 644220 1037795 363181 -2139625 -5162946 -6558330 -5544520 -3018574
39734 -3018574 -316247 1432564 1413722 -110873 -1554959 -1774151 -1584304 -2089810 -2261453
39725 -2261453 -346246 2769927 4378216 4220327 4753025 6400147 6226421 3269857 1554516
39716 1554516 4525114 9289214 10419469 7592186 5021270 4448508 3733693 2543878
39708 2543878 4181132 9801812 15033864 15305848 11793681 9193884 9611985 11573178
39700 11573178 13665769 15959200 18038637 18357936 16296766 13309286 11290845 10645488
39692 10645488 10530160 10578227 11800232 15444314 20938663 25571897 26900439 25095890
39684 25095890 22149720 19442907 17451069 17115700 19199527 22140942 22945329 20965073
$$ packed form
39743F64959j36638J15899L93575o74614k502806l023321j395384J013810K525946
39734c018574K702327J748811j8842j524595j444086k19192J89847n05506j71643
39725b261453J915207L116173J608289j57889N32698J647122j73726k956564j715341
39716A554516K970598M764100J130255k827283k570916n72762p14815j189815
39708B543878J637254N620680N232052K71984l512167k599797M18101J961193
39700A1573178K092591K293431K079437L19299k061170k987480k018441o45357
39692A0645488j15328M8067J222005L644082N494349M633234J328542j804549
39684B5095890k946170k706813j991838l35369K083827K941415Q04387j980256
$$ plain form
39676 20965073 18589175 17262710 15344395 11576657 8256222 8379292 11218169 13499977
39668 13499977 14042191 14461164 15729237 16807615 16908643 16708672 16735130 16525514 16101320
39659 16101320 16626383 18754366 21478473 23221809 23156795 21290726 18460737 16414461
39651 16414461 16464362 17684376 17879874 16794653 16717440 19089078 22138385 23180662 21993200
39642 21993200 20412773 19502599 18704277 17238291 14844624 11538235 8141583 6761952
39634 6761952 9025451 13758236 18103907 21231086 25078950 30688469 35823936 37928666
39626 37928666 38026727 39515383 43740533 48976043 53576074 57758153 61880353 65375616
39618 65375616 68463417 72721828 78369079 82900026 84462745 84943583 87180831 90410038
$$ packed form
39676B0965073k375898j326465j918315l767738l320435J23070K838877K281808
39668A3499977N42214M18973J268073J078378J01028j99971K6458k09616m24194
39659A6101320N25063K127983K724107J743336o5014j866069k829989k046276
39651A6414461M9901J220014J95498j085221p7213K371638L049307J042277j187462
39642B1993200j580427r10174p98322j465986k393667l306389l396652j379631
39634F761952K263499M732785M345671L127179L847864N609519N135467K104730
39626C7928666R8061J488656M225150N235510M600031M182079M122200L495263
39618F5375616L087801M258411N647251M530947J562719M80838K237248L229207
$$ plain form
39610 90410038 91522809 90043714 88168121 85743626 79398518 68377563 57680533 52548030
39602 52548030 52149511 51655047 48766594 44957304 41446642 37725070 34181192 32749945
39594 32749945 33722135 34330347 32058492 27886850 24938808 24895776 26788391 28527981 28662858
39585 28662858 27179277 25450645 25131018 26423314 27489058 26014156 21573788 16503174
39577 16503174 14248736 16270148 20285323 22200907 20286840 16785237 14776293 14408311
39569 14408311 13441565 10804103 7978023 6984896 8383506 11194391 13471708 13104170
39561 13104170 9675060 5667900 4189203 5193509 5669530 4011273 2204739 2621302
39553 2621302 4515792 5402845 4598560 3434179 2682351 1826981 829220 775260 2249889
$$ packed form
39610I0410038J112771j479095j875593k424495o345108j1020955j0697030n132503
39602E2548030l98519m94464k888453l809290l510662l721572l543878j431247
39594C2749945R72190O08212k271855m171642k948042m3032J892615J739590J34877
39585B8662858j483581j728632l19627J292296J065744j474902m440368n070614
39577A6503174k254438K021412M015175J915584j914067l501603k008944l67982
39569A4408311r66746k637462k826080r93127J398610K810885K277317l67538
39561A3104170l429110m007160j478697J004306M76021j658257j806534M16563
39553B621302J894490Q87053q04285j164381p51828q55370r97761n3960J474629
$$ plain form
39544 2249889 4360370 5994565 7049728 7742416 7659289 6632468 6082249 8006421 12189068
39535 12189068 15535894 15183009 11738433 8409332 7254056 7552300 7794761 7668298 7481968
39526 7481968 7060756 6217014 5321040 4555547 3653942 3134975 4312808 6873030 8063886
39517 8063886 6110034 3089867 2364694 4349248 7095096 9808223 12930874 15606034
39509 15606034 16251445 15246922 13897823 11228234 5562011 -887096 -3525105 -2269682
39501 -2269682 -2230677 -5774052 -8587796 -6429399 -1529089 1343765 1586469 1397238 743268
39492 743268 -1542073 -3659177 -2722047 302376 1946567 1731709 1930289 2420126 507433
39483 507433 -3828440 -7019000 -7194825 -6432088 -6605040 -6854251 -6731943 -8158780 -11957936
$$ packed form
39544B249889K110481J634195J055163O92688q3127j026821n50219J924172M182647
39535A2189068L346826l52885l444576l329101j155276K98244K42461j26463j86330
39526G481968m21212q43742q95974p65493r01605n18967J177833K560222J190856
39517H063886j953852l020167p25173J984554K745848K713127L122651K675160
39509A5606034O45411j004523j349099k669589n666223o449107k638009J255423
39501b269682L9005l543375k813744K158397M900310K872854K42704j89231o53970
39492G43268k285341k117104R37130L024423J644191k14858J98580M89837j912693
39483E07433m335873l190560j75825P62737j72952k49211J22308j426837l799156
$$ plain form
39474 -11957936 -15374722 -15571450 -13445190 -11626590 -10421754 -8079897 -3934963 780130
39466 780130 4539387 6376371 5788625 3175201 17213 -2264301 -3302612 -3332235 -2577720
39457 -2577720 -1511857 -873382 -1045428 -2084946 -4210673 -7122827 -9080793 -8263322 -5116964
39448 -5116964 -1820320 480319 2106126 2781092 1581814 -799140 -2300116 -2573356
39440 -2573356 -3245503 -4447534 -4088948 -1858202 -845184 -3096400 -6151388 -6451211 -4170501
39431 -4170501 -2253959 -2407831 -4411872 -7688645 -10926905 -11573925 -8525338 -4410655
39423 -4410655 -2611495 -2778545 -1835043 1293632 4708222 6961890 8647565 10243044
39415 10243044 10787910 9524016 7239360 5284602 4294001 4150618 4301667 4039623 3237757
$$ packed form
39474a1957936l416786j96728K126260J818600J204836K341857M144934M715093
39466G80130L759257J836984n87746k613424l157988k281514j038311k9623P54515
39457b577720J065863O38475j72046j039518k125727k912154j957966Q17471L146358
39448e116964L296644K300639J625807O74966j199278k380954j500976k73240
39440b573356o72147j202031L58586K230746J013018k251216l054988k99823K280710
39431d170501J916542j53872k004041l276773l238260o47020L048587M114683
39423d410655J799160j67050R43502L128675L414590K253668J685675J595479
39415A0243044N44866j263894k284656j954758r90601j43383J51049k62044q01866
$$ plain form
39406 3237757 2656921 2898036 3530747 3939272 4327637 5081695 5875524 6148327 5616355
39397 5616355 3823841 572009 -2610024 -3394826 -2151947 -2258431 -5274420 -8228167
39389 -8228167 -8046680 -6362622 -6814725 -9365540 -10820918 -9839495 -7826887 -5505817 -2206129
39380 -2206129 1485518 3573905 3369923 1817877 -582506 -3529985 -5228261 -4100924
39372 -4100924 -1859518 -1641575 -3335204 -4030477 -2806245 -1500556 -977797 -556582 -1044554
39363 -1044554 -3945274 -7360484 -7502361 -5195785 -5829584 -11185359 -16333837 -16982353 -15012873
39354 -15012873 -13744740 -12446338 -9365586 -5964585 -3623964 320345 8109729 15573426
39346 15573426 15942242 8686577 177528 -3910606 -3274569 -844597 488399 -561198
$$ packed form
39406C237757n80836K41115O32711M08525L88365P54058P93829K72803n31972
39397E616355j792514l251832l182033p84802J242879j06484l015989k953747
39389h228167J81487J684058m52103k550815j455378R81423K012608K321070L299688
39380b206129L691647K088387k03982j552046k400383k947479j698276J127337
39372d100924K241406K17943j693629o95273J224232J305689N22759M21215m87972
39363a044554k900720l415210j41877K306576o33799n355775n148478o48516J969480
39354a5012873J268133J298402L080752L401001K340621L944309P789384P463697
39346A5573426L68816p255665q509049m088134O36037K429972J332996j049597
$$ plain form
39338 -561198 -2397984 -1348616 3819859 9315726 10745227 8417961 5307310 1943373
39330 1943373 -2530382 -5981387 -5125477 -1325073 421104 -1343279 -2984456 -2132792
39322 -2132792 -913967 -1327886 -1766932 -505775 840142 63691 -1946866 -2764405 -1758937
39313 -1758937 205971 2612303 4740364 4829271 1993859 -1922601 -4238222 -4589520 -4796076
39304 -4796076 -6086692 -7652409 -7664108 -4944553 46394 5332489 8761050 9450955 7811127
39295 7811127 4681422 1222108 -991419 -1041924 480221 2730503 5870670 9611295
39287 9611295 11739046 10612036 8400204 8781148 11463576 12281288 9358527 5937712
39279 5937712 5844172 9110816 13626195 18107067 21200055 20323997 14549105 7251193 3060847
$$ packed form
39338e61198j836786J049368N168475N495867J429501k327266l110651l363937
39330A943373m473755l451005Q55910L800404J746177j764383j641177Q51664
39322b132792J218825m13919m39046J261157J345917p76451k010557q17539J005468
39313a758937J964908K406332K128061Q8907k835412l916460k315621l51298k06556
39304d796076j290616j565717j1699K719555M990947N286095L428561O89905j639828
39295G811127l129705l459314k213527n0505J522145K250282L140167L740625
39287I611295K127751j127010k211832L80944K682428Q17712k922761l420815
39279E937712r3540L266644M515379M480872L092988q76058n774892p297912m190346
$$ plain form
39270 3060847 2794145 3598995 3420439 2934659 3191845 3614479 3077690 1671262 542451
39261 542451 455266 1100605 1952432 3427146 6249413 9267593 9397873 5470885 1028802
39252 1028802 653451 3885723 5904634 4516731 2800144 3394506 3935840 1109402 -3499115
39243 -3499115 -5314927 -3226240 -655686 -550751 -2223732 -3321397 -2568469 -137457
39235 -137457 2892964 4935812 4950164 3363342 1214467 -1270892 -4353399 -7604026 -10193972
39226 -10193972 -11895145 -12729761 -12178387 -9848881 -6387476 -2682280 1146772 4873729
39218 4873729 7188472 7048845 5373347 3991457 3513138 3564030 4280381 5812290 6944100
39209 6944100 6228809 4442629 4096509 6151369 8504664 8122894 4008604 -1773153 -5403131
$$ packed form
39270C060847k66702Q04850j78556m85780K57186M22634n36789j406428j128811
39261E42451q7185O45339Q51827J474714K822267L018180J30280l926988m442083
39252A028802l75351L232272K018911j387903j716587N94362N41334k826438m608517
39243c499115j815812K088687K570554J04935j672981j097665P52928K431012
39235a37457L030421K042848J4352j586822k148875k485359l082507l250627k589946
39226a0193972j701173q34616N51374K329506L461405L705196L829052L726957
39218D873729K314743j39627j675498j381890m78319N0892P16351J531909J131810
39209F944100p15291j786180l46120K054860K353295l81770m114290n781757l629978
$$ plain form
39200 -5403131 -4332089 -3183 3123068 2291679 -674554 -2349543 -2231805 -2464909 -4172504
39191 -4172504 -6470509 -8554167 -10260948 -10725594 -9013097 -6311002 -5026502 -5148783
39183 -5148783 -3875843 224520 4826210 6808094 5758050 3177351 -59556 -3557003
39175 -3557003 -5839771 -5207557 -2222527 276475 285598 -1067360 -1000836 1546652 4799051
39166 4799051 6462644 6257826 5413730 4462001 3056634 1716126 1700601 2634290 2330933
39157 2330933 44689 -2202877 -3063080 -4379675 -7906305 -11441301 -11404274 -8169180 -5470366
39148 -5470366 -4950510 -4714738 -3435785 -2463175 -2938795 -3755983 -3714464 -3431537 -3877360
39139 -3877360 -4907458 -6224570 -7933315 -9282305 -8806941 -6631305 -4675207 -3708014
$$ packed form
39200e403131J071042M328906L126251q31389k966233j674989J17738k33104j707595
39191d172504k298005k083658j706781m64646J712497K702095J284500j22281
39183e148783J272940M100363M601690J981884j050044k580699l236907l497447
39175c557003k282768O32214K985030K499002R123j352958O6524K547488L252399
39166D799051J663593k04818q44096r51729j405367j340508j5525R33689l03357
39157B330933k286244k247566q60203j316595l526630l534996L7027L235094K698814
39148e470366N19856K35772J278953R72610m75620q17188M1519K82927m45823
39139c877360j030098j317112j708745j348990M75364K175636J956098R67193
$$ plain form
39131 -3708014 -2376929 -205201 963332 227592 -75670 2128628 4549668 2966095
39123 2966095 -2734344 -7757175 -8209107 -5699336 -4926591 -7610769 -10300452 -8658598
39115 -8658598 -3005570 1903398 2801699 1660485 2071261 3672272 2869506 -1701977 -7484777
39106 -7484777 -11718683 -13822941 -13725541 -11131697 -7662842 -6735537 -9467694 -12834929 -13395152
39097 -13395152 -10882733 -7041683 -3407522 -1604610 -2944970 -5625150 -4994276 751139
39089 751139 7281867 9224407 6655744 3798946 3067980 3544174 4052849 4447813 4377846
39080 4377846 3542797 2850863 3185187 3763787 3775767 4434458 6900418 9362183 9115858
39071 9115858 6735394 5217672 5575173 6188525 6014502 5493943 4737190 3756849 3900329
$$ packed form
39131c708014J331085K171728J168533p35740l03262K204298K421040j583573
39123B966095n700439n022831m51932K509771P72745k684178k689683J641854
39115h658598N653028M908968Q98301j141214M10776J601011q02766m571483n782800
39106g484777m233906k104258R7400K593844L468855R27305k732157l367235n60223
39097a3395152K512419L841050L634161J802912j340360k680180O30874N745415
39089G51139O530728J942540k568663k856798p30966M76194N08675L94964o9967
39080D377846q35049o91934L34324N78600J1980O58691K465960K461765k46325
39071I115858k380464j517722L57501O13352j74023n20559p56753r80341J43480
$$ plain form
39062 3900329 5829116 6835054 4149799 570692 2030417 8832683 14247966 13792837
39054 13792837 11339982 12905897 18023535 21153862 19360395 14755669 10582518 8335685
39046 8335685 8322044 10151287 12442088 13919241 14834473 16055940 17371508 18197199 19275177
39037 19275177 21858433 25540308 28644916 30730926 33093453 36494539 39671164 40608624
39029 40608624 38611686 34883343 31544061 30092588 30343024 30794095 30187258 28468300
39021 28468300 26193082 23693700 21213109 19120538 17342826 15147395 12172370 9209720
39013 9209720 7298632 6469169 6086686 6045697 6731794 7830902 7960487 5913548 2171855
39004 2171855 -1031328 -1509335 651544 2888692 2824022 1100537 823537 4026493 9442993
$$ packed form
39062C900329J928787J005938k685255l579107J459725O802266N415283m55129
39054A3792837k452855J565915N117638L130327j793467m604726m173151k246833
39046H335685j3641J829243K290801J477153R15232J221467J315568Q25691J077978
39037A9275177K583256L681875L104608K086010K362527L401086L176625R37460
39029D0608624j996938l728343l339282j451473K50436M51071o06837j718958
39021B8468300k275218k499382k480591k092571j777712k195431k975025k962650
39013I209720j911088q29463l82483m0989O86097J099108J29585k046939l741693
39004B171855l203183m78007K160879K237148o4670j723485k77000L202956N416500
$$ plain form
38995 9442993 14061189 16097167 15885364 14447203 12071001 8501011 4233232 1121899
38987 1121899 966925 3217818 4944024 4004932 1688792 1091809 3278902 6301978 7713999
38978 7713999 6631194 3545775 -117601 -2060050 -557247 3435659 6927954 8082424
38970 8082424 7466959 6067976 4101514 2410172 2712738 5010224 6641777 5670695 3596242
38961 3596242 2725833 2361608 231234 -3052370 -3911047 -584359 4371301 7380976 7976737
38952 7976737 8329094 9704684 10987880 10724832 9389391 8776909 9549508 10459827 10339265
38943 10339265 9770394 9757596 9604643 7820117 4895056 3248431 4044606 5862765 7130348
38934 7130348 8017043 8962639 9190001 8091118 6541124 5340310 3856858 1901271 1345724
$$ packed form
38995I442993M618196K035978k11803j438161k376202l569990m267779l111333
38987A121899j54974K250893J726206r39092k316140n96983K187093L023076J412021
38978G713999j082805l085419l663376j942449J502803L992906L492295J154470
38970H082424o15465j398983j966462j691342L02566K297486J631553r71082k074453
38961C596242q70409l64225k130374l283604q58677L326688M955660L009675N95761
38952G976737L52357J375590J283196k63048j335441o12482P72599R10319j20562
38943A0339265n68871j2798j52953j784526k925061j646625P96175J818159J267583
38934G130348Q86695R45596K27362j098883j549994j200814j483452j955587n55547
$$ plain form
38925 1345724 3576404 6516257 6889453 4909367 3903856 5192846 6144942 4229426
38917 4229426 686763 -1282561 -433494 1914365 4130160 5542876 5868074 4873343 3042092
38908 3042092 1804379 2463111 4921668 7732686 9364417 9101819 6800909 2699122
38900 2699122 -1835790 -4293437 -3244507 -260938 1939704 2997899 4571087 6643694
38892 6643694 7071414 5652014 5427684 7812871 9232415 5704702 -1158709 -6161825
38884 -6161825 -7280488 -6807274 -6454818 -5297640 -2977591 -1279323 -1179698 -1035555 867922
38875 867922 3931103 6432147 7344364 6269435 3452340 556198 -457266 165053 444339
38866 444339 -107516 -229295 -266593 -2505936 -6761709 -8942738 -6440160 -2244206 -780394
$$ packed form
38925A345724K230680K939853L73196j980086j005511J288990R52096j915516
38917D229426l542663j969324Q49067K347859K215795J412716L25198r94731j831251
38908C042092j237713O58732K458557K811018J631731k62598k300910m101787
38900B699122m534912k457647J048930K983569K200642J058195J573188K072607
38892F643694M27720j419400k24330K385187J419544l527713o863411n003116
38884f161825j118663M73214L52456J157178K320049J698268R9625J44143J903477
38875H67922L063181K501044R12217j074929k817095k896142j013464O22319K79286
38866D44339n51855j21779l7298k239343m255773k181029K502578M195954J463812
$$ plain form
38857 -780394 -1774586 -1543014 1094278 3719864 4484502 4008303 3113399 1648682 774
38848 774 -806053 -1118451 -2442893 -4530949 -4964533 -2734762 -172656 211247 -772786
38839 -772786 -462712 1646953 3282734 2622384 597568 -410871 791239 3371670 5638400
38830 5638400 6387896 5304296 2818149 67754 -1378366 -633315 1352717 2301366 768855
38821 768855 -2412875 -5067940 -5629042 -3954705 -997219 1580182 2042691 7829 -2726409
38812 -2726409 -3706242 -2510736 -1353018 -2676919 -6496652 -10357740 -11689357 -9988495
38804 -9988495 -6842275 -4099496 -2232008 -426248 2198735 5835354 9894718 12796171
38796 12796171 12282847 7509457 1166156 -2081196 -327610 3522955 5528719 5293103
$$ packed form
38857g80394r94192K31572K637292K625586P64638m76199q94904j464717j647908
38848G74q06827l12398j324442k088056m33584K229771K562106L83903r84033
38839g72786L10074K109665J635781o60350k024816j008439J202110K580431K266730
38830E638400P49496j083600k486147k750395j446120P45051J986032R48649j532511
38821G68855l181730k655065n61102J674337K957486K577401M62509k034862k734238
38812b726409r79833J195506J157718j323901l819733l861088j331617J700862
38804i988495L146220K742779J867488J805760K624983L636619M059364K901453
38796A2796171n13324m773390o343301l247352J753586L850565K005764k35616
$$ plain form
38788 5293103 5165286 5879292 5369016 2091756 -2460326 -5398684 -5421122 -3478123 -1256878
38779 -1256878 473334 2371538 5266036 7904802 6916240 755974 -6747873 -9283678
38771 -9283678 -5160104 715071 3096296 2385741 2441394 4352240 5349619 3354392 -141256
38762 -141256 -2089982 -842069 3145547 7636123 9327895 6380572 1150815 -1421845
38754 -1421845 662459 4154246 5037070 3510772 2426158 2196359 378314 -3612013
38746 -3612013 -6349493 -4498908 598613 4216044 3580766 604947 -718777 1186209
38738 1186209 3942408 4082787 1224715 -1256875 -222192 3405348 6138628 6654600
38730 6654600 6800649 7595298 6928564 2961071 -2251992 -4984203 -4455193 -2678163 -640481
$$ packed form
38788E293103j27817P14006n10276l277260m552082k938358k2438J942999K221245
38779a256878J730212J898204K894498K638766r88562o160266p503847k535805
38771i283678M123574N875175K381225p10555N5653J910846R97379j995227l495648
38762a41256j948726J247913L987616M490576J691772k947323n229757k572660
38754a421845K084304L491787Q82824j526298j084614k29799j818045l990327
38746c612013k737480J850585N097521L617431o35278k975819j323724J904986
38738A186209K756199J40379k858072k481590J034683L627540K733280N15972
38730F654600J46049P94649o66734l967493n213063k732211N29010J777030K037682
$$ plain form
38721 -640481 2231621 4948679 4818406 1569668 -1356979 -1473667 -811164 -2572805 -6130254
38712 -6130254 -8100614 -7325424 -5967544 -6033869 -7428183 -9495263 -11925757 -13543804 -12523658
38703 -12523658 -8891991 -5028505 -2617049 -784838 1510989 3002896 1902734 -954400
38695 -954400 -2807123 -2303618 -338745 1981973 4095640 4682401 2009606 -3335249 -7743869
38686 -7743869 -8090601 -5059817 -1852516 -465392 -591678 -1507557 -3250070 -5732231 -8038130
38677 -8038130 -9138827 -8567367 -6169656 -2077421 2616082 5856965 5973485 2980065
38669 2980065 -1379422 -4540500 -4550543 -1768495 809378 225557 -3021925 -5525851 -5430595
38660 -5430595 -4603332 -5141869 -5634089 -3378331 658089 2195815 -698224 -5033408 -7035471
$$ packed form
38721f40481K872102K717058j30273l248738k926647j16688O62503j761641l557449
38712f130254j970360P75190J357880o6325j394314k067080k430494j618047J020146
38703a2523658L631667L863486K411456J832211K295827J491907j100162k857134
38695i54400j852723N03505J964873K320718K113667N86761k672795n344855m408620
38686g743869l46732L030784L207301J387124j26286r15879j742513k482161k305899
38677h038130j100697N71460K397711M092235M693503L240883J16520k993420
38669B980065m359487l161078j0043K782048K577873n83821l247482k503926R5256
38660e430595Q27263n38537m92220K255758M036420J537726k894039m335184k002063
$$ plain form
38651 -7035471 -6550878 -5839696 -6128302 -7560330 -10865174 -15988627 -19601594 -17349777 -9556419
38642 -9556419 -2112217 -87178 -2296760 -3972435 -3124247 -1663190 -1083991 -276249 1677865
38633 1677865 3272433 2910878 1762651 2278593 4791759 7501338 9209899 10013433 9498956
38624 9498956 6592787 1853500 -2002808 -3031337 -2328254 -2398400 -4183128 -6474385 -7340065
38615 -7340065 -5475530 -1293773 2498805 2688987 -876307 -4525867 -4800696 -2314634
38607 -2314634 -319104 -441945 -1464853 -1605382 -289119 2021798 4333399 5676292
38599 5676292 6096877 6387791 6062941 3270890 -1700937 -4950839 -3805154 -1404686 -2687594
38590 -2687594 -6845793 -8386373 -5712020 -3407738 -4362692 -4768527 -429595 5887125
$$ packed form
38651g035471M84593P11182k88606j432028l304844n123453l612967K251817P793358
38642i556419P444202K025039k209582j675675Q48188J461057N79199Q07742J954114
38633A677865J594568l61555j148227N15942K513166K709579J708561Q03534n14477
38624I498956k906169m739287l856308j028529P03083p0146j784728k291257q65680
38615g340065J864535M181757L792578J90182l565294l649560k74829K486062
38607b314634J995530j22841j022908j40529J316263K310917K311601J342893
38599E676292M20585K90914l24850k792051m971827l249902J145685K400468j282908
38590b687594m158199j540580K674353K304282r54954m05835M338932O316720
$$ plain form
38582 5887125 7979056 4837405 1049256 -537208 -1888191 -4824870 -6922800 -4675625
38574 -4675625 1131725 5600645 5213142 1769586 37421 1862743 3990075 2598272
38566 2598272 -1397835 -3761490 -2947185 -1647554 -1989798 -2592856 -1893256 -1180990 -1896568
38557 -1896568 -2529940 -1136984 1030301 1442235 291981 -441382 -559233 -1078736 -1238321
38548 -1238321 464911 2892500 3378686 1922082 838718 336960 -1843829 -5762789
38540 -5762789 -7811564 -5377787 -383391 3190165 3327643 684349 -2643946 -4167604
38532 -4167604 -2720609 75435 1660645 2025481 3316755 5984692 8071227 8799906
38524 8799906 9848288 11949091 13080427 11532800 8256802 4655124 609646 -3510075
$$ packed form
38582E887125K091931l141651l788149j586464j350983k936679k097930K247175
38574d675625N807350M468920l87503l443556j732165J825322K127332j391803
38566B598272l996107k363655Q14305J299631l42244o03058O99600P12266p15578
38557a896568o33372J392956K167285M11934j150254p33363j17851n19503j59585
38548a238321J703232K427589M86186j456604j083364n01758k180789l918960
38540e762789k048775K433777M994396L573556J37478k643294l328295j523658
38532d167604J446995K796044J585210L64836J291274K667937K086535P28679
38524H799906J048382K100803J131336j547627l275998l601678m045478m119721
$$ plain form
38516 -3510075 -5470652 -4224572 -2371226 -3062601 -5828421 -7664256 -6971774 -4310840
38508 -4310840 -565726 3272458 5503597 5363207 4731551 5944992 8205141 8348697 5251456
38499 5251456 1448778 -196702 50844 -431403 -3105742 -6379176 -7411812 -5521857
38491 -5521857 -3028513 -2181722 -2194333 -755712 2136120 3926902 3066422 660785 -1679953
38482 -1679953 -3359029 -3730031 -2048605 731494 2612126 3728992 5972566 8599892
38474 8599892 7978102 3513899 -160852 197175 1437915 -598558 -4154162 -4793900 -2902062
38465 -2902062 -2372367 -3331101 -2061337 2062523 5215286 5378608 4751845 4603221 2664941
38456 2664941 -2078275 -6089322 -5561767 -1209395 3465192 6273432 6872611 5668112
$$ packed form
38516c510075j960577J246080J853346o91375k765820j835835O92482K660934
38508d310840L745114L838184K231139j40390o31656J213441K260149J43556l097241
38499E251456l802678j645480K47546m82247k674339l273434j032636J889955
38491e521857K493344Q46791j2611J438621K891832J790782q60480k405637k340738
38482a679953j679076l71002J681426K780099J880632J116866K243574K627326
38474H599892o21790m464203l674751L58027J240740k036473l555604o39738J891838
38465b902062N29695r58734J269764M123860L152763J63322o26763j48624j938280
38456B664941m743216m011047N27555M352372M674587K808240N99179j204499
$$ plain form
38448 5668112 4172271 4420706 6358641 7699649 7524649 7555774 8552472 8389539 5676305
38439 5676305 2380685 344163 -2102009 -6976474 -12415895 -15184475 -15801518 -17315909
38431 -17315909 -19766131 -19758757 -15752246 -10361441 -6559493 -4282253 -1983442 362010
38423 362010 1046171 -1514445 -7063462 -12732968 -14372261 -10373869 -4149356 -864558
38415 -864558 -1411462 -1673844 1532892 6051458 7563774 5565713 3794347 4962541 7156887
38406 7156887 6321320 1271438 -4832807 -7846707 -6684527 -3730482 -1793840 -1479140
38398 -1479140 -1656868 -1595166 -1661722 -2080145 -2044741 -713890 1342484 2508518 2078725
38389 2078725 1118381 805828 636110 -386554 -963202 1999864 8950249 15513302 16856585
$$ packed form
38448E668112j495841K48435J937935J341008j75000L1125R96698j62933k713234
38439E676305l295620k036522k446172m874465n439421k768580o17043j514391
38431a7315909k450222P374M006511N390805L801948K277240K298811K345452
38423C62010O84161k560616n549017n669506j639293L998392O224513L284798
38415h64558n46904k62382L206736M518566J512316j998061j771366J168194K194346
38406G156887q35567n049882o104245l013900J162180K954045J936642L14700
38398a479140j77728O1702o6556m18423L5404J330851K056374J166034m29793
38389B078725r60344l12553j69718j022664n76648K963066O950385O563053J343283
$$ plain form
38380 16856585 13257878 9030524 6680718 5155428 3817992 4394355 7452396 10210748
38372 10210748 10330865 9410710 9831866 10159907 7222180 1693924 -2101425 -1879357 460929
38363 460929 2665902 4680915 6301611 5522798 1445878 -3208065 -4834568 -3200153
38355 -3200153 -1178720 -990725 -2338186 -3896744 -5221708 -6979819 -9813752 -12852349
38347 -12852349 -13473187 -9749461 -3592629 131845 -1044409 -3949381 -3668906 97941
38339 97941 2819029 1290217 -2348363 -3943831 -2966343 -2696247 -5097879 -7730480 -7086885
38330 -7086885 -3817244 -2327864 -4680720 -7069859 -4430375 2531257 7687049 7033891
38322 7033891 3064331 391826 -295009 -1493468 -3973969 -5815643 -5843512 -5051052 -4292812
$$ packed form
38380A6856585l598707m227354k349806j525290j337436N76363L058041K758352
38372A0210748J20117r20155M21156L28041k937727n528256l795349K22068K340286
38363D60929K204973K015013J620696p78813m076920m653943j626503J634415
38355c200153K021433J87995j347461j558558j324964j758111k833933l038597
38347a2852349o20838L723726O156832L724474j176254k904972K80475L766847
38339I7941K721088j528812l638580j595468R77488K70096k401632k632601O43595
38330g086885L269641J489380k352856k389139K639484O961632N155792o53158
38322G033891l969560k672505o86835j198459k480501j841674k7869P92460P58240
$$ plain form
38313 -4292812 -3085316 -1377362 -344707 -570917 -1308384 -2314150 -4426244 -7349441
38305 -7349441 -8984340 -8316085 -6909810 -5892836 -3709399 662736 4249066 3274284
38297 3274284 -1028297 -3398110 -1559968 919725 -372252 -5492684 -11015850 -13850961
38289 -13850961 -13025012 -9723062 -6874967 -6900521 -8584621 -8019895 -4057464 -799195 -2621732
38280 -2621732 -8326336 -12613092 -12280979 -8545850 -4055047 -430682 1268797 411794
38272 411794 -1992093 -3824767 -4477696 -5441426 -7499778 -8884319 -7546314 -4306708 -2188517
38263 -2188517 -2729554 -4237300 -4229854 -2755248 -2111371 -3279462 -4165543 -2607529 18886
38254 18886 446002 -1454523 -2031843 853737 4542959 5341672 3302244 914261 -1081293
$$ packed form
38313d292812J207496J707954J032655k26210p37467j005766k112094k923197
38305g349441j634899O68255J406275J016974K183437M372135L586330r74782
38297C274284m302581k369813J838142K479693j291977n120432n523166k835111
38289a3850961Q25949L301950K848095k5554j684100N64726L962431L258269j822537
38280b621732n704604m286756L32113L735129M490803L624365J699479q57003
38272D11794k403887j832674o52929r63730k058352j384541J338005L239606K118191
38263b188517n41037j507746P446J474606O43877j168091q86081J558014K626415
38254A8886M27116j900525n77320K885580L689222P98713k039428k387983j995554
$$ plain form
38245 -1081293 -3708240 -6875182 -9452745 -11304904 -12261754 -10112163 -3433943 3902642
38237 3902642 5421374 221546 -5347046 -5700410 -2227945 382139 539117 -369372 -1786628
38228 -1786628 -4182801 -6771422 -8122841 -8576320 -9707773 -11682695 -12983295 -12599877
38220 -12599877 -11157921 -10051600 -10138269 -10617101 -8936015 -3420626 3396285 6322462
38212 6322462 3719785 -241302 -1537153 -1985109 -5921501 -13011736 -18125798 -17822485
38204 -17822485 -13598831 -8734693 -5027608 -3105169 -3202253 -4626390 -6230063 -7942429
38196 -7942429 -10383079 -13055842 -14730033 -15425244 -15946186 -15636903 -13070341 -9139442 -6819648
38187 -6819648 -7177569 -8022596 -7347966 -5725100 -4208752 -2269083 564215 2891152 3051754
$$ packed form
38245a081293k626947l166942k577563j852159r56850K149591O678220P336585
38237C902642J518732n199828n568592l53364L472465K610084J56978r08489j417256
38228a786628k396173k588621j351419m53479j131453j974922j300600L83418
38220a2599877J441956J106321q6669m78832J681086N515389O816911K926177
38212F322462k602677l961087j295851m47956l936392p090235n114062L03313
38204a7822485M223654M864138L707085J922439r7084j424137j603673j712366
38196g942429k440650k672763j674191o95211n20942L09283K566562L930899K319794
38187f819648l57921q45027O74630J622866J516348J939669K833298K326937J60602
$$ plain form
38178 3051754 1262974 -1187957 -3497615 -4811982 -3778906 -426777 2769784 3631166
38170 3631166 3159643 3749924 5262690 5104006 2063506 -2103493 -5373868 -7838652 -10365728
38161 -10365728 -12235271 -11625577 -8160725 -3820539 -1078151 -787679 -2143292 -3984909
38153 -3984909 -5449191 -5897733 -5492538 -5909177 -8936714 -13547981 -15825140 -13392383 -8982273
38144 -8982273 -7579971 -10295764 -13094048 -11791500 -6416008 -220766 3560754 3084971
38136 3084971 -1831304 -8912613 -14046728 -14707267 -12560064 -11350541 -12443251 -13734508
38128 -13734508 -12887680 -10182918 -7572758 -6019474 -4988721 -4301127 -4954067 -7126674
38120 -7126674 -8353856 -5617392 545744 5968069 7785192 7458367 7283186 6107325
$$ packed form
38178C051754j788780k450931k309658j314367J033076L352129L196561Q61382
38170C631166m71523N90281J512766j58684l040500m166999l270375k464784k527076
38161a0365728j869543O09694L464852M340186K742388K90472j355613j841617
38153c984909j464282m48542M05195m16639l027537m611267k277159K432757M410110
38144h982273J402302k715793k798284J302548N375492O195242L781520m75783
38136C084971m916275p081309n134115o60539K147203J209523j092710j291257
38128a3734508Q46828K704762K610160J553284J030753O87594o52940k172607
38120g126674j227182K736464O163136N422325J817123l26825j75181j175861
$$ plain form
38112 6107325 1617410 -4364114 -6869341 -4415786 -968017 -46876 -223231 1549034
38104 1549034 5029357 7813481 9229532 10094224 9899690 7354736 3313436 448308
38096 448308 -135872 171111 147166 391035 1781637 3741697 4743430 3877655 1766588
38087 1766588 359413 1349858 4061308 5631446 4378565 2202090 2236442 4864996 7822503
38078 7822503 9655554 10837053 11509390 10649414 8302395 6469499 6325514 6083274 3318398
38069 3318398 -1429613 -4961209 -4939509 -1774678 2749857 7173842 10250542 10514538 7377436
38060 7377436 2629167 -209565 1156944 5468168 8842427 8166003 3624772 -1780020
38052 -1780020 -4898322 -4855432 -3353788 -2674926 -3280806 -3678617 -2720885 -1072822 327914
$$ packed form
38112F107325m489915n981524k505227K453555L447769R21141j76355J772265
38104A549034L480323K784124J416051Q64692j94534k544954m041300k865128
38096D48308n84180L06983k3945K43869J390602J960060J001733q65775k111067
38087A766588j407175R90445K711450J570138j252881k176475L4352K628554K957507
38078G822503J833051J181499O72337q59976k347019j832896j43985k42240k764876
38069C318398m748011l531596K1700L164831M524535M423985L076700K63996l137102
38060G377436m748269k838732J366509M311224L374259o76424m541231n404792
38052a780020l118302M2890J501644O78862o05880l97811R57732J648063J400736
$$ plain form
38043 327914 2011708 4437916 5618685 2957727 -2389997 -5837896 -5063634 -2700170
38035 -2700170 -1789897 -1429989 335151 1679930 -984839 -6984227 -11307987 -10968919 -8125601
38026 -8125601 -5997904 -4755790 -3060396 -1170607 -302194 -338082 -176902 451425 1119142
38017 1119142 2047959 3901967 6520927 8855481 9854791 8810862 5630911 1666083
38009 1666083 -730093 -929822 -1617361 -5784860 -12293265 -16492509 -15820602 -12758430 -10860450
38000 -10860450 -9629943 -5823030 772923 5875820 6067968 3281147 1901251 2838917
37992 2838917 3113923 998312 -1217822 -519450 2830912 6015890 7090437 6268730 4700521
37983 4700521 3439599 3220786 4013067 4785877 4317391 2044873 -1942664 -6690654 -9717929
$$ packed form
38043C27914J683794K426208J180769k660958n347724l447899P74262K363464
38035b700170R10273L59908J765140J344779k664769n999388m323760L39068K843318
38026h125601K127697J242114J695394J889789Q68413l5888J61180O28327O67717
38017A119142R28817J854008K618960K334554R99310j043929l179951l964828
38009A666083k396176j99729o87539m167499o508405m199244O71907L062172J897980
38000a0860450J230507L806913O595953N102897J92148k786821j379896R37666
37992B838917K75006k115611k216134O98372L350362L184978J074547q21707j568209
37983D700521j260922k18813P92281P72810m68486k272518l987537m747990l027275
$$ plain form
37974 -9717929 -8185992 -2161480 4387584 7489037 7267839 6521645 6162118 4534913 1185311
37965 1185311 -1410155 -1123535 527716 88767 -3308962 -6512022 -5874041 -1690477 1713367
37956 1713367 775554 -3079180 -5205337 -3413548 -18445 2022611 2481447 2083331 114519
37947 114519 -3540218 -6059632 -4884181 -2069368 -1574748 -2659370 -411238 6206430
37939 6206430 11125020 8476669 201725 -6516327 -7584898 -4948067 -2300837 -901547
37931 -901547 -34958 518007 -55103 -1939643 -3468908 -2557092 287276 1434108 -2065358
37922 -2065358 -8620167 -13496236 -13849402 -10953542 -7739034 -5843194 -5028145 -3815381
37914 -3815381 -706220 3712301 6362293 5257787 2637793 1857334 2043479 -362477
$$ packed form
37974i717929J531937O024512O549064L101453k21198p46194l59527j627205l349602
37965A185311k595466K86620J651251m38949l397729l203060O37981M183564L403844
37956A713367r37813l854734k126157J791789L395103K041056M58836l98116j968812
37947A14519l654737k519414J175451K814813M94620j084622K248132O617668
37939F206430M918590k648351q274944o718052j068571K636831K647230J399290
37931i01547Q66589N52965n73110j884540j529265R11816K844368J146832l499466
37922b065358o554809m876069l53166K895860L214508J895840Q15049J212764
37914c815381L109161M418521K649992j104506k619994p80459J86145k405956
$$ plain form
37906 -362477 -4906778 -6613124 -3378619 658733 1387941 245424 543138 2001147 2612560
37897 2612560 3005830 4904360 7288418 7903506 6964178 5871399 4039138 802372 -1201457
37888 -1201457 1073095 5775647 8090138 6951631 5608500 5868892 6397358 6963667 9471706
37879 9471706 13379604 14512365 10675166 5038642 1615163 158097 -2093598 -5880214
37871 -5880214 -9495333 -11241543 -10343869 -6913643 -2887272 -1717562 -5161995 -10972683
37863 -10972683 -15100341 -15650386 -13812916 -11692893 -10152048 -8326520 -4839292 92848
37855 92848 4086459 5193110 4532199 4592384 5374822 4621868 1839527 -708303 -1505716
37846 -1505716 -1349945 -572476 2008223 5729727 7045866 4569019 2473234 5461604
$$ packed form
37906c62477m544301j706346L234505M037352P29208j142517K97714J458009O11413
37897B612560L93270J898530K384058O15088r39328j092779j832261l236766k003829
37888a201457K274552M702552K314491j138507j343131K60392N28466N66309K508039
37879I471706L907898J132761l837199n636524l423479j457066k251695l786616
37871e880214l615119j746210Q97674L430226M026371J169710l444433n810688
37863a0972683m127658n50045J837470K120023J540845J825528L487228M932140
37855I2848L993611J106651o60911O0185P82438p52954k782341k547830p97413
37846a505716J55771P77469K580699L721504J316139k476847k095785K988370
$$ plain form
37838 5461604 12027962 16241990 15326836 11940590 9065654 6140175 1371165 -4641925
37830 -4641925 -9306157 -10896371 -9795878 -7517290 -5419953 -4135092 -3461912 -2525894
37822 -2525894 -390505 2846779 5470842 5562941 3543590 2071449 2207416 1254935 -3209962
37813 -3209962 -8493183 -9588209 -6464085 -4185432 -4957787 -4896715 -1023630 3276513 3662176
37804 3662176 1770695 1754173 2716375 474288 -4424184 -6524867 -3654911 90978 779779
37795 779779 -603918 -1507105 -1697942 -1572673 -125500 2819417 5101985 5369055 5355181
37786 5355181 6769509 8238148 7827523 6478137 6110242 6038909 4417351 2201392 2413911
37777 2413911 5568083 8619109 8990379 7541481 6753112 7402391 7953040 6675971 3829113
$$ packed form
37838E461604O566358M214028r15154l386246k874936k925479m769010o013090
37830d641925m664232j590214J100493K278588K097337J284861O73180R36018
37822b525894K135389L237284K624063R2099k019351j472141J35967r52481m464897
37813c209962n283221j095026L124124K278653p72355O1072L873085M300143L85663
37804C662176j891481j6522R62202k242087m898472k100683K869956L745889O88801
37795G79779j383697r03187j90837J25269J447173K944917K282568K67070j3874
37786E355181J414328J468639m10625j349386l67895p1333j621558k215959K12519
37777B413911L154172L051026L71270j448898p88369O49279N50649j277069k846858
$$ plain form
37768 3829113 1560636 1251616 1179008 -1820692 -7917358 -13227792 -14378997 -12521734 -11062383
37759 -11062383 -10843130 -10010688 -7929589 -6465844 -7061113 -8689374 -9423970 -8570796 -6774998
37750 -6774998 -5277317 -5359734 -7266152 -9423764 -9966654 -9127140 -8656889 -8742522 -7352519
37741 -7352519 -3359718 1389220 4252332 4807330 4614514 5026529 6288315 7840903 8432715
37732 8432715 6862218 3782033 1823923 2487245 3658703 1935325 -2948228 -7746756
37724 -7746756 -9666288 -8902633 -7027307 -4876834 -3019517 -2573429 -3889151 -5373921
37716 -5373921 -5343411 -4548390 -5096375 -7021711 -7976209 -6885959 -5831758 -6797609 -8178385
37707 -8178385 -6844252 -2993461 -345408 -1273161 -4265457 -7066023 -9648004 -12184337
$$ packed form
37768C829113k268477l09020p2608k999700o096666n310434j151205J857263J459351
37759a1062383K19253Q32442K081099J463745n95269j628261p34596Q53174J795798
37750f774998J497681q2417j906418k157612n42890Q39514M70251q5633J390003
37741g352519L992801M748938K863112N54998j92816M12015J261786J552588N91812
37732H432715j570497l080185j958110O63322J171458j723378m883553m798528
37724g746756j919532P63655J875326K150473J857317M46088j315722j484770
37716e373921L0510P95021n47985j925336r54498J090250J054201r65851j380776
37707h178385J334133L850791K648053r27753k992296k800566k581981k536333
$$ plain form
37699 -12184337 -12517631 -8858854 -3796986 -2002714 -3960547 -5447877 -3908304 -1776819
37691 -1776819 -1874152 -2995810 -2899580 -2851257 -5332606 -8824387 -9193636 -6078982 -3826649
37682 -3826649 -5229988 -7868790 -8166549 -6067947 -3677769 -1724066 160994 1332061
37674 1332061 850403 -612672 -1732234 -2656484 -4212433 -5700401 -5636252 -4367448 -3867440
37665 -3867440 -4930835 -6435151 -7449483 -8194845 -8605240 -7733580 -5218970 -1991394 911525
37656 911525 2968185 3530568 2330974 1026248 2176633 5665900 7996556 6522487
37648 6522487 2736007 -264440 -1934285 -3688859 -5417487 -5539238 -4376112 -4514400
37640 -4514400 -6886958 -8891957 -8014594 -5666668 -5471818 -8598559 -12747139 -15436021
$$ packed form
37699a2184337l33294L658777N061868J794272j957833j487330J539573K131485
37691a776819r7333j121658R6230M8323k481349l491781l69249L114654K252333
37682c826649j403339k638802k97759K098602K390178J953703J885060J171067
37674A332061m81658j463075j119562r24250j555949j487968O4149J268804N00008
37665c867440j063395j504316j014332p45362m10395Q71660K514610L227576K902919
37656I11525K056660N62383j199594j304726J150385L489267K330656j474069
37648F522487l786480l000447j669845j754574j728628j21751J163126j38288
37640d514400k372558k004999Q77363K347926J94850l126741m148580k688882
$$ plain form
37632 -15436021 -16232988 -15392559 -12474350 -7900520 -4538613 -5416038 -9852679 -13836551
37624 -13836551 -14798537 -14117990 -13777322 -12616209 -8425892 -2715332 -108508 -2405767
37616 -2405767 -6034752 -6909700 -5687712 -6148264 -9767960 -14226098 -16685234 -16408821 -14270360
37607 -14270360 -11677807 -10334285 -11395613 -14094324 -16091574 -15615188 -12678567 -8401389
37599 -8401389 -4178103 -1346192 -307149 148333 1308740 2238227 653474 -3456531
37591 -3456531 -6935184 -7256244 -5658708 -5065304 -6126808 -7060262 -6554950 -4869912 -2382049
37582 -2382049 873912 3849679 4495726 2143416 -1255766 -3384080 -4382772 -6235101
37574 -6235101 -9497790 -11888239 -10798467 -6643310 -2734835 -1610305 -2215737 -1422489
$$ packed form
37632a5436021p96967Q40429K918209M573830L361907q77425m436641l983872
37624a3836551r61986O80547L40668J161113M190317N710560K606824k297259
37616b405767l628985q74948J221988m60552l619696m458138k459136K76413K138461
37607a4270360K592553J343522j061328k698711j997250M76386K936621M277178
37599h401389M223286K831911J039043M55482J160407R29487j584753m110005
37591c456531l478653l21060J597536N93404j061504r33454N05312J685038K487863
37582b382049L255961K975767O46047k352310l399182k128314r98692j852329
37574f235101l262689k390449J089772M155157L908475J124530o05432P93248
$$ plain form
37566 -1422489 1988874 5719604 6392689 2882011 -2907648 -7765094 -9391217 -7796631
37558 -7796631 -5106667 -3402437 -2415390 -260845 3107641 4625509 1653652 -4237115
37550 -4237115 -8808209 -10028434 -9622641 -9974744 -11519560 -13537113 -15524547 -16866313
37542 -16866313 -16750041 -15507626 -14704883 -14745590 -13694596 -9979160 -5216557 -2514592 -2440605
37533 -2440605 -2542349 -948157 1207123 1507519 -706484 -3695675 -5174195 -4442388 -2994515
37524 -2994515 -3000858 -4808162 -6223592 -4926309 -1298342 1988547 2942118 1710382 -791314
37515 -791314 -4171556 -7775508 -9734930 -8091881 -2932196 3074659 6466080 5630427
37507 5630427 2164996 -484056 -300196 1351964 1415449 -1538504 -6249573 -10409384 -12221507
$$ packed form
37566a422489L411363L730730O73085l510678n789659m857446j626123J594586
37558g796631K689964J704230R87047K154545L368486J517868k971857n890767
37550d237115m571094j220225M05793l52103j544816k017553j987434j341766
37542a6866313J16272J242415Q02743m0707J050994L715436M762603K701965P3987
37533b440605j01744J594192K155280L00396k214003k989191j478520P31807J447873
37524b994515o343j807304j415430J297283L627967L286889R53571j231736k501696
37515g91314l380242l603952j959422J643049N159685O006855L391421q35653
37507E630427l465431k649052J83860J652160O3485k953953m711069m159811j812123
$$ [...]
##END NTUPLES=NMR SPECTRUM
##END=
