##TITLE=31Pdec_DE-77Fk_TFA
 CDCl3, 128 sc
 28.11.2024
##JCAMPDX= 6.0         $$ Bruker NMR JCAMP-DX V2.0
##DATA TYPE= NMR SPECTRUM
##DATA CLASS= NTUPLES
##ORIGIN= UXNMR, Bruker Analytische Messtechnik GmbH
##OWNER= root
$$ XWIN-NMR		Version 3.5
$$ Thu Nov 28 16:12:33 2024 Russian Standard Time (UT+4h)  she@DPX200
##.OBSERVE FREQUENCY= 81.013821
##.OBSERVE NUCLEUS= ^31P
##.ACQUISITION MODE= SIMULTANEOUS
##.ACQUISITION SCHEME= undefined
##.AVERAGES= 128
##.DIGITISER RES= 17
##SPECTROMETER/DATA SYSTEM= spect
##.PULSE SEQUENCE= zgpg30
##.SOLVENT NAME= CDCl3
##.SHIFT REFERENCE= (INTERNAL, CDCl3, 0, 198.062)
##AUDIT TRAIL= $$ (NUMBER, WHEN, WHO, WHERE, WHAT)
$$ ##TITLE= Audit trail, XWIN-NMR		Version 3.5
$$ ##JCAMPDX= 5.01
$$ ##ORIGIN= Bruker BioSpin GmbH
$$ ##OWNER= she
$$ F:/spectra/data/she/nmr/P31/2/pdata/1/auditp.txt
$$ ##AUDIT TRAIL=  $$ (NUMBER, WHEN, WHO, WHERE, WHAT)
(   1,<2024-11-28 16:11:33.79 +0400>,<she>,<DPX200>,
      <continue with go, POWCHK disabled, PULCHK disabled
       configuration hash MD5:
       00 E9 B6 7A A2 85 ED C7 34 08 36 98 17 FE 4E 26
       data hash MD5: 32K
       AF FE 5A D7 CB F8 B8 AA FC 76 3B B6 9A 63 37 CB>)
(   2,<2024-11-28 16:11:39.15 +0400>,<she>,<DPX200>,
      <Start of raw data processing
       efp BC_mod = 2 LB = 1.5 FT_mod = 6 PKNL = 1 PHC0 = 2217.861 PHC1 = 272.4883 SI = 64K 
       data hash MD5: 64K
       D8 3C 13 67 E6 DD 58 16 4D 4A 12 F6 41 0C 1D F7>)
(   3,<2024-11-28 16:11:51.84 +0400>,<she>,<DPX200>,
      <abs ABSG = 5 
       data hash MD5: 64K
       03 26 29 BC 6E 50 21 27 6D D7 BE CC BD C6 27 2C>)
$$ ##END=
$$ 
$$ hash MD5
$$ FA 6D 36 0F 98 E0 94 4A 61 B7 8B 4F AD B7 84 79
##$RELAX= 
##$RELAX= 
##$RELAX= 
##$RELAX= 
##$RELAX= 
##$RELAX= 
##$RELAX= 
##$RELAX= 
$$ Bruker specific parameters
$$ --------------------------
##$DU= <F:/spectra>
##$EXPNO= 2
##$NAME= <P31>
##$PROCNO= 1
##$TYPE= <nmr>
##$USER= <she>
##$AMP= (0..31)
100 100 100 100 100 100 100 100 100 100 100 100 100 100 100 100 100 100 
100 100 100 100 100 100 100 100 100 100 100 100 100 100 
##$AQSEQ= 0
##$AQ_mod= 1
##$AUNM= <au_zg>
##$AUTOPOS= <>
##$BF1= 81.014009
##$BF2= 200.13
##$BF3= 200.13
##$BF4= 200.13
##$BF5= 200.13
##$BF6= 200.13
##$BF7= 200.13
##$BF8= 200.13
##$BYTORDA= 1
##$CFDGTYP= 0
##$CFRGTYP= 5
##$CHEMSTR= <none>
##$CNST= (0..31)
1 1 145 1 1 1 1 1 1 1 1 1 1 1 1 1 1 1 1 1 1 1 1 1 1 1 1 1 1 1 1 1 
##$CPDPRG= <waltz16>
##$CPDPRG1= <>
##$CPDPRG2= <waltz16>
##$CPDPRG3= <>
##$CPDPRG4= <mlev>
##$CPDPRG5= <mlev>
##$CPDPRG6= <mlev>
##$CPDPRG7= <mlev>
##$CPDPRG8= <mlev>
##$CPDPRGB= <>
##$CPDPRGT= <>
##$D= (0..31)
0 1 0 0 0 0 0 0 0 0.06 0 0.03 2e-05 3e-06 0 0 0.0002 0 0 0 0 0 0 0 0 0 
0 0 0 0 0 0 
##$DATE= 1732795683
##$DBL= (0..7)
120 120 120 11 120 120 24 19 
##$DBP= (0..7)
150 150 150 150 150 150 150 150 
##$DBP07= 0
##$DBPNAM0= <>
##$DBPNAM1= <>
##$DBPNAM2= <>
##$DBPNAM3= <>
##$DBPNAM4= <>
##$DBPNAM5= <>
##$DBPNAM6= <>
##$DBPNAM7= <>
##$DBPOAL= (0..7)
0.5 0.5 0.5 0.5 0.5 0.5 0.5 0.5 
##$DBPOFFS= (0..7)
0 0 0 0 0 0 0 0 
$$ [...]
##$SUBNAM3= <"">
##$SUBNAM4= <"">
##$SUBNAM5= <"">
##$SUBNAM6= <"">
##$SUBNAM7= <"">
##$SUBNAM8= <"">
##$SUBNAM9= <"">
##$SW= 400.765351723535
##$SWIBOX= (0..15)
0 1 3 0 0 0 0 0 0 0 0 0 0 0 0 0 
##$SW_h= 32467.5324675325
##$TD= 32768
##$TD0= 1
##$TE= 0
##$TE2= 300
##$TE3= 300
##$TEG= 300
##$TL= (0..7)
0 120 53 12 22 120 120 120 
##$TP= (0..7)
150 150 150 150 150 150 150 150 
##$TP07= 0
##$TPNAME0= <>
##$TPNAME1= <>
##$TPNAME2= <>
##$TPNAME3= <>
##$TPNAME4= <>
##$TPNAME5= <>
##$TPNAME6= <>
##$TPNAME7= <>
##$TPOAL= (0..7)
0.5 0.5 0.5 0.5 0.5 0.5 0.5 0.5 
##$TPOFFS= (0..7)
0 0 0 0 0 0 0 0 
##$TUNHIN= 0
##$TUNHOUT= 0
##$TUNXOUT= 0
##$USERA1= <user>
##$USERA2= <user>
##$USERA3= <user>
##$USERA4= <user>
##$USERA5= <user>
##$V9= 5
##$VALIST= <valist>
##$VCLIST= <CCCCCCCCCCCCCCC>
##$VD= 0
##$VDLIST= <DDDDDDDDDDDDDDD>
##$VPLIST= <PPPPPPPPPPPPPPP>
##$VTLIST= <TTTTTTTTTTTTTTT>
##$WBST= 1024
##$WBSW= 4
##$XGAIN= (0..3)
0 0 0 0 
##$XL= 0
##$YL= 0
##$YMAX_a= 13076
##$YMIN_a= -20990
##$ZGOPTNS= <>
##$ZL1= 120
##$ZL2= 120
##$ZL3= 120
##$ZL4= 120
##$ABSF1= 198.0616
##$ABSF2= -202.7028
##$ABSG= 5
##$ABSL= 3
##$ALPHA= 0
##$AQORDER= 0
##$ASSFAC= 0
##$ASSFACI= 0
##$ASSFACX= 0
##$ASSWID= 0
##$AUNMP= <proc_1d>
##$AZFE= 0.1
##$AZFW= 0.5
##$BCFW= 0
##$BC_mod= 2
##$BYTORDP= 0
##$COROFFS= 0
##$CY= -3
##$DATMOD= 1
##$DC= 0
##$DFILT= <>
##$DTYPP= 0
##$F1P= 0
##$F2P= 0
##$FCOR= 1
##$FTSIZE= 65536
##$FT_mod= 6
##$GAMMA= 0
##$GB= 0
##$INTBC= 1
##$INTSCL= 9.790993e-09
##$ISEN= 30
##$LB= 1.5
##$LEV0= 0
##$LPBIN= 0
##$MAXI= 10000
##$MC2= 0
##$MEAN= 0
##$ME_mod= 0
##$MI= 50
##$NCOEF= 0
##$NC_proc= -9
##$NLEV= 6
##$NOISF1= 182.463
##$NOISF2= 159.3651
##$NSP= 0
##$NTH_PI= 0
##$NZP= 0
##$OFFSET= 198.0616
##$PC= 4
##$PHC0= 2217.861
##$PHC1= 272.4883
##$PH_mod= 1
##$PKNL= yes
##$PPARMOD= 0
##$PSCAL= 0
##$PSIGN= 0
##$REVERSE= no
##$SF= 81.0140089999434
##$SI= 65536
##$SIGF1= 159.3651
##$SIGF2= -187.1042
##$SINO= 113.3802
##$SIOLD= 16384
##$SREGLST= <1H.CDCl3>
##$SSB= 0
##$STSI= 65536
##$STSR= 0
##$SW_p= 32467.5324675325
##$SYMM= 0
##$S_DEV= 0
##$TDeff= 32768
##$TDoff= 0
##$TI= <>
##$TILT= no
##$TM1= 0
##$TM2= 0
##$TOPLEV= 0
##$USERP1= <user>
##$USERP2= <user>
##$USERP3= <user>
##$USERP4= <user>
##$USERP5= <user>
##$WDW= 1
##$XDIM= 65536
##$YMAX_p= 148587440
##$YMIN_p= -371191411
$$ End of Bruker specific parameters
$$ ---------------------------------
##NTUPLES= NMR SPECTRUM
##VAR_NAME=  FREQUENCY,     SPECTRUM/REAL,   SPECTRUM/IMAG
##SYMBOL=    X,             R,               I
##VAR_TYPE=  INDEPENDENT,   DEPENDENT,       DEPENDENT
##VAR_FORM=  AFFN,          ASDF,            ASDF
##VAR_DIM=   65536,         65536,           65536
##UNITS=     HZ,            ARBITRARY UNITS, ARBITRARY UNITS
##FACTOR=    0.49542278885378, 1,            1
##FIRST=     16045.7642231865, 0,            0
##LAST=      -16421.768244346, 0,            0
##MIN=       -16421.768244346, -371191411,   0
##MAX=       16045.7642231865, 148587440,    0
$$ Real data points
##PAGE= N=1
##DATA TABLE= (X++(R..R)), XYDATA
$$ [...]
6566B7912401o493673l791981M113080P871891M515522j311617n980357q962470
6558A7872796q133792j855439M368649K179065p154374j2426707p015500L053547
6550i111755P900533M668253k288447o303169k096805R221657J7479182J2449685
6542C1919134k620318j3060136j0071844P30526R131291J0385967L847840q384755
6534B1877705j7456752j2613875L667607J4421723R168247k375323n614479j512582
6526I562271j066445n916990p056558m16576P517858R760358N991266m65795n977536
6517A1931853p261653m526355k777288m824624n713351k08628P529609R209355
6509C358918M458848m73923l385570o326312p135149j262495P792827J0037196
$$ y = [27912401, 21418728, 17626747, 21739827, 29611718, 34127240, 32815623, 26835266, 17872796, 9739004, 7883565, 12252214, 14431279, 7276905, -5149802, -12165302, -9111755, -1211222, 3457031, 1168584, -5134585, -7231390, 1990267, 19469449, 31919134, 29298816, 16238680, 6166836, 6897362, 16028653, 26414620, 30262460, 21877705, 4420953, -8192922, -4525315, 9896408, 19064655, 16689332, 11074853, 9562271, 8495826, 2578836, -4477722, -4894298, 2623560, 12383918, 18375184, 17909389, 11931853, 4670200, 143845, -2633443, -7458067, -13171418, -13380046, -5850437, 3358918, 7817766, 7343843, 3958273, -2368039, -9503188, -10765683, -2972856, 7064340]
6501G064340K786372n774689q442693n909352m97190P367323J3600966J1193925
6493B1389002J237753n369117k693085J717032n64642n230853k589504O648921
6485A4545507J2056324P911679p90392o356015o337499l188968p03452j440122
6477A5697062m485940n618710k081304L410140N780957L731730N9281l195488
6469A3297728o388785q673124o342353K347218J1810672J2397016J470078j0985285
6461H933165j2529762m045797Q08172n498566j3342445j0291748J96963M817380
6453c0952638J014914j595264L77615o46113o039540m636259P947623J7613451
6445a6916211J1899937N16150J32508O973135L711716r561376j2621082K689574
$$ y = [7064340, 9850712, 4076023, -4366670, -10276022, -10773212, -3405889, 10195077, 21389002, 22626755, 17257638, 14564553, 16281585, 15716943, 10486090, 7896586, 14545507, 26601831, 34513510, 33723118, 27367103, 21029604, 17840636, 17137184, 15697062, 11211122, 5592412, 3511108, 6921248, 12702205, 16433935, 16493216, 13297728, 6908943, -1764181, -8106534, -5759316, 6051356, 18448372, 19918450, 8933165, -3596597, -7642394, -6834222, -12332788, -25675233, -35966981, -35770018, -30952638, -29937724, -31532988, -31155373, -31801486, -37841026, -42477285, -34529662, -16916211, -5016274, -4500124, -4367616, 2605519, 6317235, -3244141, -15865223, -13175649]
6437a3175649J7301823J2390878l217890p534461K357415Q885612J422381j0372097
6429H058012j2745136n160015L729241Q623872R391949N905830j363236p517524
6421H922993o756354o17046K264764k972935j0195023r624486r71238N434729
6413a4514596J935606o317673q579247l267136P34574k061720n591239j988803
6405c9650234O195145J0249876Q437686O764396P599340O486990K026531n6878
6397H052852K905240M393925p87792o981638p014856m965208q720577j3861407
6389b6979461q489086N938801J2930965M533570o405818n438709K798028L831982
6381a7279728m174280r529673n343265K730957O935315O361390M400610M285067
$$ y = [-13175649, 4126174, 16517052, 13299162, 5764701, 8122116, 17007728, 18430109, 8058012, -4687124, -9847139, -6117898, 2505974, 11897923, 17803753, 16440517, 8922993, 2166639, 1549593, 3814357, 841422, -9353601, -18978087, -19949325, -14514596, -12578990, -18896663, -27475910, -30743046, -30008472, -32070192, -37661431, -39650234, -33455089, -23205213, -14767527, -8003131, -403791, 6083199, 8109730, 8052852, 10958092, 15352017, 14564225, 7582587, 567731, -4397477, -13118054, -26979461, -35468547, -29529746, -16598781, -12065211, -18471029, -23909738, -21111710, -17279728, -21454008, -30983681, -36326946, -33595989, -26660674, -20299284, -15898674, -11613607]
6373a1613607P875767J2975069J2122901M40724j5417140k2576829j6391209l656615
6365c6240939P652136J4342264J4308271O541090k909698m123112L350062P970521
6357A0890595J654047r217903j3316163q458003n32869N741551Q538657O279926
6349A579838P3345m753977n434637o178198r951656j0844299k672270Q820234
6341b9361620J2078033O033952N1845j915545n684308j2878883j4165806l119326
6333d8961658J1755205J7485040J3735637J0507534J1897911J1840897O106781
6326C4367347n58750k576027k033067m128057q388139r832712o837320k880307
6318b867032j081584j222925k169846l317950l098886K36586N291581Q283715
$$ y = [-11613607, -3737840, 9237229, 21360130, 21800854, 6383714, -16193115, -32584324, -36240939, -28588803, -14246539, 61732, 6602822, 3693124, -429988, 2920074, 10890595, 12544642, 3326739, -9989424, -18447427, -18980296, -13238745, -4700088, 1579838, 1653183, -3100794, -8535431, -14713629, -24665285, -35509584, -38181854, -29361620, -17283587, -11249635, -11197790, -13113335, -18797643, -31676526, -45842332, -48961658, -37206453, -19721413, -5985776, 4521758, 16419669, 28260566, 34367347, 33808597, 31232570, 29199503, 25071446, 16683307, 6850595, 13275, -2867032, -3948616, -5171541, -7341387, -10659337, -13758223, -13521637, -8230056, 53659]
6310E3659Q134818P314728O650276L818200r30644k662525Q34142M202628K142962
6301B9558244k162273k459731N8683p44405m759711n487970j376695J169037j674659
6292A2120520n265993m796160k908918m191632o929019n699375M90802P002400
6284a0177375R075708N943502J009157n89675L193958P950103P130578M60081
6276B3996037n510118n936100k500921J117227L425806L243508o24558n305227
6268A1905654n122497j25611K268333k099443p592527p549256m073109l134667
6260a5523123m341251k415424L564722Q673652R116399O235705L933338M617397
6252A3861415O688187N323862j412209p536318n699829J075811K269454l796695
$$ y = [53659, 8188477, 15503205, 22153481, 25971681, 25041037, 22378512, 23212654, 27415282, 29558244, 27395971, 24936240, 24994923, 24250518, 19490807, 14002837, 12626142, 13795179, 12120520, 6854527, 2058367, -850551, -5042183, -11971202, -17670577, -17179775, -10177375, -1101667, 4841835, 5850992, 5261317, 8455275, 16405378, 23535956, 23996037, 18485919, 12549819, 10048898, 11166125, 14591931, 17835439, 17210881, 11905654, 6783157, 6657546, 8925879, 6826436, -766091, -8315347, -12388456, -15523123, -19864374, -22279798, -18715076, -10041424, -925025, 5310680, 9244018, 13861415, 20549602, 25873464, 24461255, 16924937, 11225108, 12300919, 14570373, 10773678]
6244A0773678o621435q77481M209079N04412n035732k768510K939012K593308
6236E716331p87943J899790P594401O050976k35407P49440P667123N340632q930288
6227B5065055j7155833p274717P691977Q788033k222985q594050l828386K142109
6219D611203j14249p149639q846382j198990R240156J2420789O208646p28499
6211A4443035k81658L617894J329062o616574r400049k470019N894090P504702
6203A4020483L944370p39996o964138j3410201j3465890n358697K219595K335457
6195a7419017k5069J719778L235391k355209r846043p946757L105704J1531302
6187a7999920J0798463O187268M173403M409577M060506L005114K563373L525493
$$ y = [10773678, 4152243, 3274762, 7483841, 7988253, 2952521, 184011, 3123023, 5716331, 4928388, 6828178, 14422579, 20473555, 20238148, 20987588, 28654711, 33995343, 25065055, 7909222, 634505, 8326482, 17114515, 14891530, 6297480, 2469094, 4611203, 4496954, -2652685, -11499067, -12698057, -3457901, 8962888, 15171534, 14443035, 14161377, 17779271, 19108333, 12491759, 3091710, 621691, 6515781, 14020483, 17964853, 17224857, 10260719, -3149482, -16615372, -21974069, -19754474, -17419017, -17444086, -15724308, -12488917, -14844126, -24690169, -32636926, -29531222, -17999920, -7201457, -1014189, 3159214, 7568791, 11629297, 14634411, 17197784, 20723277]
6179B0723277N791888O546008J155977r234404j4733915q693163M64242j161856
6171H58054j2839000j9295592j2130495n52125L192324k9657o31991N619425J4223520
6162b1585537J8612222J5128894M531325p150227j1899104p535312j38517L622852
6154f413404L327792J748844l37850k352412j435371K809433M653395l26117o687193
6145e012883n226565L527876R771848Q644696N402607M050907R8247r433751j6671216
6136d848234j2614669j551548M218495J894609q3329K197449K002532m845025
6128a3629720j0975994q209929L64893O119831O625090M640371J094591l108246
6120a7079113l303578K423489P242287M799945k6493O83315L849307J636604k514076
$$ y = [20723277, 26515165, 33061173, 34217150, 24982746, 10248831, 1555668, 2019910, 858054, -11980946, -31276538, -43407033, -43959158, -40766834, -40796491, -41428482, -35809057, -21585537, -2973315, 12155579, 16686904, 9536677, -2362427, -9897739, -10036256, -6413404, -3085612, -1336768, -1674618, -4027030, -5462401, -2652968, 2000427, 1674310, -5012883, -10239448, -6711572, 3060276, 11704972, 17107579, 21158486, 21256733, 11822982, -4848234, -17462903, -19014451, -14795956, -12901347, -12984676, -10787227, -8784695, -13629720, -24605714, -32815643, -32450750, -26330919, -19705829, -15065458, -13970867, -17079113, -20382691, -17959202, -10716915, -5916970, -5943463, -5260148, -1410841, 225763, -2288313]
6111b288313P16861P027818K317837j1855276j5781018j596259J2492597R295003
6103C29250k346479m573073J078019P79328n328633m620147L913236P031726k42912
6094c979685p013142n030345L73270K882438M933373Q255476P059683r12176o868286
6085b99394m077021O8181l969603j0496204o291520P212410J3553843N089673
6077G90365n621448m712223L033630L486250l824049n343350M227431J2863391
6069D899997R859351K134718K008731O722209L469294q323645j4304096o890978
6061d24419L282332L423129l995582p457419k967382L594730O456217N350596
6053G262202L075928K308883L302841K928781q93557l768524J35753P284911P542532
$$ y = [-2288313, -1571452, 5456366, 7774203, -4081073, -19862091, -21458350, -8965753, 329250, -2017229, -6590302, -5512283, -4732955, -10061588, -14681735, -10768499, -3736773, -3979685, -10992827, -16023172, -15649902, -12767464, -7834091, 421385, 7481068, 6568892, -299394, -4376415, -4308234, -8277837, -18774041, -25065561, -17853151, -4299308, 790365, -4831083, -9543306, -6509676, -3023426, -6847475, -12190825, -7963394, 4899997, 14759348, 16894066, 18902797, 25625006, 29094300, 20770655, 6466559, -424419, 2857913, 6281042, 2285460, -5171959, -8139341, -4544611, 1911606, 7262202, 10338130, 12647013, 15949854, 18878635, 17985078, 14216554, 14352307, 21637218, 29179750]
6044B9179750m62738o812100o495991o547076j1210226j2369902l839490N894882
6036a2662891O135574j99947m346944o149888q772569q001955k60152O866699
6028b7392073O075645M055800Q658165J1345893P24923j4002896j4158011j348809
6020b6041363O048605L448555L417434Q504679N947173o034691j1073891k039091
6012a7822590O362302K478285m569525l164706K811318N755735P345688Q361579
6004G558086K229302r104266r706024O009347J9487206J3872905j337162p727310
5996B1282084n314487m137008k362776N669833J0218669j484038j9603294k1429539
5988a7160556m648112R905837Q736403O3765l700542p90471N271740J1269832
$$ y = [29179750, 28717012, 21904912, 15408921, 8861845, -2348381, -14718283, -18557773, -12662891, -6527317, -6727264, -11074208, -17224096, -25996665, -33998620, -34258772, -27392073, -21316428, -17260628, -8602463, 2743430, 3468353, -10534543, -24692554, -26041363, -19992758, -16544203, -13126769, -4622090, 1325083, -4709608, -15783499, -17822590, -11460288, -8982003, -13551528, -16716234, -13904916, -8149181, -803493, 7558086, 9787388, 683122, -9022902, -3013555, 16473651, 30346556, 29009394, 21282084, 15967597, 11830589, 9467813, 15137646, 25356315, 23872277, 4268983, -17160556, -21808668, -11902831, -3166428, -3102663, -6803205, -7593676, -2321936, 8947896]
5980H947896J1891436M162208m454767m136780J463733K68513q073491j1712879
5972a644131o993923l606053o039912n300405M548659J4679420J4398535N957963
5964A6000153j231768l663906l965805l673412k096073N96204K902033K916591
5956G784017m77846m713064m188673J586629M399281j132952o977362k509233
5948f229203P854469J0187068K390296l728100k172155l32166l916255p807614
5940c753660o746058l269336k3565M656369Q680637N426505l265092n260737L562250
5931G313J0858047O349085k230433k298562M032408N870480J951701K0740J742323
5922B6303102Q26885m666377q717561p019140k527148j75339j440254m500668
$$ y = [8947896, 20839332, 25001540, 20546773, 16409993, 17873726, 18142239, 10068748, -1644131, -8638054, -12244107, -18284019, -23584424, -19035765, -4356345, 10042190, 16000153, 14768385, 11104479, 7138674, 3465262, 1369189, 1965393, 4867426, 7784017, 7306171, 2593107, -1595566, -8937, 4390344, 3257392, -3719970, -6229203, 1625266, 11812334, 14202630, 10474530, 8302375, 7970209, 4053954, -3753660, -10499718, -13769054, -13792619, -9136250, -455613, 4970892, 1705800, -3554937, 7313, 10865360, 17214445, 14984012, 12685450, 16717858, 22588338, 24540039, 24560779, 26303102, 27129987, 22463610, 13746049, 6726909, 4199761, 4024422, 2584168, -1916500]
5914a916500n822947k418210M113992P726692N364280J317348N12128J319760
5906A0196543p0002k008750n25470K543352J704677k677409l886701R17818N465212
5897A1659270K174705p594017j3859226q560258N084978J4833385J2058349J030652
5889A6827838o676485n801412j590233q99682m048928o626390n132084M70106
5881a3477270O209233N927396j884098r365300p210578K673849R236414P282355
5873f07999K298181o07824k687378l746027O12876Q547738R582475L30449p269607
5864F452884k874808N983619N776872k200538n768280j667852K221382K199561
5856A0122840K856207N630985N449713P03268l850248o302608r868700j3432180
$$ y = [-1916500, -7739447, -10157657, -6043665, 1683027, 7047307, 8364655, 8876783, 10196543, 10126541, 8117791, 7592321, 10135673, 11840350, 9162941, 5276240, 6194058, 11659270, 13833975, 6239958, -7619268, -16179526, -11094548, 3738837, 15797186, 16827838, 10151353, 4349941, 2759708, 1860026, -2188902, -8815292, -13947376, -13477270, -7268037, -1340641, -3224739, -12590039, -19800617, -17126768, -7890354, -607999, 1690182, 1082358, -1605020, -5351047, -4738171, 3809567, 13392042, 13722491, 6452884, 3578076, 9561695, 15338567, 13138029, 7369749, 5701897, 7923279, 10122840, 12979047, 18610032, 24059745, 24763013, 20912765, 14610157, 4741457, -8690723]
5848h690723j0021259P28511P814666L310411n078061l606151Q846222J8942751
5840A2246367J5218408R24474j0749852j1263570m218262J282021K123442K968895
5832H531923O913412R228683L715505p913787j7224802j7933155j0218248J492526
5824b3407943J0949370J2502530O078728j271970l008706r33462j177417m367472
5816d636342n416380k252757J129832Q81899k245871n345893o226665l395217
5808b7507394L121935J0286114J3927756J2010955M728594n941726j4368203j3497141
5800a7239110l907007L625400R95447n852274o119656m55230K248776J266232
5792b5437422M051580R735359P376854m681192j1726975l655500Q381169P718140
$$ y = [-8690723, -18711982, -17983471, -10168805, -6858394, -11936455, -15542606, -6696384, 12246367, 27464775, 28389249, 17639397, 6375827, 2157565, 3439586, 5563028, 8531923, 15445335, 24674018, 28389523, 20475736, 3250934, -14682221, -24900469, -23407943, -12458573, 43957, 6122685, 4850715, 1842009, 908547, -268870, -4636342, -10052722, -12305479, -11175647, -10293748, -12539619, -17885512, -24112177, -27507394, -24385459, -14099345, -171589, 11839366, 16567960, 10626234, -3741969, -17239110, -21146117, -17520717, -16525270, -22377544, -28497200, -28952430, -26703654, -25437422, -21385842, -11650483, -4273629, -8954821, -20681796, -24337296, -15956127, -8237987]
5784h237987l594296r389085l758043K823350J403598m005148o089699n030180
5776c5877490m030171j648206M280917R646267Q558163K985537N80258K677441
5768a2827284J948976m936016r263165j622057J2637441J8023891Q917615l492658
5760I386743o990448l304320k044700n826843q763207o555460q93939M952273
5752b0039901Q799068Q449197L502006j875976k789114P968J845361J349372J100955
5743C48936J827788J186698j530920l984418m232242k186209J197994K843564
5735d528809j246949q839142r794565R48171J2680175J1249343m29990o198487
5727f160253m40397N784835M958484M580445J1308015J6790713J0208278m200303
$$ y = [-8237987, -11832283, -21221368, -24979411, -22156061, -20752463, -24757611, -30847310, -35877490, -39907661, -41555867, -37274950, -27628683, -19070520, -16084983, -15504725, -12827284, -10878308, -15814324, -25077489, -26699546, -14062105, 3961786, 12879401, 9386743, 2396295, -908025, -2952725, -8779568, -17542775, -24098235, -24992174, -20039901, -11240833, -2791636, 710370, -1165606, -3954720, -3946752, -2101391, -752019, 348936, 2176724, 3363422, 1832502, -2151916, -6384158, -8570367, -7372373, -4528809, -5775758, -14614900, -24409465, -23461294, -10781119, 468224, 38234, -6160253, -6600650, -815815, 4142669, 8723114, 20031129, 36821842, 47030120, 42829817]
5719D2829817j3521366j3708700r926982m694632K611193P525530L776091n372285
5711I518666r457294n658769k062627m080855o526813l359591J970290J943663
5703a7713330l489968o990115m067309J919517N544193O008632N791914N282876
5695g713590K723860q34138j236329J854265K127739m728110j2864742j3039440
5687c3710485n722080Q474M49335J742490Q236212J4494515J3209906M789329
5679C497696n267580j2832804j4758525q138696M462888J3858266J3768371P675571
5671B265187K156686j308989l298586j726560L254685N436845J151324l407181
5663D523411j321920L713046M153074J759577L269090O494772K911547p049260
$$ y = [42829817, 29308451, 15599751, 5672769, 978137, 3589330, 11114860, 14890951, 9518666, 61372, -5597397, -7660024, -11740879, -18267692, -21627283, -19656993, -17713330, -21203298, -28193413, -32260722, -30341205, -24797012, -18788380, -12996466, -7713590, -4989730, -5823868, -7060197, -5205932, -3078193, -7806303, -20671045, -33710485, -39432565, -39424091, -38974756, -37232266, -28996054, -14501539, -1291633, 3497696, -1769884, -14602688, -29361213, -37499909, -33037021, -19178755, -5410384, 2265187, 4421873, 3112884, -185702, -1912262, 1342423, 6779268, 7930592, 4523411, 3201491, 6914537, 11067611, 12827188, 16096278, 22591050, 25502597, 18453337]
5655A8453337j3298252j1140012n650250j97242P041012J2644019P537840o910145
5647H480307j4578842n385880R108066J1246189J257378n872012l091013J697797
5639B861990R62486j682235L06287N518275P312242L253187k721378n727065m386122
5630E697667p50778K004905J927193n76314l706362n973465o103073k231276N970965
5621c740538J3689417J2987376J820919j0717291j2688204l098495P135658R390651
5613A4779493P026453P016044P529320J667286r041726j4411805r925371k482757
5605B156937J156321L216658P249103R560963N720414j87857j258614J037952
5597B8651877m4332m424558m929934R75557O761444N312168l592012j4664037
$$ y = [18453337, 5155085, -5984927, -11635177, -11832419, -4791407, 7852612, 15390452, 8480307, -6098535, -11484415, -2376349, 8869840, 10127218, 4255206, 1164193, 2861990, 3824476, 2142241, 2448528, 7966803, 15279045, 18532232, 15810854, 10083789, 5697667, 4946889, 6951794, 8878987, 8302673, 4596311, -1377154, -7480227, -9711503, -3740538, 9948879, 22936255, 24757174, 14039883, 1351679, -1746816, 5388842, 14779493, 21805946, 28821990, 36351310, 38018596, 28976870, 14565065, 4639694, 2156937, 3313258, 6529916, 13779019, 23339982, 29060396, 28872539, 27613925, 28651877, 28607545, 24182987, 19253053, 20228610, 26990054, 32302222, 28710210, 14046173]
5589A4046173k1293943j8955570r393861n90140K018204K057339M609983O208929
5581b1292886J233293n025739k025155P166101O519519q763278k1602816j5294925
5573e9085886L438816J4550133J1312994M763556M186572N629375K432341k307354
5565a5079453k03994R215765J5866820J0863567j894296r173009m143003M766224
5557A0218621M513126n341223j2327606q225326P80384M451263K369108J252550
5549b309103K763909K112663j694841j985815N741028J4838047J3896719J574345
5541C4936952j0012321r519284o01480L374809k364774q420492o135502J18687
5533A376595J704968l48013N58660L560150K667945n56980P28753M241782L37803
$$ y = [14046173, -7247770, -26203340, -35597201, -36187341, -34169137, -32111798, -27501815, -21292886, -20059593, -25085332, -27110487, -19944386, -13424867, -22188145, -43790961, -59085886, -55647070, -41096937, -29783943, -25020387, -20833815, -15204440, -12772099, -15079453, -15283447, -6067682, 9799138, 20662705, 18768409, 9595400, 5452397, 10218621, 14731747, 9390524, -2937082, -11162408, -10382024, -5930761, -3561653, -2309103, 454806, 2567469, 872628, -1113187, 4627841, 19465888, 33362607, 34936952, 24924631, 15405347, 14803867, 18178676, 15813902, 7393410, 1257908, 1376595, 3081563, 2733550, 3292210, 6852360, 9520305, 8963325, 9692078, 13933860, 14271663]
5524A4271663r587409j1259744L1903R356525L817112q077169j0589539m107719
5516a6144377k22741p65750K417062R850819J2018765N324892k376171m462799
5508E639700l144643j993700m34886J614687K144951K480622N907266Q777641
5500B0991638K749349j0128127j4721458k396682J4679292J7836746N463283p127210
5492B7346831q769682l616812n93962p13058N24750L601769M205546P77917k556665
5483B0206634k245385o81526j810907l465817O10405J0175862J5319216P917980
5475D6026462o969749j6181477j3540476m980802Q67492J748676K18950j792745
5467E396331l432040k902057J174493P088176J1196453J1500124Q521893L337475
$$ y = [14271663, 4684254, -6575490, -6543587, 2812938, 6630050, -1447119, -12036658, -16144377, -16367118, -17132868, -14715806, -4864987, 7153778, 12478670, 10102499, 5639700, 2495057, 501357, 66471, 1681158, 3826109, 6306731, 12213997, 20991638, 23740987, 13612860, -1108598, -3505280, 11174012, 29010758, 34474041, 27346831, 18577149, 14960337, 14366375, 13653317, 14178067, 17779836, 21985382, 22763299, 20206634, 17961249, 17279723, 15468816, 12002999, 12613404, 22789266, 38108482, 46026462, 39056713, 22875236, 9334760, 4353958, 5221450, 6970126, 7189076, 5396331, 1964291, -937766, 236727, 7324903, 18521356, 30021480, 38543373, 41880848]
5459D1880848l038783q180319q843794n076528k066512m468237q971289o961882
5451e726496L267755J1665768Q665602j191077m880017J245507P272116M240352
5443B4559510n271813j3563443j6772444j3535087k878603J0453536J5572704
5436a435640P795086l804225q204905o351067n444585n355015j345316L696722
5428b0448945K204321l676170k919902P047581J4739447J0520349m77591o301573
5420F87517k689543M915060R045924O144361j429656o646890m338326K190996
5412G879443M768019J001991l450514l854820k053354j609923k550566l090795
5404b960519k478925o10995J713066K019356n25836k214553j28195J872604p41556
$$ y = [41880848, 38842065, 30661746, 21817952, 16741424, 14674912, 10206675, 1235386, -5726496, -2458741, 9207027, 17872629, 16681552, 11801535, 13047042, 20319158, 24559510, 19287697, 5724254, -11048190, -24583277, -27461880, -17008344, -1435640, 6359446, 2555221, -5649684, -12000751, -17445336, -22800351, -24145667, -20448945, -18244624, -21920794, -24840696, -17793115, -3053668, 7466681, 6989090, 687517, -2002026, 2913034, 11958958, 18103319, 16673663, 10026773, 5688447, 7879443, 12647462, 13649453, 10198939, 6344119, 4290765, 2680842, 130276, -2960519, -5439444, -6050439, -4337373, -2318017, -2843853, -5058406, -5186601, -3313997, -4055553]
5395d055553l792889m97911N060011K684827n516787n671646N357563J2963881
5387F531496P696342Q36082N621280J4795808J1825811k771413j2182378p998887
5379B4354141p8904o71111r555837j7409578j6535877o673004M660669P981862
5371a3927639K623573q66769N052218J2239557P239125q102165j7136489j0444289
5363b3322878K686811Q241887M690767J017566L067575P778736R190008O007325
5355A9357797K483695K672314M773274L319643k524523o721694m963681j248314
5347A7148511j516630m592523n091925k289380K17193J385425K759374L508544
5339A1528589K132424J380822M285801O893498L173282l648155l979617K967668
$$ y = [-4055553, -7848442, -8346353, -3286342, -601515, -6118302, -11789948, -6432385, 6531496, 14227838, 15063920, 20685200, 35481008, 47306819, 44535406, 32353028, 24354141, 24275237, 23604126, 14048289, -3361289, -19897166, -26570170, -21909501, -13927639, -11304066, -12170835, -7118617, 5120940, 12360065, 4257900, -12878589, -23322878, -20636067, -12394180, -7703413, -6685847, -3618272, 4160464, 13350472, 19357797, 21841492, 24513806, 29287080, 32606723, 30082200, 23360506, 18396825, 17148511, 15631881, 11039358, 5947433, 3658053, 3875246, 5260671, 8020045, 11528589, 13661013, 15041835, 19327636, 26221134, 29394416, 25746261, 21766644, 24734312]
5331B4734312O461417j59401r591481j0863216l008810O151128R551372M960732
5323B8236053n468849j5077998j6120536p855728J705809N637712O164260Q833871
5315F054594J2237422R657198K08618p654722o375507K51124J152829p268856
5307H262700j4976177j1000581O27120N310153j190122n917200J973411J4360899
5299b549797J6191869P563405J523627L459692O092091M395063J966459N12667
5291C9155076m115000j1285607j2732971n868088K54302j786932p668851j0205605
5283a4253676r260970o762221j009861P159095J1234867R103511P443460Q979909
5275A2634114N687825n996575j3979853p190424N408390P232710q60174l900592
$$ y = [24734312, 31195729, 31036328, 21444847, 10581631, 7572821, 13723949, 23275321, 28236053, 22767204, 7689206, -8431330, -16287058, -14581249, -8943537, -2779277, 6054594, 18292016, 27949214, 28157832, 20503110, 14127603, 14378727, 15531556, 8262700, -6713477, -17714058, -17086938, -11776785, -12966907, -18884107, -16910696, -2549797, 13642072, 21205477, 22729104, 26188796, 32280887, 36675950, 38642409, 39155076, 35040076, 23754469, 11021498, 5153410, 5407712, 3620780, -4048071, -14253676, -23514646, -30276867, -31286728, -24127633, -12892766, -3789255, 3654205, 12634114, 18321939, 12325364, -1654489, -8844913, -3436523, 3796187, 2936013, -964579]
5267i64579K415350O908333K777835l199029m023822k085534j767614k916741
5259b855801m600873o130461l017377P743281J7128410J0953032r237196k3920960
5251a3937945j9367724k977274J0510172J6842244J8721098J5200329N517877
5244C0508777l308065l689370J284848K858839P2876l76431L742881O364049K276127
5235C9734531n526232r378767n383692K262564N182982M94454m839487l753522
5227A8792831j113878p076472j8139786j7640888r56806J2978513O779733r306957
5219a5683710j1876018J578095J1109831N616593k785108k06616R112838J2791229
5211I657134Q165125L18310q698800j7872908k0593777j1380722L363514J1306802
$$ y = [-964579, 1450771, 8359104, 11136939, 7937910, 3914088, 1828554, 60940, -2855801, -7456674, -13587135, -16604512, -8861231, 8267179, 19220211, 9983015, -13937945, -33305669, -36282943, -25772771, -8930527, 9790571, 24990900, 30508777, 27200712, 23511342, 24796190, 27655029, 27727905, 27351474, 31094355, 37458404, 39734531, 34208299, 24829532, 19445840, 21708404, 26891386, 27385840, 22546353, 18792831, 17678953, 10602481, -7537305, -25178193, -26134999, -13156486, -6376753, -15683710, -27559728, -25981633, -14871802, -9255209, -12040317, -12246933, -3134095, 9657134, 17822259, 18140569, 9441769, -8431139, -29024916, -40405638, -37042124, -25735322]
5203b5735322J0090620Q330677J0465314R895576O79579j1323452j4987973q070891
5195b0655872Q29451L517939P93333r22422J944552P090481R973166Q100954K160798
5186A2832380m912410r454262r298535n465699q65594K731032M994545M772223
5178d666320Q14687m324427n298910j611012M7811m365994q209168k980945P408928
5169b3185350J0355545K803945m064469j630617M200845M018550k69253m14668
5161h185472L860167N523527K580633M1697K82889O25830Q61270L837728O797867
5152A6226136J859173j0607618j7873744j0651868L588128J0394293O496727M38457
5144a30316j300619p8526J636826M054909O065072M822819J587585J768540O187636
$$ y = [-25735322, -15644702, -7314025, 3151289, 13046865, 13726444, 2402992, -12584981, -20655872, -19826421, -16308482, -15515149, -16437571, -14493019, -7402538, 2570628, 10671582, 12832380, 7919970, -1534292, -10832827, -16298526, -17164120, -14433088, -9438543, -4666320, -3851633, -8176060, -13474970, -15085982, -15038171, -19404165, -27613333, -30594278, -23185350, -12829805, -10025860, -14090329, -15720946, -11520101, -7501551, -7770804, -8185472, -4325305, 1198222, 3778855, 3820552, 4103441, 4729271, 5590541, 9428269, 16226136, 18085309, 7477691, -10396053, -21047921, -17459793, -7065500, -568773, -130316, -1430935, -1509461, 127365, 4182274, 10247346, 15070165, 16657750, 18426290, 24613926]
5135B4613926P818603J383445p931881j0277928l528264M583531N877058l23344
5127B2215146q240268j1324777o727705K728721R864966Q760853Q10816o047824
5119A2039928n605097J57087M536555M912341M844910O749366O456459j040628
5111C3050921j2276684j7107467j0974546r90190K777339j223951o305615o572897
5103a9623090k170328K646888L461055o21060m580056j538163P549708J2292236
5095b582810O238229k417203j475430O979603R311878Q04903q147588q493899
5087B17683l391739J784550Q120851J4540468J2460112j37670r485865m249498
5079A9858892N388654K787858p359791o090094O571098Q010796j1059396k8113316
$$ y = [24613926, 32432529, 33815974, 25884093, 15606165, 12077901, 16661432, 22538490, 22215146, 13974878, 2650101, -4077604, -1348883, 8516083, 17276936, 18087752, 12039928, 6434831, 6591918, 11128473, 16040814, 20885724, 27635090, 34091549, 33050921, 20774237, 3666770, -7307776, -8297966, -5520627, -6744578, -13050193, -19623090, -21793418, -19146530, -15685475, -16306535, -20886591, -22424754, -14875046, -2582810, 3655419, 1238216, -237214, 6742389, 16054267, 16859170, 8711582, 217683, -3174056, -1389506, 6731345, 21271813, 33731925, 33594255, 24108390, 19858892, 25247546, 28035404, 20675613, 14585519, 21156617, 29167413, 18108017, -10005299]
5071a0005299j9814934L920827J4388179L741617q429660n745904N208108R470594
5063g266472M682613j36039N45705K877985M94433p575653j5930407j7915365
5055d0223200j1726058j746242O198535R895521J0614853J0103495R402621Q781266
5047A300791P028986K750986k114051l091718J26765J357954l870799j0791675
5039g302761j0734403k041320Q728168J4648951J3199397N596655l252519o041068
5031A2801100m04435O056067M209207m036392q409373n138157j210888k520689
5023A346440n909208o202117l858296j268323K205679O409400P159492K630962
5015B514029j548655J24521L965507K483692l601546o281915k706900Q20079q68221
$$ y = [-10005299, -29820233, -25899406, -11511227, -7769610, -16199270, -21945174, -16737066, -7266472, -2583859, -2719898, -2174193, 703792, 1198225, -6377428, -22307835, -40223200, -51949258, -53695500, -47496965, -37601444, -26986591, -16883096, -7480475, 1300791, 8329777, 11080763, 8966712, 5874994, 6001759, 7359713, 3488914, -7302761, -18037164, -20078484, -11350316, 3298635, 16498032, 22094687, 18842168, 12801100, 12396665, 18452732, 22661939, 18625547, 10216174, 5078017, 3867129, 1346440, -4562768, -10764885, -14623181, -15891504, -13685825, -7276425, -116933, 2514029, 965374, 1089895, 5055402, 7539094, 3937548, -2344367, -5051267, -4231188, -5099409]
5006e099409l946234k016733L788741O360337L022370p66217L10716L695952L794531
4997I144054K069844N145188J1618108R592805n947955k0559865j6401826K419827
4989b919820J3940469Q185874j734873k725126k20891l656356p399932j597068
4981A872277P169631M043150r139828j4885359o357218L875642M625713O34289
4973h161703P67715M490968O887408O599521K503971p329340j7203061j5421025
4965b6865546k130884N746072k457413j3708386r426800P710047J9802371K0093543
4957a236996J6713810J3350506M353492q978372j4093018n683002M194269K386202
4949A1006891p950949j3646960q635849J698414Q415147O314939k417610q592002
$$ y = [-5099409, -9045643, -11062376, -7273635, -913298, 2109072, 1342855, 1653571, 5349523, 9144054, 11213898, 16359086, 27977194, 37569999, 31622044, 11062179, -5339647, -2919820, 11020649, 19206523, 17471650, 14746524, 14525633, 10869277, 3469345, 1872277, 9041908, 13085058, 3945230, -10940129, -17297347, -13421705, -8795992, -8161703, -7393988, -2903020, 3984388, 10583909, 13087880, 5758540, -11444521, -26865546, -28996430, -23250358, -25707771, -39416157, -48842957, -41132910, -21330539, -1236996, 15476814, 28827320, 33180812, 24202440, 10109422, 4426420, 8620689, 11006891, 3055942, -10591018, -19226867, -17528453, -9113306, -2798367, -5215977, -13807979]
4941a3807979m773689M410765P255075J955154p26390M344201P221309k2161p498310
4932a642025j948863J0112499R947325m351962j3123742l716956J0737519J0356252
4924A6370047l753291j2921696p750562J048077K18102p882263j0983054n072436
4916c0727076J584949J987169j93539J518764N267352M503436k03442j346860
4908a7609247L073085N407319p7728q135035r822189m015226L280683P274577
4900b0623761P227882M260595R31350N0100J39194l791536j0884952j1804046
4892c4495174j953948Q720655Q380674J059504M19368Q139045J1461609L491003
4884E222736o525723p601987j579585K527080J243604k066558l408585j472597
$$ y = [-13807979, -18581668, -14170903, -6915828, -4960674, -5687064, -1342863, 5878446, 5856285, -1642025, -3590888, 6521611, 16468936, 12116974, -1006768, -4723724, 6013795, 16370047, 12616756, -304940, -8055502, -7007425, -6789323, -14671586, -25654640, -30727076, -29142127, -27154958, -27348497, -25829733, -20562381, -16058945, -16262387, -17609247, -14536162, -9128843, -9206571, -17341606, -27163795, -31179021, -27898338, -20623761, -13395879, -9135284, -8203934, -8153834, -8014640, -11806176, -22691128, -34495174, -36449122, -27728467, -19347793, -18288289, -17868921, -9729876, 1731733, 5222736, -1302987, -8904974, -10484559, -7957479, -6713875, -8780433, -12189018, -13661615]
4876a3661615J153541j272278r792017j3736992j336881K0467170K8638021J2613930
4868B3072879j0478020j7518440o844883N787793J0008563P320466Q63622p667539
4860D544441j3006543j0150403k892082R79585J688556N075381R964757R076794
4852E280486K486973j171103J309586L047946p98627n833044o757285m261595
4844f696663j67816N867157J1032172R135925L70904o199082m705431j25772N37588
4835I048982k554920o345134j0298407j1843286n029306Q419407J4915569O189608
4827B502513n735068k997545J2257847J9746445Q714853q938074j6440440j2075375
4819b964844n434873k204558q87289m52554k826644p339334q355179j522648R191759
$$ y = [-13661615, -12508074, -13780352, -23572369, -37309361, -38646242, -18179072, 10458949, 23072879, 12594859, -4923581, -11768464, -5980671, 4027892, 11348358, 12211980, 4544441, -8462102, -18612505, -21504587, -20525002, -18836446, -13761065, -3796308, 5280486, 7767459, 6596356, 7905942, 10953888, 10155261, 4322217, -2435068, -6696663, -6864479, -997322, 10034850, 19170775, 19541679, 13342597, 8637166, 8511394, 9048982, 6494062, 148928, -10149479, -21992765, -27022071, -18602664, -3687095, 2502513, -3232555, -6230100, 6027747, 25774192, 34489045, 25550971, 9110531, -2964844, -8399717, -10604275, -11491564, -11944118, -14770762, -22110096, -30465275, -31987923, -22796164]
4810b2796164J3669125O586656m862777p638290J583637J1465441R985689l31233
4802G662084o784215l808548J560709J984596k66972O56084M293589N424242K080816
4793A2802385l066692p201830q672477n728334J009934O048849M607853M13058
4785B12746J583137P778800R005009R72281o164315k131746O241900L497557j0377352
4776A0618017j7476524p383178P090059Q076828k565282q180427j698018P748033
4768c770492J1037986R098158N054823j519788p872384o126686M801593J3213342
4760B3916552Q537605m208578j1534983q801308k655311O97356J346614Q38846
4752H136793q84566k892954l347340l210049n367525r263573j0434620o436768
$$ y = [-22796164, -9127039, -2540383, -7403160, -15041450, -13457813, -1992372, 7993317, 7662084, 877869, -2930679, -1369970, 614626, 347654, 1003738, 5297327, 10721569, 12802385, 9735693, 2533863, -6138614, -11866948, -10857014, -4808165, -200312, 212746, 1795883, 9574683, 18579692, 19551973, 13387658, 11255912, 17497812, 20995369, 10618017, -6858507, -14241685, -7151626, 925202, -1640080, -9820507, -11518525, -3770492, 7267494, 16365652, 21420475, 19900687, 12028303, 5901617, 10703210, 23916552, 32454157, 28245579, 16710596, 7909288, 5253977, 5951333, 7297947, 8136793, 7252227, 4359273, 1011933, -2198116, -7565641, -16829214, -27263834, -33700602]
4744c3700602j02232M025990M264161K465119J892951M209006P272857P006223
4736b666527K683240j588342k235671m29688J140437K400262L741648L121847
4728F167206n89233m017765l314229L32987K980887L217245J484028k439365o652693
4719b830932n607687K698860J1107006J1266849M556274j433496m150862o144335
4711I461677o899374m018778j063065m140756j0548788j0719510k649351N266938
4703b5311007P497098P587803Q617188P667265L878263K353963M884006N519970
4695B2694549R21413l188129j786018J262668J067631j51152M30960l44406m013983
4686A6893533m520051R54667L209321n509973j6041755j3985510k609536J182241
$$ y = [-33700602, -33802834, -29776844, -25512683, -23047564, -21154613, -16945607, -9672750, -2666527, 16713, -1571629, -3807300, -4236988, -3096551, -696289, 3045359, 6167206, 5577973, 1560208, -1754021, -1421034, 1559853, 4777098, 6261126, 3821761, -2830932, -8438619, -5739759, 5367247, 16634096, 21190370, 19756874, 15606012, 9461677, 2562303, -1456475, -2519540, -6660296, -17209084, -27928594, -30577945, -25311007, -17813909, -10226106, -1608918, 6058347, 9936610, 12290573, 17174579, 22694549, 23615962, 20427833, 18641815, 19904483, 20972114, 20820962, 21251922, 20907516, 16893533, 12373482, 13328149, 16537470, 11027497, -5014258, -18999768, -21609304, -20427063]
4678b0427063o906237j2073799l821747Q384434J0558253M532788K504731P303051
4670i945589R194139J675366q587750j0913692m450918K165777L418340L371145
4662a4073182P039172J0305204N171831o558489j3417371j0074117m431031m186599
4654c0224582m692002J723162J0808614J1471023K996379l423406m98454O856095
4646d983171J0369755P992214K817467j312827j568018J246055J253128n926547
4638I888056j5301169j7272214j0030415m94964O561291J1936181J4140162Q221317
4630G648245m122759j2358003j0100504k903558J675223M111060P289799Q622721
4622a37776N527720K508781L973536M801502k199557j2457894j3834612m388965
$$ y = [-20427063, -27333300, -39407099, -43228846, -34844412, -24286159, -19753371, -17248640, -9945589, -751450, 923916, -7663834, -18577526, -23028444, -20862667, -17444327, -14073182, -7034010, 3271194, 8443025, 1884536, -11532835, -21606952, -26037983, -30224582, -34916584, -33193422, -22384808, -10913785, -7917406, -11340812, -11839266, -4983171, 5386584, 13378798, 16196265, 14883438, 13315420, 14561475, 15814603, 9888056, -5413113, -22685327, -32715742, -33210706, -26649415, -14713234, -573072, 7648245, 3525486, -8832517, -18933021, -21836579, -20161356, -16050296, -8760497, -137776, 5389944, 7898725, 11872261, 16673763, 14474206, 2016312, -11818300, -16207265]
4614a6207265M157175L025903k297822j874378M129381O894623J818399n977465
4606f331449q802291m918284J325784N340152N997189M135921K12463m576905
4598g617420o555964k789895L498149M925063k25914l998199J180088J1154348
4590d29744J4593444Q141854L45005j311002m63510l992662r377234q084968o4949
4581f43766M391292K845m539934P27240J1277640J3860134N488709l036875l299125
4572B4228160L66624L2698m377906q008464r086476q237282m861712P6696K258558
4563g609104N99713O54065N341414Q040201K696827m955592o015911l064803m331297
4554h644487p184499j895005R110817J1532310J554227p137788m413927J892033
$$ y = [-16207265, -12050090, -9024187, -11322009, -13196387, -9067006, -2172383, -353984, -6331449, -15133740, -20052024, -18726240, -13386088, -7388899, -3252978, -3040515, -7617420, -14173384, -16963279, -13465130, -8540067, -8765981, -12764180, -11584092, -429744, 14163700, 22305554, 22650559, 21339557, 20876047, 16883385, 7506151, -578817, -643766, 3747526, 3750371, -789563, -62323, 11215317, 25075451, 30564160, 27527285, 24228160, 24594784, 24627482, 20249576, 12241112, 3154636, -5082646, -9944358, -9867662, -7609104, -7009391, -6355326, -1013912, 7026289, 9723116, 4767524, -1248387, -4313190, -8644487, -15828986, -17723991, -8613174, 2919136, 4473363, -2664425, -7078352, -5186319]
4546e186319N22076o126640q929172o454411k612103K284899Q316800J0288379
4538g896491M668879l215611p139877q931470j1043138p711017N227257J7645990
4530a8395478J5338261K11978j1715710j1161807l427218L533549P655422Q767878
4522i193125O081442J372648k625475o667268j0882516r322557J551355J2008333
4514a7677163R448928j360444k920511Q432288J5861226P106938q173409j4338495
4506c620642j0684499o251821l692417L4413L665245L825534L011571N242228
4498h470388P086692K832988l871356l697921L541126P301347J170393q417021
4490b524140j1119319m761468M360948R258530P661821K183800k609465l980382
$$ y = [-5186319, -4664243, -10790883, -19720055, -26174466, -28786569, -26501670, -18184870, -7896491, -3227612, -6443223, -13583100, -22514570, -33557708, -41268725, -36041468, -18395478, -3057217, -2845239, -14560949, -25722756, -29149974, -25616425, -17961003, -9193125, -3111683, -1739035, -4364510, -11031778, -21914294, -31236851, -29685496, -17677163, -8228235, -9588679, -12509190, -4076902, 11784324, 18891262, 10717853, -3620642, -14305141, -20556962, -24249379, -24214966, -20549721, -16724187, -13712616, -8470388, -1383696, 1449292, -2422064, -6119985, -2578859, 4722488, 5892881, -2524140, -13643459, -18404927, -14043979, -4785449, 2876372, 5060172, 2450707, -1529675]
4482a529675k571994l09356J758468K707586J300356j639969k747908o10431J508320
4473b134603M93047j246976R94777P004652J1436595J0149831L760033m000237
4465B6457119q381660n718484K519463Q796759O962091J11983l385565j224917
4457B6136789Q77445r05713k929081j216466J504123P84455j568079o73220K277653
4448B4287906R95601n259621q702535l800059M187472O170479J299272l439864
4440A5738651l719049j745429J2414K298900M581081L306856k027252o185910
4432A2260262n399686k608772j455879k61612K578959K664715l190032q166459
4424c578504l654329N987365P781436n81117p054862l514251L145464L338176
$$ y = [-1529675, -4101669, -4411025, -2652557, 55029, 1355385, -284584, -3032492, -3642923, -2134603, -1641556, -2888532, -1893755, 5110897, 16547492, 26697323, 30457356, 26457119, 18075459, 12356975, 14876438, 23673197, 30635288, 30747271, 27361706, 26136789, 27014234, 26108521, 23179440, 21962974, 23467097, 24251552, 22683473, 22010253, 24287906, 25283507, 20023886, 11321351, 7521292, 11708764, 17879243, 19178515, 15738651, 12019602, 10274173, 10286587, 12585487, 17166568, 20473424, 18446172, 12260262, 6860576, 4251804, 2795925, 2534313, 5113272, 7777987, 4587955, -3578504, -7232833, -1245468, 6535968, 5954851, -1100011, -4614262, -1468798, 1869378]
4416A869378j248732l013221m41258K754990M935070N689269K341526n418856
4408G468166j1133484q905798k150754J570252J365510J751902L489380L289150
4400c255676P23893k092044o023670j2133801j4796022p005702O847993J3267976
4392b4467053P712106J472028N333995J3720577J2619238n17851j2638934j1087298
4384g853192J640783J1458242Q731373j998098q897302p120483k553070j373489
4376g965236j611047J142393M791654M294059J101325R85496L564638K701881
4368I005163k022160l372443J336412M894915J540180m272366o133063n488740
4360d512102o189093n614857J33842O832913P408714L866682M216917Q613636
$$ y = [1869378, 620646, -2392575, -2833833, -78843, 4856227, 10545496, 12887022, 7468166, -3665318, -12571116, -14721870, -13151618, -11786108, -10034206, -6544826, -3255676, -2531783, -4623827, -10647497, -22781298, -37577320, -44583022, -37735029, -24467053, -16754947, -15282919, -9948924, 3771653, 16390891, 15873040, 3234106, -7853192, -6212409, 5245833, 13977206, 11979108, 3081806, -4038677, -6591747, -7965236, -9576283, -8433890, -3642236, 651823, 1753148, 2738644, 6303282, 9005163, 6983003, 3610560, 4946972, 9841887, 11382067, 7109701, 976638, -4512102, -10701195, -16316052, -16182210, -9349297, -1940583, 1926099, 6143016, 14756652]
4352A4756652Q526828N90983q168606j1351581j0815600r911530p252422k005996
4344b5631272J711647J401113J200968M530656P320264N027531J058350P26428
4336b654315J722677o89151l259321J07864N770329M762637j443373k914943R0297
4327A492701m338306j7655010k2902410q829530J1184766J7498124J1246816P711143
4319d591706J0270047Q961542J999039r6438N866924Q702381J192097q063027
4311B4240859q375464j886299K622732K252764n51633l820783n244262k071637
4303G166277L142251L473920j543906m156608j705470j656285p247816r345787
4295a1873424j638179O826623N889364J412606M164088R537647N065463o393546
$$ y = [14756652, 23283480, 23874463, 15705857, 4354276, -6461324, -16372854, -23625276, -25631272, -23919625, -22518512, -21317544, -16786888, -9466624, -4439093, -3380743, -2654315, -931638, -1620789, -4880110, -4772246, 998083, 5760720, 4317347, 1402404, 1492701, -2845605, -20500615, -43403025, -52232555, -41047789, -23549665, -12302849, -4591706, 5678341, 14639883, 16638922, 16542484, 22409408, 31111789, 32303886, 24240859, 15865395, 13979096, 16601828, 18854592, 18302959, 14482176, 9237914, 7166277, 10308528, 13782448, 12238542, 8081934, 6376464, 4720179, -2527637, -11873424, -13511603, -6684980, -795616, 616990, 4781078, 14318725, 19384188, 12990642]
4287A2990642r002979R21267R435810P467812K840128M150910O597212K154925
4279C7555727o551304j1420794j0747535q139007m966893p33728L004915M652179
4271B653560N317736N574135L226606j931194n130690k619232K409189L601650
4263A3101760j094342q198482j2322249r429592r5142Q567649Q234842p59875
4255a995431q332978n979823L791603J1392391J0445771K370356o106813q262251
4247b677175l199355K413814J525838m113205o353303k562284Q74574j092195
4239a5183291m658240l759397J137753N444253P387708P483151M365684l009915
4231g92294j0174041r570137M23059J1656972J3308796K786832j0983819j6047840
$$ y = [12990642, 3987663, 4908930, 14344740, 21812552, 24652680, 28803590, 35400802, 37555727, 31004423, 19583629, 8836094, 697087, -4269806, -5003534, -1998619, 2653560, 7971296, 13545431, 16772037, 14840843, 9710153, 7090921, 9500110, 13101760, 12007418, 3808936, -8513313, -17942905, -18038047, -9470398, -1235556, -1995431, -10328409, -16308232, -12516629, -1124238, 9321533, 11691889, 5585076, -2677175, -5876530, -3462716, -1936878, -6050083, -12403386, -14965670, -14091096, -15183291, -19841531, -23600928, -22463175, -17018922, -9631214, -2148063, 2217621, -792294, -10966335, -20536472, -20113413, -8456441, 4852355, 7639187, -3344632, -19392472]
4223a9392472r388072J078420O527002N644701J577768l910316q481992o775972
4215c3120933K572061J1077964J0115823L836755K880389P299458P357572J302896
4207A3321985q62481N117638R169173K659073p502993r209683k494719K268251
4199A2466244o81547o920044r279384n544993M81439L129341J135176m71590K558075
4190c127283O818627O450590K476167l1807r35436k278976m09704P233322J1027550
4181B7223050M75232j4768611j3580422M959448J8199821J3212037L048830J479607
4173D0248992K200614m185672j0977162q483704j471410J306748J891544M025419
4165B4555369K898544k844245l320682M904553Q920698J223655n949105l263279
$$ y = [-19392472, -28780544, -27702124, -21175122, -15530421, -13952653, -17862969, -26344961, -33120933, -30548872, -19470908, -9355085, -5518330, -2637941, 4661517, 12019089, 13321985, 12459504, 17577142, 26746315, 29405388, 21902395, 12692712, 10197993, 12466244, 11784697, 4864653, -4414731, -9959724, -9478285, -6348944, -5213768, -5685358, -3127283, 3691344, 10141934, 12618101, 12586294, 11650858, 9371882, 8962178, 16195500, 27223050, 27698282, 12929671, -650751, 4308697, 22508518, 35720555, 38769385, 40248992, 42449606, 38263934, 27286772, 18803068, 17331658, 18638406, 20529950, 24555369, 27453913, 24609668, 21288986, 26193539, 35114237, 36337892, 30388787, 27125508]
4157B7125508j718952r644161j3632196l735640M643817j395282o243577M042955
4149e57528J1598130R57637m955756J4138255K8583042P448930j4520906Q246415
4141E0938219L0629330l4060498j56826840j90994431p0877191Q1260252J15375721
4134a74555438M5549311l439495J5172637L7710609K1450465K430171J1539132
4127d4142608K1081642N293661j1623184l383870J1693215P227622n737331l976289
4119b3567142O098474M516813n533198p105291p47072J67838m896760n486441
4111c6552779o90144J406168N10J394275N926362P946352O211109M256373K978542
4102g123232P61056j625812k285635j665213p97281O34698K338275L718808O438212
$$ y = [27125508, 25406556, 15762395, 2130199, -1605441, 3038376, 1643094, -4600483, -557528, 11040602, 11998239, 7042483, 21180738, 49763780, 57212710, 42691804, 50938219, 81567549, 47507051, -109319789, -300314220, -371191411, -289931159, -174555438, -129006127, -132445622, -117272985, -79562376, -58111911, -55681740, -44142608, -23060966, -17767305, -29390489, -32774359, -21081144, -13853522, -19590853, -23567142, -17468668, -12951855, -18485053, -25590344, -26337416, -26169578, -31066338, -36552779, -37242923, -35836755, -35836245, -34441970, -28515608, -20569256, -14358147, -10101774, -7123232, -6362176, -7987988, -10273623, -11938836, -12736117, -12101419, -9763144, -6044336, 393876]
4093C93876J0816726J0900477J778776r233510r837808j383750K364399l305334
4085B493852p759333l824435J644765J977720J257919K620973m95086j0956638
4077a3040263j7450286r686952M527213R827164M735123N47118K729666N061278
4069a2749939J670675m233611n391506N12709Q156922R808295M124632j376956
4061E21221k4792M293756L407578j941235m454526l763409n667092q542315m590349
4052b0761163M022048N993785J299070L398978J4616382J7790805L232653j3417267
4044A6175291j4344284n143639r65781r72036M105934R685950M159684p972356
4036D728763j0652187j575927N826262M785279J961353J670440L87148j279221
$$ y = [393876, 11210602, 22111079, 23889855, 14656345, 4818537, 3434787, 5799186, 2493852, -5265481, -9089916, -7445151, -5467431, -4209512, -1588539, -2083625, -13040263, -30490549, -40177501, -35650288, -25823124, -21088001, -20540883, -17811217, -12749939, -11079264, -15312875, -20704381, -20191672, -12034750, -2226455, 1898177, 521221, 496429, 4790185, 8197763, 6256528, 1802002, -1961407, -7628499, -16170814, -20761163, -16739115, -10745330, -9446260, -6047282, 8569100, 26359905, 29592558, 16175291, 1831007, -3312632, -4278413, -5250449, -1144515, 8541435, 12701119, 4728763, -5923424, -7499351, -1673089, 3112190, 5073543, 6743983, 7131131, 5851910]
4028E851910K803976J0522239J0991003J895817n836738n208730k753921n717986
4020A2547570j0605218j0609062n689767L32571N478582P828848M692105k217604
4012A758025o265422l850282J567465M895372M313368O80638k804022j306794
4004a011652N435385R613987M955310l130172n485923l573632m925611p675131
3996e797439l559824M963679O298916l37498k814643K638609M851588j728660
3988D514728o851960l499433o03612n056389o325187N765817K0091719J8460828
3980B6496511K827216q883315r062025n879657n275342l919593m83214O03892
3972c575527j074980l54050K971540K732694k065884m398618j000233K187094
$$ y = [5851910, 8655886, 19178125, 30169128, 32064945, 26228207, 21019477, 18265556, 12547570, 1942352, -8666710, -14356477, -14023906, -8545324, -716476, 3975629, 1758025, -4507397, -8357679, -6790214, -1894842, 2418526, 3099164, 295142, -1011652, 4423733, 14037720, 18993030, 15862858, 10376935, 6803303, 1877692, -5797439, -9357263, -4393584, 1905332, 1567834, -1246809, 1391800, 6243388, 4514728, -2337232, -5836665, -6440277, -11496666, -17821853, -12056036, 8035683, 26496511, 29323727, 20440412, 11378387, 5498730, 223388, -3696205, -4179419, -3575527, -4650507, -5004557, -2033017, 699677, -1366207, -5764825, -6765058, -4577964]
3964d577964j0837m510359o031356l662842J572107Q508078J2134688O025482
3956I446997o875665j3369980o326187M138273L630074o287918r881358J078573
3948b4447191J5738526J7564241M148141j1031013j4607089o520270L180202O607462
3940i366991M027975k38001l158453l377614l40524M231101O369342M136531L02356
3931B585722j560673j791407k666697l519946j565123K949591N960889M541357
3923D933713K18445l288501m008262k853657j665671m65995K770392Q246859J1104900
3914A4992223N762625n440272j2166346p754037K084427N862616m19716r987281
3906g065761j3675811q535040P55707O640884N817113K521798K571853M573673
$$ y = [-4577964, -4588801, -9099160, -15130516, -18793358, -17221251, -8713173, 3421515, 9446997, 2571332, -10798648, -17124835, -12986562, -9356488, -15644406, -25525764, -24447191, -8708665, 8855576, 13003717, 1972704, -12634385, -19154655, -15974453, -9366991, -5339016, -5577017, -8735470, -12113084, -12453608, -8222507, -1853165, 2283366, 2585722, 1025049, -766358, -3433055, -6953001, -8518124, -5568533, 392356, 4933713, 5152158, 1863657, -2144605, -4998262, -6663933, -7129928, -4359536, 3887323, 14992223, 20754848, 15314576, 3148230, -4605807, -2521380, 3341236, 2921520, -7065761, -20741572, -29276612, -28520905, -21880021, -16062908, -13541110, -10969257, -6395584]
3898f395584K297012l729885n187119J4772K117172n017310j1866066p022098
3890c4789106M531687R803736Q642395J0649987J4385724P977440p590411j4359757
3882g48305l801265Q509317N041946r300265j6699836j0815491M64700R358103
3874a7991096J2957089Q924379j284011p970899l303295O028654O721555k093437
3866A988939q386931n418455M79921J861173j18237j300797j670815k636056l043025
3857a8244283j664822N36490K929385N960207Q067716O489603K487716Q22505
3849G384517K337061K065553l049788r183545j0925638p632208k242195K435000
3841a8811243M146582J955446q28638J776454J0817250J9236337J9228214J0615408
$$ y = [-6395584, -4098572, -7828457, -13015576, -13000804, -10883632, -15900942, -27767008, -34789106, -30257419, -20453683, -11811288, -1161301, 13224423, 21201863, 13611452, -748305, -4549570, 3959747, 9001693, -298572, -16998408, -27813899, -27349199, -17991096, -5034007, 3890372, 2606361, -5364538, -8667833, -2639179, 4082376, 1988939, -6397992, -11816447, -11336526, -9475353, -9593590, -10894387, -12565202, -15201258, -18244283, -19909105, -19372615, -16443230, -10483023, -2415307, 4074296, 6562012, 7384517, 9721578, 11787131, 8737343, -446202, -11371840, -19004048, -21246243, -18811243, -14664661, -12709215, -13537853, -11761399, -944149, 18292188, 37520402, 48135810]
3833D8135810k97110p842469j0599954r892648p295123l236890K564186Q544700
3825B0080502J0332653N245197k814070o687463m379916n52146L32713j782041
3817A9775429n103100p884276p544517l297350m0568l312235r502367q550459
3809b5459443J502679J0768982J1753359Q754200P918840O746878J079672n092848
3801A7972319o039840m575902o227472q168091m598855R17440M69186l164884
3793a3416099N20485J1429742J6425787Q357407l791354q446947n587169k156536
3785C335316j713505m253481r120554j2400816p836060L939199J2803466J1275538
3777c970897L756162j542229l614047n129900m141031K020828Q532576P756972
$$ y = [48135810, 47838700, 39996231, 29396277, 19503629, 12208506, 8971616, 11535802, 20080502, 30413155, 35658352, 32844282, 26156819, 21776903, 21224757, 21557470, 19775429, 14672329, 6788053, -756464, -4053814, -4094382, -7406617, -16908984, -25459443, -23956764, -13187782, -1434423, 7319777, 15238617, 21985495, 23065167, 17972319, 11932479, 7356577, 1129105, -7038986, -11637841, -10720401, -10251215, -13416099, -12895614, -1465872, 14959915, 23317322, 19525968, 11079021, 5491852, 3335316, 1621811, -2631670, -11752224, -24153040, -31989100, -28049901, -15246435, -3970897, -214735, -1756964, -5371011, -10500911, -14641942, -12621114, -4088538, 3668434]
3769C668434L65583n938649p473205p036745o445579m287071j168229O2032K56918
3760b7996511L531067R498165J2137409Q396790K428581r53004j917808k263953
3752B860736j441355O06126O18550l828941r484373j0138805l474365O334178
3744a7948249J1955906Q865966K19395m736405q49148M795628P81052j1456293
3736h372148j6092921l504539J4479555J8223240N330734p667395p917519l15195
3728e836188L776267K422569J217619J904093J371537n32976l21221J805297Q76519
3719F683516m630693r047301p023582p56011L533450L285525O24785j619146j581365
3710a0530822J496833N062725L440582n225635j3779153j3104225l976521L744548
$$ y = [3668434, 4034017, -1904632, -9377837, -16414582, -22860161, -27147232, -28315461, -28253429, -27996511, -24465444, -14967279, -2829870, 5566920, 7995501, 7042497, 5124689, 2860736, 1419381, 2025507, 2644057, -1184884, -10669257, -20808062, -24282427, -17948249, -5992343, 2873623, 3093018, -1643387, -2492535, 2303093, 3084145, -8372148, -24465069, -27969608, -13490053, 4733187, 10063921, 2396526, -5520993, -5836188, -2059921, 362648, 1580267, 3484360, 4855897, 4322921, 4001700, 5806997, 6683516, 2052823, -6994478, -14018060, -14774071, -11240621, -7955096, -7330311, -8949457, -10530822, -9033989, -3971264, -530682, -5756317, -19535470, -32639695, -36616216, -32871668]
3702c2871668M523727L768823Q273963J5216402J5624948O655044m075908o677667
3694A0437664M97604Q823709P862602l158143j3226995j1547959o71811O845885
3686E862556M697722o44008j523991K68468k65810q98535L742482J0808878J0936681
3677C2984443J644449q267264r715975l573733K176491J688559m182546r728815
3669C025609r397077k849139M560723P734830P028704N379078K807656j930437
3661A6359947o162766n471492o71885K979935L825047N300350Q393168Q534925
3653C3087229K470168o477648j2534672j3178688r154778k910065J561225J729140
3645e408089N85175K633239N070725K69035j0404184j4029221l440125J0555378
$$ y = [-32871668, -28347941, -24579118, -16305155, -1088753, 14536195, 21191239, 17115331, 10437664, 10935268, 19758977, 27621579, 24463436, 11236441, -311518, -983329, 5862556, 10560278, 9916270, 8392279, 8660747, 8394937, 7496402, 11238884, 22047762, 32984443, 34628892, 26361628, 16645653, 13071920, 15248411, 16936970, 12754424, 3025609, -6371468, -9220607, -4659884, 3074946, 10103650, 15482728, 18290384, 16359947, 10197181, 4725689, 4053804, 7033739, 10858786, 16159136, 24552304, 33087229, 35557397, 29079749, 16545077, 3366389, -5788389, -8698454, -7137229, -5408089, -4822914, -2189675, 2881050, 3150085, -7254099, -21283320, -24723445, -14168067]
3637a4168067J2729310L571200l902168l543254r21577o4997K201801O149581
3629B051829N124282k330586o096049R77344R253618M173266j1370098j8683756
3621a6900150q409742P355690J2806445Q320013M283375K640859l208968j2580414
3613e692892j4798999n326971O405714J0894131J0912682J2505594J2297710M629015
3605C1825984m585278m334286L166061M203524n115918j2593573r231987k146319
3597A188208q04235j631089K864286P865885K589872j0574192j6683123r108501
3589b4292889J515357L163869j690180k364849L584546Q066593N318287q7710
3581f786976q74212J903556J011641m743480p265748j330518O207836O152632
$$ y = [-14168067, -1438757, 2132443, -1769725, -5312979, -6234556, -6299553, -4097752, 2051829, 7176111, 4845525, -1250524, -273180, 8980438, 13153704, 1783606, -16900150, -25309892, -17954202, -5147757, 3172256, 7455631, 10096490, 6887522, -5692892, -20491891, -25818862, -19413148, -8519017, 2393665, 14899259, 27196969, 31825984, 27240706, 22906420, 26072481, 30276005, 25160087, 12566514, 3334527, 1188208, 383973, -1247116, 1617170, 9483055, 12072927, 1498735, -15184388, -24292889, -22777532, -19613663, -21303843, -23668692, -20084146, -12017553, -6699266, -6786976, -7661188, -5757632, -4745991, -9489471, -16755219, -18085737, -11877901, -5725269]
3573e725269J415625J882967O671976M094450p969423j4826781n837482Q400713
3565a1893224J0781473J851324l577933N04830N345774L842782J0646o21563M59716
3556F703825K66763N65760L676921P096932O526389J434449m684951p733022o525718
3547G327348m749461p328880j2123030r874532J905268J0728977M657060q137127
3539a7594377q664557M681893J2434716K560770j2044167j3085088k104093N063885
3531b8751018J368300n525732o397139L10953J0259114J6390548J2437487P0684
3523A63197r654328q145600J48578N004326M467426M086546N499541N064797K648738
3514I283221K539867N067570N516420K479601k77419j336121l107515m356741
$$ y = [-5725269, -4309644, -2426677, 4245299, 8339749, 370326, -14456455, -20293937, -11893224, -1111751, 739573, -2838360, -2333530, 3012244, 6855026, 6865672, 6244109, 6703825, 6970588, 7536348, 11213269, 18310201, 24836590, 26271039, 21586088, 13853066, 7327348, 2577887, -4750993, -16874023, -26748555, -24843287, -14114310, -9457250, -17594377, -26258934, -21577041, -9142325, -6581555, -18625722, -31710810, -33814903, -28751018, -27382718, -32908450, -39305589, -38994636, -28735522, -12344974, 92513, 163197, -9491131, -17636731, -17488153, -12483827, -8016401, -3929855, 1569686, 6634483, 9283221, 11823088, 16890658, 22407078, 24886679, 24609260, 23273139, 20165624, 15808883]
3506A5808883j31245P663996Q805191n40805r933876r144925l448449m415093
3498D663677j0385571q875882K054567Q318253N73286j0662522r500473L009806
3490b0804859J1729574R042735K255164o17869j095747k424687j456143M449357
3482A077525R288626N964194j756190l610314K211161O765773L491744l696872
3474A9735647p322963n383081r23535K906868M786527N090774N258103N277963
3466B9426303K603021l246504p062001m306676O28107m28654o838608j0000787
3458G74201p049301m189208m469534k721385L073717N901523J867573j294487
3450h106901L640358J0778956J0200272L031386k725995n813140j0105424j3648322
$$ y = [15808883, 15677638, 23341634, 32146825, 31606020, 21672144, 12527219, 9078770, 4663677, -5721894, -14597776, -12543209, -4224956, -3651670, -14314192, -23814665, -20804859, -9075285, -32550, 2222614, 1604745, 508998, -1915689, -3371832, 1077525, 10366151, 16330345, 14574155, 10963841, 13175002, 19940775, 23432519, 19735647, 12412684, 7029603, 6106068, 9012936, 13799463, 18890237, 24148340, 29426303, 32029324, 28782820, 21720819, 17414143, 18042250, 17613596, 10774988, 774201, -6275100, -10464308, -14933842, -17655227, -14581510, -8679987, -6812414, -8106901, -4466543, 6312413, 16512685, 19544071, 16818076, 11004936, 899512, -12748810]
3442a2748810j1093691m778010j947138k156567J325954Q019647R725780M521542
3434i131293N8500P38540K210650J475816K012773N022599N652320K629963J935812
3425A2605680N384228N282958k490137r231611o053339J801897L259500j732890
3417H826286m282689j573597J204362K070921M457081P949823P104695J618407
3409B7375289j472691P08052J253356n613231j4483410j5966920r765501l861502
3401b1826558k616381k177781J885628P669721R742957N697629k209720r873038
3393a3707543j3686641j1548560m192311M270844Q912661Q080524M610168K785396
3385a4475462M362361P419516Q677174P036943M838604M818817N838968L733001
$$ y = [-12748810, -23842501, -28620511, -30567649, -32724216, -31398262, -23378615, -13652835, -9131293, -9072793, -8334253, -6123603, -4647787, -2635014, 2387585, 8039905, 10669868, 12605680, 17989908, 23272866, 20782729, 11551118, 5497779, 7299676, 10559176, 8826286, 4543597, 2970000, 4174362, 6245283, 10702364, 18652187, 25756882, 27375289, 25902598, 26610650, 27864006, 22250775, 7767365, -8199555, -17965056, -21826558, -24442939, -26620720, -24735092, -17065371, -7322414, -1624785, -3834505, -13707543, -27394184, -38942744, -43135055, -38864211, -29951550, -21871026, -17260858, -14475462, -10113101, -2693585, 5983589, 13020532, 17859136, 22677953, 28516921, 32249922]
3377C2249922k352590p113974n561985k16486K303713K60472k980799o575587
3369A0012686j2626165j8038043j4710278k131626Q110751O852131j53366j800183
3361b4484093K227039M178709K410965J627875J297974l928561j1629300j1433191
3353c9732583q01345R415118J0001851N078059L183416M438335L270448j697937
3345f844638o853937q771533n555373K645521J0376550R433512l08661p759610
3337a3638169m027561N649392R507184M557129k463712n951076n897005l617675
3329a5881493j47004J941641J110495N24909L831681Q415634Q446228L762754
3321A2004845m6921j86531K30403k106444o712043j1333862j3633140j0931216
$$ y = [32249922, 29897332, 22783358, 17221373, 17004887, 19308600, 19569072, 16588273, 10012686, -2613479, -20651522, -35361800, -37493426, -29382675, -22530544, -22683910, -24484093, -22257054, -18078345, -15667380, -14039505, -12741531, -16670092, -28299392, -39732583, -40533928, -31118810, -21116959, -16038900, -12855484, -8417149, -5146701, -6844638, -13698575, -22470108, -28025481, -25379960, -15003410, -5569898, -5878559, -13638169, -17665730, -12016338, -2509154, 2047975, -415737, -6366813, -12263818, -15881493, -16028497, -14086856, -12976361, -12451452, -8619771, -204137, 8242091, 12004845, 11957924, 11771393, 12001796, 9895352, 3183309, -8150553, -21783693, -32714909]
3313c2714909k833892N751755Q612438N449690J140405j515723l207741k846205
3305b2164182K213213Q928131Q463186k208415j3449617j3446744l224259M677390
3297c0211297K573506k784654O5197J1457865J9686341J6058778N595626o54895
3289B1786467Q8512J496334n91603l444920m272141m022692k350911L213357R565431
3280B1467834Q116971j746175q022333l104668K845930l148965j5006620j5020182
3272a3618208o98230J1021470Q049168k316136p564084o389711m210836k135242
3264a7861809J519419N237102O838722P156793O130087R06303p038312r273083
3256f384778j537752P950938Q756864K531131q60199J521241L090395l11370m044691
$$ y = [-32714909, -35548801, -29797046, -21184608, -15734918, -14594513, -16110236, -19317977, -22164182, -19950969, -11022838, -2559652, -4768067, -18217684, -31664428, -34888687, -30211297, -27637791, -30422445, -30357248, -18899383, 786958, 16845736, 22441362, 21786467, 21874979, 23371313, 22779710, 19334790, 15062649, 11039957, 8689046, 11902403, 21467834, 29584805, 27838630, 19816297, 16711629, 19557559, 16408594, 1401974, -13618208, -14316438, -3294968, 4754200, 2438064, -5126020, -11515731, -15726567, -17861809, -16342390, -11105288, -4266566, 2890227, 9020314, 9926617, 2888305, -6384778, -7922530, 28408, 8785272, 11316403, 10456204, 11977445, 15067840, 14756470, 10711779]
3247A0711779k535357K027344K575244l067346q283811n258541L630955N875872
3239E676139n264938j8167737j4950570L798958J7583946J3460846L037311L134598
3231H308553J0215498Q061278n356258j5096334j2592386o180078m873249n132672
3223b2645648k95157P159139J0439629Q292160L102525m677749j3269629j6014324
3215b7909054q671912L021849R734105R779836Q055608O908894N031074L112834
3207I063234K873159J482776m946426j2043380j0076357J243664R184154M307381
3199A088205o337689r097196j910607N458869O598540M492757K226996k410268
3191A09607q837387q788407K385590J4424609J2114429l936649j5860549j0734731
$$ y = [10711779, 8176422, 10203766, 12779010, 9711664, 1427853, -3830688, -199733, 5676139, 411201, -17756536, -32707106, -28908148, -11324202, 2136644, 5173955, 8308553, 18524051, 26585329, 21229071, 6132737, -6459649, -12639727, -17512976, -22645648, -22940805, -15781666, -5342037, 2950123, 6052648, 1374899, -11894730, -27909054, -36580966, -33559117, -23825012, -14045176, -5989568, 919326, 5950400, 9063234, 11936393, 13419169, 8472743, -3570637, -13646994, -12403330, -3219176, 1088205, -5249484, -14346680, -16257287, -10798418, -4199878, 292879, 2519875, 109607, -8727780, -17516187, -15130597, -705988, 11408441, 7471792, -8388757, -19123488]
3183a9123488L750689J1196467P629070K521607J930173P55368o135658j3472456
3175a0948228j2162398k126595P552565R944825O511382K129881r55557k263867
3167b317992k94589N392700J0711922R633450J272210p866442j0351936n571130
3159F08193M32293K327172Q63027L32079K381193M270220K949006j233067n688632
3150G241484q692425r683499p760545k463417L899075P192745N830374K527355
3142a908853N60911j86879j962816m995910o233988k157192P222208J6159792
3134F497273J5905479L277736j2732962j7671059p708045N655259J0799998R972623
3126A3996302J1254707J2754987O565835m055261n934920L026488Q260847L61603
$$ y = [-19123488, -15372799, -4176332, 3452738, 5974345, 7904518, 8659886, 2524228, -10948228, -23110626, -25237221, -17684656, -7739831, -1228449, 901432, -54125, -2317992, -2612581, 2780119, 13492041, 23125491, 24397701, 16531259, 6179323, 608193, 1040486, 3367658, 4230685, 4562764, 6943957, 11214177, 14163183, 12930116, 7241484, -1450941, -11134440, -18894985, -21358402, -17459327, -10266582, -4436208, -1908853, -1347942, -1534821, -3497637, -8493547, -14727535, -16884727, -9662519, 6497273, 22402752, 25680488, 12947526, -4723533, -12431578, -6776319, 4023679, 13996302, 25251009, 38005996, 44571831, 40516570, 34581650, 37608138, 45868985, 46230588]
3118D6230588j0436535j1096498n600230n483703r793280r323838m535332l067497
3110a3106325l122740L279459J1530054P767438o206167j0642094K085332J3247361
3102D832318N565058j0092907j1617476J693158J1309151Q296045J738755l41333
3094A1382769j214338l541681k205117M379507P248274j36234r629757q796346
3086b512923N06265M113394l552356j0036643j832678J5070184K0979240Q735504
3078C1469987o084178o830562J500163K440007m924246n309994N886147J2925780
3070C1073104M433765q086035q889326k409834k957478q970535o574747M707154
3062B326068R261591K03502j0255859j0162771k993234K939785P432455J2628692
$$ y = [46230588, 35794053, 24697555, 19097325, 13613622, 3820342, -5503496, -10038828, -13106325, -16229065, -12949606, -1419552, 6347886, 141719, -10500375, -8415043, 4832318, 10397376, 304469, -11313007, -9619849, 1689302, 9985347, 11724102, 11382769, 10168431, 6626750, 4421633, 8801140, 16049414, 15913180, 6283423, -2512923, -2006658, 2106736, -1445620, -11482263, -13314941, 1755243, 22734483, 31469987, 25385809, 18555247, 20055410, 22495417, 17571171, 12261177, 18147324, 31073104, 35506869, 27420834, 18531508, 16121674, 13164196, 4193661, -2381086, 2326068, 11587659, 11791161, 1535302, -8627469, -11620703, -8680918, -1248463, 11380229]
3054A1380229J4812270J1057339O250584M899520K605740n586238j3996683j3053472
3046A8369289l927203K697686J199558l559500n272453l620814j435832o4824
3038D385907O8152k092626o545994j0495787j0399932n952296j050802M01484
3030c1681894l63905J666909P436675J0627803O108230j351789k740092K328325
3022g969738N664432L608200J856744M528268O289402O62389r398383j5037301
3014i795987j2081608l262523O890457J4303371J4875924P215033m140225j1625944
3006B378498j1444071o457332k739922l307486m494840k14734Q249584J0682551
2998g347752J750710p681774k862947J2602280J9141629Q157636o483494r803095
$$ y = [11380229, 26192499, 37249838, 43500422, 48399942, 51005682, 45419444, 31422761, 18369289, 14442086, 17139772, 18339330, 14779830, 9507377, 5886563, 4450731, 4385907, 4454059, 2361433, -4184561, -14680348, -25080280, -31032576, -32083378, -31681894, -32045799, -30378890, -22942215, -12314412, -6206182, -7557971, -10298063, -7969738, -2305306, 1302894, 3159638, 7687906, 13977308, 14639697, 5241314, -9795987, -21877595, -25140118, -18249661, -3946290, 10929634, 18144667, 14004442, 2378498, -9065573, -15522905, -18262827, -21570313, -26065153, -26279887, -18030303, -7347752, -5597042, -13278816, -16141763, -3539483, 15602146, 23759782, 17276288, 7473193]
2990G473193n664467n448456p750416l212426O572233R575069J522351q349426
2982e282345j0588374n545271P90187L636820J440663l165154m644123j283695
2974b4641292J748499Q98782J069295O628901J0820020M769314o190882p782365
2966a2679728J771610Q147488J563699j0105367j3614477o919370J860516N405869
2958b4569760K306245l682088n669935Q56034J1945111J8428374J6361652R855479
2950B5831112L647218j066900l259615j748644O53795k60491k498828p33630K533229
2941B3097246j400769j2014667j6615167q251096L271891N485240j65619m214128
2933a0807069m331396m715458n258048j728321N057210R068258P794910M307908
$$ y = [7473193, 1808726, -3639730, -11390146, -14602572, -8030339, 1544730, 3067081, -5282345, -15870719, -21415990, -20625803, -16988983, -15548320, -18713474, -23357597, -24641292, -22892793, -21994011, -20924716, -14295815, -3475795, 1293519, -4897363, -12679728, -10908118, -2760630, -1196931, -11302298, -24916775, -31836145, -29975629, -24569760, -22263515, -25945603, -31615538, -30759504, -18814393, -386019, 15975633, 25831112, 29478330, 28411430, 25151815, 23403171, 24056966, 23796475, 21297647, 20564017, 23097246, 21696477, 9681810, -6933357, -15184453, -11912562, -6427322, -6592941, -10807069, -15138465, -19853923, -25111971, -26840292, -21783082, -12714824, -4919914, -612006]
2925f12006Q36004l539130q338994j0115703o908208j164064K898485L498711
2917b3444905K808369M425856Q210474Q665407J736934p813855j1089575o899868
2909b3401163k347481j044003R79674N311615O520125K342262m52901K889851
2901i202021O249742K717860l719032n590402m631140o864946j0076758p341954
2893c8458651N2704M316503M257034O025543J0925341J2398118O460337k864992
2885C111937r653829j1060250o404308K003165P832410P319671N447307Q200300
2877F796403J1116835N281532o483704j0799471k720203P098850P763023J598428
2869A9651693k280164p12571K016276R37614m434126q925544o007142L102738
$$ y = [-612006, 223998, -3315132, -11654126, -21769829, -28678037, -29842101, -26943616, -23444905, -20636536, -16210680, -8000206, 665201, 2402135, -5411720, -16501295, -23401163, -25748644, -26792647, -25812973, -20501358, -13981233, -11638971, -12091872, -9202021, -2952279, -234419, -3953451, -9543853, -14174993, -21039939, -31116697, -38458651, -38405947, -34089444, -29832410, -23806867, -12881526, -483408, 5976929, 3111937, -6541892, -17602142, -24006450, -22003285, -14170875, -6851204, -1403897, 6796403, 17913238, 23194770, 16711066, 5911595, 3191392, 10290242, 18053265, 19651693, 17371529, 16658958, 18675234, 19612848, 15178722, 6253178, 246036, 3348774]
2861C348774P756623J503921p059860o371137j13039m87397o841641p480694k106564
2852a7851014l261518j1923800j1982990K791720J5728354J2976545M314316L686866
2844e521521N862882P49131l727331M745465J6646199J2256725n719925j5204205
2836A0087420q987336k416390m839476o418883K44381O059858K687362l165193
2828f748257l367592k078773m801087n981318P90971J0038559J3059794J1053252
2820A1965549R143223N346758l348777j0834385r576798l291530o00325n15486
2812a711771L941879J0871074J0761591J979382o423901q288569o722358n364169
2804i56842k651732K300752N853407N331592K633195j89126l763944p625445q407498
$$ y = [3348774, 11105397, 12609318, 5549458, -821679, -934718, -1422115, -8263756, -15744450, -17851014, -21112532, -33036332, -45019322, -42227602, -26499248, -13522703, -9208387, -5521521, 341361, 1090492, -2636839, 2108626, 18754825, 31011550, 25291625, 10087420, 1100084, -1316306, -6155782, -12574665, -12330284, -6270426, -3583064, -6748257, -10115849, -12194622, -16995709, -22977027, -22186056, -12147497, 912297, 11965549, 21108772, 26455530, 23106753, 12272368, 2695570, -595960, -1196285, -1711771, 2230108, 13101182, 23862773, 25842155, 19418254, 11129685, 4407327, -956842, -3608574, -1307822, 4545585, 9877177, 12510372, 12321246, 8557302, 931857, -7475641]
2795g475641m229597K416353P236485O914643N61220p384106p943154K227438
2787g676359J3205998J2510588K500123k858191Q92316K866370m122508j1376953
2779E941384q999986j764555L34810j241184J194506N822661M646157o87217o11344
2770D635232N355442P378653K775369O70703M752263M939783n727809j6982291
2762G797345j4538788k33110J1164803J0576918J235542r092013j3599880p664792
2754a4353975O019407J5414992J0983901j690847r164835q002348n886470o244119
2746a2924294l542410L937633P950990K309335p265352j1022322o714997J279188
2738b5992229Q118233R330868K096012r001859j3490527p601464P11664M509079
$$ y = [-7475641, -11705238, -9288885, -2052400, 4862243, 5423463, -1960643, -9903797, -7676359, 5529639, 18040227, 20540350, 17682159, 18574475, 21440845, 17318337, 5941384, -3058602, -4823157, -4488347, -5729531, -4535025, 1287636, 5933793, 5246576, 4635232, 9990674, 17369327, 20144696, 20815399, 25567662, 30507445, 24779636, 7797345, -6741443, -6974553, 4190250, 14767168, 16002710, 6910697, -6689183, -14353975, -8334568, 7080424, 18064325, 16373478, 7208643, -793705, -6680175, -12924294, -16466704, -12529071, -4578081, -2268746, -9534098, -20556420, -27271417, -25992229, -17873996, -8543128, -6447116, -15448975, -28939502, -36540966, -35829302, -31320223]
2730c1320223P821314J5241696J9647688J1837337k528160q539980l030119K467891
2722A1597444K93294l797743k454901K564073N762763N099762l06409j0932105
2714G826178k0498316j7768300j511144J3721769J4494629N205514j00230K744440
2706D114540O186239N235449L187917L298459L811016K970258J977715J035866
2698C1817459j792977o066870q454707q181506p936517q096972n672188q76286
2690a5260564J374206l32752l22669M851891R171878N878795o93794m04875O977092
2681A1239208J0263154K894091p271355q662054j124190N179766L124651m422358
2673A1220913r874555q628982j663102N801741P864301L160291l100727m722083
$$ y = [-31320223, -23498909, -8257213, 11390475, 23227812, 20699652, 12159672, 9129553, 11597444, 11890738, 8092995, 5638094, 8202167, 13964930, 19064692, 18758283, 7826178, -12672138, -30440438, -31951582, -18229813, -3735184, 1470330, 1370100, 4114540, 10300779, 15536228, 18724145, 22022604, 25833620, 28803878, 30781593, 31817459, 30024482, 23957612, 15502905, 7321399, -615118, -8712090, -14384278, -15260564, -13886358, -14219110, -14541779, -9689888, -518010, 5360785, 4666991, 4262116, 11239208, 21502362, 24396453, 17125098, 8463044, 7338854, 12518620, 15643271, 11220913, 1346358, -7282624, -8945726, -3143985, 4720316, 7880607, 4779880, 57797]
2665E7797j909023k43118k626811n896170n923870k469998J980516M868718M367948
2656g794011J267651M49968N591192J1674562R413598n97630o215426j135261
2648A2654643M620620j5505q943383p948131K536559P883620K032699m582244
2640H238878l058928J360146Q16332k496120l194661k852716m406336m266740
2632i860145M33514L370254j741902q664101o645587K564364P471710M884970
2624h186923L009195N970666P398367K785861k443679k607103r38606k709118
2616B278660n646236m131918J252680M913779M618735L159397K878591L067477
2608A2391165K421496P27164j814113m657206o527854o528454n184448l394112
$$ y = [57797, -1851226, -2094344, -4721155, -10617325, -16541195, -19011193, -17030677, -12161959, -7794011, -6526360, -6076392, -485200, 11189362, 20602960, 20005330, 13789904, 12654643, 17275263, 17259758, 8316375, 368244, 2904803, 10788423, 12821122, 8238878, 5179950, 6540096, 7356428, 4860308, 1665647, -1187069, -5593405, -9860145, -9426631, -6056377, -7798279, -16462380, -23107967, -20543603, -13071893, -8186923, -5177728, 792938, 8191305, 10977166, 8533487, 5926384, 4987778, 2278660, -3367576, -7499494, -6246814, -1333035, 3285700, 6445097, 9323688, 12391165, 14812661, 15539825, 13725712, 9068506, 2540652, -3987802, -9172250, -12566362]
2600a2566362j246874J159232K788739K677844J265608m745k03353j21686k017702
2591h269299o731895j0305393o270327N761272J6152461J4541304K580603p021853
2583D36873m556183P254450J7814519J8603223Q540463n895161j4896529j3708464
2575A3593191p618960m984407n959103l891259K208798M728929l2456m309178
2567f264445K18243R477101J2030317M276757n720169q699407l745682K466537
2559D039252K989804k446824o582776k642891O304491J0099516M826326k450033
2551A4136865n139664o120118r499259j0415057k344315R573537J3134429N970800
2543I297218k183029m802429o128615j0465013j3283189q775380L45684P044890
$$ y = [-12566362, -13813236, -12654004, -9865265, -7187421, -5921813, -5926558, -6129911, -6251597, -8269299, -15001194, -25306587, -31576914, -25815642, -9663181, 4878123, 7458726, 436873, -4119310, 3135140, 20949659, 39552882, 48093345, 42198184, 27301655, 13593191, 5974231, 989824, -4969279, -8860538, -6651740, -1922811, -1955267, -6264445, -6046202, 3430899, 15461216, 19737973, 14017804, 5318397, 1572715, 4039252, 7029056, 4582232, -2000544, -4643435, 1661056, 11760572, 16586898, 14136865, 8997201, 2877083, -6622176, -17037233, -19381548, -9808011, 3326418, 9297218, 7114189, 2311760, -3816855, -14281868, -27565057, -36340437, -35994753, -28949863]
2535b8949863R529464J0398040R627558N352763J82860l95016L226329L984312
2527A2956447j248268n917169l464515J499231r57518j0234971j3849412m795814
2519b6011989P630600J0493098M517307K09460Q25205k6600m697902o897981l187938
2510a7146740J178172J722224N29622j648071q524978j7248450j5349429J616904
2502e4870746J8746471J9654010Q196083m2602j188272l334213p868045p075410
2494b7782724r720M639096L528666K980236N861966P049321M868055M323048N496534
2485A0954478J675403o748835r850551m942917k040453n866256o864541O15288
2477b3068384N663187j032043r158206m493201P214599R601205K554191J053123
$$ y = [-28949863, -19420399, -9022359, 605199, 5957962, 6140822, 5745806, 8972135, 12956447, 11708179, 5791010, 2326495, 3825726, 2868208, -7366763, -21216175, -26011989, -18381389, -7888291, -3370984, -3161524, -2336319, -2362919, -7060821, -13958802, -17146740, -15968568, -14246344, -13716722, -15364793, -23889771, -41138221, -56487650, -54870746, -36124275, -16470265, -8274182, -8316784, -9505056, -12839269, -20707314, -27782724, -27792444, -23153348, -19624682, -16644446, -10782480, -3733159, 1134896, 5457944, 10954478, 12629881, 5881046, -3969505, -8912422, -10952875, -16819131, -23683672, -23068384, -17405197, -18437240, -27595446, -32088647, -24874048, -15272843, -12718652, -11665529]
2469a1665529R230593J3923179O662253l613030n502035q54996J339317j543970
2461G975782n215625o434723n791846m579588k271545K889693J0577135J5530489
2453A2679772J1627211J096756n485453k987648K70870m783659j3000846j2454728
2445a3037725k984223M055685L210321O22802J636022L640610L711431L656573
2437D511496M106480J968176k617385m071817L13609O011404P963738O000959
2429B4186660J851100l134235n901160l901157o24462k109799p070321q061435
2421d764809l234021J622706L636149N576475O476657R96975q268178r802690
2413g760736k91428Q475442O831340N50844j326371j344670n819645j1139540
$$ y = [-11665529, -2434936, 11488243, 18150496, 14537466, 9035431, 8180435, 9519752, 7975782, 2760157, -3674566, -9466412, -14046000, -16317545, -13427852, -2850717, 12679772, 24306983, 25403739, 19918286, 16930638, 17201508, 12417849, -582997, -13037725, -16021948, -11966263, -8755942, -8133140, -6497118, -2856508, 854923, 4511496, 8617976, 10586152, 7968767, 3896950, 4210559, 10221963, 18185701, 24186660, 26037760, 22903525, 17002365, 13101208, 12476746, 10366947, 3296626, -4764809, -7998830, -6376124, -2739975, 2836500, 9313157, 10310132, 2041954, -7760736, -8052164, 423278, 7254618, 7805462, 6479091, 5134421, -685224, -11824764]
2405a1824764r841980m058471j271563j358124J155408N642920O598017L405683
2397a1552874m46957m802273j0408586j2505410o340891L750148R759809J1244959
2389b1302075J2275254J1560798O146031Q95667K389773O286787L199300n053267
2381A6398268q173210m902237l822236o858582o691434k103660r12691m192171
2373b1257953k224250Q471399J7416668J5788286P921212J170324m177242q690157
2365A4418287q969959n525213m331244m755309J417863J2606754J4147412J648667
2357B0657258q156855k538672O693653L769758m519929l054036K956422k097809
2349A3709790j2983361r401820Q060634J5016197J538670j1744418o242648P348837
$$ y = [-11824764, -21666744, -25725215, -26996778, -28354902, -27199494, -21556574, -14958557, -11552874, -11999831, -16802104, -27210690, -39716100, -46056991, -42306843, -32547034, -21302075, -9026821, 2533977, 8680008, 9575675, 11965448, 18252235, 21451535, 16398268, 8225058, 3322821, -499415, -7357997, -14049431, -16153091, -17065782, -21257953, -23482203, -15010804, 2405864, 18194150, 26115362, 27285686, 23108444, 14418287, 5448328, -76885, -4408129, -9163438, -7745575, 4861179, 19008591, 20657258, 12500403, 9961731, 16655384, 20425142, 15905213, 12851177, 15807599, 13709790, 726429, -8675391, -614757, 14401440, 15940110, 4195692, -2046956, 5301881]
2341E301881Q672618k002624r271220o921163j041308L585899N874305K525626
2333F724014p090660j3715276q049651M260269Q622543J323702p197760q682189
2325b3805008o089075m497234k645764K184587P781380J0348655R855759P956851
2317A090151L970944k810569q782442q475166j771224M495795M156386m94598
2309h620723j395142M342648R650152O662177k027742o480207l009601J662198
2301G83760J338787j133264l80316J734689j032082r036390j5024346j2612081
2293c5361243k995971O740197J0061438O764625L716175P726202J6444477J9829401
2285C2925301J2735102J601619m754297o031670o874496p044825k750728M428602
$$ y = [5301881, 13974499, 11971875, 2700655, -4220508, -5261816, -1675917, 4198388, 6724014, -366646, -14081922, -22131573, -17871304, -9248761, -7925059, -15122819, -23805008, -29894083, -34391317, -37037081, -34852494, -27071114, -16722459, -6866700, 1090151, 5061095, 2250526, -6531916, -15007082, -16778306, -12282511, -8126125, -8620723, -10015865, -5673217, 3976935, 10639112, 8611370, 2131163, -878438, 783760, 2122547, 989283, 608967, 2343656, 1311574, -7724816, -22749162, -35361243, -38357214, -31617017, -21555579, -14790954, -11074779, -3348577, 13095900, 32925301, 45660403, 47262022, 42507725, 36476055, 29601559, 22556734, 19806006, 24234608]
2277B4234608P874365N251498R21137j471197k799956m063487m046913k915842
2269B2984213l072651m709654m821926k054647J378203L401384L634341J117598
2261A7856861m381871q343765m903301M038242R234553O137544N12394j128091
2253A9022566m19288j888517m524526m660221l170369l353085m326526k873777
2245f193743k51523r29332m875088o658598k972390L228636O944471O185208K325956
2236c196403j618016k605417J7173L323336L871031J645870p60742j721823j027496
2227b072487J530908M636445M020636k735140j0186434r119590J536861J1306781
2219a082020R813959r74246r557938q435537j374986K724700J74400m825706o331852
$$ y = [24234608, 32108973, 37360471, 38281608, 36810411, 34010455, 29946968, 25900055, 22984213, 19911562, 15201908, 10379982, 8325335, 9703538, 13104922, 16739263, 17856861, 13474990, 5131225, 227924, 4266166, 13500719, 19638263, 20150657, 19022566, 18603278, 16714761, 12190235, 7530014, 4359645, 1006560, -3319966, -6193743, -6445266, -7374598, -12249686, -18908284, -21880674, -18652038, -11707567, -5522359, -3196403, -4814419, -7419836, -7402663, -4079327, -208296, 1437574, 676832, -1044991, -2072487, -541579, 4094866, 8115502, 5380362, -4806072, -13925662, -12388801, -1082020, 8731939, 7757693, -1800245, -10235782, -11610768, -8886068, -8711668, -13537374, -19869226]
2210a9869226l235855Q64210K886799L440870M605196O322063O426015L696385
2202E136457l61384k986101l038359k238907l089855n213427m911920J26821O795642
2193i781033R754429P946474M633588J352173l428097q619293r171754l809931
2185a1123444Q76466q07224m579215k215998N583007R765521O440100K319625
2177F258838L767870O482305J521716j1017700j9990621j5829362j956717Q697411
2169b2066260P753763l06911m812543j873137K360548J290868l037492k842016
2161b3533180N350130J6173775K0628658J4726752L482489l612345k255788K193351
2153C3153842J981855k966539o424878n765179l955394j899874K781150P474706
$$ y = [-19869226, -23105081, -22240871, -19354072, -15913202, -11308006, -4985943, 1440072, 5136457, 4775073, 1788972, -1249387, -3488294, -6578149, -11791576, -16703496, -16576675, -9781033, -26604, 7919870, 12553458, 13905631, 10477534, 1858241, -7313513, -11123444, -10246978, -11054202, -15633417, -17849415, -12266408, -2500887, 3939213, 6258838, 10026708, 16509013, 18030729, 7013029, -12977592, -28806954, -30763671, -22066260, -14312497, -14619408, -19431951, -21305088, -18944540, -17653672, -20691164, -23533180, -18183050, -2009275, 18619383, 33346135, 36828624, 33216279, 30960491, 33153842, 35135697, 32169158, 25744280, 19979101, 16023707, 14123833, 16904983, 24379689]
2145B4379689M722182m925117j0002376m747768J051552k418777r220677q782519
2137i943811l942564l576589m321274L160382J3678892J2273398o00092p593566
2129h65224j400434M987879Q40817o512828o782635k591812n41930O47991L063242
2120i154934K235450l191259n255937R5227M375419J110768k251157J944645P281276
2111b810502N186707K52748P7695M72690m237312o696233O64432Q066506K839507
2102C816238p140430n942577J663888j285251j0759257n239153J5604888K4524337
2094A5242683P749830j3385814j5150761l702261J484060j812811l146226j170960
2086a3892260j655444k103887M082739J2808804J3452836N039625l487719o374978
$$ y = [24379689, 29101871, 24176754, 14174378, 9426610, 10478162, 8059385, -1161292, -9943811, -13886375, -17462964, -21784238, -18623856, -4944964, 7328434, 6728342, -865224, -2265658, 2722221, 3563038, -2949790, -9732425, -12324237, -12866167, -12218176, -9154934, -6919484, -10110743, -15366680, -15271453, -10896034, -9785266, -12036423, -10091778, -2810502, 2376205, 2628953, 2706648, 3179338, -1057974, -7754207, -7089775, 976731, 3816238, -3324192, -9266769, -7602881, -8888132, -19647389, -24886542, -9281654, 15242683, 22992513, 9606699, -5544062, -9246323, -7762263, -9575074, -12721300, -13892260, -15547704, -17651591, -13568852, -760048, 12692788, 17732413, 14244694, 7869716]
2078G869716m730703p63503K596025M52967p013502j0983214o024846P0992j807273
2069b0333341o588348l370977N642583Q378251K841637n19249K662501L488084
2061g798859m451991j3212686j1285204M74780J0432581J0636055M540375N97203
2053a0067746J193288M09085o177591j2627224r564145P62358N472538O3121l897865
2044c4434181L174491J3105401J2488969K943579l509616l381832k431822j484853
2036a3529864L672026R645414P540544j345123n790008k523758j93281k645508
2028e169558k513337L461911O663008J714736l092512N7373M485427J35944r167741
2019c424749j1259320l770343L881685M401041L4568k597539J118007J0644441
$$ y = [7869716, 3139013, 2375510, 4971535, 5424502, -1589000, -12572214, -18597060, -18526068, -20333341, -26921689, -30292666, -24650083, -16271832, -13430195, -13949444, -11286943, -7798859, -12250850, -25463536, -36748740, -36273960, -25841379, -15205324, -10664949, -10067746, -8874458, -8465373, -14642964, -27270188, -36834333, -36071975, -30599437, -30536316, -34434181, -31259690, -18154289, -5665320, -2721741, -6231357, -9613189, -12045011, -13529864, -9857838, -212424, 7328120, 5982997, 192989, -2330769, -2524050, -5169558, -7682895, -4220984, 2442024, 4156760, 1064248, 1121621, 5607048, 5742992, -3424749, -14684069, -18454412, -14572727, -10171686, -10137118, -12734657, -11616650, -972209]
2011i72209J8643894J5831034K589676q445285p277643N32664K772968k219840
2003B1455259o051519m745935k609818k353038j366042N06090j520993q199688
1995d885684j1801271n528585O828763J4877060J2875693M268710k959167l369892
1987A0305627J709000N537164L015807l109522n365212j233313L626601L370307
1979A7856459l04498j630740K81570L40369m499758r920366r294611k296651M402270
1970e065956N140963J572408l25512K103021N570491N339647N10037n242507p061536
1961B541056l373049K052222L488051J4852k928811j142482J608695r50687o760024
1952e450177o455071L303262J3530053J3546767L743545o234089r133038o144838
$$ y = [-972209, 17671685, 33502719, 36092395, 27647110, 20369467, 20902131, 23675099, 21455259, 15403740, 10657805, 8047987, 5694949, 4328907, 4834997, 3314004, -4885684, -16686955, -22215540, -15386777, -509717, 12365976, 16634686, 13675519, 10305627, 12014627, 17551791, 20567598, 17458076, 12092864, 10859551, 14486152, 17856459, 17551961, 15921221, 16202791, 16543160, 12043402, 2123036, -7171575, -9468226, -5065956, 75007, 1647415, 1321903, 3424924, 8995415, 14335062, 14845099, 9602592, 2541056, -831993, 1220229, 4708280, 4723132, 1794321, 651839, 2260534, 1309847, -5450177, -11905248, -8601986, 4928067, 18474834, 22218379, 15984290, 6851252, 706414]
1944G06414l390218n683199j2256036j6275836j0732243K792924J3838473J4390632
1936a6609089P791890L125668L728517N577922M663724R13517l907735p378229
1928b093815o354829m36402N126198M745836K48227j776496N7239R19028m38649
1919c663J711641R854779J6003445J1171006j242208q462865m236538M234999
1911B9030596O418898O50015o312751q542193o460177m602561o584172j1615105
1903h017450j4132778q101636N744111J7900241J8729408R054731j368964n900984
1895A3906679o504959n965461j572992Q076356J5490971J1905843M58587o861799
1887B8933225n560971l299275o137174q849146m097810N341390J0263227P285963
$$ y = [706414, -2683804, -8367003, -20623039, -36898875, -47631118, -44838194, -30999721, -16609089, -8817199, -5691531, -1963014, 3614908, 8278632, 9192149, 5284414, -2093815, -8448644, -8885046, -3758848, 986988, 1235215, -541281, -484042, 434986, -3663, 1707978, 11562757, 27566202, 38737208, 37495000, 29032135, 24795597, 29030596, 35449494, 36099509, 29786758, 21244565, 14784388, 10181827, 3597655, -8017450, -22150228, -30251864, -24507753, -6607512, 12121896, 21176627, 19807663, 13906679, 7401720, 1436259, -136733, 7939623, 23430594, 35336437, 35795024, 28933225, 23372254, 20072979, 13935805, 5086659, 988849, 6330239, 16593466, 23879429]
1879B3879429J293504k317206k466105m76650J971547K682649k22448o481642
1871A7863078j3285284j6159070j1224596K24599R677759Q677921q01172q133568
1863a3160333p354086k754687M68694L439862P532338Q914642N231311J138439
1855C456180P23998Q08088j513269k088492J145135L77716r357656j6983685r299771
1846c2731756O806650J2491133N205395R59082P089429J1565926N233778l014942
1838A3604695l153197j049133n917498j2344548r088339J793754Q423104O880207
1830h50955K935750l86418m622676p369516m193894J202230K12770o109078o719147
1821b5900934K268118J0390580P995404O6186k242081K062868M529119J852799
$$ y = [23879429, 25172933, 22855727, 20389622, 19912972, 21884519, 24567168, 24344720, 17863078, 4577794, -11581276, -22805872, -22581273, -12903514, -4225593, -5026765, -13160333, -20514419, -23269106, -22800412, -19360550, -11828212, -2913570, 2317741, 3456180, 4180178, 4988266, 3474997, 1386505, 2531640, 2909356, -6448300, -23431985, -32731756, -25925106, -13433973, -8228578, -7269496, -180067, 11385859, 16619637, 13604695, 10451498, 9402365, 3484867, -8859681, -17948020, -16154266, -7731162, -850955, 2084795, 1698377, -2924299, -10293815, -14487709, -13285479, -13072709, -19181787, -25900934, -23632816, -13242236, -5246832, -5180646, -7422727, -5359859, -830740, 1022059]
1813A022059P27468O101807J1791516Q706407q65395m944812J048661O628033
1805C0215744J007956j0608481j4389952q206524l278011n151671n579618J860213
1797a4130344R792817R227511M248525L654080M965407m27656j0053131j1937014
1789d659805l127971N968571P753867O279506O066581L101539o087162j4588027
1781G07099j2960276k654901O029578P353359N012336M189503M523360K745077
1773A4945135j088995k862833K75579N547914P140190L104497k504320n187854
1765A9369313m713386k415791K141142P766355Q872431K369934n398178o195155
1757B1796665k728402m849747j2779252j4683816m428077Q265372J1427430O139059
$$ y = [1022059, 1749527, 7851334, 19642850, 28349257, 27483862, 22539050, 23587711, 30215744, 31223700, 20615219, 6225267, -1981257, -5259268, -10410939, -15990557, -14130344, -4337527, 4889984, 9138509, 12792589, 17757996, 17330340, 7277209, -4659805, -7787776, -1819205, 5934662, 12214168, 18280749, 21382288, 15295126, 707099, -12253177, -14908078, -8878500, -1525141, 3487195, 7676698, 12200058, 14945135, 13856140, 10993307, 11268886, 16816800, 23956990, 27061487, 24557167, 19369313, 14655927, 12240136, 14381278, 22147633, 31020064, 33389998, 27991820, 21796665, 19068263, 14218516, 1439264, -13244552, -17672629, -9407257, 2020173, 8159232]
1749H159232P96850k317490n234396m889400K872879J2254513J2152560K471294
1741B6266042m838486l366743o07423m182238r314841p781106k353571k440854
1733h619220q534875j1134058n470145J811011L747573L280119O756672J2114070
1725f048853J0892205J173049q018092p529897N88190N846369J935331o445363
1717g607061r846547n126290J747759L878532J893108J621645M522638N059590
1709c856626n64416p506196q419134l566626O41706J530077K131171L561172K754077
1700a3294795m11730r94362K516996M426126J348851j128690K180193O113859
$$ y = [8159232, 8956082, 6638592, 1404196, -3485204, -612325, 11642188, 23794748, 26266042, 21427556, 18060813, 17453390, 13271152, 3956311, -3824795, -6178366, -8619220, -17154095, -28288153, -33758298, -31947287, -28199714, -24919595, -18162923, -6048853, 4843352, 6016401, -2001691, -9531588, -8943398, -3097029, -1161698, -7607061, -17453608, -22579898, -20832139, -16953607, -15060499, -13438854, -8916216, -3856626, -4421042, -11927238, -20346372, -23912998, -23271292, -21741215, -19610044, -16048872, -13294795, -13706525, -14700887, -12183891, -7757765, -6408914, -7537604, -5357411, 756448]
$$ [...]
##END NTUPLES=NMR SPECTRUM
##END=
