##TITLE=31Pdec_DE-77F2TFA
 DMSO-d6, 64 sc
 28.11.2024
##JCAMPDX= 6.0         $$ Bruker NMR JCAMP-DX V2.0
##DATA TYPE= NMR SPECTRUM
##DATA CLASS= NTUPLES
##ORIGIN= UXNMR, Bruker Analytische Messtechnik GmbH
##OWNER= root
$$ XWIN-NMR		Version 3.5
$$ Thu Nov 28 14:58:26 2024 Russian Standard Time (UT+4h)  she@DPX200
##.OBSERVE FREQUENCY= 81.013821
##.OBSERVE NUCLEUS= ^31P
##.ACQUISITION MODE= SIMULTANEOUS
##.ACQUISITION SCHEME= undefined
##.AVERAGES= 64
##.DIGITISER RES= 17
##SPECTROMETER/DATA SYSTEM= spect
##.PULSE SEQUENCE= zgpg30
##.SOLVENT NAME= DMSO
##.SHIFT REFERENCE= (INTERNAL, DMSO, 0, 198.062)
##AUDIT TRAIL= $$ (NUMBER, WHEN, WHO, WHERE, WHAT)
$$ ##TITLE= Audit trail, XWIN-NMR		Version 3.5
$$ ##JCAMPDX= 5.01
$$ ##ORIGIN= Bruker BioSpin GmbH
$$ ##OWNER= she
$$ F:/spectra/data/she/nmr/P31/2/pdata/1/auditp.txt
$$ ##AUDIT TRAIL=  $$ (NUMBER, WHEN, WHO, WHERE, WHAT)
(   1,<2024-11-28 14:57:06.17 +0400>,<she>,<DPX200>,
      <created by zg, POWCHK disabled, PULCHK disabled
       configuration hash MD5:
       00 E9 B6 7A A2 85 ED C7 34 08 36 98 17 FE 4E 26
       data hash MD5: 32K
       D3 6C 4E DF F9 B5 66 93 94 31 B7 D1 B4 9B BF 63>)
(   2,<2024-11-28 14:57:08.50 +0400>,<she>,<DPX200>,
      <Start of raw data processing
       efp BC_mod = 2 LB = 1.5 FT_mod = 6 PKNL = 1 PHC0 = 2177.776 PHC1 = 272.4883 SI = 64K 
       data hash MD5: 64K
       74 9C 9A 92 6F 9D C5 99 0A 0E 05 1D 59 A7 5F D5>)
(   3,<2024-11-28 14:57:39.34 +0400>,<she>,<DPX200>,
      <pk PHC0 = -15.44721 PHC1 = 0 
       data hash MD5: 64K
       00 72 A0 27 6F 14 D7 5B 5A DC 4F CF 4B 40 E3 0E>)
$$ ##END=
$$ 
$$ hash MD5
$$ 5C 17 8F 0D 7B 71 01 82 2F 44 BF 6E E4 56 28 C0
##$RELAX= 
##$RELAX= 
##$RELAX= 
##$RELAX= 
##$RELAX= 
##$RELAX= 
##$RELAX= 
##$RELAX= 
$$ Bruker specific parameters
$$ --------------------------
##$DU= <F:/spectra>
##$EXPNO= 2
##$NAME= <P31>
##$PROCNO= 1
##$TYPE= <nmr>
##$USER= <she>
##$AMP= (0..31)
100 100 100 100 100 100 100 100 100 100 100 100 100 100 100 100 100 100 
100 100 100 100 100 100 100 100 100 100 100 100 100 100 
##$AQSEQ= 0
##$AQ_mod= 1
##$AUNM= <au_zg>
##$AUTOPOS= <>
##$BF1= 81.014009
##$BF2= 200.13
##$BF3= 200.13
##$BF4= 200.13
##$BF5= 200.13
##$BF6= 200.13
##$BF7= 200.13
##$BF8= 200.13
##$BYTORDA= 1
##$CFDGTYP= 0
##$CFRGTYP= 5
##$CHEMSTR= <none>
##$CNST= (0..31)
1 1 145 1 1 1 1 1 1 1 1 1 1 1 1 1 1 1 1 1 1 1 1 1 1 1 1 1 1 1 1 1 
##$CPDPRG= <waltz16>
##$CPDPRG1= <>
##$CPDPRG2= <waltz16>
##$CPDPRG3= <>
##$CPDPRG4= <mlev>
##$CPDPRG5= <mlev>
##$CPDPRG6= <mlev>
##$CPDPRG7= <mlev>
##$CPDPRG8= <mlev>
##$CPDPRGB= <>
##$CPDPRGT= <>
##$D= (0..31)
0 1 0 0 0 0 0 0 0 0.06 0 0.03 2e-05 3e-06 0 0 0.0002 0 0 0 0 0 0 0 0 0 
0 0 0 0 0 0 
##$DATE= 1732791425
##$DBL= (0..7)
120 120 120 11 120 120 24 19 
##$DBP= (0..7)
150 150 150 150 150 150 150 150 
##$DBP07= 0
##$DBPNAM0= <>
##$DBPNAM1= <>
##$DBPNAM2= <>
##$DBPNAM3= <>
##$DBPNAM4= <>
##$DBPNAM5= <>
##$DBPNAM6= <>
##$DBPNAM7= <>
##$DBPOAL= (0..7)
0.5 0.5 0.5 0.5 0.5 0.5 0.5 0.5 
##$DBPOFFS= (0..7)
$$ [...]
##$SUBNAM3= <"">
##$SUBNAM4= <"">
##$SUBNAM5= <"">
##$SUBNAM6= <"">
##$SUBNAM7= <"">
##$SUBNAM8= <"">
##$SUBNAM9= <"">
##$SW= 400.765351723535
##$SWIBOX= (0..15)
0 1 3 0 0 0 0 0 0 0 0 0 0 0 0 0 
##$SW_h= 32467.5324675325
##$TD= 32768
##$TD0= 1
##$TE= 0
##$TE2= 300
##$TE3= 300
##$TEG= 300
##$TL= (0..7)
0 120 53 12 22 120 120 120 
##$TP= (0..7)
150 150 150 150 150 150 150 150 
##$TP07= 0
##$TPNAME0= <>
##$TPNAME1= <>
##$TPNAME2= <>
##$TPNAME3= <>
##$TPNAME4= <>
##$TPNAME5= <>
##$TPNAME6= <>
##$TPNAME7= <>
##$TPOAL= (0..7)
0.5 0.5 0.5 0.5 0.5 0.5 0.5 0.5 
##$TPOFFS= (0..7)
0 0 0 0 0 0 0 0 
##$TUNHIN= 0
##$TUNHOUT= 0
##$TUNXOUT= 0
##$USERA1= <user>
##$USERA2= <user>
##$USERA3= <user>
##$USERA4= <user>
##$USERA5= <user>
##$V9= 5
##$VALIST= <valist>
##$VCLIST= <CCCCCCCCCCCCCCC>
##$VD= 0
##$VDLIST= <DDDDDDDDDDDDDDD>
##$VPLIST= <PPPPPPPPPPPPPPP>
##$VTLIST= <TTTTTTTTTTTTTTT>
##$WBST= 1024
##$WBSW= 4
##$XGAIN= (0..3)
0 0 0 0 
##$XL= 0
##$YL= 0
##$YMAX_a= 4102
##$YMIN_a= -16848
##$ZGOPTNS= <>
##$ZL1= 120
##$ZL2= 120
##$ZL3= 120
##$ZL4= 120
##$ABSF1= 0
##$ABSF2= 0
##$ABSG= 0
##$ABSL= 0
##$ALPHA= 0
##$AQORDER= 0
##$ASSFAC= 0
##$ASSFACI= 0
##$ASSFACX= 0
##$ASSWID= 0
##$AUNMP= <proc_1d>
##$AZFE= 0.1
##$AZFW= 0.5
##$BCFW= 0
##$BC_mod= 2
##$BYTORDP= 0
##$COROFFS= 0
##$CY= -3
##$DATMOD= 1
##$DC= 0
##$DFILT= <>
##$DTYPP= 0
##$F1P= 0
##$F2P= 0
##$FCOR= 1
##$FTSIZE= 65536
##$FT_mod= 6
##$GAMMA= 0
##$GB= 0
##$INTBC= 1
##$INTSCL= 9.790993e-09
##$ISEN= 30
##$LB= 1.5
##$LEV0= 0
##$LPBIN= 0
##$MAXI= 10000
##$MC2= 0
##$MEAN= 0
##$ME_mod= 0
##$MI= 50
##$NCOEF= 0
##$NC_proc= -8
##$NLEV= 6
##$NOISF1= 182.463
##$NOISF2= 159.3651
##$NSP= 0
##$NTH_PI= 0
##$NZP= 0
##$OFFSET= 198.0616
##$PC= 4
##$PHC0= 2162.329
##$PHC1= 272.4883
##$PH_mod= 1
##$PKNL= yes
##$PPARMOD= 0
##$PSCAL= 0
##$PSIGN= 0
##$REVERSE= no
##$SF= 81.0140089999434
##$SI= 65536
##$SIGF1= 159.3651
##$SIGF2= -187.1042
##$SINO= 113.3802
##$SIOLD= 16384
##$SREGLST= <1H.CDCl3>
##$SSB= 0
##$STSI= 65536
##$STSR= 0
##$SW_p= 32467.5324675325
##$SYMM= 0
##$S_DEV= 0
##$TDeff= 32768
##$TDoff= 0
##$TI= <>
##$TILT= no
##$TM1= 0
##$TM2= 0
##$TOPLEV= 0
##$USERP1= <user>
##$USERP2= <user>
##$USERP3= <user>
##$USERP4= <user>
##$USERP5= <user>
##$WDW= 1
##$XDIM= 65536
##$YMAX_p= 321589736
##$YMIN_p= -129348720
$$ End of Bruker specific parameters
$$ ---------------------------------
##NTUPLES= NMR SPECTRUM
##VAR_NAME=  FREQUENCY,     SPECTRUM/REAL,   SPECTRUM/IMAG
##SYMBOL=    X,             R,               I
##VAR_TYPE=  INDEPENDENT,   DEPENDENT,       DEPENDENT
##VAR_FORM=  AFFN,          ASDF,            ASDF
##VAR_DIM=   65536,         65536,           65536
##UNITS=     HZ,            ARBITRARY UNITS, ARBITRARY UNITS
##FACTOR=    0.49542278885378, 1,            1
##FIRST=     16045.7642231865, 0,            0
##LAST=      -16421.768244346, 0,            0
##MIN=       -16421.768244346, -129348720,   0
##MAX=       16045.7642231865, 321589736,    0
$$ Real data points
##PAGE= N=1
##DATA TABLE= (X++(R..R)), XYDATA
$$ [...]
##PAGE= N=2
##DATA TABLE= (X++(I..I)), XYDATA
6750E740016l56751J504317K567523K053486Q49738k07759j359213k794552l590470
$$ 5740016 5383265 6887582 9455105 11508591 12358329 12150570 10791357 7996805 4406335
6741D406335k694134m19298J837824L032581L020466K113160Q07109l23322j083126
$$ 4406335 1712201 1292903 3130727 6163308 9183774 11296934 12104043 11780721 10697595
6732A0697595j738677k153362j421876P37987K675834K167578p86549l604081
$$ 10697595 8958918 6805556 5383680 6121667 8797501 10965079 10178530 6574449
6724F574449l950198k089435K599J018395J095709Q56957O77719Q16371J389861
$$ 6574449 2624251 534816 537415 1555810 2651519 3508476 4186195 5002566 6392427
6715F392427J903280J360180n96267k728641k939808m65403K700473L262043J67789
$$ 6392427 8295707 9655887 9059620 6330979 3391171 2925768 5626241 8888284 9056073
6706I056073l618254l939697l11297L122553K344422j671135m227538k713061
$$ 9056073 5437819 1498122 1186825 4309378 6653800 4982665 755127 -1957934
6698a957934N68598J822212L67123j493658k159173k325903k764581k330421L84251
$$ -1957934 -1389336 432876 799999 -693659 -2852832 -5178735 -7943316 -10273737 -9889486
6689i889486M030587M965208J658687k480677k613583J169840L403839O01286
$$ -9889486 -5858899 -893691 764996 -1715681 -4329264 -3159424 244415 845701
6681H45701l376600k537248K121735L533217q14271m560823j823874L810299M730364
$$ 845701 -2530899 -5068147 -2946412 586805 -227466 -4788289 -6612163 -2801864 1928500
6672A928500O75207j671698N78318K941910J802980p0412Q30126K620150J520566
$$ 1928500 2603707 932009 1510327 4452237 6255217 6184805 7014931 9635081 11155647
6663A1155647j921789m143726l862160k517749j215416m55638j272985l462978
$$ 11155647 9233858 5090132 1227972 -1289777 -2505193 -2960831 -4233816 -7696794
6655g696794m206614j718786J170756O20250k173162k397190J331308N139026
$$ -7696794 -11903408 -13622194 -12451438 -11831188 -14004350 -16401540 -15070232 -9931206
6647i931206N400997K843235N70644N54866K486148M085290K774523r46229k768249
$$ -9931206 -4530209 -1686974 -1116330 -561464 1924684 6009974 8784497 7838268 5070019
6638E070019Q7094M098488L732671m83037k846178j304896q2295k267055n007266
$$ 5070019 5157113 9255601 12988272 12505235 9659057 8354161 8271866 6004811 997545
6629I97545m619248k094506l60094M07890J395924J998321J446716J198820K373409
$$ 997545 -3621703 -5716209 -6076303 -5668413 -4272489 -2274168 -827452 371368 2744777
6620B744777K902534O42356k466538k881308p47236Q21698P74189Q49372J728580
$$ 2744777 5647311 6289667 3823129 941821 194585 1016283 1790472 2639844 4368424
6611D368424J961072R25900j55356o49996j382197k467268k527275q58280J339921
$$ 4368424 6329496 7255396 7100040 6450044 5067847 2600579 73304 -784976 554945
6602E54945K533160K261426O64253j901602m302180m991075l540373j036586J191240
$$ 554945 3088105 5349531 6013784 4112182 -189998 -5181073 -8721446 -9758032 -8566792
6593h566792K452155K492765J576723Q23621J324923K626309L016054J719505
$$ -8566792 -6114637 -3621872 -2045149 -1221528 103395 2729704 5745758 7465263
6585G465263Q0520k7835J334465K005845M39590j884139k054601k9754O72496
$$ 7465263 7545783 7517948 8852413 10858258 11297848 9413709 7359108 7329354 8001850
6576H001850j793705l898662j635290K404032J862341l328968n636032r92400
$$ 8001850 6208145 2309483 674193 3078225 4940566 1611598 -4024434 -5016834
6568e016834M552930L683293j320838k552771J534156M754849K899461j471892
$$ -5016834 -463904 3219389 1898551 -654220 879936 5634785 8534246 7062354
6560G062354m384288n023045l726303l73731L278564L736102M49649k762154k729517
$$ 7062354 2678066 -2344979 -6071282 -6445013 -3166449 569653 1019302 -1742852 -4472369
6551d472369m79100J592497K818673K884286P91308k508458l525137q63550K291670
$$ -4472369 -4951469 -3358972 -540299 2343987 3135295 626837 -2898300 -3761850 -1470180
6542a470180K978101K862575M464578N634558K438740l630923o329024l176755
$$ -1470180 1507921 4370496 8835074 14469632 16908372 13277449 6948425 3771670
6534C771670R15312M03449l592319n339186k128777K885692N121034L481820K27580
$$ 3771670 4686982 5090431 1498112 -3841074 -5969851 -3084159 2036875 5518695 5746275
6525E746275k313252l454863l386685k427238j227878l86932N39533K343435L985110
$$ 5746275 3433023 -21840 -3408525 -5835763 -7063641 -7450573 -6911040 -4567605 -582495
6516e82495K858473j442622n182544m345919L83571M494636M971017K824138P35747
$$ -582495 2275978 833356 -4349188 -8695107 -8311536 -3816900 1154117 3978255 4714002
6507D714002J88553Q50092J129642m42128l021578l562461r41602J437562j0846
$$ 4714002 4902555 5752647 6882289 6440161 3418583 -143878 -1085480 352082 341236
6498C41236l310906l272607Q35131M143977L233828K02390j551812j765357j689501
$$ 341236 -2969670 -6242277 -5407146 -1263169 1970659 2173049 621237 -1144120 -2833621
6489b833621j331073m07086M97880J315853K570936L141950J187563j694311j339592
$$ -2833621 -4164694 -4571780 -4073900 -2758047 -187111 2954839 4142402 2448091 1108499
6480A108499K213343L436552l99596m290431k833427J608677K986874N71574j531373
$$ 1108499 3321842 6758394 6358798 2068367 -765060 843617 3830491 4402065 2870692
6471B870692j536466j005969j90671J936367L533198J287036l697744o265602
$$ 2870692 1334226 328257 137586 2073953 5607151 6894187 3196443 -3069159
6463c069159m207473o97843R25260P75666K3312j154171k024461j181738P61067
$$ -3069159 -7276632 -7974475 -7049215 -6273549 -6250237 -7404408 -9428869 -10610607 -9849540
6454i849540J369719K63191j72640J151639K247118J371552o20380k192844k805817
$$ -9849540 -8479821 -8216630 -8389270 -7237631 -4990513 -3618961 -4239341 -6432185 -9238002
6445i238002k029504K98539K539788K743689J889757K331008L014180O24989l886007
$$ -9238002 -11267506 -10968967 -8429179 -5685490 -3795733 -1464725 1549455 2174444 -1711563
6436a711563n134294j543321J553425J83985j910338L77068M989526O030476K897057
$$ -1711563 -6845857 -8389178 -6835753 -6651768 -8562106 -8185038 -3195512 2834964 5732021
6427E732021K62008K25797J49840j686510l310588k873635j183121P44757L156379
$$ 5732021 5994029 6219826 6369666 4683156 1372568 -1501067 -2684188 -1939431 1216948
6418A216948N210667M347981l4669m596889n757854l801589j525180j61993J275739
$$ 1216948 6427615 10775596 10740927 6144038 386184 -3415405 -4940585 -5102578 -3826839
6409c826839L204930M153394K776458l8158j988374j866594m52656R98159K131527
$$ -3826839 -621909 3531485 6307943 6269785 4281411 2414817 1962161 2960320 5091847
6400E091847K857544K400031K66033k343645l556646l093520k099890j010454
$$ 5091847 7949391 10349422 10615455 8271810 4715164 1621644 -478246 -1488700
6392a488700N80862K044503K014526R12266P22309J587379J302376p54752k157456
$$ -1488700 -907838 1136665 3151191 4063457 4785766 6373145 7675521 6920769 4763313
6383D763313j542390j062410k282701k650602N21939M905324N960827L398836
$$ 4763313 3220923 2158513 -124188 -2774790 -2252851 2652473 8613300 12012136
6375A2012136Q01048j88840j086569k472402l071159l134569m391224n809084
$$ 12012136 12813184 12624344 11537775 9065373 5994214 2859645 -1531579 -7340663
6367g340663l784379J738369N343424K943292k510273m903347k345580J957619
$$ -7340663 -11125042 -9386673 -4043249 -1099957 -3610230 -8513577 -10859157 -8901538
6359h901538M445539M134319J943180m56312j556300j347711j156552j269329
$$ -8901538 -4455999 -321680 1621500 1165188 -391112 -1738823 -2895375 -4164704
6351d164704k13625K310631L710549J867609j267910k000451J08994K112146J961969
$$ -4164704 -4378329 -2067698 1642851 3510460 2242550 242099 351093 2463239 4425208
6342D425208L37636j573931l419333m462502l505040q65184J454308K321699K471386
$$ 4425208 4762844 3188913 -230420 -4692922 -8197962 -9063146 -7608838 -5287139 -2815753
6333b815753K333675R41403j790079l570691k332973Q22336L019460L146310K296322
$$ -2815753 -482078 459325 -1330754 -4901445 -7234418 -6412082 -3392622 -246312 2050010
6324B050010J332361N9984j165317j026724P76375K541901K569147J278996L58053
$$ 2050010 3382371 3442355 2277038 1250314 2026689 4568590 7137737 8416733 8774786
6315H774786L74500L01445p29355k103540k415872j071894J007719K162168J474509
$$ 8774786 9149286 9450731 8721376 6617836 4201964 3130070 4137789 6299957 7774466
6306G774466m25446k073113k589528k142293j211237j15373O31967M20054m79449
$$ 7774466 7349020 5275907 2686379 544086 -667151 -782524 -150557 269497 -209952
6297b09952q12076R7244J381783J927381J748256J157502k94195k537857l718981
$$ -209952 -1022028 -924784 456999 2384380 4132636 5290138 4995943 2458086 -1260895
6288a260895k407164m43975r05058l279212l761488j069736J359520P71619m06239
$$ -1260895 -3668059 -4112034 -5017092 -8296304 -12057792 -13127528 -11768008 -10996389 -11402628
6279a1402628J626072N910964P892226N682186J863134o37120j393785j059088
$$ -11402628 -9776556 -3865592 4026634 9708820 11571954 10934834 9541049 8481961
6271H481961J7211R59990M22560j553347l238494l284809j771990P39084L387276
$$ 8481961 8499172 9459162 9881722 8328375 5089881 1805072 33082 772166 4159442
6262D159442M318112K128019j530448l038419j308375P99142L49906k336658n022105
$$ 4159442 8477554 10605573 9075125 6036706 4728331 5527473 5877379 3540721 -1481384
6253a481384o094056m793401j132897L011500M706503L369475J634586J546135
$$ -1481384 -7575440 -12368841 -13501738 -10490238 -5783735 -2414260 -779674 766461
6245G66461J971310J322385M65513P32593J204738N78580j53903K35764K51592
$$ 766461 2737771 4060156 4525669 5258262 6463000 7041580 6887677 7123441 7375033
6236G375033j815383l782922j988206K646899N004280K629597j453226l577811
$$ 7375033 5559650 1776728 -211478 2435421 7439701 10069298 8616072 5038261
6228E038261l566067k729800j096462J279070K751471K123797N93905j75272m31131
$$ 5038261 1472194 -1257606 -2354068 -1074998 1676473 3800270 4394175 4218903 3787772
6219C787772j104706j694923j189867P6424J190677K233008L421256L664029J801586
$$ 3787772 2683066 988143 -201724 -125300 1065377 3298385 6719641 10383670 12185256
6210A2185256j240058l115547k622467n64519J368848J663076j52363k528187
$$ 12185256 10945198 7829651 5207184 4642665 6011513 7674589 7522226 4994039
6202D994039k772178k69004K136954J526873j233605k795057j735281K98321J364608
$$ 4994039 2221861 1952857 4089811 5616684 4383079 1588022 -147259 151062 1515670
6193A515670J066699k25016j951163k993689k459417j005195J03673J052089K754606
$$ 1515670 2582369 2357353 406190 -2587499 -5046916 -6052111 -5948438 -4896349 -2141743
6184b141743M304238L532857N03381j907991j723106p3972J112723J460610J129399
$$ -2141743 2162495 5695352 6198733 4290742 2567636 2493664 3606387 5066997 6196396
6175F196396k39159k047058k343612p30943K89740j043220k655444j718348Q01169
$$ 6196396 5957237 3910179 1566567 835624 1125364 82144 -2573300 -4291648 -3490479
6166c490479J731605P60114M80890J690143K142275O02960r51191m11560J523761
$$ -3490479 -1758874 -998760 -517870 1172273 3314548 3917508 2966317 2554757 4078518
6157D078518K728318K144688J6478k533580l438316j338166J798954K091875r35102
$$ 4078518 6806836 8951524 8968002 6434422 2996106 1657940 3456894 5548769 4613667
6148D613667k993177q79858K775872L235205J43617k795409l310683k385681j255446
$$ 4613667 1620490 740632 3516504 6751709 6895326 4099917 789234 -1596447 -2851893
6139b851893j753P77536N8318j266646q91322J306550K728580J994605R08567
$$ -2851893 -2853646 -2076110 -2017792 -3284438 -4175760 -2869210 -140630 1853975 2762542
6130B762542J349440K601886L185235L052270K308398j1168l750231o146418n041700
$$ 2762542 4111982 6713868 9899103 12951373 15259771 15248603 11498372 5351954 310254
6121C10254k142438n00103j809J612439L994050L974152N55560l004512l427382
$$ 310254 -1832184 -2332287 -2334096 -721657 3272393 7246545 7802105 4797593 1370211
6112A370211j482362k93690j152745k568238k565668o70032J889279L152990K080148
$$ 1370211 -112151 -405841 -1558586 -4126824 -6692492 -7362524 -5473245 -2320255 -240107
6103b40107l14291k003900k240090j887248j457415k98409J738842L385014L665030
$$ -240107 -554398 -2558298 -4798388 -6685636 -8143051 -8441460 -6702618 -3317604 347426
6094C47426L177202K595473J314502r62674k586304j818455M84019J993153K133103
$$ 347426 3524628 6120101 7434603 6471929 3885625 2067170 2551189 4544342 6677445
6085F677445K110122K131573J045256j044240k274444j925078j553935k081356
$$ 6677445 8787567 10919140 11964396 10920156 8645712 6720634 5166699 3085343
6077C085343j945071Q1909K116548J570349q54689k143276j369946m44620m00693
$$ 3085343 1140272 1222181 3338729 4909078 4054389 1911113 541167 96547 -304146
6068c04146K96294K748965N213192N268893K909774r7417k720848m751290n260855
$$ -304146 -7852 2741113 7954305 13223198 16132972 16035555 13314707 8563417 3302562
6059C302562l178880M89278K830669K095162m95572k544047l085309k690927j800449
$$ 3302562 123682 612960 3443629 5538791 5043219 2499172 -586137 -3277064 -5077513
6050e077513r3406K474225M800345N326722L611940R96886n57433l36986O53696
$$ -5077513 -5170919 -2696694 2103651 7430373 11042313 12039199 11481766 11144780 11798476
6041A1798476J049194L92347j114042l205375n118954n331418l022599M50827
$$ 11798476 12847670 13240017 12125975 8920600 3801646 -1529772 -4552371 -4101544
6033d101544K780068L255531K779301J593503r44356l834236m072280n56026L308321
$$ -4101544 -1321476 1934055 4713356 6306859 5362503 1528267 -2544013 -3100039 208282
6024B08282L229520m78324l350325k570116R868J172269N10656j5746P21273J912936
$$ 208282 3437802 2959478 -390847 -2960963 -2951095 -1778826 -1268170 -1283916 -562643 1350293
6014A350293K338937J597772o2696j972301k927653j904671M78593J844179L75369
$$ 1350293 3689230 5287002 5224306 3252005 324352 -1580319 -1101726 742453 1117822
6005A117822k709414l948997j570466K002218K705404k35568l338608l258141
$$ 1117822 -1591592 -5540589 -7111055 -5108837 -2403433 -2639001 -5977609 -9235750
5997i235750o32074J562948K083098J932391J636481M97596j215126j701181k77469
$$ -9235750 -9867824 -8304876 -6221778 -4289387 -2652906 -2155310 -3370436 -5071617 -5349086
5988e349086J253168J207598M67123O84800J296409M58664j546794k151503j58069
$$ -5349086 -4095918 -2888320 -2421197 -1736397 -439988 18676 -1528118 -3679621 -3837690
5979c837690K302380K465168L77172j509342j496830j72919J056139J790584K506841
$$ -3837690 -1535310 929858 1307030 -202312 -1699142 -1872061 -815922 974662 3481503
5970C481503L266751L343584K176269K57524j123386r13665P78505K391963J774871
$$ 3481503 6748254 10091838 12268107 12525631 11402245 10488580 11267085 13659048 15433919
5961A5433919j640578n181337m744990M65860N872090N988922P92238m268029
$$ 15433919 13793341 8612004 3867014 4332874 10204964 16193886 16986124 12718095
5953A2718095m837360k134493l9966L1304n43392q06184j207493j785046j588712
$$ 12718095 7880735 5746242 5706276 5737580 5194188 4388004 3180511 1395465 -193247
5944a93247k27971J522991K873189L496598K881055O96903j948311l099904k290151
$$ -193247 -421218 1101773 3974962 7471560 10352615 11049518 9101207 6001303 3711152
5935C711152j046668o49574o96883m51777j84150k23873Q6989J256496K327592
$$ 3711152 2664484 2014910 1318027 866250 682100 458227 545216 1801712 4129304
5926D129304K013766N99972n67201j109064j730611k353066j710361M43503J892038
$$ 4129304 6143070 6743042 6175841 5066777 3336166 983100 -727261 -283758 1608280
5917A608280J75769l849521o076887l647251J395153M311246L365222J543610
$$ 1608280 1784049 -2065472 -8142359 -11789610 -10394457 -6083211 -2717989 -1174379
5909a174379J906419L241185K392723l90343j491410N66231K688587J690039j109634
$$ -1174379 732040 3973225 6365948 5975605 4484195 5050426 7739013 9429052 8319418
5900H319418j851885O45190L750605M479485K309866j127018l619864l768843
$$ 8319418 6467533 7112723 10863328 15342813 17652679 16525661 12905797 9136954
5892I136954k118030r00444j691872l497945m019698k414437J14110J904590J962402
$$ 9136954 7018924 6118480 4426608 928663 -3091035 -5505472 -5391362 -3486772 -1524370
5883a524370K22149j963848k310086k08988J762850Q77877j705285k287913J34341
$$ -1524370 -1302221 -3266069 -5576155 -5785143 -4022293 -3144416 -4849701 -7137614 -7003273
5874g003273K714663L263040K919356L051933K444023o5452k351345j469481J700756
$$ -7003273 -4288610 -1025570 1893786 4945719 7389742 7324290 4972945 3503464 5204220
5865E204220L267781J583926r35799j548280l94037P84329J141776P42266m70950
$$ 5204220 8472001 10055927 9120128 7571848 7177811 7962140 9103916 9846182 9375232
5856I375232k222276l187776k187098O9286J588875J597018J386883K109111K615573
$$ 9375232 7152956 3965180 1778082 1847368 3436243 5033261 6420144 8529255 11144828
5847A1144828Q49304k672066m446346k224193J531968K415029p7464j894514k00977
$$ 11144828 11994132 9322066 4875720 2651527 4183495 6598524 6521060 4626546 4425569
5838D425569K773208L331657J563626K94580P9308j363624m563861o339538l945624
$$ 4425569 7198777 10530434 12094060 12388640 12467948 11104324 6540463 200925 -3744699
5829c744699P87011L272002J348768k556457m096846j311230L281520M864115
$$ -3744699 -2957688 314314 1663082 -893375 -4990221 -6301451 -3019931 1844184
5821A844184J471632l229865l826756J96941L874993L415310P58399k36343M34529
$$ 1844184 3315816 85951 -3740805 -3543864 331129 3746439 4504838 4268495 4703024
5812D703024j4750j916747k692835j384309o8495n6660R7448J425499K278430
$$ 4703024 4688274 2771527 78692 -1305617 -1374112 -1430772 -1333324 92175 2370605
5803B370605J285315K06651J195697K879044K226021m73482j722241p2746J757732
$$ 2370605 3655920 3862571 5058268 7937312 10163333 9689851 7967610 7894864 9652596
5794I652596J100969q41479j175240L97007J607843J140918j0151p07038j356515
$$ 9652596 10753565 9912086 8736846 9133853 10741696 11882614 11872463 11165425 9808910
5785I808910k697008m075368m061538k454345o89420K0822K61148J364785K986620
$$ 9808910 7111902 3036534 -1025004 -3479349 -4168769 -4147947 -3886799 -2522014 464606
5776D64606K874040k07642m138943n392897l230734n51716o9755q81051R6548
$$ 464606 3338646 3131004 -1007939 -6400836 -9631570 -10183286 -10253041 -11134092 -11037544
5767a1037544L865034P690944P932073M075049m34094j756612m2985P81087j631534
$$ -11037544 -7172510 518434 8450507 12525556 12091462 10334850 10291865 11072952 9441418
5758I441418m447785l613516k41285O86991j787677k604642J244558N121885L353784
$$ 9441418 4993633 1380117 1138832 1825823 38146 -2566496 -1321938 3799947 7153731
5749G153731j928976l969804j475416N66250l17032r49778O04556J283124r76141
$$ 7153731 5224755 1254951 -220465 345785 28753 -921025 -316469 966655 -9486
5740i486k759837o03800L177764M292247K893447J886398J427708k87887k559044
$$ -9486 -2769323 -3373123 -195359 4096888 6990335 8876733 10304441 10016554 7457510
5731G457510l046130k026315j659951j905577j118001J72494K06690j6203J853714
$$ 7457510 4411380 2385065 725114 -1180463 -2298464 -2125970 -1919280 -1935483 -81769
5722h1769M444009L751664k50342k762986j100154J720489J913949k33022k212829
$$ -81769 4362240 8113904 7863562 5100576 4000422 5720911 7634860 7401838 5189009
5713E189009k758598j707792P46445L057810L105907J197232k00700m28437j322275
$$ 5189009 2430411 722619 1469064 4526874 7632781 8830013 8629313 8200876 6878601
5704F878601l270351m115768k945050j243640O30446L756128O284436M090128
$$ 6878601 3608250 -507518 -3452568 -4696208 -4065762 -309634 5974802 10064930
5696A0064930j957262m977931j693218K466313K075108j21991O82065K470241
$$ 10064930 8107668 3129737 1436519 3902832 5977940 5855949 6538014 9008255
5688I008255Q88601j564342N93437N091823M125972k948015p801682n425778n52108
$$ 9008255 9896856 8332514 8925951 14017774 18143746 15195731 7394049 1968271 1416163
5679A416163O28514j478712l133308l014188j501689J217670L427317K363178
$$ 1416163 2044677 565965 -2567343 -5581531 -7083220 -5865550 -2438233 -75055
5671g5055j042468j999874J071826L580204J700553j933227k860675j320248l55170
$$ -75055 -1117523 -3117397 -2045571 1534633 3235186 1301959 -1558716 -2878964 -3234134
5662c234134n28862m21002p185J2800L27849J498535K312708K122751K316994
$$ -3234134 -3762996 -4183998 -4191183 -4178383 -3850534 -2351999 -39291 2083460 4400454
5653D400454L011379J512299k708352m946648j480616L910544M485839k75509
$$ 4400454 7411833 8924132 6215780 1269132 -211484 3699060 8184899 7909390
5645G909390m822056n472190l418258p62627J547784K109371L174k433728j824028
$$ 7909390 3087334 -2384856 -5803114 -6565741 -5017957 -2908586 -2905412 -5339140 -7163168
5636g163168J115065K489044J192395j87062m79426j339350k812842k191808J088486
$$ -7163168 -6048103 -3559059 -2366664 -2553726 -3033152 -4372502 -7185344 -9377152 -8288666
5627h288666L580883K905776J098833P57636J216308R74867Q73979K012526K896767
$$ -8288666 -4707783 -1802007 -703174 54462 1270770 2245637 3119616 5132142 8028909
5618H028909J596130r20566k219547j905578j388660j203126p09523K05429Q73154
$$ 8028909 9625039 8704473 6484926 4579348 3190688 1987562 1278039 1483468 2356622
5609B356622Q06582k14555k195582m034838l647279k42291M239237O884541O384293
$$ 2356622 3163204 2948649 753067 -3281771 -6929050 -7171341 -2932104 3952437 10336730
5600A0336730L537036L24643j276692j026738j091229l167499n143941l493468
$$ 10336730 13873766 14198409 12921717 11894979 10803750 7636251 2492310 -1001158
5592a001158P85517K507046n8916k182797l6221L161675K537998m22733p48250
$$ -1001158 -215641 2291405 2232489 49692 13471 3175146 5713144 5290411 4542161
5583D542161J375473J147301k223639l929632j759015J53819j568116l787834
$$ 4542161 5917634 7064935 4841296 911664 -847351 -693532 -2261648 -6049482
5575f049482k052305K162111L873911K121156O24324J658508L153458K316176
$$ -6049482 -8101787 -5939676 -2065765 55391 679715 2338223 5491681 7807857
5567G807857o68557l390605l974873k544219r32882r20121k016086j781138O04974
$$ 7807857 7139300 3748695 -226178 -2770397 -3703279 -4623400 -6639486 -8420624 -7815650
5558g815650K508834J592474J3499J660548N609715O271423J226546m717262n748443
$$ -7815650 -5306816 -3714342 -3700843 -2040295 3569420 9840843 11067389 6350127 601684
5549F01684k560397l84881j295095k363400j176218O72725Q07771j12971J48472
$$ 601684 -1958713 -2343594 -3638689 -6002089 -7178307 -6505582 -5697811 -5810782 -5662310
5540e662310J762109K709443J743983q6716q78490K1345J378005J257721q38552
$$ -5662310 -3900201 -1190758 553225 466509 -411981 -390636 987369 2245090 1406538
5531A406538k949255k506849M95748L104207K731530N9077k073136j924542k24145
$$ 1406538 -1542717 -4049566 -3553818 -449611 2281919 2340996 267860 -1656682 -1880827
5522a880827J094696P22040j036717k469950k060073k43371J044868Q15664L2699
$$ -1880827 -786131 -64091 -1100808 -3570758 -5630831 -5874202 -4829334 -4013670 -3980971
5513c980971j47034J92002O15728J077730R17876r66534l605910l775526m55265
$$ -3980971 -4128005 -3936003 -3320275 -2242545 -1324669 -2291203 -5897113 -9672639 -10127904
5504a0127904K596669J689352j046739n41602L396949N502490K732133j694630
$$ -10127904 -7531235 -5841883 -6888622 -7430224 -4033275 1469215 4201348 2506718
5496B506718l476718k764137k135376j918619n33490K030766L780313L287036
$$ 2506718 -970000 -3734137 -5869513 -7788132 -8321622 -6290856 -2510543 776493
5488G76493J089557r99127j162352Q35434K710553J772749j387584l243533k183918
$$ 776493 1866050 866923 -295429 540005 3250558 5023307 3635723 392190 -1791728
5479a791728n85166o60036j007657M04386K350121K460861J246682O16781l6098
$$ -1791728 -2376894 -3036930 -4044587 -3640201 -1290080 1170781 2417463 3034244 2998146
5470B998146k409743m949865m288280j023531L54388j648008k877636J54298M809632
$$ 2998146 588403 -4361462 -8649742 -9673273 -9318885 -10966893 -13844529 -13690231 -8880599
5461h880599O109390L568840R48910M80365O74833k28185j555408j849191j236775
$$ -8880599 -2771209 797631 1746541 2226906 2901739 2673554 1118146 -731045 -1967820
5452a967820p84738n21182M69771K180418L114337K055270k95993k118239k472673
$$ -1967820 -2752558 -3273740 -2803969 -623551 2490786 4546056 4250063 2131824 -340849
5443c40849j708536k80541J524753K694217K028735K20126l63650Q82678J421708
$$ -340849 -2049385 -2329926 -805173 1889044 3917779 4137905 3774255 4656933 6078641
5434F078641n34259k566145j339410J803991K237446r11975l061721r44323K474989
$$ 6078641 5544382 2978237 1638827 3442818 5680264 4768289 1706568 762245 3237234
5425C237234K503242m85059k208407j017300N16118M58313K95051J560113K596552
$$ 3237234 5740476 5255417 3047010 2029710 2545828 3004141 3299192 4859305 7455857
5416G455857J049332k009237l116604j236007Q62549N62738j240877j941791r25701
$$ 7455857 8505189 6495952 3379348 2143341 3005890 3568628 2327751 385960 -539741
5407e39741K33061N36959O14945J004798J105200L23707j032116k417953l313059
$$ -539741 -306680 230279 845224 1850022 2955222 3278929 2246813 -171140 -3484199
5398c484199k579091N65630M180092M458233O61430k809478j771595J802681K389354
$$ -3484199 -6063290 -5497660 -1317568 3140665 3802095 992617 -778978 1023703 3413057
5389C413057j217349m307746l068748N79835K702513K927796L501653M544516
$$ 3413057 2195708 -2112038 -5180786 -4600951 -1898438 1029358 4531011 9075527
5381I075527L650077J60438l013896l035570r21692q5210j735571l421194k556478
$$ 9075527 12725604 12886042 9872146 6836576 5914884 5829674 4094103 672909 -1883569
5372a883569L3701J505540J218516J389770L065599L837107J465743j944979k257509
$$ -1883569 -1849868 -344328 874188 2263958 5329557 9166664 10632407 8687428 6429919
5363F429919P66538K837522Q97114l163421n579006n154851l139315o72283J590394
$$ 6429919 7196457 10033979 10931093 7767672 2188666 -2966185 -6105500 -6777783 -5187389
5354e187389K554672J534070l74308j285473o51553O19379J563141J605534L87255
$$ -5187389 -2632717 -1098647 -1472955 -2758428 -3409981 -2790602 -1227461 378073 765328
5345G65328j518439k387684j336954L3608l62388j936044k248281q53362O613
$$ 765328 -753111 -3140795 -4477749 -4444141 -4806529 -6742573 -8990854 -9844216 -9837603
5336i837603r08815j763602n42172J883202L328535L478136L406970K991314J329746
$$ -9837603 -10746418 -12510020 -13052192 -11168990 -7840455 -4362319 -955349 2035965 3365711
5327C365711o17088n68698J401302K320851N92967j513873j348748J65467L23924
$$ 3365711 2748623 2179925 3581227 5902078 6495045 4981172 3632424 3797891 4121815
5318D121815j089720j929863j247759j54651M10282L72271n27169j970444j939483
$$ 4121815 3032095 1102232 -145527 -300178 110104 482375 -44794 -2015238 -3954721
5309c954721O44081K910898J565465j071089L24864M839014M923738k137836q599430
$$ -3954721 -3310640 -399742 1165723 94634 419498 5258512 10182250 8044414 -555016
5300e55016o743658K35322L797731K300447O21295N25845n26226k112292o70070
$$ -555016 -7298674 -7063352 -3265621 -965174 -343879 181966 -344260 -2456552 -3126622
5291c126622K820475K794463j471364l691356n45087L075147K509968O74809K081623
$$ -3126622 -306147 2488316 1016952 -2674404 -3219491 -144344 2365624 3040433 5122056
5282E122056M761055L834794m74749l862980m392596l063115k47089L589092N397181
$$ 5122056 9883111 13717905 13243156 9380176 4987580 1924465 1677376 5266468 10663649
5273A0663649K586787k445492m903661l761054j744855m72329N54670J231403
$$ 10663649 13250436 10804944 5901283 2140229 395374 -76955 477715 1709118
5265A709118J024916J034058K283317K956872R60808j928150k403766r64149o25352
$$ 1709118 2734034 3768092 6051409 9008281 9969089 8040939 5637173 4673024 4047672
5256D047672j356440o09786J209713J065256q32490q92294J269749J552036j594341
$$ 4047672 2691232 2081446 3291159 4356415 3523925 2631631 3901380 5453416 3859075
5247C859075l974483k076265J689527L169134K263527J420912J280300R10812
$$ 3859075 -115408 -2191673 -502146 2666988 4930515 6351427 7631727 8542539
5239H542539J44934r52510k889982m839346m244049n86149K864947L415622K498235
$$ 8542539 8687473 7734963 4844981 5635 -4238414 -4824563 -1959616 1456006 3954241
5230C954241K301428J800879l59331j741270N40341L978751L261591j615277m779549
$$ 3954241 6255669 8056548 7697217 5955947 6496288 10475039 13736630 12121353 7341804
5221G341804k869949N38577P54307j639036k975590k282800j520816j541653j150810
$$ 7341804 4471855 5010432 5764739 4125703 1150113 -1132687 -2653503 -4195156 -5345966
5212e345966P5147Q80627P32502Q60127J938305K517721J122247j310733k597657
$$ -5345966 -5270819 -4390192 -3657690 -2797563 -859258 1658463 2780710 1469977 -1127680
5203a127680k146842j124282l86184M2867j62141j210605j685083J35150K918498
$$ -1127680 -3274522 -4398804 -4784988 -4742121 -4904262 -6114867 -7799950 -7664800 -4746302
5194d746302K911785q13890m343685l990592q91909J794575L636024N508229N759911
$$ -4746302 -1834517 -2648407 -6992092 -10982684 -11874593 -10080018 -6443994 -935765 4824146
5185D824146K380087k053906k525550J168863L944663K890593N45535n25023j435189
$$ 4824146 7204233 5150327 2624777 3793640 7738303 10628896 11174431 10649408 9214219
5176I214219k861434k095388J922417M522141J174391m915144o219070j002428
$$ 9214219 6352785 4257397 6179814 10701955 11876346 6961202 742132 -260296
5168b60296M730486N557896K650201L30957J14851K47410p64284k240245k541681
$$ -260296 4470190 10028086 12678287 13009244 13124095 13371505 12607221 10366976 7825295
5159G825295j225389J74735j95394j881109k171727L39409L456451M124234K349144
$$ 7825295 6599906 6774641 6579247 4698138 2526411 2865820 6322271 10446505 12795649
5150A2795649M08420r01222k582935m254836l621922m2678L701508M565606K560331
$$ 12795649 13204069 12302847 9719912 5465076 1843154 1800476 5501984 10067590 12627921
5141A2627921l05251k843358m828712n439493l602867J17170L393802M248417
$$ 12627921 12322670 9479312 4650600 -788893 -4391760 -4274590 -880788 3367629
5133C367629K603864j78425k435604k895127j355855P89314J506012K86617j167174
$$ 3367629 5971493 5793068 3357464 462337 -893518 -104204 1401808 1688425 521251
5124E21251j089554J15962P20956K31535k22270J11182P44791J291005K005996
$$ 521251 -568303 -452341 268615 500150 277880 389062 1133853 2424858 4430854
5115D430854K434880J276730j324758k952694j812173P95505K274839J774982
$$ 4430854 6865734 8142464 6817706 3865012 2052839 2848344 5123183 6898165
5107F898165R9342j881848l109526k355989l36929J09820j696639k175344J071902
$$ 6898165 6997507 5115659 2006133 -349856 -686785 -576965 -2273604 -4448948 -3377046
5098c377046M246021K479802j946885k523766J052299K266314j383660m140204
$$ -3377046 868975 3348777 1401892 -1121874 -69575 2196739 813079 -3327125
5090c327125j515894K533937K495498r5618m45350J254472J401243n9587l56478
$$ -3327125 -4843019 -2309082 186416 90798 -354552 899920 2301163 2241576 1885098
5081A885098K16079q79951k630085j389891K365187L795450J149687j537096q45063
$$ 1885098 2101177 1221226 -1408859 -2798750 -433563 3361887 4511574 2974478 2129415
5072B129415J283186J493326K05261l9710Q12402L80618k139296m223370k793834
$$ 2129415 3412601 4905927 5111188 5071478 5883880 6264498 4125202 -98168 -2892002
5063b892002J964323O193737O272020K868895j59104r44435j438721l193112m223711
$$ -2892002 -927679 5266058 11538078 14406973 14247869 13303434 11864713 8671601 4447890
5054D447890k414137M61353J293989L75753J28930O06714P2647j004941o29339
$$ 4447890 2033753 2495106 3789095 4164848 4293778 4900492 4973139 3968198 3338859
5045C338859O46499N25008l93101P69589L614405M201401J391397j093027o83049
$$ 3338859 3985358 4510366 4117265 4886854 8501259 12702660 14094057 13001030 12317981
5036A2317981K66577q72720k531875k284047j409983k330381l664586j972730
$$ 12317981 12584558 11711838 9179963 6895916 5485933 3155552 -509034 -2481764
5028b481764K352247M693208K248237k191641l701486j059207K206726K408796
$$ -2481764 -129517 4563691 6811928 4620287 918801 -140406 2066320 4475116
5020D475116K07681o22423J236163K447247k6347l701885l440601J168503M934202
$$ 4475116 4682797 4060374 5296537 7743784 7717437 4015552 574951 1743454 6677656
5011F677656M061684M83672k145859l411049m711998n480808l930690m29988K548264
$$ 6677656 10739340 11223012 9077153 5666104 954106 -4526702 -8457392 -8887380 -6339116
5002f339116L502431L031363K206444J473189J066787J136513J316159J073404
$$ -6339116 -2836685 194678 2401122 3874311 4941098 6077611 7393770 8467174
4994H467174N50064L99222P49146Q05348l56234k645526m630725m683382k762123
$$ 8467174 9017238 9416460 10165606 10970954 10614720 7969194 3338469 -1344913 -4107036
4985d107036n84517N44090J412011L343432N477700N255822J971743j524888j686785
$$ -4107036 -4691553 -4147463 -2735452 607980 6085680 11341502 13313245 11788357 10101572
4976A0101572J568309M398374L139175j362145m372620k782893J082748K639595
$$ 10101572 11669881 16068255 19207430 17845285 13472665 10689772 11772520 14412115
4968A4412115J011671p37949r31055j335316l111464m304591l216505j222565
$$ 14412115 15423786 14685837 13754782 12419466 9308002 5003411 1786906 564341
4960E64341k01695j3934l80491j920243l240494j070309L860110N640409J753529
$$ 564341 362646 348712 -31779 -1952022 -5192516 -6262825 -2402715 3237694 4991223
4951D991223j993941k30663L142888J630076k506965j921870L300545N834566
$$ 4991223 2997282 2766619 5909507 7539583 5032618 3110748 6411293 12245859
4943A2245859L068833J8765k34563n43144k537649l269498j357261K81119J31497
$$ 12245859 15314692 15333457 15098894 14555750 12018101 8748603 7391342 7672461 7803958
4934G803958L06158J159834O0593k460668j902110K432296N249740L562224R55384
$$ 7803958 8110116 9269950 9330543 6869875 4967765 7400061 12649801 16212025 17167409
4925A7167409P18336Q66802p24172j964539p72791J320924K616369L479787L138652
$$ 17167409 17885745 18752547 18028375 16063836 15291045 16611969 19228338 22708125 25846777
4916B5846777l18862m883596n512580k034544k0353j962043m126698l824084k667597
$$ 25846777 25527915 20644319 15131739 13097195 13076842 11114799 6988101 3164017 496420
4907D96420j067917K607569N795336L467391j995767k233655L601876P190312
$$ 496420 -571497 2036072 7831408 11298799 9303032 7069377 10671253 17861565
4899A7861565N281337L897056N195249L167310l104192n613075k295643j381949
$$ 17861565 23142902 27039958 32235207 35402517 32298325 26685250 24389607 23007658
4891B3007658m914262l714403M120639P207089K048038R34183P988117Q857073
$$ 23007658 18093396 14378993 18499632 25706721 27754759 28688942 36677059 45534132
4883D5534132j819196o241222N285877J4049807O480568J064063J3129105K2154798
$$ 45534132 43714936 37473714 42759591 56809398 63289966 64354029 77483134 99637932
4875I9637932J2612824J6618309O0488235R1402968L1084108r6460047j67892644
$$ 99637932 112250756 128869065 189357300 280760268 311844376 215384329 47491685
4868D7491685j16076714j5237841K7777739P436380q755346N000744J5117920
$$ 47491685 -68585029 -83822870 -56045131 -48608751 -57364097 -52363353 -37245433
4861c7245433L871790n164149K452172R546154M610850O55339N754313P742126
$$ -37245433 -33373643 -38537792 -36085620 -26539466 -21928616 -21273277 -15518964 -7776838
4853g776838m21293p154472m549700j070135k835351k962123K016594M117937
$$ -7776838 -8198131 -15352603 -19902303 -20972438 -23807789 -26769912 -24753318 -20635381
4845b0635381K31594j090732L451782M979848l11757l207163J479124N249276
$$ -20635381 -20403787 -21494519 -18042737 -13062889 -13374646 -16581809 -15102685 -9853409
4837i853409J599049k782377j050734K346914J718005m73N55606l7910l363332
$$ -9853409 -8254360 -11036737 -12087471 -9740557 -8022552 -8023025 -7467419 -7505329 -10868661
4828a0868661l720189J230618M375370J020765k820422j290435J634329P83627
$$ -10868661 -14588850 -13358232 -8982862 -7962097 -10782519 -12072954 -10438625 -9654998
4820i654998r72004K40339J572493K97149P2066K886102L128006k324850o279495
$$ -9654998 -10627002 -10386663 -8814170 -8517021 -8444955 -5558853 -2430847 -4755697 -11035192
4811a1035192k206832M405787M845782O89203r50714R6580p56505k598502q53002
$$ -11035192 -13242024 -8836237 -3990455 -3301252 -4251966 -4155386 -4911891 -7510393 -8363395
4802h363395L261681L959684K11615l251084l114672k55714K895813L536248r4011
$$ -8363395 -5101714 -1142030 -930415 -4181499 -7296171 -7551885 -4656072 -1119824 -1213835
4793a213835m831937m357007J483147M779157J471668j764781J273266N556682
$$ -1213835 -6045772 -10402779 -8919632 -4140475 -2668807 -4433588 -3160322 2396360
4785B396360L578492j606484k011782J537419J966391j094037j803732L60992
$$ 2396360 5974852 4368368 2356586 3894005 5860396 4766359 2962627 3323619
4777C323619L42627j962257j428406J691505J189139l502338m976422k3377M732827
$$ 3323619 3666246 1703989 275583 1967088 3156227 -346111 -5322533 -5345910 -613083
4768f13083L295625j210425l013813k249264k034676j977127K00005L695589N644268
$$ -613083 2682542 1472117 -1541696 -3790960 -5825636 -7802763 -7602758 -3907169 1737099
4759A737099N084554K869660m22074l955996n818118m937915k499604n4497K150991
$$ 1737099 6821653 9691313 9269239 5313243 -504875 -5442790 -7942394 -7996891 -5845900
4750e845900L827132L552987O18371l258923n282499m029195l10866L460664M847500
$$ -5845900 -2018768 1534219 2152590 -1106333 -6388832 -10418027 -10728893 -7268229 -2420729
4741b420729L462391J293873R7776n64585j418353j233209J153008L805758L595741
$$ -2420729 1041662 2335535 2433311 1868726 450373 -782836 370172 4175930 7771671
4732G771671N89795k196275l074143k981726k685492j534880N47823K128033J968061
$$ 7771671 8361466 6165191 3091048 109322 -2576170 -4111050 -3563227 -1435194 532867
4723E32867K74522j772960k577128r14938K307660L984069K232105r85926k321499
$$ 532867 807389 -965571 -3542699 -4457637 -2149977 1834092 4066197 3080271 758772
4714G58772r96737J318934K997942K890350K17901l491673m338852q41113L076758
$$ 758772 -237965 1080969 4078911 6969261 7187162 3695489 -643363 -1484476 1592282
4705A592282L048734K80226j005096j27626L90307J17244O57601J137249r83906
$$ 1592282 4641016 4921242 3916146 3788520 4178827 4296071 4953672 6090921 5107015
4696E107015m546851n265621k382902K0383m92594j414927p3778K310789L272969
$$ 5107015 560164 -4705457 -7088359 -7067976 -7560570 -8975497 -9049275 -6738486 -3465517
4687c465517K534252J086862l11093m99889J255166K784451P20773m011561n991757
$$ -3465517 -931265 155597 -155496 -655385 599781 3384232 4105005 93444 -5898313
4678e898313k491659K504122L892860K062206Q89252J418601J160878j036830
$$ -5898313 -8389972 -5885850 -1992990 69216 958468 2377069 3537947 2501117
4670B501117k703743j225807K119050L175151J25866l496333k770972J778077
$$ 2501117 -202626 -1428433 690617 3865768 3991634 495301 -2275671 -497594
4662d97594M149255J024200l294005l120605M03266J893486M88210L10519K598686
$$ -497594 3651661 4675861 1381856 -1738749 -1335483 558003 1046213 1356732 3955418
4653C955418L402166M56021k897116k976188q33868M50252L05101R6713M92676
$$ 3955418 7357584 7813605 4916489 1940301 1106433 1556685 1861786 1958499 2451175
4644B451175J306033K015066J435210r58457l055602k269814K31771R27274l94195
$$ 2451175 3757208 5772274 7207484 6249027 3193425 923611 1155382 2082656 1688461
4635A688461o57312M94955p8008k654872l270978q57656K39199j872890k386150
$$ 1688461 1031149 1526104 1448096 -1206776 -4477754 -5335410 -5096211 -6969101 -9355251
4626i355251J863214N523524K568780l363936l922211J216624M283921J437196
$$ -9355251 -7492037 -1968513 600267 -2763669 -6685880 -5469256 -1185335 251861
4618B51861k532200k597662k76480M31598p68004j262928L25406L128074N355502
$$ 251861 -2280339 -4878001 -5154481 -4722883 -5490887 -6753815 -6428409 -3300335 2055167
4609B055167N224690K163436j946803m168306l687515k162645q20256P71747K595973
$$ 2055167 7279857 9443293 7496490 3328184 -359331 -2521976 -3342232 -2570485 25488
4600B5488L093145J421536p57404j201581O8234J144000J028514P56271J396413
$$ 25488 3118633 4540169 3782765 2581184 2649418 3793418 4821932 5578203 6974616
4591F974616J924535K86851l395738o104007n396399k470651k20328P13404J707845
$$ 6974616 8899151 9186002 5790264 -313743 -5710142 -8180793 -8401121 -7687717 -5979872
4582e979872K769855K483170J380398J856924L737012L454602m63796m298996
$$ -5979872 -3210017 -726847 653551 2510475 6247487 9702089 9238293 4939297
4574D939297m101910j165936L71576o36469k011932k308545k063451j691925q26585
$$ 4939297 837387 -328549 43027 -593442 -2605374 -4913919 -6977370 -8669295 -9495880
4565i495880M74165J749829K922966L699587L217200J653435P09992R41417M72635
$$ -9495880 -9021715 -7271886 -4348920 -649333 2567867 4221302 4931294 5872711 6345346
4556F345346j648588k983121j340635J010195K23638l122902m471804j476415
$$ 6345346 4696758 1713637 373002 1383197 1606835 -1516067 -5987871 -7464286
4548g464286L309500N989180N033570J467678k308377l844983k730977j176160
$$ -7464286 -4154786 1834394 6867964 8335642 6027265 2182282 -548695 -1724855
4540a724855r80319r53085N79831K111976Q65508k422253m026828k528763m05952
$$ -1724855 -2705174 -3658259 -3078428 -966452 -100944 -2523197 -6550025 -9078788 -9484740
4531i484740M5372n35234o13108l7476O21810J074645R74828J76622m13022J94516
$$ -9484740 -9439368 -9974602 -10587710 -10625186 -10003376 -8928731 -7953903 -7777281 -8190303 -7995787
4521g995787J319162J528809R72632Q27804R02211K07130m56010N97185K322041
$$ -7995787 -6676625 -5147816 -4175184 -3347380 -2445169 -2238039 -2694049 -2096864 225177
4512B25177J436395k518146n475899l856456P26502L455663J816908k120922m144188
$$ 225177 1661572 -856574 -6332473 -10188929 -9462427 -6006764 -4189856 -6310778 -10454966
4503a0454966j900510K881233N935257M818874J378426r44514j256987j077224
$$ -10454966 -12355476 -9474243 -3538986 1279888 2658314 1713800 456813 -620411
4495f20411j168193r79340p51529j439546k397741j690130Q26410K963100L241440
$$ -620411 -1788604 -2767944 -3519473 -4959019 -7356760 -9046890 -8220480 -5257380 -2015940
4486b015940K462834J840925J501702J186196O65035o14539k512896l237519j622541
$$ -2015940 446894 2287819 3789521 4975717 5640752 5026213 2513317 -724202 -2346743
4477b346743L13077L2427r34646J021180M979370N528954P85078m154600m207100
$$ -2346743 -2033666 -2001239 -2935885 -1914705 3064665 8593619 9378697 5224097 1016997
4468A016997q13737J558116J832676J449595K1579l433443o435322m980391N12201
$$ 1016997 203260 1761376 3594052 5043647 5065226 1631783 -4803539 -9783930 -9271729
4459i271729N075294N455719L235797J186315j48150r77352m81009J267214J724108
$$ -9271729 -4196435 1259284 4495081 5681396 5533246 4555894 4074885 5342099 7066207
4450G066207j051813m766300n062369j281182K447902K570395K89886j034223
$$ 7066207 6014394 1248094 -3814275 -5095457 -2647555 -77160 212726 -821497
4442h21497o39700j24793J88441J415348K813455J848703j405595l193010j307051
$$ -821497 -1461197 -1585990 -1397549 17799 2831254 4679957 3274362 81352 -1225699
4433a225699J427699J396787n62982j254807m53757m58073j464178j264210O53988
$$ -1225699 202000 1598787 1035805 -219002 -672759 -1130832 -2595010 -3859220 -3205232
4424c205232K192726K122412J528828J401393J322020Q71896J64199r74853k303359
$$ -3205232 -1012506 1109906 2638734 4040127 5362147 6234043 6398242 5423389 3120030
4415C120030k284159l21045J172065m584j724192n15361K327039K376315m85088
$$ 3120030 835871 514826 1686891 1682307 -41885 -557246 1769793 4146108 3661020
4406C661020j664734M21443J902950N10259m64135J829683M669653M219517J214867
$$ 3661020 1996286 2417729 4320679 4830938 4366803 6196486 10866139 15085656 16300523
4397A6300523j386184k996953m080404l491681r75639N54302q04508k099338o8543
$$ 16300523 14914339 11917386 7836982 4345301 3369662 3923964 3119456 1020118 951575
4388I51575K814273J660594k883451n026502k059037K209551L094843Q07903p39700
$$ 951575 3765848 5426442 2542991 -2483511 -4542548 -2332997 761846 1569749 830049
4379H30049J023818M536369N716079K419959k586901m428287k211665J4940o05851
$$ 830049 1853867 6390236 12106315 14526274 11939373 7511086 5299421 5314361 4708510
4370D708510j771900m34772J858813J501397j341465l185862k432566p24186K63951
$$ 4708510 2936610 2501838 4360651 5862048 4520583 1334721 -1097845 -1822031 -1558080
4361a558080M07890n9650p68780o46968P56432K057932J988681J424458J589515
$$ -1558080 -1150190 -1209840 -1978620 -2625588 -1869156 188776 2177457 3601915 5191430
4352E191430J758287R03919n9645q9001k63117j612053k635934j877400q71416
$$ 5191430 6949717 7853636 7793991 7704990 7441873 5829820 3193886 1316486 445070
4343D45070j252798j202500J238903L467544J766751j996424k437812J142879
$$ 445070 -807728 -2010228 -771325 2696219 4462970 2466546 28734 1171613
4335A171613L949380L200326J197519J10786j136914l105431l538896j188203
$$ 1171613 5120993 8321319 9518838 9629624 8492710 5387279 1848383 660180
4327F60180J558162K110975J003483j5546o39255j053842o26941P94655K016976
$$ 660180 2218342 4329317 5332800 5317254 4677999 3624157 2997216 3791871 5808847
4318E808847K102281J403172N47730j4380M04362J589105J431320j292545l906102
$$ 5808847 7911128 9314300 9862030 9847650 10252012 11841117 13272437 11979892 8073790
4309H073790l001014j2295N42659j758201k681273n83349J084705K09073l89221
$$ 8073790 5072776 5060481 5603140 3844939 1163666 580317 1665022 1874095 1484874
4300A484874J394393K631025N27555k189614j550362J083912J457829o89918j925809
$$ 1484874 2879267 5510292 6037847 3848233 2297871 3381783 4839612 4149694 2223885
4291B223885j087144l55947o87834l67401J309797K339952J133139j048873j931489
$$ 2223885 1136741 780794 92960 -274441 1035356 3375308 4508447 3459574 1528085
4282A528085r85652N03479J149004O91396J2738K9921M23881M1881j181792j806116
$$ 1528085 542433 1045912 2194916 2886312 2899050 2928971 3352852 3394733 2212941 406825
4272D06825j066865k30585o06432j256870k28518K385170M028080K510782j391004
$$ 406825 -660040 -890625 -1497057 -2753927 -2982445 -597275 3430805 5941587 4550583
4263D550583m349263l616782j07077K130403M96868k688422l037861m8986K276327
$$ 4550583 201320 -3415462 -3522539 -1392136 -895268 -3583690 -6621551 -6670537 -4394210
4254d394210J146282j492961k435512j563772o03388L02171J959181L308191K297755
$$ -4394210 -3247928 -4740889 -7176401 -8740173 -9343561 -9041390 -7082209 -3774018 -1476263
4245a476263n44337k039088n09311J895696K019594l66200k542987k187970K90435
$$ -1476263 -2020600 -4059688 -4568999 -2673303 -653709 -1019909 -3562896 -5750866 -5460431
4236e460431K744893L756411L566060K983536K268505J298682J61572q19032j252165
$$ -5460431 -2715538 1040873 4606933 7590469 9858974 11157656 11319228 10500196 9248031
4227I248031q21064R7570J05174j733180m024142m201051j803021J142191L183111
$$ 9248031 8426967 8524537 8629711 6896531 2872389 -1328662 -3131683 -1989492 1193619
4218A193619M463741M272146R81695m030710o007532k907026J354587K617323
$$ 1193619 5657360 9929506 10911201 6880491 872959 -2034067 -679480 1937843
4210A937843J990368K154554J914129p55075l422718k662094m10869q42993k783498
$$ 1937843 3928211 6082765 7996894 7241819 3819101 1157007 746138 -96855 -2880353
4201b880353j762991J663495K639868N51730k98515J218700J506249k62561k31060
$$ -2880353 -4643344 -2979849 -339981 211749 -86766 1131934 2638183 2375622 2144562
4192B144562K741860M335523J720034k388914m570139m437642k410061Q35308
$$ 2144562 4886422 9221945 10941979 8553065 3982926 -454716 -2864777 -2029469
4184b029469K137213r10549m399553k625244K171968K829096k79582P9774M178021
$$ -2029469 107744 -802805 -5202358 -7827602 -5655634 -2826538 -3106120 -3026346 1151675
4175A151675L976355j839246m122219Q28178M388427J028907k002623J478603
$$ 1151675 5128030 3288784 -833435 -5257 4383170 5412077 3409454 4888057
4167D888057N160576K262674k144336j346045Q24724j070800k952507l54209J395536
$$ 4888057 10048633 12311307 10166971 8820926 9645650 8574850 5622343 5268134 6663670
4158F663670k045267l650135J833435N742992P80614l798151J264742O520155
$$ 6663670 4618403 968268 2801703 8544695 9325309 5527158 6791900 13312055
4150A3312055J125445m661222K261994J0495392L461236o318448L069525J8960525
$$ 13312055 14437500 9776278 12038272 22533664 25994900 19676452 22745977 41706502
4142D1706502J3003344J33695K5103689P8879049Q6349599J0029983q2311576
$$ 41706502 54709846 54843541 79947230 158826279 245175878 255205861 172894285
4135A72894285j00173346m6560618N27118O15561j3736298q426560L897431J381381
$$ 172894285 72720939 26160321 26687439 27303000 13566702 5140142 9037573 10418954
4127A0418954p247334m655992L911666N053064J725004K747619L883845k066720
$$ 10418954 3171620 -1484372 2427294 7480358 9205362 11952981 15836826 13770106
4119A3770106q732538o463354M54246J655517k086572k838417j09089R41474O84018
$$ 13770106 5037568 -1425786 -971540 683977 -1402595 -4241012 -4350101 -3408627 -2724609
4110b724609K940578N602050L638365j279527l078659j029487L78466p17263k308701
$$ -2724609 215969 5818019 9456384 8176857 5098198 4068711 4447177 3729914 1421213
4101A421213l030486k451179N14327M552096M730735n18985n028022l106268J781783
$$ 1421213 -1609273 -4060452 -3546125 1005971 5736706 5217721 189699 -2916569 -1134786
4092a134786K774262K52951l83989J408485J444007q51588j868725j099751j833891
$$ -1134786 1639476 1892427 1508438 2916923 4360930 3509342 1640617 540866 -1293025
4083a293025m188343m053432k05954L281269L412685K161517K142933K608479
$$ -1293025 -5481368 -9534800 -9740754 -6459485 -3046800 -885283 1257650 3866129
4075C866129J829670J22491j481851k969801m120736l736807j495613J101815
$$ 3866129 5695799 5818290 4336439 1366638 -2754098 -6490905 -7986518 -6884703
4067f884703K514091K422311R91159j199592k230067j27280M070497O395860M180967
$$ -6884703 -4370612 -1948301 -957142 -2156734 -4386801 -4514081 -443584 5952276 10133243
4058A0133243r61461n053367n636340l317079m47799J139561J454976J519872
$$ 10133243 9171782 4118415 -1517925 -4835004 -5282803 -4143242 -2688266 -1168394
4050a168394J368182L6404j910842j677845K141669O596233P417324M348949J029238
$$ -1168394 199788 236192 -1674650 -3352495 -1210826 5385407 12802731 17151680 18180918
4041A8180918p5321k3577n96329j810030l009898m145417m740633l387309K78101
$$ 18180918 18105597 18082020 17485691 15675661 12665763 8520346 3779713 392404 670505
4032F70505M223262N898112M742397K030559q10120k745505k967636j631179m25078
$$ 670505 4893767 10791879 15534276 17564835 16754715 14009210 11041574 9410395 8985317
4023H985317j032331k849755l365366j304183J511953K315723Q22437p34257q90926
$$ 8985317 7952986 5103231 1737865 433682 1945635 4261358 5083795 4349538 3458612
4014C458612o82310j406080k314072k121218j508021j740392j546778J414185
$$ 3458612 2776302 1370222 -943850 -3065068 -4573089 -6313481 -7860259 -6446074
4006f446074N599985N734887j05286o567312p235670k752138Q36795O23784m35907
$$ -6446074 -846089 4888798 4783512 -1783800 -9019470 -11771608 -10934813 -10311029 -10746936
3997a0746936O36153K661084L580136M169019N588126N799777K110694l706341
$$ -10746936 -10110783 -7449699 -3869563 299456 5887582 11687359 13798053 10091712
3989A0091712o412857l751593Q88500K985886J668741j030447l312980m193528
$$ 10091712 3678855 -72738 815762 3801648 5470389 4439942 1126962 -3066566
3981c066566k804682M18003K750235J797493j138097k401952n89346K253531L919293
$$ -3066566 -5871248 -5453245 -2703010 -905517 -2043614 -4445566 -5034912 -2781381 1137912
3972A137912M113858L030794O47930j669565j677734J87166M81255k148740m345405
$$ 1137912 5251770 8282564 8930494 7260929 5583195 5770361 6251616 4102876 -242529
3963b42529l047300l45683P9156j018162l39494J614214J192474j666650k546064
$$ -242529 -3289829 -3635512 -3556356 -4574518 -4914012 -3299798 -2107324 -3773974 -6320038
3954f320038N13222L795518L566310J116473j86515K09102N90909Q8155r87554
$$ -6320038 -5806816 -2011298 1555012 2671485 2484970 2694072 3284981 3373136 2385582
3945B385582k039061j813600P77173M078151M439839J170617j937308j875078
$$ 2385582 346521 -1467079 -689906 3388245 7828084 8998701 7061393 5186315
3937E186315k99163Q3676j54009N16156Q35292r19757l129148l309535k585884
$$ 5186315 4887152 4970828 4816819 5332975 6168267 5248510 2119362 -1190173 -3776057
3928c776057l540688n079587l951113n15743J636288J526826J612509K626317
$$ -3776057 -7316745 -12396332 -16347445 -16863188 -15226900 -13700074 -12087565 -9461248
3920i461248K390365O21602J74098J889833K678795R43790k85895J436833L397109
$$ -9461248 -7070883 -6449281 -6275183 -4385350 -1706555 -762765 -1048660 388173 3785282
3911C785282K051243r94637j584094L08139R72364p09787j690431O7950K540421
$$ 3785282 5836525 4841888 3257794 3565933 4538297 3828510 2138079 2206029 4746450
3902D746450K967234J420618l66420j492189j667101m05011J680770K136858n87726
$$ 4746450 7713684 9134302 8767882 7275693 5608592 5203581 6884351 9021209 8433483
3893H433483m236632m733528j247536K513218K685313m89186l620350m137862
$$ 8433483 4196851 -536677 -1784213 729005 3414318 2925132 -695218 -4833080
3885d833080k089886J047150L671147M473704L285056J779954J859487K809327
$$ -4833080 -6922966 -5875816 -2204669 2269035 5554091 7334045 9193532 12002859
3877A2002859J547924l256205q442918r213333m463374J814596M533779K324691
$$ 12002859 13550783 10294578 1851660 -7361673 -11825047 -10010451 -5476672 -3151981
3869c151981j626652l067019q21856K524379L900683K923801J250067j12135j164245
$$ -3151981 -4778633 -7845652 -8667508 -6143129 -2242446 681355 1931422 1819287 655042
3860F55042j275216L56297K399100K183517k85096j637154J72845K957497L777578
$$ 655042 -620174 -263877 2135223 4318740 4033644 2396490 2569335 5526832 9304410
3851I304410K736394J071311j721437n531400o822819k666656L515266M959707
$$ 9304410 12040804 13112115 11390678 5859278 -963541 -3630197 -114931 4844776
3843D844776M48571m112910l741510O8327L147995M095766L678784J951137j141254
$$ 4844776 5293347 1180437 -2561073 -2492746 655249 4751015 8429799 10380936 9239682
3834I239682m044546m904773l679352j620719J30294N84996o48347j951061q20440
$$ 9239682 5195136 290363 -3388989 -5009708 -4879414 -4294418 -4942765 -6893826 -7714266
3825g714266K357732M006869K422027N47759J429333L434675L158464J088914
$$ -7714266 -5356534 -1349665 1072362 1620121 3049454 6484129 9642593 10731507
3817A0731507M86088J603820J252463j588300l634682k233187N40063P87713k019518
$$ 10731507 11217595 12821415 14073878 12485578 8850896 6617709 7157772 7945485 5925967
3808E925967m823511n052731l156359j230151l48176L15764K025611M544324O183257
$$ 5925967 1102456 -3950275 -7106634 -8336785 -8684961 -8369197 -6343586 -1799262 4383995
3799D383995N966689M864122M007399K572817r29637n555230q053364o611535
$$ 4383995 10350684 15214806 19222205 21795022 20865385 15310155 7256791 645256
3791F45256k944498K3955J134806Q02334n76405k413798l122001j513083J107276
$$ 645256 -2299242 -2275287 -1140481 -338147 -914552 -3328350 -6450351 -7963434 -6856158
3782f856158K035203P27403l66551O23071K077555J173305j740377l189174j295804
$$ -6856158 -4820955 -4093552 -4460103 -3837032 -1759477 -586172 -2326549 -5515723 -6811527
3773f811527J538194J936073J44072n65255J434159M103509M717340L044980O85930
$$ -6811527 -5273333 -3337260 -3193188 -3758443 -2324284 1779225 6496565 9541545 10227475
3764A0227475j227193k293047j958877j94296J417350J136403l13157m25541J253204
$$ 10227475 9000282 6707235 4748358 4554062 5971412 7107815 6794658 6369117 7622321
3755G622321J887435p10347m422548n169116k223590J094942K073991J521379
$$ 7622321 9509756 8799409 4376861 -792255 -3015845 -1920903 153088 1674467
3747A674467J178165O84038q36568j934990n18777K180354K423352o34586l110935
$$ 1674467 2852632 3536670 2700102 765112 246335 2426689 4850041 4215455 1104520
3738A104520j473041K617195M547630K595032n85099j807448q11250K72013l71761
$$ 1104520 -368521 2248674 6796304 9391336 8806237 6998789 6187539 6459552 6087791
3729F087791k431843l873115l139785r96156N07432R26438J861115L955703N248536
$$ 6087791 3655948 -217167 -3356952 -4353108 -3845676 -2919238 -1058123 2897580 8146116
3720H146116L849345P45134j680753k592456k494716j602923m71648o63223k231025
$$ 8146116 11995461 12740595 11059842 8467386 5972670 4369747 3898099 3234876 1003851
3711A003851k122884J595475N208465L305452k938842o064249k058004M342603
$$ 1003851 -1119033 476442 5684907 8990359 6051517 -12732 -2070736 2271867
3703B271867O099276K256722k537152m236825k515742M75931K071835R21421j525720
$$ 2271867 8371143 10627865 8090713 3853888 1338146 1814077 3885912 4807333 3281613
3694C281613k415936j152129R4905J19277K72174J196994J110571o85074j639316
$$ 3281613 865677 -286452 -191547 -72270 199904 1396898 2507469 1822395 183079
3685A83079R1205K303114K326575J271109J236034Q54763k030699n100474l964100
$$ 183079 274284 2577398 4903973 6175082 7411116 8265879 6235180 1134706 -2829394
3676b829394P56218L553863J568242k243412m078759l425336j287118J768801
$$ -2829394 -2073176 1480687 3048929 805517 -3273242 -6698578 -7985696 -6216895
3668f216895M210491L682804N56086j542297p26768L48007j041298l037949k107447
$$ -6216895 -2006404 1676400 2232486 690189 -36579 311428 -729870 -3767819 -5875266
3659e875266J160360K704829J032074p32349L24931K589774K321951q84351l358005
$$ -5875266 -4714906 -2010077 -978003 -1710352 -1385421 1204353 3526304 2641953 -716052
3650g16052k316486M57868J360983m2100j199635j131091j498311k499012j465526
$$ -716052 -3032538 -2574670 -1213687 -1255787 -2455422 -3586513 -5084824 -7583836 -9049362
3641i049362K273152M684870K672530n41110k05315K050493Q02603l685423n145550
$$ -9049362 -6776210 -2091340 581190 40080 -165235 1885258 2687861 -997562 -6143112
3632f143112j341593K102559N55213k707221k412983N16012J566332J86428m45927
$$ -6143112 -7484705 -5382146 -4826933 -7534154 -9947137 -9431125 -7864793 -7678365 -8124292
3623h124292O50620J480821J371110J660494K309005J643048l58495j772306j877991
$$ -8124292 -7473672 -5992851 -4621741 -2961247 -652242 990806 632311 -1139995 -3017986
3614c017986j658291j125775Q26363L639540N057744M295918K564858K85771l066238
$$ -3017986 -4676277 -5802052 -4975689 -1336149 3721595 8017513 10582371 10868142 7801904
3605G801904n908330n069742q30735K068986P25990j701566r85477J591950J515426
$$ 7801904 1893574 -3176168 -4006903 -1937917 -1211927 -2913493 -3898970 -2307020 -791594
3596g91594j595020l279503j032999K181519K646094J030315N49843J933097K901304
$$ -791594 -2386614 -5666117 -6699116 -4517597 -1871503 -841188 -291345 1641752 4543056
3587D543056K017443N84550K61448N64294j42454j995530l195285k282636o2868
$$ 4543056 6560499 7145049 7406497 7970791 7828337 5832807 2637522 354886 292018
3578B92018J275627P40393l82588k77331J081509K032763J479736J53942n92872
$$ 292018 1567645 2308038 1925450 1648119 2729628 4762391 6242127 6396069 5803197
3569E803197l89886K40932P10807M02369j157986l069570k988548j6471L002942
$$ 5803197 5413311 5654243 6365050 6767419 5609433 2539863 -448685 -465156 2537786
3560B537786K367522j328565l515785j818264Q21894P59110j138149j383184P59672
$$ 2537786 4905308 3576743 60958 -1757306 -935412 -176302 -1314451 -2697635 -1937963
3551a937963K722801K628137J116790m69737j335621q96948N46051J112987l53702
$$ -1937963 784838 3412975 4529765 4060028 2724407 1827459 2373510 3486497 3132795
3542C132795j745342k39253K862036L174152n13758m523074n748082n176654m363809
$$ 3132795 1387453 1148200 4010236 7184388 6670630 2147556 -3600526 -8777180 -13140989
3533a3140989k241612J751270M619699L623045R73737P70682K562477K119131
$$ -13140989 -15382601 -13631331 -9011632 -5388587 -4414850 -3644168 -1081691 1037440
3525A037440j704084m926243m028672k56663K960073M196255L992006K759611
$$ 1037440 -666644 -5592887 -9621559 -9878222 -6918149 -2721894 1270112 4029723
3517D029723Q32642n63567m35568K22713n37825k696160l791037k084226Q28900
$$ 4029723 4862365 4298798 3863230 4085943 3548118 851958 -2939079 -5023305 -4194405
3508d194405J845165M19814q42491p6477J225303Q78625m22848o08853j43184
$$ -4194405 -2349240 -1929426 -2771917 -2848394 -1623091 -744466 -1167314 -1776167 -1919351
3499a919351j193400l157799k779784L97475K442295P69374j948774k197710q97803
$$ -1919351 -3112751 -6270550 -9050334 -8652859 -6210564 -5441190 -7389964 -9587674 -10485477
3490a0485477r36267j843753q62966K033698L989096L486182J507756q28198k637084
$$ -10485477 -11421744 -13265497 -14128463 -12094765 -8105669 -4619487 -3111731 -3939929 -6577013
3481f577013k099913J524730N183884M964421J559406q46470r48782j364601k970124
$$ -6577013 -8676926 -7152196 -1968312 2996109 4555515 3709045 2760263 1395662 -1574462
3472a574462k933651K3379K708210K187107p7368j343549j665595k022334j237830
$$ -1574462 -4508113 -4484734 -1776524 410583 333215 -1010334 -2675929 -4698263 -5936093
3463e936093J805967M824764M471300J064505j839950j955631o9720J909088K567154
$$ -5936093 -4130126 694638 5165938 6230443 4390493 2434862 2365142 4274230 6841384
3454F841384J336217p78178j448860J91080J793210O97866k208819l652643k442948
$$ 6841384 8177601 7399423 5950563 6141643 7934853 8632719 6423900 2771257 328309
3445C28309n59309J27120R6723P07992K070422L100899K902375J617027J31832
$$ 328309 -231000 -103880 -7157 700835 2771257 5872156 8774531 10391558 10523390
3436A0523390j005045k064882k857356j648111K622586P070781O792474J338796
$$ 10523390 9518345 7453463 4596107 2947996 5570582 12641363 19433837 20772633
3428B0772633l684230l697081j030393o25022k393318k282318L30619J405202
$$ 20772633 17088403 13391322 12360929 11735907 9342589 7060271 7390890 8796092
3420H796092j058036l623344k581389Q44092K768151J904016K74595p0395Q34578
$$ 8796092 7738056 4114712 1533323 2377415 5145566 7049582 7324177 7253782 8088360
3411H088360J541516Q85965p58469j756457j272122n60574j036088j858946j414769
$$ 8088360 9629876 10515841 9757372 8000915 6728793 6168219 5132131 3273185 1858416
3402A858416m56702r79556k249085j451337J173846J795945p60778k185130R32392
$$ 1858416 1401714 422158 -1826927 -3278264 -2104418 -308473 -1069251 -3254381 -2321989
3393b321989N108374M359253j319123o027380n764669k342855M38250J072704
$$ -2321989 2786385 7145638 5826515 -200865 -5965534 -8308389 -7870139 -6797435
3385f797435K85234m33067N01552L236774N184962L579828l72267k576400j776995
$$ -6797435 -6512201 -6945268 -6443716 -3206942 1978020 5557848 5185581 2609181 832186
3376H32186j043648k354908l158690p71477K687432L168560P57041p35961N55502
$$ 832186 -211462 -2566370 -5725060 -6496537 -3809105 -640545 116496 -619465 -63963
3367f3963K751317L881678L917957K785096k06906l785699m729738k311211r0820
$$ -63963 2687354 6569032 10486989 13272085 13065179 9279480 4549742 2238531 2147711
3358B147711j055622l285262l177794j032594j762o38156l85266J531319K571819
$$ 2147711 1092089 -2193173 -5370967 -6403561 -6405323 -7043479 -7428745 -5897426 -3325607
3349c325607J280422j66946M14054J816563J884907J151159J457872K492133K408106
$$ -3325607 -2045185 -2212131 -1798077 18486 1903393 3054552 4512424 7004557 9412663
3340I412663J041166m9263l05049o14455j269788j674098j986748k915100l847500
$$ 9412663 10453829 10404566 10099517 9485062 8215274 6541176 4554428 1639328 -2208172
3331b208172l358031j714212o52885m21543M60036J932898J726498p34012k465778
$$ -2208172 -5566203 -7280415 -7933300 -8354843 -7894807 -5961909 -4235411 -4969423 -7435201
3322g435201j030740J753034K722977K153495K525440L651443K693746p56224
$$ -7435201 -8465941 -6712907 -3989930 -1836435 689005 4340448 7034194 6277970
3314F277970l070673j544065J490478J617742j821470m915575l987147L42386
$$ 6277970 3207297 1663232 3153710 4771452 2949982 -1965593 -5952740 -5610354
3306e610354M247290M874390K760118M97362j32727O31764J513616J435658q0730
$$ -5610354 -1363064 3511326 6271444 6768806 6636079 7267843 8781459 10217117 10136387
3297A0136387k593943m463235m019897j671193K55275N60192P09805K016981K789269
$$ 10136387 7542444 3079209 -940688 -2611881 -2356606 -1796414 -1086609 930372 3719641
3288C719641O06034l345230n017277k785415O28740K234253K245664K175805J816482
$$ 3719641 4325675 980445 -4036832 -6822247 -6193507 -3959254 -1713590 462215 2278697
3279B278697K59423j603178j993852j031150n45270j313674k147283j695725J66048
$$ 2278697 2538120 934942 -1058910 -2090060 -2635330 -3949004 -6096287 -7792012 -7625964
3270g625964K621006M350219L953211J308673j609317k626426j966273j553953
$$ -7625964 -5004958 -654739 3298472 4607145 2997828 371402 -1594871 -3148824
3262c148824j912635j560086K72068K222712K820569K244765J171096m83343k378253
$$ -3148824 -5061459 -6621545 -6349477 -4126765 -1306196 938569 2109665 1626322 -751931
3253g51931k798968o88160K191719K912143Q98104j646815k593731j811353m49150
$$ -751931 -3550899 -4239059 -2047340 864803 1762907 116092 -2477639 -4288992 -4738142
3244d738142K59875m91796k321383l268856j670919J270517K433930R73554j73309
$$ -4738142 -4478267 -4970063 -7291446 -10560302 -12231221 -10960704 -8526774 -7553220 -7726529
3235g726529J667671M813988N255518K138206j131018j589811l56421l28026j837758
$$ -7726529 -6058858 -1244870 4010648 6148854 5017836 3428025 3071604 2743578 905820
3226I05820k545977j091845J159708K347263K386057K046537J052666j291216
$$ 905820 -1640157 -2732002 -1572294 774969 3161026 5207563 6260229 4969013
3218D969013l969905m438545j527587K744442M958895L557113J4263k789936l031789
$$ 4969013 999108 -3439437 -4967024 -2222582 2736313 6293426 6307689 3517753 485964
3209D85964j217748N31124O40247k79011k69500J363460K894982K151871p40195
$$ 485964 -731784 -200660 439587 160576 -108924 1254536 4149518 6301389 5561194
3200E561194l225027k940543j50154K488899K537901K27064j890127j971012j017927
$$ 5561194 2336167 -604376 -754530 1734369 4272270 4499334 2609207 638195 -379732
3191c79732j133414k214584k051746J83492K490339K851370J673587L10728r87938
$$ -379732 -1513146 -3727730 -5779476 -5595984 -3105645 -254275 1419312 1730040 742102
3182G42102k119217k007925n13533K93452p51974j274679R69022L410872J916439
$$ 742102 -1377115 -3385040 -3898573 -3605121 -4357095 -5631774 -4662752 -1251880 664559
3173F64559k143574l182097r5280J937985J32168j209827J713408N041123L026336
$$ 664559 -1479015 -4661112 -4756392 -2818407 -2686239 -3896066 -2182658 2858465 5884801
3164E884801k531920m788853k037064P92289M74583o19099j6739P21183m74873
$$ 5884801 3352881 -1435972 -3473036 -2680747 -2206164 -2825263 -2842002 -2120819 -2595692
3155b595692k466796l078320k157113o29075J002103J801170P16025r11648q0916
$$ -2595692 -5062488 -8140808 -10297921 -10926996 -9924893 -8123723 -7407698 -8319346 -8400262
3146h400262L084507M493332K038143r68730j008316L00857l46373j998780j409628
$$ -8400262 -5315755 -822423 1215720 246990 -761326 -460469 -806842 -2805622 -4215250
3137d215250R61248J784639Q08131R48431K362413J508129k524132n314276l203045
$$ -4215250 -3254002 -1469363 -661232 287199 2649612 4157741 1633609 -3680667 -6883712
3128f883712J400569L639471K521143O11053o09154j693821k424201j355489J434719
$$ -6883712 -5483143 -1843672 677471 1288524 679370 -1014451 -3438652 -4794141 -3359422
3119c359422L487095K715769k79144l195348m321216l420287j239225J174720
$$ -3359422 127673 2843442 2564298 -631050 -4952266 -8372553 -9611778 -8437058
3111h437058L001947L958979M085137L245308J155897j873194m409800m662184
$$ -8437058 -5435111 -1476132 2609005 5854313 7010210 5137016 727216 -3934968
3103c934968k294564O66593J568034J04998j260495m30136J755226L041072K794970
$$ -3934968 -6229532 -5562939 -3994905 -3889907 -5150402 -5580538 -3825312 -784240 2010730
3094B010730J994347J136595K65972M10663K268590L607221J298374l304884m695343
$$ 2010730 4005077 5141672 5407644 5818307 8086897 11694118 12992492 9687608 4992265
3085D992265q63594K922780J243259l436830m282314q3257L367905K059920j020863
$$ 4992265 4128671 7051451 8294710 4857880 575566 492309 3860214 5920134 4899271
3076D899271j286403Q16097J536470k72024k214250k316153j189031k95803j2532
$$ 4899271 3612868 4428965 5965435 5693411 3479161 1163008 -26023 -321826 -334358
3067c34358J56043M85572N88291j53102j590010k365936j232551J125663K611144
$$ -334358 -178315 307257 895548 742446 -847564 -3213500 -4446051 -3320388 -709244
3058g09244K281565J219367N48970O9651n29468o92051j94094J75359K01729R02506
$$ -709244 1572321 2791688 3340658 3410309 2880841 2188790 1994696 2170055 2371784 3274290
3048C274290K264479K099653q74091m250534m554648j670009J635449L635198
$$ 3274290 5538769 7638422 6764331 2513797 -2040851 -3710860 -2075411 1559787
3040A559787M420897L527406J73761l847779m849362k071281P85419M04967j889785
$$ 1559787 5980684 9508090 9681851 5834072 984710 -1086571 -301152 103815 -1785970
3031a785970k500375n02663J777664K226927J155254K42186M12622Q58261m738
$$ -1785970 -4286345 -4789008 -3011344 -784417 370837 613023 1025645 1883906 1879168
3022A879168k233585l453635j591649J800527L116314J845331J426586L769469
$$ 1879168 -354417 -3808052 -5399701 -3599174 -482860 1362471 2789057 6558526
3014F558526N795888L808421r28118l990351l758680k329009j240573J64565J876032
$$ 6558526 12354414 16162835 15234717 11244366 7485686 5156677 3916104 4080669 5956701
3005E956701K043410q4874k471092k984096k048675j301460j100475p67695j49060
$$ 5956701 8000111 7915237 5444145 2460049 411374 -890086 -1990561 -2758256 -2907316
2996b907316N03315J408850K657333L238021J982300o25396k601029k570882j131332
$$ -2907316 -2404001 -995151 1662182 4900203 6882503 6257107 3656078 1085196 -46136
2987d6136k4984l29764j438995j622431J73499K834329L813319J943631p82817
$$ -46136 -71120 -400884 -1839879 -3462310 -3288811 -454482 3358837 5302468 4519651
2978D519651j163545J318869L524919K328520j484158m255305m052907k401468
$$ 4519651 3356106 4674975 8199894 10528414 9044256 4788951 736044 -1665424
2970a665424j025666Q07624L893704N963673M020423q56186m313243m500143l710250
$$ -1665424 -2691090 -1883466 2010238 7973911 11994334 11138148 6824905 2324762 -1385488
2961a385488l585524k505452M21606K534301J792474O03944J717259K936083N56511
$$ -1385488 -4971012 -7476464 -7054858 -4520557 -2728083 -2124139 -406880 2529203 3085714
2952C085714l696964m510807j288325Q30982r47191l081627j663952J983702M195433
$$ 3085714 -611250 -5122057 -6410382 -5579400 -6526591 -9608218 -11272170 -9288468 -5093035
2943e093035L965542K439755L24487j524244j416966N70573J416057q27631l680995
$$ -5093035 -1127493 1312262 1636749 112505 -1304461 -733888 682169 -145462 -3826457
2934c826457l442621j08446L284172M595814L560500O43329k454864k865518l0621
$$ -3826457 -7269078 -7377524 -4093352 502462 4062962 4706291 2251427 -614091 -644712
2925f44712K329376P19408k974475m028294j441108J520339K518840K148481J073940
$$ -644712 1684664 2404072 -570403 -4598697 -6039805 -4519466 -2000626 147855 1221795
2916A221795r17330k625329j877036Q37051K339276J306764k09776p70688j743690
$$ 1221795 304465 -2320864 -4197900 -3360849 -1021573 285191 75415 -695273 -2438963
2907b438963l893670m854112k373559K033843M914695M811341K651684l6624j420170
$$ -2438963 -6332633 -11186745 -13560304 -11526461 -6611766 -1800425 851259 814635 -605535
2898f05535L27134M594489P450653N671738R21745k407576k906764l025708m272360
$$ -605535 -278401 4316088 11766741 17438479 18360224 15952648 13045884 10020176 5747816
2889E747816m592934k011552J345411J439045j989272m414702k165530K662841
$$ 5747816 1154882 -856670 488741 1927786 -61486 -4476188 -6641718 -3978877
2881c978877M795229K544573l90223l04332J795984K469243R05663p21324r39250
$$ -3978877 816352 3360925 2970702 2666370 4462354 6931597 7837260 7115936 6176686
2872F176686l80517J93147Q14395J178032P52128P3437j74506j123032m064346
$$ 6176686 5796169 5989316 6803711 7981743 8733871 8807308 8632802 7509770 3445424
2863C445424o911562n735215o23834L520130L549755J964631K086891K843057
$$ 3445424 -3466138 -9201353 -9825187 -6305057 -2755302 -790671 1296220 4139277
2855D139277J580813p61028j344339n50212j165107l140425l224249j13957L406040
$$ 4139277 5720090 4959062 3614723 3064511 1899404 -1241021 -4465270 -4579227 -1173187
2846a173187M264544K516476L00128n81264L15148J643495R41580k292480m648618
$$ -1173187 3091357 5607833 5907961 5326697 5641845 7285340 8226920 5934440 1285822
2837A285822k556481K252325M216664J268746k646639l356070j415892L31407
$$ 1285822 -1270659 981666 5198330 6467076 3820437 464367 -951525 -620118
2829f20118R72234R96051K67490p69844q7022K812231M696370K812234l14340
$$ -620118 352116 1348167 1615657 845813 758791 3571022 8267392 11079626 10765286
2820A0765286j57774K657237K989080p12175l594438j665285K041093J830468
$$ 10765286 10607512 13264749 16253829 15541654 11947216 10281931 12323024 14153492
2812A4153492k559127n968967m983349j587668N29716L94674n44211r84474o54700
$$ 14153492 11594365 5625398 642049 -945619 -415903 -21229 -565440 -1549914 -2204614
2803b204614Q6952L54183o09999j881145j039854K679562O201305N408632J84622
$$ -2204614 -2117662 -1763479 -2373478 -4254623 -5294477 -2614915 3586390 8995022 9179644
2794I179644m928521n641553k323155J149728J919057N37499n95595o7762J429890
$$ 9179644 4251123 -1390430 -3713585 -2563857 -644800 -107301 -702896 -770658 659232
2785F59232K260538J776420R29520P83857Q30098l15708k535222l790121k717369
$$ 659232 2919770 4696190 5625710 6409567 7239665 6923957 4388735 598614 -2118755
2776b118755n11867Q19003J142595J756146K870456L190961J950246q6562j742303
$$ -2118755 -2630622 -1811619 -669024 1087122 3957578 7148539 9098785 9012223 7269920
2767G269920k266850j144300J258644K710305R15640k846940m083692p38743L403039
$$ 7269920 5003070 3858770 5117414 7827719 8743359 5896419 1812727 1073984 4477023
2758D477023L353656l62827k651724j048171J474779J678063O53413J042999K152695
$$ 4477023 7830679 7467852 4816128 3767957 5242736 6920799 7574212 8617211 10769906
2749A0769906J037977k540130n454360n630538m319656l160448j545434J426908
$$ 10769906 11807883 9267753 3813393 -1817145 -6136801 -9297249 -10842683 -9415775
2741i415775M290288M788271L224664J983725J895422J234379j174931l726513
$$ -9415775 -5125487 -337216 2887448 4871173 6766595 8000974 6826043 3099530
2733C099530m014782j840709R66985K907417L685317L272819J657039l57211j470663
$$ 3099530 -915252 -2755961 -1788976 1118441 4803758 8076577 9733616 9376405 7905742
2724G905742j562233j924636l037006l148692m80955L625569N481872L375324
$$ 7905742 6343509 4418873 1381867 -1766825 -2247780 1377789 6859661 10234985
2716A0234985k65512j863278p76986O93982N59376r91243k533006k759972j031048
$$ 10234985 9969473 8106195 7329209 8023191 8582567 7591324 5058318 2298346 1267298
2707A267298J927350L723401K240505j658362m708822m975551l562156k139330
$$ 1267298 3194648 6918049 9158554 7500192 2791370 -2184181 -5746337 -7885667
2699g885667p12650R71111J683114L19049j915021k830285j969663l61968J387286
$$ -7885667 -8598317 -7627206 -5944092 -5625043 -7540064 -10370349 -12340012 -12701980 -11314694
2690a1314694K821434K545815q3569k822674k760151l99967J172238J009593J082253
$$ -11314694 -8493260 -5947445 -6031014 -8853688 -11613839 -12013806 -10841568 -9831975 -8749722
2681h749722K122192K262829R53771O63884K539795L424741J93502m977312o898906
$$ -8749722 -6627530 -4364701 -3410930 -2747046 -207251 3217490 3410992 -1566320 -8465226
2672h465226l965050L86909K447006J995504J118872J181108J665643J270475
$$ -8465226 -12430276 -12043367 -9596361 -7600857 -6481985 -5300877 -3635234 -2364759
2664b364759j79768j083567n7348J678963J628721r1607n74677J326931L065953
$$ -2364759 -2544527 -3628094 -3685442 -2006479 -377758 -469365 -1044042 282889 3348842
2655C348842K653920J863525K567676K740540r1122l438489k539722K148615M739545
$$ 3348842 6002762 7866287 10433963 13174503 13083381 9644892 7105170 9253785 13993330
2646A3993330J851220l102579m872013k629064K43615M64743k339084n650591
$$ 13993330 15844550 12741971 7869958 5240894 5484509 5949252 3610168 -2040423
2638b040423o188505l225409K99938J374283P13625P55753J153865j57055k128855
$$ -2040423 -8228928 -11454337 -11154399 -9780116 -9066491 -8310738 -7156873 -7313928 -9442783
2629i442783j398958J706433K875614R17521P5800K647742M306940R36874l955655
$$ -9442783 -10841741 -9135308 -6259694 -5342173 -5266373 -2618631 1688309 2625183 -1330472
2620a330472l970489N99118L557614K058663m53652o81648K21916M4707r19382
$$ -1330472 -5300961 -4701843 -1144229 914434 460782 -220866 1050 45757 -873625
2611h73625j488339j620467j120841R05031L549584L700293L26705l033490k587496
$$ -873625 -2361964 -3982431 -5103272 -4198241 -648657 3051636 3378341 344851 -2242645
2602b242645O09120K603472K302480J988958K493589J574859j729117m306202
$$ -2242645 -1633525 969947 3272427 5261385 7754974 9329833 7600716 3294514
2594C294514k937151Q82321K852830J581679n17850j619381k426449l092427j712520
$$ 3294514 357363 1239684 4092514 5674193 5156343 3536962 1110513 -1981914 -3694434
2585c694434K091446M981896M210732J951988J853951K875183R43393l650430
$$ -3694434 -1602988 3378908 7589640 9541628 11395579 14270762 15214155 11563725
2577A1563725n453542j848267K472529J786906k914971n699586l457450J159188
$$ 11563725 6110183 4261916 6734445 8521351 5606380 -93206 -3550656 -2391468
2569b391468L792675K840377J0404j787399j000160J224120K451593J881551P99040
$$ -2391468 1401207 4241584 4251988 2464589 1464429 2688549 5140142 7021693 7820733
2560G820733Q1340p50848j456414o23098J387050J719908p40871k987353k254837
$$ 7820733 7902073 7151225 5694811 5071713 6458763 8178671 7437800 4450447 2195610
2551B195610l03676j92754j060380j16241J761274J071086k115610l627431j407382
$$ 2195610 1891934 1699180 638800 522559 2283833 3354919 1239309 -2388122 -3795504
2542c795504J880088L460666L783069L745882K281509r83702l521018k994266
$$ -3795504 -1915416 1545250 5328319 9074201 11355710 10372008 6850990 3856724
2534C856724p27930J55362j305704l552188m694131l489520K83485M644700O078719
$$ 3856724 3128794 3284156 1978452 -1573736 -6267867 -9757387 -9473902 -4829202 1249517
2525A249517L401333j92560r10291R29707K127113J448463M61499m9209j277516
$$ 1249517 4650850 4458290 3547999 4477706 6604819 8053282 8514781 8465572 7188056
2516G188056l236603l376273l38597K915726K411385j210643l216661j306061
$$ 7188056 3951453 575180 236583 3152309 5563694 4353051 1136390 -169671
2508a69671J123825j04325l812405m973033j607732K811662M323746L100093J735434
$$ -169671 954154 849829 -2962576 -7935609 -9543341 -6731679 -2407933 692160 2427594
2499B427594J165771L96528j006798k251768k548277j532752P57993L034178L076552
$$ 2427594 3593365 3989893 2983095 731327 -1816950 -3349702 -2591709 442469 3519021
2490C519021O04655j451654o47685J250410Q61666j465050k124369J51352K517092
$$ 3519021 4123676 2672022 2024337 3274747 4136413 2671363 546994 698346 3215438
2481C215438K398058O25602q38614j677021k333493k411139j381733M36167K386228
$$ 3215438 5613496 6239098 5400484 3723463 1389970 -1021169 -2402902 -1966735 419493
2472D19493L682484L028688J6383k919423k448920J051188L330076J664396j976586
$$ 419493 4101977 7130665 7147048 4227625 1778705 2829893 6159969 7824365 5847779
2463E847779m216695m165002k624100K9230L189352N161286M862824L086648J011439
$$ 5847779 1631084 -2533918 -5158018 -5128788 -1939436 3221850 8084674 11171322 12182761
2454A2182761p99051j261826O46269K992180J770785l310269p062904n409956
$$ 12182761 11383710 10121884 10768153 13760333 15531118 12220849 5157945 -252011
2446b52011p76005K075070K552268K832094K724787P42308j396650m99518K333140
$$ -252011 -1028016 1047054 3599322 6431416 9156203 9898511 8501861 8002343 10335483
2437A0335483K553946q42023l610235k578448J53527Q55191r95660l131677l618035
$$ 10335483 12889429 12047406 8437171 5858723 6012250 6867441 5871781 2740104 -877931
2428h77931k303353o19249l81122j458455j161040K073769N368139M729219R38160
$$ -877931 -3181284 -3800533 -4181655 -5640110 -6801150 -4727381 640758 5369977 6308137
2419F308137j525893j136370o60952j466603j170126J455453L575798K684641
$$ 6308137 4782244 3645874 2984922 1518319 348193 1803646 5379444 8064085
2411H064085K70424j426918k928528m938656n418486k649588J161557K697963
$$ 8064085 8334509 6907591 3979063 -959593 -6378079 -9027667 -7866110 -5168147
2403e168147K088070J638888J911676K088723K311014K449145O19574l364780
$$ -5168147 -3080077 -1441189 470487 2559210 4870224 7319369 7938943 4574163
2395D574163n139832j059156M979449N288855j076454o786592o185421j798038
$$ 4574163 -565669 -1624825 3354624 8643479 7567025 780433 -5404988 -7203026
2387g203026R75289J084555P91711R26284P15222K95396L19235K98271l66459
$$ -7203026 -6227737 -5143182 -4351471 -3425187 -2709965 -2414569 -2095334 -1797063 -2163522
2378b163522r35522q15672j009685k136167k619494j050952J200932K114182K152995
$$ -2163522 -3099044 -3914716 -4924401 -7060568 -9680062 -10731014 -9530082 -7415900 -5262905
2369e262905K549360K102673p06152l457180j979375L015211N754533L105392
$$ -5262905 -2713545 -610872 -1317024 -4774204 -6753579 -3738368 2016165 5121557
2361E121557j348454k805816j372156o9490L71631J314755K572709K502566J104333
$$ 5121557 3773103 967287 -404869 -474359 -102728 1212027 3784736 6287302 7391635
2352G391635K3822l40077j120169k375242k626904j278815N97206K150935L391366
$$ 7391635 7415457 7075380 5955211 3579969 953065 -325750 271456 2422391 5813757
2343E813757L673238J818170j485554l446832k442221L4794J613503J658302O96531
$$ 5813757 9486995 11305165 9819611 6372779 3930558 3965352 5578855 7237157 7933688
2334G933688r86329k728498k986143j287201K91165m98293k732876l214464o82237
$$ 7933688 6947359 4218861 1232718 -54483 236682 -261611 -2994487 -6208951 -6891188
2325f891188K457668K979423L11396l212191m728790l090326N50668L754346M632712
$$ -6891188 -4433520 -1454097 -1142701 -4354892 -9083682 -12174008 -11623340 -7868994 -3236282
2316c236282L276189J573172J337896K316255K370479L13912j822844r38133K400362
$$ -3236282 39907 1613079 2950975 5267230 7637709 7951621 6128777 5190644 7591006
2307G591006L619679K02264m095036m061196n89129O37775k246648m621212k615057
$$ 7591006 11210685 11412949 7317913 3256717 2667588 3305363 1058715 -3562497 -6177554
2298f177554J356250K889814J835656Q49294M33627o34266j550357k11280K681468
$$ -6177554 -4821304 -1931490 -95834 753460 1187087 552821 -997536 -1208816 1472652
2289A472652L633314Q93113l218850m813684k066597L073084N846465K864048
$$ 1472652 5105966 5999079 2780229 -2033455 -4100052 -1026968 4819497 7683545
2281G683545l387749o356173l479075M21361M70000r63406J280440O189900P925348
$$ 7683545 4295796 -2060377 -5539452 -5118091 -4648091 -5611497 -4331057 1858843 9784191
2272I784191M871933J231715l40225j576880l220414k871157j97040J163958m84454
$$ 9784191 14656124 15887839 15547614 13970734 10750320 7879163 7682123 8846081 8361627
2263H361627j942375r31943j73708k126030l905660j799870K280295L349787M27395
$$ 8361627 6419252 5487309 5313601 3187571 -718089 -2517959 -237664 3112123 3539518
2254C539518k811746l168392o66509K558131L741482J492982j740670j567631
$$ 3539518 727772 -2440620 -3107129 -548998 3192484 4685466 2944796 1377165
2246A377165J996335L352110o12955m980208l608306J658561L930068J408202
$$ 1377165 3373500 6725610 6112655 1132447 -2475859 -817298 3112770 4520972
2238D520972j180189n68609J183975J203083n56311k956748m992187m819717j241693
$$ 4520972 3340783 2772174 3956149 5159232 4602921 1646173 -3346014 -8165731 -9407424
2229i407424L197533M228898J675839k54272Q55003K853027L341362K957924K835246
$$ -9407424 -6209891 -1980993 -305154 -559426 295577 3148604 6489966 9447890 12283136
2220A2283136K254164P52103l04773j41173j13609j212285k375812k720511k946992
$$ 12283136 14537300 15289403 14984630 14843457 14729848 13517563 11141751 8421240 5474248
2211E474248l061988j450905J869420L734391J981002j056063j784121l81508
$$ 5474248 2412260 961355 2830775 6565166 8546168 7490105 5705984 5324476
2203E324476R2610j514981l106555k304279J091354N151007O975975M663212m42679
$$ 5324476 5417086 3902105 795550 -1508729 -417375 4733632 11709607 16372819 15930140
2194A5930140m290442m290139k092386r69610j609868k165197j423913J05135
$$ 15930140 11639698 7349559 5257173 4287563 2677695 512498 -911415 -806280
2186h06280J731208L174748L669890K266439n58611k822292l070572j803494n91590
$$ -806280 924928 4099676 7769566 10036005 9477394 6655102 3584530 1781036 1189446
2177A189446k58804k09075N48959J808625J964670n8112k950712m026405k131582
$$ 1189446 930642 721567 1270526 3079151 5043821 4985709 2034997 -1991408 -4122990
2168d122990J289028L954450M562448L065774O12148p20115K43138J880230J364176
$$ -4122990 -2833962 1120488 5682936 8748710 9360858 8640743 8883881 10764111 12128287
2159A2128287j435779l427000k309416O79515K822967K888975J124875j703834
$$ 12128287 10692508 7265508 4956092 5635607 8458574 11347549 12472424 10768590
2151A0768590l951129l625361q92095J445354J406018K37593k8255M29730N25543
$$ 10768590 6817461 3192100 2300005 3745359 5151377 5388970 5360715 5790445 6315988
2142F315988P44104J895703K702091J255823j782489l806242l677503k456390
$$ 6315988 7060092 8955795 11657886 12913709 11131220 7324978 3647475 1191085
2134A191085j156332J24537J051609J055575N57059N49638R26630O21617o37680
$$ 1191085 34753 159290 1210899 2266474 2823533 3373171 4299801 4921418 4283738
2125D283738j904309k134180q17029J810311M107302L690017L25882k879241l063456
$$ 4283738 2379429 245249 -571780 1238531 5345833 9035850 9361732 6482491 3419035
2116C419035j406810j165111k738751l363134j557066P53956J131473k92480j316981
$$ 3419035 2012225 847114 -1891637 -5254771 -6811837 -6057881 -4926408 -5218888 -6535869
2107f535869j14199K978796N297258M115931J46244k442205j091893J610860J780045
$$ -6535869 -6650068 -3671272 1625986 5741917 5888161 3445956 2354063 3964923 5744968
2098E744968r8581o43400N43937O23058j170765k337017j805705j552347k286300
$$ 5744968 5646387 5002987 5546924 6169982 4999217 2662200 856495 -695852 -2982152
2089b982152j626498J525650M461439M744199L522549K441004N76373k642853
$$ -2982152 -4608650 -3083000 1378439 6122638 9645187 12086191 12662564 10019711
2081A0019711m513344k611679R53929K413284J717441J502767K122805J546499
$$ 10019711 5506367 2894688 3848617 6261901 7979342 9482109 11604914 13151413
2073A3151413m97078j930493j767888j022030k83040O23130O87607j355498l914527
$$ 13151413 12654335 10723842 8955954 7933924 7650884 8274014 8961621 7606123 3691596
2064C691596l663903n78174J362478r6157j982554n02983L219016M507593J356070
$$ 3691596 27693 -550481 811997 715840 -1266714 -1769697 1449319 5956912 7312982
2055G312982l105645m477210j838051J896163L532480K756663J627765J445775
$$ 7312982 4207337 -269873 -2107924 -211761 3320719 6077382 7705147 9150922
2047I150922J184237m26417k347705k241026K96712L011742L655935K150654p9241
$$ 9150922 10335159 9908742 7561037 5320011 5616723 8628465 12284400 14435054 14355813
2038A4355813j739834k317668k103112j904057k042618j729591l17970J199380
$$ 14355813 12615979 10298311 8195199 6291142 4248524 2518933 2200963 3400343
2030C400343J310350L50921M8486O98840P59021l82496j337632j216491j098921
$$ 3400343 4710693 5061614 5110100 5808940 6567961 6185465 4847833 3631342 2532421
2021B532421j790495k087427r20080N11158P27782O53311J974918L842060L789972
$$ 2532421 741926 -1345501 -2265581 -1754423 -1026641 -373330 1601588 5443648 9233620
2012I233620J541715o83566j701568k632642m042077m259437j933809J423816
$$ 9233620 10775335 10091769 8390201 5757559 1715482 -2543955 -4477764 -3053948
2004c053948L030595K044060l6579j485919j828611j708752k097706l218092l816769
$$ -3053948 -23353 2020707 1984128 498209 -1330402 -3039154 -5136860 -8354952 -12171721
1995a2171721k289279R50988L281934K910965J060180R995L7232j38048o93181
$$ -12171721 -14461000 -13510012 -10228078 -7317113 -6256933 -6246938 -6209706 -6347754 -7040935
1986g040935n14042N17249J028260L06483o63205p77722o4137J033441K227602
$$ -7040935 -7554977 -7037728 -6009468 -5702985 -6366190 -7143912 -7208049 -6174608 -3947006
1977c947006K871360K360687J479045J672880K475758J692879r41601k626081
$$ -3947006 -1075646 1285041 2764086 4436966 6912724 8605603 7664002 5037921
1969E037921j578387P5394k39818j355275o34946J237505J405633j59412p95019
$$ 5037921 3459534 3534928 3295110 1939835 1304889 2542394 3948027 3788615 2993596
1960B993596o7729l27965j789043j470530J358042K896846N62611k575801k330105
$$ 2993596 2925867 2597902 808859 -661671 696371 3593217 4155828 1580027 -750078
1951g50078N14176K172062J621905O20458k24908j340589j394748J076784L794079
$$ -750078 -235902 1936160 3558065 4178523 3953615 2613026 1218278 2295062 6089141
1942F089141K811931j380716l982344k686115k88082N35923Q54761J978545K239182
$$ 6089141 8901072 7520356 3538012 851897 563815 1099738 1954499 3933044 6172226
1933F172226J29957k306243k397055j041902q88287j866141j679928J10330J411792
$$ 6172226 6302183 3995940 1598885 556983 -331304 -2197445 -3877373 -3767043 -2355251
1924b355251P90968r05008k039508j652605J67020J915818J463118j121842k491186
$$ -2355251 -1564283 -2469291 -4508799 -6161404 -5994384 -4078566 -2615448 -3737290 -6228476
1915f228476J05804M591561O150041L312289m90765j643625k78069J137823J114376
$$ -6228476 -6122672 -1531111 4618930 7931219 7440454 5796829 5518760 6656583 7770959
1906G770959Q701j069188j263188o46507l45101j334651l045672l884544k968458
$$ 7770959 7779660 6710472 5447284 4800777 4455676 3121025 75353 -3809191 -6777649
1897f777649o14487K295082M360740L920451Q59500k457617l707560l254199k449461
$$ -6777649 -7392136 -5097054 -736314 3184137 4043637 1586020 -2121540 -5375739 -7825200
1888g825200o96804K796315N455764L682405j239234l993554k741233j013261
$$ -7825200 -8522004 -5725689 -269925 3412480 2173246 -1820308 -4561541 -5574802
1880e574802o63420J420685O245718Q000912K152205n750745o433129j22130L995688
$$ -5574802 -6238222 -4817537 1428181 9429093 11581298 5830553 -602576 -724706 3270982
1871C270982J338724k599609k088869O49369Q91461o36710m35364Q46103k89219
$$ 3270982 4609706 2010097 -78772 570597 1462058 825348 389984 1236087 946868
1862I46868l748151n688607m205699j082622J866811M392356N612491L969712
$$ 946868 -2801283 -8489890 -12695589 -13778211 -11911400 -7519044 -1906553 2063159
1854B063159L53851j795451q53168Q99656Q36193n24285j115447n89488j10361
$$ 2063159 2417010 621559 -231609 668047 1504240 979955 -135492 -724980 -835341
1845h35341k6484L74948J195564J445415K85143j923652l654891l110305J43363
$$ -835341 -861825 -486877 708687 2154102 2439245 515593 -3139298 -6249603 -6106240
1836f106240L994849N283025L299131Q19318N53591J536039O76562k611722n328512
$$ -6106240 -2111391 3171634 6470765 7290083 7843674 9379713 10056275 7444553 2116041
1827B116041m758119j719335R10980J629593J087858L42144j47041K7249J222631
$$ 2116041 -2642078 -4361413 -3450433 -1820840 -732982 -390838 -537879 -510630 712001
1818G12001K678976K575996J27002k973059m258625l409978k255392j762767n92045
$$ 712001 3390977 5966973 6093975 3120916 -1137709 -4547687 -6803079 -8565846 -9157891
1809i157891K303091M926315M169772L72611k268165q61286K355212L153544J175720
$$ -9157891 -6854800 -1928485 2241287 2613898 345733 -515553 1839659 4993203 6168923
1800F168923J30485K064258M179657K988635l56343j675961j55794J25197l659208
$$ 6168923 6299408 8363666 12543323 15531958 15175615 13499654 13343860 13469057 9809849
1791I809849q041523p202224r49213M486795M217493L88954j615028l62007J078109
$$ 9809849 1768326 -5433898 -6383111 -1896316 2321177 2710131 1095103 733096 1811205
1782A811205O33181k07782J90662Q03153K82057k55997P52449J993200R14067
$$ 1811205 2444386 2236604 2427266 3230419 3512476 3256479 4008928 6002128 6916195
1773F916195j774251k377173K91147K531624O48706l848027o314341n004846k284820
$$ 6916195 5141944 2764771 3055918 5587542 6236248 2388221 -3926120 -8930966 -11215786
1764a1215786k59767J592955L536869L426240l8375l749804l184847J342107M591298
$$ -11215786 -11475553 -9882598 -6345729 -2919489 -2957864 -6707668 -9892515 -8550408 -3959110
1755c959110L368792O59475Q70670L280070L315674n29627m444715m590361j890318
$$ -3959110 -590318 69157 939827 4219897 7535571 7005944 2561229 -2029132 -3919450
1746c919450K5748j92200o95753L25561K352001L490528K585419K67353j515147
$$ -3919450 -3893702 -4085902 -4781655 -4456094 -2104093 1386435 3971854 4239207 2724060
1737B724060j240175M26698J146592k28794k108121k392366j331407p11913r15772
$$ 2724060 1483885 1910583 3057175 2828381 720260 -1672106 -3003513 -3715426 -4631198
1728d631198p20242J66320N36312J16577N05800K583297M588422M186731J404980
$$ -4631198 -5351440 -5185120 -4648808 -4532231 -4026431 -1443134 3145288 7332019 8736999
1719H736999j740349l627504l821093k432255k47757J053251L94675j158679j687785
$$ 8736999 6996650 3369146 -451947 -2884202 -3131959 -2078708 -1684033 -2842712 -4530497
1710d530497j042235p58326j431083j812717r95933j9160k68210j116320l89949
$$ -4530497 -5572732 -6331058 -7762141 -9574858 -10570791 -10589951 -10858161 -11974481 -12364430
1701a2364430K713765N889132N647734J372394l111938l341529K49914K459727
$$ -12364430 -9650665 -3761533 1886201 3258595 146657 -3194872 -2944958 -485231
1693d85231J00948l449305k940302J144756L407329J620139l89731O79867K294084
$$ -485231 -384283 -3833588 -6773890 -5629134 -2221805 -601666 -991397 -311530 1982554
1684A982554L99056l848911n509442k615606K088943N530642P003862O548903
$$ 1982554 2381610 -1467301 -6976743 -9592349 -7503406 -1972764 5031098 11580001
1676A1580001L992531M10303k104956l109564m094665n392281n225482l013542
$$ 11580001 15572532 15982835 13877879 10768315 6673650 1281369 -3944113 -6957655
1668f957655j177091j708582k819332j458337J837030L250063R60350k085498
$$ -6957655 -8134746 -9843328 -12662660 -14120997 -12283967 -9033904 -8073554 -10159052
1660a0159052j769085J988432N079987M313567J347283L03953K023681K895185
$$ -10159052 -11928137 -9939705 -4859718 -546151 801132 1105085 3128766 6023951
1652F023951L19242k956022k411146J701975M589309L384657R1349k340078l447681
$$ 6023951 6343193 3387171 976025 2678000 7267309 10651966 10743315 8403237 4955556
1643D955556l579480k116744N41075J887644N76813j304848j391989l41220K60082
$$ 4955556 1376076 -740668 -199593 1688051 2264864 960016 -431973 -773193 -513111
1634e13111Q96180K194197K264665m95975l646774l609891j204961k90847j573496
$$ -513111 383069 2577266 4841931 4345956 699182 -2910709 -4115670 -4406517 -5980013
1625e980013j954408J2340K141464K592248K056564J325935K75422r4217J606241
$$ -5980013 -7934421 -7922081 -5780617 -3188369 -1131805 194130 469552 375335 1981576
1616A981576L578509K155481j988067l378175L11528M160163K978225j335266
$$ 1981576 5560085 7715566 5727499 2349324 2660852 6821015 9799240 8463974
1608H463974l263064j665848p0238o45293j910350j827864j07219K200507L320153
$$ 8463974 5200910 3535062 3464824 2819531 909181 -918683 -1025902 1174605 4494758
1599D494758J911349o69785r93818J598062L149541P76584k454150k071730O82930
$$ 4494758 6406107 5736322 4742504 6340566 9490107 10266691 7812541 5740811 6423741
1590F423741R75546j803789l526352k303832p86290p74652l65366J918849M154592
$$ 6423741 7399287 5595498 2069146 -234686 -1020976 -1795628 -2160994 -242145 3912447
1581C912447M112508K174962m49391l429400n706199n255204k305006l9796k01751
$$ 3912447 8024955 10199917 9750526 6321126 614927 -4640277 -6945283 -6985079 -7186830
1572g186830o26738Q58798K765923K620237J012051J88539K74865l00579j676209
$$ -7186830 -7813568 -6954770 -4188847 -1568610 -556559 -368020 -93155 -393734 -2069943
1563b069943k416140j941216j068476n42578n43061j001332j093059N97238L874137
$$ -2069943 -4486083 -6427299 -7495775 -8038353 -8581414 -9582746 -10675805 -10078567 -6204430
1554f204430N898087M177071j5636k912483k568575m08160J282898J935637K511625
$$ -6204430 -306343 3870728 3855092 942609 -1625966 -2034126 -751228 1184409 3696034
1545C696034L583141M100064K399331j247458l957191l482364j356608n84088
$$ 3696034 7279175 11379239 13778570 12531112 8573921 5091557 3734949 3150861
1537C150861q39292O62366L384480K975612j686468n380729l736524K30530J072063
$$ 3150861 2311569 2973935 6358415 9334027 7647559 2266830 -1469694 -1239164 -167101
1528a67101o30671r1549L116726M229105J049705k865098l989294l196325k533194
$$ -167101 -797772 -889321 2227405 6456510 7506215 4641117 651823 -2544502 -5077696
1519e077696j593295M17673J973104J294238p10233j787162j327494l44222L41793
$$ -5077696 -6670991 -6253318 -4280214 -2985976 -3696209 -5483371 -6810865 -7155087 -6813294
1510f813294M63972p1461o92378k41142J392888K572861J767714n02691k111118
$$ -6813294 -6349322 -6420783 -7113161 -7354303 -5961415 -3388554 -1620840 -2123531 -4234649
$$ [...]
##END NTUPLES=NMR SPECTRUM
##END=
