##TITLE=31Pdec_DE-76k_d3Cl_TFA
 CDCl3, 24 sc
 28.11.2024
##JCAMPDX= 6.0         $$ Bruker NMR JCAMP-DX V2.0
##DATA TYPE= NMR SPECTRUM
##DATA CLASS= NTUPLES
##ORIGIN= UXNMR, Bruker Analytische Messtechnik GmbH
##OWNER= root
$$ XWIN-NMR		Version 3.5
$$ Thu Nov 28 13:51:54 2024 Russian Standard Time (UT+4h)  she@DPX200
##.OBSERVE FREQUENCY= 81.013821
##.OBSERVE NUCLEUS= ^31P
##.ACQUISITION MODE= SIMULTANEOUS
##.ACQUISITION SCHEME= undefined
##.AVERAGES= 64
##.DIGITISER RES= 17
##SPECTROMETER/DATA SYSTEM= spect
##.PULSE SEQUENCE= zgpg30
##.SOLVENT NAME= CDCl3
##.SHIFT REFERENCE= (INTERNAL, CDCl3, 0, 198.062)
##AUDIT TRAIL= $$ (NUMBER, WHEN, WHO, WHERE, WHAT)
$$ ##TITLE= Audit trail, XWIN-NMR		Version 3.5
$$ ##JCAMPDX= 5.01
$$ ##ORIGIN= Bruker BioSpin GmbH
$$ ##OWNER= she
$$ F:/spectra/data/she/nmr/P31/2/pdata/1/auditp.txt
$$ ##AUDIT TRAIL=  $$ (NUMBER, WHEN, WHO, WHERE, WHAT)
(   1,<2024-11-28 13:50:53.34 +0400>,<she>,<DPX200>,
      <created by zg, POWCHK disabled, PULCHK disabled
       configuration hash MD5:
       00 E9 B6 7A A2 85 ED C7 34 08 36 98 17 FE 4E 26
       data hash MD5: 32K
       46 F5 34 43 46 94 5E DC D8 48 C7 3C AB 70 E3 71>)
(   2,<2024-11-28 13:50:55.76 +0400>,<she>,<DPX200>,
      <Start of raw data processing
       efp BC_mod = 2 LB = 1.5 FT_mod = 6 PKNL = 1 PHC0 = 2220.246 PHC1 = 272.4883 SI = 64K 
       data hash MD5: 64K
       4B 75 C9 D9 1C D1 60 6C 23 75 14 6A B8 E0 51 51>)
(   3,<2024-11-28 13:51:13.37 +0400>,<she>,<DPX200>,
      <pk PHC0 = 6.842715 PHC1 = 0 
       data hash MD5: 64K
       54 D4 81 4B DA B0 F3 13 D1 42 7D 14 98 D6 5B D2>)
(   4,<2024-11-28 13:51:21.85 +0400>,<she>,<DPX200>,
      <abs ABSG = 5 
       data hash MD5: 64K
       45 CE 7B 84 A1 97 9C D2 C1 F6 65 84 EB C8 CF 97>)
$$ ##END=
$$ 
$$ hash MD5
$$ F8 2B B9 3D 8F ED 08 19 D5 AD 87 89 3E 69 5B D1
##$RELAX= 
##$RELAX= 
##$RELAX= 
##$RELAX= 
##$RELAX= 
##$RELAX= 
##$RELAX= 
##$RELAX= 
$$ Bruker specific parameters
$$ --------------------------
##$DU= <F:/spectra>
##$EXPNO= 2
##$NAME= <P31>
##$PROCNO= 1
##$TYPE= <nmr>
##$USER= <she>
##$AMP= (0..31)
100 100 100 100 100 100 100 100 100 100 100 100 100 100 100 100 100 100 
100 100 100 100 100 100 100 100 100 100 100 100 100 100 
##$AQSEQ= 0
##$AQ_mod= 1
##$AUNM= <au_zg>
##$AUTOPOS= <>
##$BF1= 81.014009
##$BF2= 200.13
##$BF3= 200.13
##$BF4= 200.13
##$BF5= 200.13
##$BF6= 200.13
##$BF7= 200.13
##$BF8= 200.13
##$BYTORDA= 1
##$CFDGTYP= 0
##$CFRGTYP= 5
##$CHEMSTR= <none>
##$CNST= (0..31)
1 1 145 1 1 1 1 1 1 1 1 1 1 1 1 1 1 1 1 1 1 1 1 1 1 1 1 1 1 1 1 1 
##$CPDPRG= <waltz16>
##$CPDPRG1= <>
##$CPDPRG2= <waltz16>
##$CPDPRG3= <>
##$CPDPRG4= <mlev>
##$CPDPRG5= <mlev>
##$CPDPRG6= <mlev>
##$CPDPRG7= <mlev>
##$CPDPRG8= <mlev>
##$CPDPRGB= <>
##$CPDPRGT= <>
##$D= (0..31)
0 1 0 0 0 0 0 0 0 0.06 0 0.03 2e-05 3e-06 0 0 0.0002 0 0 0 0 0 0 0 0 0 
0 0 0 0 0 0 
##$DATE= 1732787452
##$DBL= (0..7)
120 120 120 11 120 120 24 19 
##$DBP= (0..7)
150 150 150 150 150 150 150 150 
##$DBP07= 0
##$DBPNAM0= <>
##$DBPNAM1= <>
$$ [...]
##$SUBNAM3= <"">
##$SUBNAM4= <"">
##$SUBNAM5= <"">
##$SUBNAM6= <"">
##$SUBNAM7= <"">
##$SUBNAM8= <"">
##$SUBNAM9= <"">
##$SW= 400.765351723535
##$SWIBOX= (0..15)
0 1 3 0 0 0 0 0 0 0 0 0 0 0 0 0 
##$SW_h= 32467.5324675325
##$TD= 32768
##$TD0= 1
##$TE= 0
##$TE2= 300
##$TE3= 300
##$TEG= 300
##$TL= (0..7)
0 120 53 12 22 120 120 120 
##$TP= (0..7)
150 150 150 150 150 150 150 150 
##$TP07= 0
##$TPNAME0= <>
##$TPNAME1= <>
##$TPNAME2= <>
##$TPNAME3= <>
##$TPNAME4= <>
##$TPNAME5= <>
##$TPNAME6= <>
##$TPNAME7= <>
##$TPOAL= (0..7)
0.5 0.5 0.5 0.5 0.5 0.5 0.5 0.5 
##$TPOFFS= (0..7)
0 0 0 0 0 0 0 0 
##$TUNHIN= 0
##$TUNHOUT= 0
##$TUNXOUT= 0
##$USERA1= <user>
##$USERA2= <user>
##$USERA3= <user>
##$USERA4= <user>
##$USERA5= <user>
##$V9= 5
##$VALIST= <valist>
##$VCLIST= <CCCCCCCCCCCCCCC>
##$VD= 0
##$VDLIST= <DDDDDDDDDDDDDDD>
##$VPLIST= <PPPPPPPPPPPPPPP>
##$VTLIST= <TTTTTTTTTTTTTTT>
##$WBST= 1024
##$WBSW= 4
##$XGAIN= (0..3)
0 0 0 0 
##$XL= 0
##$YL= 0
##$YMAX_a= 7115
##$YMIN_a= -5638
##$ZGOPTNS= <>
##$ZL1= 120
##$ZL2= 120
##$ZL3= 120
##$ZL4= 120
##$ABSF1= 198.0616
##$ABSF2= -202.7028
##$ABSG= 5
##$ABSL= 3
##$ALPHA= 0
##$AQORDER= 0
##$ASSFAC= 0
##$ASSFACI= 0
##$ASSFACX= 0
##$ASSWID= 0
##$AUNMP= <proc_1d>
##$AZFE= 0.1
##$AZFW= 0.5
##$BCFW= 0
##$BC_mod= 2
##$BYTORDP= 0
##$COROFFS= 0
##$CY= -3
##$DATMOD= 1
##$DC= 0
##$DFILT= <>
##$DTYPP= 0
##$F1P= 0
##$F2P= 0
##$FCOR= 1
##$FTSIZE= 65536
##$FT_mod= 6
##$GAMMA= 0
##$GB= 0
##$INTBC= 1
##$INTSCL= 9.790993e-09
##$ISEN= 30
##$LB= 1.5
##$LEV0= 0
##$LPBIN= 0
##$MAXI= 10000
##$MC2= 0
##$MEAN= 0
##$ME_mod= 0
##$MI= 50
##$NCOEF= 0
##$NC_proc= -8
##$NLEV= 6
##$NOISF1= 182.463
##$NOISF2= 159.3651
##$NSP= 0
##$NTH_PI= 0
##$NZP= 0
##$OFFSET= 198.0616
##$PC= 4
##$PHC0= 2227.089
##$PHC1= 272.4883
##$PH_mod= 1
##$PKNL= yes
##$PPARMOD= 0
##$PSCAL= 0
##$PSIGN= 0
##$REVERSE= no
##$SF= 81.0140089999434
##$SI= 65536
##$SIGF1= 159.3651
##$SIGF2= -187.1042
##$SINO= 113.3802
##$SIOLD= 16384
##$SREGLST= <1H.CDCl3>
##$SSB= 0
##$STSI= 65536
##$STSR= 0
##$SW_p= 32467.5324675325
##$SYMM= 0
##$S_DEV= 0
##$TDeff= 32768
##$TDoff= 0
##$TI= <>
##$TILT= no
##$TM1= 0
##$TM2= 0
##$TOPLEV= 0
##$USERP1= <user>
##$USERP2= <user>
##$USERP3= <user>
##$USERP4= <user>
##$USERP5= <user>
##$WDW= 1
##$XDIM= 65536
##$YMAX_p= 160542179
##$YMIN_p= -247831891
$$ End of Bruker specific parameters
$$ ---------------------------------
##NTUPLES= NMR SPECTRUM
##VAR_NAME=  FREQUENCY,     SPECTRUM/REAL,   SPECTRUM/IMAG
##SYMBOL=    X,             R,               I
##VAR_TYPE=  INDEPENDENT,   DEPENDENT,       DEPENDENT
##VAR_FORM=  AFFN,          ASDF,            ASDF
##VAR_DIM=   65536,         65536,           65536
##UNITS=     HZ,            ARBITRARY UNITS, ARBITRARY UNITS
##FACTOR=    0.49542278885378, 1,            1
##FIRST=     16045.7642231865, 0,            0
##LAST=      -16421.768244346, 0,            0
##MIN=       -16421.768244346, -247831891,   0
##MAX=       16045.7642231865, 160542179,    0
$$ Real data points
##PAGE= N=1
##DATA TABLE= (X++(R..R)), XYDATA
$$ [...]
##PAGE= N=2
##DATA TABLE= (X++(I..I)), XYDATA
7474a200489l789504o78553K697986K548304m40267j980532o4378K615876K788604
7465B497047Q32534o23990o55109n44548j165512j936489k243503k056466r74939
7456f870975J521936M308652M800879J992521j865065l704284k863755r22647
7448c602738O55242J430141J339534O58644K81532P34476J099433P2626k082022
7439E86868l681964l484659j481038J537920L934776L551247L4718l506085l364071
7430e872288J19378K881589K365792J40731j194594j166213m50589O90151J407905
7421a078138N3334l029694m552322k410799J042569K366286J943148K497014M040326
7412H71724L942876J689563r388O14981K081588K292636R79028j191412l552827
$$ plain form
7474 -1200489 -4989993 -5668546 -2970560 -422256 -862523 -2843055 -2907433 -291557 2497047
7465 2497047 3329581 2705591 2050482 1505934 340422 -1596067 -3839570 -5896036 -6870975
7456 -6870975 -5349039 -1040387 3760492 5753013 3887948 183664 -2680091 -3602738
7448 -3602738 -2947496 -1517355 -177821 480823 762355 1496831 2596264 2668890 586868
7439 586868 -3095096 -6579755 -8060793 -6522873 -2588097 963150 997868 -2508217 -5872288
7430 -5872288 -5752910 -2871321 -505529 -364798 -1559392 -2725605 -3176194 -2486043 -1078138
7421 -1078138 -1024804 -4054498 -8606820 -11017619 -9975050 -7608764 -5665616 -3168602 871724
7412 871724 4814600 6504163 6494775 7109756 9191344 11483980 12463008 11271596 7718769
7403G718769m730921l377974n62761Q22488K6701m87080R28296K457239J848812
7394D643569j69003j584121k341466l491761m420277l471972p91723J604102K439253
7385g583399K273067K157869K443944K697492J984983j44128k307748k177462
7377f55382K37008J762571J85657k308435k063252Q17026K795231J878636m53998
7368B195062k195305k941394k674665j049373J064178J449337o15354k746613
7360g514127k016571J573602M986795N072359J409110l105915m603260k053744
7352f251751J549539K849621K210188K340240L546549L177234J15690l117444
7344F419866m005459l271120k760868k227461m15361K054880L126067J997173
$$ plain form
7403 7718769 2987848 -390126 -952887 -130399 -103698 -590778 337518 2794757 4643569
7394 4643569 4474566 2890445 548979 -2942782 -7363059 -10835031 -11626754 -10022652 -7583399
7385 -7583399 -5310332 -3152463 -708519 1988973 3973956 3829828 1522080 -655382
7377 -655382 -418374 1344197 1529854 -778581 -2841833 -2024807 770424 2649060 2195062
7368 2195062 -243 -2941637 -5616302 -6665675 -5601497 -4152160 -4767514 -7514127
7360 -7514127 -9530698 -7957096 -2970301 2102058 3511168 405253 -4198007 -6251751
7352 -6251751 -4702212 -1852591 357597 2697837 6244386 9421620 9537310 6419866
7344 6419866 2414407 -856713 -3617581 -5845042 -6260403 -4205523 -1079456 917717
7336I17717k07368j818590j508065J101647M276026M799316J562618k372079l126768
7327C624454o85671J608049J505627j98994j605594j470061N84982L417422M167042
7318A0947256J096367l321819m623158j987839Q64006R77368m11508r00453n41833
7309B098387m58268k11743Q83273J515169K47320j458687j000816J141013J920157
7300D675805M22606j032551j099359j525103l430799m293791j430646L146181
7292d567657M576073J527460k221291l086337j851937j163723j172008j46284
7284h105704J726325K137993N79208j73052K002000M899704M465674L11668l510202
7275D333614l596444j108678M45466j76681j281101j443581j295916j679816j696910
$$ plain form
7336 917717 710349 -1108241 -2616306 -1514659 2761367 7560683 9123301 6751222 3624454
7327 3624454 2938783 4546832 6052459 5853465 4247871 2777810 3362792 6780214 10947256
7318 10947256 12043623 8721804 4098646 2110807 2974813 3952181 3540673 2640220 2098387
7309 2098387 1640119 1428376 2311649 3826818 4074138 2615451 1614635 2755648 4675805
7300 4675805 5098411 4065860 2966501 1441398 -1989401 -6283192 -7713838 -4567657
7292 -4567657 8416 1535876 -685415 -3771752 -5623689 -6787412 -7959420 -8105704
7284 -8105704 -6379379 -4241386 -3662178 -3835230 -1833230 3066474 7532148 7843816 4333614
7275 4333614 737170 -371508 73958 -102723 -1383824 -2827405 -4123321 -5803137 -7500047
7266g500047R4512L182340N084217L960009N26959k782622m031410l031096j059083
7257e556221K20416n921r42693q56185R26904K833427K603867J24036k187763
7248b840133k281477q77920p0041k66551l0474J179980J952896J361933Q09987
7239a061800J862657L308313K519743m31335k290977j010302J327229J446876
7231E670404o15718j938391j071301J89770k09392j588372j667527J75534J986298
7222I31305J546728j019632l209649k722362j5819K136931J932722O79143P87890
7213A047257K293363K903270J380877r26335k355166k918553l174314k841941
7205d591542j817513j024137p61537K52344K343646K996418J54746l676648l889011
$$ plain form
7266 -7500047 -7405535 -4223195 861022 4821031 5347990 2565368 -1466042 -4497138 -5556221
7257 -5556221 -5335805 -5341726 -6284419 -7140604 -6213700 -3380273 -776406 -652370 -2840133
7248 -2840133 -5121610 -5999530 -6069571 -6336122 -6366596 -5186616 -3233720 -1871787 -1061800
7239 -1061800 800857 4109170 6628913 6197578 3906601 2896299 4223528 5670404
7231 5670404 5054686 3116295 2044994 2234764 2025372 437000 -1230527 -1054993 931305
7222 931305 2478033 1458401 -1751248 -4473610 -4489429 -2352498 -419776 259367 1047257
7213 1047257 3340620 6243890 7624767 6698432 4343266 1424713 -1749601 -4591542
7205 -4591542 -6409055 -7433192 -8194729 -7942385 -5598739 -2602321 -2447575 -6124223 -10013234
7196a0013234j51776K981574K420388K47198k11254R85315J758408J660317J676759
7187A353695J906306J772957J497510J343062M88527j288438j995572j729K631546
7178G707864K274570j032255l362202k293695K19357J247690O72062J54960K68277
7169E856628L53967M8950n32979j347298k048345j852336o76747M48724R26880
7160A177444J436429K211221J813052p15942l468779l569314j137768Q13702O80670
7151g59285K26933J249621K343805J070039j690431k177495R91715M201983L092952
7142H549837j681472m954225l264578J243612L826182K568398l89520k035508
7134C862726j333653P09354K263326J844264m53910k597882k529518o85183M81769
$$ plain form
7196 -10013234 -10165010 -7183436 -4763048 -4515850 -4727104 -3741789 -1983381 -323064 1353695
7187 1353695 3260001 5032958 6530468 7873530 8362057 7073619 5078047 5076318 7707864
7178 7707864 9982434 8950179 5587977 3294282 3513639 4761329 5433391 5588351 5856628
7169 5856628 6210595 6259545 5726566 4379268 2330923 478587 -198160 250564 1177444
7160 1177444 2613873 4825094 6638146 5922204 2453425 -1115889 -2253657 -1439955 -759285
7151 -759285 -532352 717269 3061074 4131113 2440682 263187 1254902 5456885 8549837
7142 8549837 6868365 1914140 -1350438 -106826 3719356 6287754 5898234 3862726
7134 3862726 2529073 3238427 5501753 7346017 6892107 4294225 1764707 1079524 1561293
7125A561293k32472j303529r17640M20482R06096J98915k58878N52159J936958
7116B863384K577853K097948J220537P33181M53682p41386l445840o144491n977846
7107f362978j933943L282334N698622M235406J336262m80985j281652k391746
7099B101320l775312m041955k544347k05573J705101K586274K215773N96081j361932
7090b724570j926579k52585K376465L780731L143287J447808K0663o19399p77639
7081D468182j281101k810953m589326m297854q36132L182601L789976P97904j703077
7072c279780q13664J627517K468569J744319J285742Q24262j188038l797644m095887
7063e224604j646629P19821J135721R82019K007898L570240M010481K931250R12586
$$ plain form
7125 1561293 1328821 25292 -892348 -471866 434230 633145 374267 926426 2863384
7116 2863384 5441237 7539185 8759722 9492903 9946585 9205199 5759359 -385132 -6362978
7107 -6362978 -8296921 -5014587 684035 4919441 6255703 5774718 4493066 2101320
7099 2101320 -1673992 -5715947 -8260294 -8465867 -6760766 -4174492 -1958719 -1362638 -2724570
7090 -2724570 -4651149 -4903734 -2527269 1253462 4396749 5844557 5865220 5245821 4468182
7081 4468182 3187081 376128 -4213198 -8511052 -9347184 -6164583 -2374607 -1576703 -3279780
7072 -3279780 -4093444 -2465927 2642 1746961 3032703 3856965 2668927 -1128717 -5224604
7063 -5224604 -6871233 -6151412 -5015691 -4033672 -2025774 1544466 5554947 8486197 9398783
7054I398783j503058l484357l904168k599946o41490J033565K053206J791049
7046B143584K8026j496051n58093K093800L290529K019155N50480J41884q78583
7037G334731k997739l199171K69290L860579L137575r16859l727683l602817k493688
7028b335782j510600R3836J793766J673317j30724j234430p80714l58022o20099
7019c409452p7220J788230K999134K015108M0875q52056k75069P17875R99028
7010C946453q0833k155363l599349l189427j876908j324005j236346l59408N35396
7001i339790k77384j627076l94401L006239M057469Q22120k476284j320266K548944
6992e000429L861699J279295j492266j397378M68426J458364R62020L08665M86138
$$ plain form
7054 9398783 7895725 4411368 507200 -2092746 -2734236 -1700671 352535 2143584
7046 2143584 2171610 675559 117466 2211266 5501795 7520950 8071430 8213314 7334731
7037 7334731 4336992 1137821 1407111 5267690 8405265 7488406 3760723 157906 -2335782
7028 -2335782 -3846382 -3752546 -1958780 -285463 -416187 -1650617 -2431331 -2789353 -3409452
7019 -3409452 -3486672 -1698442 1300692 3315800 3356675 2504619 2229550 2947425 3946453
7010 3946453 3865620 1710257 -1889092 -5078519 -6955427 -8279432 -9515778 -9875186 -9339790
7001 -9339790 -9617174 -11244250 -11638651 -8632412 -4574943 -3752823 -6229107 -7549373 -5000429
6992 -5000429 -1138730 140565 -1351701 -2749079 -2280653 -822289 139731 448396 934534
6983I34534J122736J365276R90780L71337l64977j431162k424928k252828p89541
6974b478773L95801J36221n74753m15216p6332p40208j535123j206597j101899
6965g596879k988176m718856k416509K903663N567454L232050J08163K96231K190089
6956c422770K148823j1796k215704l608884l761332j294616L439554O773488N946336
6947C993099K727454J45748j678234l426633l429221n88857K110020J405223q93686
6938C64913p83705J361909J751606m40141k347779k521388k307126k277619j365649
6929h564979L60146J572323K126629K422966J275801j834760l641642r02892L470377
6920c716031L400350j291666m349132k324506J244657K438987K236147K620454
$$ plain form
6983 934534 2057270 3422546 4413326 4784663 4419686 2988524 563596 -1689232 -2478773
6974 -2478773 -2082972 -1946751 -2521504 -2936720 -3013052 -3753260 -5288383 -6494980 -7596879
6965 -7596879 -10585055 -15303911 -17720420 -14816757 -9249303 -6017253 -5909090 -5612859 -3422770
6956 -3422770 -1273947 -1285743 -3501447 -7110331 -10871663 -12166279 -8726725 -1953237 3993099
6947 3993099 6720553 6866301 5188067 1761434 -1667787 -2256644 -146624 1258599 364913
6938 364913 -418792 943117 2694723 2254582 -93197 -2614585 -4921711 -7199330 -8564979
6929 -8564979 -8204833 -6632510 -4505881 -2082915 -807114 -2641874 -6283516 -7186408 -3716031
6920 -3716031 -315681 -1607347 -5956479 -8280985 -7036328 -4597341 -2361194 259260
6912B59260K288907k35620k677465j762361K123191N558364N822517K571759k282549
6903A1666003n322277m403705j455086k67584j381657k082723j287626n25550
6895e060205L1659J795805L373766J305814l323505m670216q99264K502454J273139
6886c670553j500289j742749j111037k224637k477222J055402M739621L407224
6878c524240p60381j512740J398667K686987Q62741k44918Q64961J328437K85854
6869A385368N34040K302142J808922j596513k828897J038378N347177M461837
6861A2452454n9786k441336j247133k04008j447480k411500l82017K828127K816793
6852I904114j574832o119847n774730p20118L716300L374505l97863l594395m419741
$$ plain form
6912 259260 2548167 2312547 -364918 -2127279 -4088 5554276 11376793 13948552 11666003
6903 11666003 6343726 1940021 484935 217351 -1164306 -3247029 -4534655 -5060205
6895 -5060205 -5028546 -3232741 141025 1446839 -1876666 -6546882 -7446146 -4943692 -3670553
6886 -3670553 -5170842 -6913591 -8024628 -10249265 -12726487 -11671085 -6931464 -3524240
6878 -3524240 -4284621 -5797361 -4398694 -1711707 -848966 -1093884 -228923 1099514 1385368
6869 1385368 1919408 4221550 6030472 4433959 1605062 2643440 7990617 12452454
6861 12452454 12392668 9951332 8704199 8500191 7052711 4641211 4259194 7087321 9904114
6852 9904114 8329282 2209435 -3565295 -4285413 -569113 2805392 2407529 -1186866 -5606607
6843e606607l407724r42884K349419M239730L240840J427917J663447K813634
6835E777772J359336k633293n083787l721291o41568J522938K400993K085347
6827A066447J99701j984002j890771L63425J411797l32699k131893j329055N39701
6818d087349M20410j677867l257943l015926j772433o62566o9415K18181P51293
6809a3153615J750519K436047J947856P25919l11954j257245j994120p17606L275886
6800g298313O361124M346166p92865k781754j93465J697053k19140k067602k49514
6791a198310K062590N27695k629101k280116J036327K263687K01065j052538R69715
6782i8986L670451L769729J357289j451277l068379k852531j245524k8513o25944
$$ plain form
6843 -5606607 -9014331 -9957215 -7607796 -3368066 -127226 1300691 2964138 5777772
6835 5777772 7137108 4503815 -579972 -4301263 -4942831 -3419893 -1018900 1066447
6827 1066447 1266148 -717854 -2608625 -2245200 -833403 -1166102 -3297995 -4627050 -4087349
6818 -4087349 -3666939 -5344806 -8602749 -11618675 -13391108 -14053674 -14123089 -13904908 -13153615
6809 -13153615 -11403096 -8967049 -7019193 -6293274 -6605228 -7862473 -9856593 -10574199 -7298313
6800 -7298313 -937189 3408977 2616112 -165642 -359107 1337946 1118806 -948796 -1198310
6791 -1198310 864280 1391975 -1237126 -3517242 -2480915 -217228 -16163 -1068701 -98986
6782 -98986 3571465 7341194 8698483 7247206 4178827 1326296 80772 52259 -573685
6773e73685k033987k074568m34436J248763J844172J475186M19223q07021q44449
6764a780802J010250L098642L007992N37932k321116l589519k266470J342905
6756i60186M522697L330376k464954p231063n387384J531870O720705O095847
6748F157908J441647l387357n830029m694196o19499L238545M011424K698599
6740C017042K212362K437463Q26444k330872l481638j428109O35927J63517j196102
6731H56034r54205K90300M49322o92630j701224j616861m86944J017100J795559
6722a043549J401749J003505J586010J653818o67804l559170l009242J146321
6714a488362M371385L734346J402334J79123p18262k813212m441027l065729K76672
$$ plain form
6773 -573685 -2607672 -4682240 -5116676 -3867913 -2023741 -548555 -129332 -936353 -1780802
6764 -1780802 -770552 2328090 5336082 5874014 3552898 -36621 -2303091 -960186
6756 -960186 3562511 6892887 4427933 -2803130 -8190514 -6658644 62061 6157908
6748 6157908 7599555 4212198 -1617831 -6312027 -6931526 -3692981 318443 3017042
6740 3017042 5229404 7666867 8493311 6162439 2680801 1252692 1888619 2052136 856034
6731 856034 -98171 192129 641451 -51179 -1752403 -3369264 -3856208 -2839108 -1043549
6722 -1043549 358200 1361705 2947715 4601533 3933729 374559 -2634683 -1488362
6714 -1488362 2883023 6617369 8019703 8198826 7480564 4667352 226325 -2839404 -2562732
6705b562732K013489P80248j143912q21545K197349N257784M775218J72618m483959
6696F184558m809448j845410n06011k225766l234328j273743O07833m53111k149024
6687i704450j175297J141028J674707J183034K384261M229731L134214p80256
6679B086972l373496k597845q85187p92052j684569j744928o16574R41665K118378
6670f547636K195549J222534O92215J996601M272693N268256M080627J606582
6662A4787421j145937l522432m567183l687540j691393J12778J209996J328798
6654B824508Q9352j443336q70842J840297K939118j14741m286126m893488k142570
6645f057828q206m6702m83711m81772q47307q81612R67596L243202K696981k49519
$$ plain form
6705 -2562732 -549243 231005 -912907 -1734452 462897 5720681 10495899 10668517 6184558
6696 6184558 1375110 -470300 -976311 -3202077 -6436405 -7710148 -7102315 -7555426 -9704450
6687 -9704450 -10879747 -9738719 -8064012 -6880978 -4496717 -266986 2867228 2086972
6679 2086972 -1286524 -3884369 -4769556 -5561608 -7246177 -8991105 -9607679 -8666014 -6547636
6670 -6547636 -4352087 -3129553 -2437338 -440737 3831956 9100212 13180839 14787421
6662 14787421 13641484 10119052 5551869 1864329 172936 285714 1495710 2824508
6654 2824508 2913860 1470524 599682 2439979 5379097 5264356 978230 -3915258 -6057828
6645 -6057828 -6066034 -6112736 -6596447 -7078219 -7925526 -8807138 -7839542 -4596340 -1899359 -2148878
6635b148878j641970j85863J174272P55788N21287J451622J194648j371756l312905
6626c563755k020634R51669K846391L304993K791557P88621j930958k498623j32858
6617E36403J895898J084250p22522j282643j839401l562192l758405j63154L900579
6608c911187L722978N33982n80805J261554K134318K14935k016383k805312l338012
6599d783932l904339k466825J158642L554727K347885l33179j181649j41373N76108
6590e173935R5616n37880l37079N56669J192163N62166j166501k096896o23314
6581g528991J953222K633292Q48484o40680L45663K636537L910304L764105L103932
6572A1025868J958956l21284l409727n942667o758653n413089k196293J418073
$$ plain form
6635 -2148878 -3790848 -3976711 -2802439 -2046651 -1525364 -73742 1120906 -250850 -3563755
6626 -3563755 -5584389 -4632720 -1786329 1518664 4310221 5098842 3167884 669261 536403
6617 536403 2432301 3516551 2794029 1511386 -328015 -3890207 -7648612 -7811766 -3911187
6608 -3911187 -188209 345773 -235032 1026522 3160840 3375775 1359392 -1445920 -4783932
6599 -4783932 -8688271 -11155096 -9996454 -6441727 -4093842 -4427021 -5608670 -5750043 -5173935
6590 -5173935 -5078319 -5616199 -5953278 -5396609 -4204446 -3642280 -4808781 -6905677 -7528991
6581 -7528991 -5575769 -2942477 -2093993 -2734673 -2389010 247527 4157831 7921936 11025868
6572 11025868 12984824 12663540 9253813 3311146 -3447507 -8860596 -11056889 -9638816
6564i638816L080434J583302j579806l551874k955444q07572J177078K362542
6556a0330156L064145L328579K639211J014186k36022L15856K286853L583847
6548E666499K748482M51877j703893k959803l385499l068252k247493j565353
6540f063435j318370j074779o85736p38154j194339p36787J385413L900240N056867
6531a469080M490732K475755r32374m285537m312858O5458M678559M392872j78737
6522D924790l614947l043502q92419N1320L82183J366600J903422O09774j263130
6513D24091j399485L53308K163603K674879J842749J59524j655620k715803k652364
6504h05118j984045j521875j828627l045172m438008m548471k873215p63540O04561
$$ plain form
6564 -9638816 -6558382 -4975080 -6554886 -10106760 -13062204 -13869776 -12692698 -10330156
6556 -10330156 -7266011 -3937432 -1298221 -284035 -520057 -204201 2082652 5666499
6548 5666499 8414981 8866858 7162965 4203162 817663 -2250589 -4498082 -6063435
6540 -6063435 -7381805 -8456584 -9142320 -9880474 -11074813 -11811600 -10426187 -6525947 -1469080
6531 -1469080 3021652 5497407 4565033 279496 -4033362 -3967904 710655 5103527 4924790
6522 4924790 1309843 -1733659 -2626078 -2574758 -2192575 -825975 1077447 1687221 424091
6513 424091 -975394 -622086 1541517 4216396 6059145 6218669 4563049 1847246 -805118
6504 -805118 -2789163 -4311038 -6139665 -9184837 -13622845 -18171316 -21044531 -21808071 -21203510
6495b1203510K031878M232835N473205M103264K125231K512747L842876K098307
6487E216833k343469m606777k924409r65478r78562k87263K626903M172559J825575
6478A735912p01430N99391L072756J911639j719422l040883j640356q75888j013053
6469a671334N42356K850241J769783k829086n974582m740425j426834J334736
6461a0145145L595396M986414L733296O78597m12176J222143J590402j284692
6453C964235l296236n06986M151985M701357M43098l597612l563946p29677J258603
6444B824821P30728p01779k53953K390216L741813M91414n243844p495011m119514
6435g635109K34163N23034k408014m338086l654744j721737N79708L137120M638628
$$ plain form
6495 -21203510 -19171632 -14938797 -9465592 -5362328 -3237097 -724350 3118526 5216833
6487 5216833 2873364 -1733413 -4657822 -5623300 -6601862 -6889125 -4262222 -89663 1735912
6478 1735912 1034482 1633873 4706629 6618268 4898846 1857963 217607 -658281 -1671334
6469 -1671334 -1128978 1721263 3491046 661960 -5312622 -10053047 -11479881 -10145145
6461 -10145145 -6549749 -1563335 2169961 2848558 2436382 3658525 5248927 3964235
6453 3964235 667999 161013 4312998 9014355 9457453 5859841 2295895 1566218 2824821
6444 2824821 3555549 2853770 2599817 4990033 8731846 9223260 3979416 -3515595 -7635109
6435 -7635109 -7400946 -6877912 -9285926 -13624012 -17278756 -19000493 -18420785 -15283665 -10645037
6426a0645037L700404J519538O08831J162730J155024j63737j268128r81478r4275
6417e006128k5615j193364k714729k816196k46184L564643M879608J903000k403440
6408d058405l805758k129501o20448p19964o35585O82177J421303J50681j401065
6399a1116565r10156Q02409R67098p76852j541898P46622M165182N034493K601635
6390b8032j64767n75276O92252J440344J281203J299094J498244J011980L69834
6381F824876Q17654J372534l47280l718424m903244k492134j3167n79835k200979
6372e239999j471524P94204J417678L96111L80599J654437J859924M94244l05086
6363a9412K39403M42120l14079m19318O07285Q56822n17562j501862n38943Q04381
$$ plain form
6426 -10645037 -6944633 -5425095 -4816264 -3653534 -2498510 -2662247 -3930375 -4911853 -5006128
6417 -5006128 -5031743 -6225107 -8939836 -11756032 -12002216 -8437573 -3557965 -1654965 -4058405
6408 -4058405 -7864163 -9993664 -10614112 -11334076 -11969661 -11287484 -9866181 -9715500 -11116565
6399 -11116565 -12026721 -11224312 -10257214 -11034066 -12575964 -11829342 -7664160 -2629667 -28032
6390 -28032 -192799 -768075 -75823 1364521 2645724 3944818 5443062 6455042 6824876
6381 6824876 7642530 9015064 8667784 4949360 46116 -2446018 -2459185 -3039020 -5239999
6372 -5239999 -6711523 -5917319 -4499641 -4103530 -3722931 -2068494 -208570 285674 -19412
6363 -19412 219991 662111 348032 -71286 535999 1392821 875259 -626603 -1165546 -361165
6353c61165L05456j661937k984763k435113k22744K542384L950046K614791n9075
6344A687880q53898Q80839K012723L30033j903317j428853R45733J777155L41121
6335C789416p17764O4929Q97140K0025j418042j248990N12656J922716J766889
6326E588975O06313m85409j029993r63507l66645K54351J39191p70980j575332
6317A396964j628133j422637j526675j330720r6921J271100J257775L95965P56142
6308i27140K422987K938271J242450m28297k12938M27198l04071j213412q06231
6299C138817q44888l285875n600416l893881M27283K334335J139077J010396K961487
6290b613665K701982j284994l747095o73630L905119M120763J211058N58939K634074
$$ plain form
6353 -361165 -55709 -1717646 -4702409 -7137522 -7360266 -4817882 -867836 1746955 1687880
6344 1687880 833982 1714821 3727544 4057577 2154260 725407 1671140 3448295 3789416
6335 3789416 3071652 3136581 4033721 4053746 2635704 1386714 1899370 3822086 5588975
6326 5588975 6195288 5709879 4679886 3716379 3349734 3604085 3743276 2972296 1396964
6317 1396964 -231169 -1653806 -3180481 -4511201 -4608122 -3337022 -2079247 -1683282 -927140
6308 -927140 1495847 4434118 5676568 5248271 5035333 5462531 5158460 3945048 3138817
6299 3138817 2293929 -991946 -6592362 -10486243 -10058960 -7724625 -6585548 -5575152 -2613665
6290 -2613665 88317 -1196677 -4943772 -5617402 -1712283 2408480 3619538 4178477 6812551
6281F812551L159195J064965R810J511164K053268j132391n429693o323358l121401
6272a395890P14090J659989m74318k467396j012648L037972M845059J704529k561603
6263D049784k331315J805456L763406P03254l285147l552158r49409Q59685R43411
6254B006967Q16112O77250o50545k734476l371466j643218P53901J604981M50372
6245b090122j403052k307015j602795m5138J071833J299612J200375J240118J368969
6236a267215J726043K523779K896767J371132j676196l523609k450442l79130
6228g78871l91015k357254l158151j209572J352816J749270J18115j266652j237285
6219g178599o34808m01423l42994K0645O96133J778897L511764M989143M158054
$$ plain form
6281 6812551 9971746 11036711 11046521 12557685 14610953 13478562 8048869 1725511 -1395890
6272 -1395890 -681800 978189 503871 -1963525 -2976173 61799 4906858 6611387 4049784
6263 4049784 1718469 3523925 7287331 7990585 4705438 1153280 203871 1063556 2006967
6254 2006967 2823079 3500329 2849784 115308 -3256158 -4899376 -4145475 -2540494 -2090122
6245 -2090122 -3493174 -5800189 -7402984 -7448122 -6376289 -5076677 -3876302 -2636184 -1267215
6236 -1267215 458828 2982607 5879374 7250506 5574310 2050701 -399741 -778871
6228 -778871 -1169886 -3527140 -6685291 -7894863 -6542047 -4792777 -4674662 -5941314 -7178599
6219 -7178599 -7813407 -8214830 -8557824 -8537179 -7841046 -6062149 -2550385 2438758 6596812
6210F596812O32624k496598j842021J561629L155533R19058k019625k085466j47146
6201D274800M23449j217683k919618l094252k138651q10609L64920L66622j209124
6192e960146k455748j096637J874735L168106J972072P33067O40017j14929k086112
6183c325575k250068J287996N158919M863715J191249j248359q04671j36161j023471
6174C713574j907343j508758j299741k557744l718390k846158p38092O67712J409652
6165h785288K621832L637505K626947j81247k334218k378804j173782K51632J915822
6156c799601L300167K870675N82206j066246l03508J117449N08517j615312k531448
6147i37101j650288q82474p69345M73917L170334M555800K719495l56932j878001
$$ plain form
6210 6596812 7229436 4732838 2890817 4452446 7607979 8527037 6507412 4421946 4274800
6201 4274800 4698249 3480566 560948 -2533304 -4671955 -5482564 -5117644 -4751022 -5960146
6192 -5960146 -8415894 -9512531 -7637796 -4469690 -2497618 -1764551 -1124534 -1239463 -3325575
6183 -3325575 -5575643 -4287647 871272 5734987 6926236 5677877 4873206 4737045 3713574
6174 3713574 1806231 297473 -1002268 -3560012 -7278402 -10124560 -10862652 -10194940 -8785288
6165 -8785288 -6163456 -2525951 100996 -80251 -2414469 -4793273 -5967055 -5715423 -3799601
6156 -3799601 -499434 2371241 2953447 1887201 1583693 2701142 3209659 1594347 -937101
6147 -937101 -2587389 -3469863 -4239208 -3765291 -594957 3960843 6680338 6323406 4445405
6138D445405k194984l077627l850532k577443j79426K55399j553693k171305M48117
6129a0456089L786180M346873K288786N30248O52030J692614K248708J891533
6121F980883O94489j047890k365516k039350m1356K022226K375540P77598j450654
6112E905970k843876k872689j760485N7110J837643K513644J722331N85358L15117
6103E460123J96154j455105m101007m791782k165295J314607K674834K222507
6095f44964K050497K393755K012708J023691M96852n0061j773571l495675k766865
6086g53633r4050J093864n90549k521827k113461j98283R11676M79606p79457
6077d566114j887016j650583N06052K935249L082687J093000k56331J96361O77958
$$ plain form
6138 4445405 2250421 -827206 -4677738 -7255181 -7434607 -7179208 -8732901 -10904206 -10456089
6129 -10456089 -6669909 -2323036 -34250 495998 1148028 2840642 5089350 6980883
6121 6980883 7675372 6627482 4261966 2222616 2181260 4203486 6579026 7356624 5905970
6112 5905970 3062094 189405 -1571080 -1513970 323673 2837317 4559648 5145006 5460123
6103 5460123 5656277 4201172 100165 -4691617 -6856912 -5542305 -2867471 -644964
6095 -644964 1405533 3799288 5811996 6835687 7332539 7282478 5508907 2013232 -753633
6086 -753633 -847683 246181 -344368 -2866195 -4979656 -5177939 -4266263 -3786657 -4566114
6077 -4566114 -6453130 -8103713 -7597661 -4662412 -1579725 -486725 -743056 -546695 131263
6068A31263J83846R1288P62103K83366j430622j247173J703301L184724K67697
6059C929793l183852k293128O89299p810l793503m155592R78897N735782M863172
6050B763058N40229j982368j517712p03655j297032k513837k689809q91455K053573
6041f239008L535048J845839q99865r52298J610450K681264L55082k085820j361440
6032a510748Q72045J171114j12184P6722K181541L367008J934772n37558j858785
6023E583927j785095j314667j110196j334600j900858k248308j638553j67780
6015e916130J052629J148403N65443M18859P90643K99439j920194m107857l254093
6006a0922858P25011L893580L125347O04222Q05665L770664M911701J919854j833194
$$ plain form
6068 131263 315109 406397 1168500 1451866 21244 -1225929 477372 3662096 3929793
6059 3929793 745941 -1547187 -857888 -865698 -4659201 -8814793 -7835896 -2100114 2763058
6050 2763058 3303287 1320919 -196793 -900448 -2197480 -4711317 -7401126 -8292581 -6239008
6041 -6239008 -2703960 -858121 -1757986 -2710284 -1099834 1581430 1936512 -149308 -1510748
6032 -1510748 -638703 532411 420227 496949 2678490 6045498 7980270 7442712 5583927
6023 5583927 3798832 2484165 1373969 39369 -1861489 -4109797 -5748350 -5916130
6015 -5916130 -4863501 -3715098 -3149655 -2730796 -1940153 -1640714 -3560908 -7668765 -10922858
6006 -10922858 -10197847 -6304267 -3178920 -2574698 -1769033 2001631 6913332 8833186 6999992
5997F999992k379476l70366J137266J327304J086504Q285k538153m615597l626699
5988b970940o06130P17045q07125k504164k242586j008911l11640J60570J022950
5979h550931J728782K027479K777710L829234L164270m124l078271l208227j252486
5970b566564l05541j192914j855860q37556R23808J860201J421936j56550k004615
5961d713655k482933p35474J477675J429529p90488k171770r06041J615917L578659
5952c698581M845922M993613K201493l396625p617533o700197k418704M83173
5944a1307439P63563R64929K031850J995331M20496j37568J439440K720922J975072
5935H66596J077018J752243K114883N3283k563341k669199j084431r29146k134650
$$ plain form
5997 6999992 4620516 4250150 5387416 6714720 7801224 7809509 5271356 655759 -2970940
5988 -2970940 -3577070 -2860025 -3667150 -6171314 -8413900 -9422811 -9734451 -9573881 -8550931
5979 -8550931 -6822149 -4794670 -2016960 1812274 4976544 4972420 1894149 -1314078 -2566564
5970 -2566564 -2872105 -4065019 -5920879 -6758435 -5834627 -3974426 -2552490 -2709040 -4713655
5961 -4713655 -7196588 -7932062 -6454387 -5024858 -5815346 -7987116 -8893157 -7277240 -3698581
5952 -3698581 1147341 6140954 8342447 4945822 -2671711 -9371908 -11790612 -11307439
5944 -11307439 -10543876 -9578947 -7547097 -5551766 -5131270 -5268838 -3829398 -1108476 866596
5935 866596 1943614 3695857 5810740 5864023 3300682 631483 -452948 -1382094 -3516744
5926c516744j656051J025591K588834R30240j670810j911026K29171K046466J635620
5917b98709l47375j791761j460883m97812j183991l590494m619533j875694K635062
5908a3031190M835911L830646K281824J940560J729025O32569l47988k39898J01121
5899A732580m57938j481168j726934o98982J119050K597476K471552P35221p06891
5890C583966k83137Q22208M19758j132622j713696j328397j905517l017674j606016
5881f161127K741470N812890M258425K62568j726472q34440J42228r59495l430862
5872A05185m889110l374420P21727M096455L516523p9424k655845k745714k841236
5863h145859l950325k857041K262619P064774O147548Q34176k549339j159895
$$ plain form
5926 -3516744 -5172795 -4147204 -1558370 -628130 -2298940 -4209966 -3980795 -1934329 -298709
5917 -298709 -646084 -2437845 -3898728 -4396540 -5580531 -9171025 -13790558 -15666252 -13031190
5908 -13031190 -8195279 -4364633 -2082809 -142249 1586776 2219345 1871357 1631459 1732580
5899 1732580 1274642 -206526 -1933460 -2632442 -1513392 1084084 3555636 4290857 3583966
5890 3583966 3300829 4123037 4542795 3410173 1696477 368080 -1537437 -4555111 -6161127
5881 -6161127 -3419657 2393233 6651658 6914226 5187754 4353314 4495542 3536047 105185
5872 105185 -4783925 -8158345 -7436618 -3340163 176360 96936 -2558909 -5304623 -8145859
5863 -8145859 -12096184 -14953225 -12690606 -5625832 521716 1355892 -1193447 -2353342
5855b353342J759936K523742J310799P7653p06278j697382k685532k342998J30377
5846c983025L236831L650303J21m048929l379722J202147K989788j122088n385793
5837f840367l364100K363324M215570J044089r42892J682869M901004M105435
5829G164932L06074k812520l884370l418284j629606P19846J661527M11486j251091
5820b732006j490593o61047J9906K38353O6056n10285p14929N27943K554240L310050
5810F07688K270287R93390M29802Q489k93033L04532J086015L18473j253585p27329
5800C744729J998577L114276M80345l073491m116607k983875j413908P34635L343094
5791A827775L813542P80359k459299k241145k32868n83116l002574l473687j150136
$$ plain form
5855 -2353342 -593406 1930336 3241135 3318788 2612510 915128 -1770404 -4113402 -3983025
5846 -3983025 -746194 2904109 2904230 -1144699 -4524421 -3322274 -332486 -1454574 -6840367
5837 -6840367 -10204467 -7841143 -3625573 -2581484 -3524376 -1841507 3059497 7164932
5829 7164932 7471006 4658486 774116 -2644168 -4273774 -3553928 -1892401 -1480915 -2732006
5820 -2732006 -4222599 -4883646 -4863740 -4625387 -4559331 -5069616 -5784545 -5256602 -2702362 607688
5810 607688 2877975 3871365 4301167 4309656 4016623 4321155 5407170 5725643 4472058 3744729
5800 3744729 5743306 8857582 9337927 6264436 2147829 -836046 -2249954 -1515319 1827775
5791 1827775 5641317 6421676 3962377 1721232 1488364 905248 -2097326 -5571013 -6721149
5782f721149M34714m99387j254550M59489K682886K342028m25477l106226m083791
5773a0171463l337288j329367J213090L281962M350067M440469L237580N88881
5765B273931j807430j342081J725711L417914Q41035l590599n019623k460468
5757e961610L20247L18454r76998o42214J008473J178427p88036k186451q90504
5748h620212J664429K743633J927374O93543l98247j792653k730971j582163J219284
5739f875983K926109K119088O15470N60755J409372J308502M4180j057026j142932
5730i2465k92268J063045J832305N90198k202560l622270j989944N7342j094054
5721e750671m322723m693576m71078M066418M370744J569292L00407K181328M169852
$$ plain form
5782 -6721149 -6286435 -6785822 -8040372 -7580883 -4897997 -2555969 -2981446 -6087672 -10171463
5773 -10171463 -13508751 -14838118 -13625028 -10343066 -5992999 -1552530 1685050 2273931
5765 2273931 466501 -875580 850131 4268045 5109080 1518481 -3501142 -5961610
5757 -5961610 -5641363 -5322909 -6299907 -6942121 -5933648 -4755221 -5543257 -7729708 -8620212
5748 -8620212 -6955783 -4212150 -2284776 -1591233 -1989480 -3782133 -6513104 -8095267 -6875983
5739 -6875983 -3949874 -1830786 -1215316 -654561 754811 2063313 2107493 1050467 -92465
5730 -92465 -384733 678312 2510617 3100815 898255 -2724015 -4713959 -4656617 -5750671
5721 -5750671 -10073394 -14766970 -15238048 -11171630 -6800886 -5231594 -4931187 -2749859 1419993
5712A419993L136126l04700l114872l340763j408974R21941J815998L76332k227678
5703b726597l022745k26831L859297M726920J218570k609845k723468m74358k06524
5694b185581k618853l948034j923054J047726K023506J702574K139685K743539
5686a018492J504397j197767k948860k809373j870123o82800J278844L473852
5678d270322M007745K211200j77833j140224n37233L31492M23224j28946k41886
5669D77217Q69319K266125J876966p09672l176652l479766k582283k283284j736598
5660h478628R04277M087871L819649l56197l792218k768829P12103K253463R32566
5651b685943o61258p03005L04984J547727K835035L402147J942163j419238m492787
$$ plain form
5712 1419993 4556119 4251419 1136547 -2204216 -3613190 -2691249 -875251 -498919 -2726597
5703 -2726597 -5749342 -5976173 -2116876 2610044 3828614 1218769 -1504699 -1979057 -2185581
5694 -2185581 -4804434 -8752468 -10675522 -9627796 -7604290 -5901716 -3762031 -1018492
5686 -1018492 485905 -711862 -3660722 -6470095 -8340218 -9023018 -7744174 -4270322
5678 -4270322 -262577 1948623 1770790 630566 93333 424825 848049 719103 477217
5669 477217 1346536 3612661 5489627 4779955 1603303 -1876463 -4458746 -6742030 -8478628
5660 -8478628 -7574351 -3486480 333169 -23028 -3815246 -6584075 -5871972 -3618509 -2685943
5651 -2685943 -3347201 -4050206 -3745222 -2197495 637540 4039687 5981850 4562612 69825
5642F9825n087819l043333L7078K349950K984811K229067J247366J057291J495542
5633C339778J445297K50428j388579k137631j436762L9397J208638J600602J469795
5624D390963J072089J47740j613563l616297m277827k466569Q13033K749669J504952
5615a295810j445526k697166r01986J716987K474344J530485P40858M46513l29729
5606B38970j086570j13053K026386K131267j202185n153401o320118m749534k579873
5597a6808111p07643J005486K005427K027869K362174L639829L845979J335315
5589a293675j652854j839812q4218R9768j567623k008332m09091O46094K74668
5580g835075P66838K565886K572085k56716k206453q24410O47502j148484l461113
$$ plain form
5642 69825 -5017994 -8061327 -8024249 -5674299 -2689488 -460421 786945 1844236 3339778
5633 3339778 4785075 5035503 3646924 1509293 72531 111928 1320566 2921168 4390963
5624 4390963 5463052 5610792 3997229 380932 -3896895 -6363464 -5550431 -2800762 -1295810
5615 -1295810 -2741336 -5438502 -6340488 -4623501 -2149157 -618672 122186 568699 238970
5606 238970 -847600 -960653 1065733 3197000 1994815 -3158586 -9478704 -14228238 -16808111
5597 -16808111 -17515754 -16510268 -14504841 -12476972 -10114798 -6474969 -2628990 -1293675
5589 -1293675 -2946529 -4786341 -4870559 -4770791 -6338414 -8346746 -8755837 -8109743 -7835075
5580 -7835075 -7068237 -4502351 -1930266 -2186982 -4393435 -5217845 -4570343 -5718827 -9179940
5571i179940j762519K497019M087378K332687J369683K568309K718367O07441
5563E238425m17262J327049K198762q00452m399875l623329O04334K882878J148251
5554D158781j253943j332331m64109j434833m150556o002510n103844j875619
5546a7458964J728435L671040L168459J298721r1864k75727J71971R23052K266873
5537d598004L579237L131491O57053j269258k32176K436226L142304Q75042j631463
5528F090452j928443q26774l16044n00804l07269J50693o8787p19372o18636L97750
5518A352766J468870K365922L313648L287628P20100l511663n914505m454039
5510a371273j231804L90044J02800K41656J714752K510588P63902k293701l699336
$$ plain form
5571 -9179940 -10942459 -8445440 -4358062 -2025375 -655692 1912617 4630984 5238425
5563 5238425 4821163 6148212 8346974 7546522 3146647 -476682 127652 3010530 4158781
5554 4158781 2904838 1572507 1108398 -326435 -4476991 -10479501 -15583345 -17458964
5546 -17458964 -15730529 -12059489 -8891030 -7592309 -7684173 -7959900 -7787929 -6864877 -4598004
5537 -4598004 -1018767 2112724 2769777 1500519 1268343 3704569 6846873 7721915 6090452
5528 6090452 4162009 3335235 3019191 2518387 2211118 2361811 2293024 1573652 955016 1352766
5518 1352766 2821636 5187558 8501206 11788834 12508934 8997271 3082766 -1371273
5510 -1371273 -2603077 -2213033 -2110233 -1868577 -153825 2356763 3120665 826964 -2872372
5501b872372k505314q41103q84161j821177j066484J765818L863107L033068R12457
5492d16161N39909J771543J679588o09734k370859j513152L29583P70077M92723
5483F73517J529972L217695K974546O24660j184942j229754j385606k918626l791150
5474a489688j751418J697103K922203J005591j290057j213057J224043M148871
5466E253591N582934M097665k05064m600283n546678k816505k00315o54410k378548
5457a467613j723360J422029L867264L978046L098331J996363o50796m844316
5449E675948p309386n334371p75802K092391J602571m13856j644358j042651J575905
5440e573609N238274P317332N586606J117236k528355l300233k506865k479383
$$ plain form
5501 -2872372 -5377686 -6218789 -7102950 -8924127 -9990611 -8224793 -4361686 -1328618 -416161
5492 -416161 123748 1895291 3574879 2965145 594286 -918866 -589283 180794 673517
5483 673517 2203489 5421184 8395730 9020390 7835448 6605694 5220088 2301462 -1489688
5474 -1489688 -3241106 -1544003 1378200 2383791 1093734 -119323 1104720 5253591
5466 5253591 10836525 14934190 14729126 10128843 4582165 1765660 1565345 910935 -1467613
5457 -1467613 -3190973 -1768944 2098320 6076366 9174697 11171060 10520264 5675948
5449 5675948 -1633438 -6967809 -7743611 -5651220 -4048649 -4462505 -6106863 -7149514 -5573609
5440 -5573609 -335335 6981997 12568603 13685839 11157484 7857251 5350386 2871003
5432B871003l691778m561525l256249M16950M349965N722506L902928J088531
5424F842331o15218j480022k349997k260289r3991K562607K920965Q49969j293404
5415E082951k293429k892806l268714k625949j436951j164164j387378j60239
5407a0146679K238308L045367J419573m8641M79526J508556J460422J411010K360297
5398C727739K585106N11543j925273j816345K16539Q99985j094463l847259m994501
5389e736929l876746j302316J235884K462910K532380K733786L361291L157916
5381D568176J613570l431j019518k629785n178630o379990m469451j195456Q50852
5372a3843663K104120M276176O221120N109186J275224j476572p77266J748210
$$ plain form
5432 2871003 -820775 -5382300 -8638549 -8221599 -3871634 1850872 5753800 6842331
5424 6842331 6227113 4747091 2397094 136805 42814 2605421 5526386 6376355 5082951
5415 5082951 2789522 -103284 -3371998 -5997947 -7434898 -8599062 -9986440 -10146679
5407 -10146679 -7908371 -4863004 -3443431 -3492072 -3012546 -1503990 -43568 1367442 3727739
5398 3727739 6312845 6824388 4899115 3082770 3299309 4199294 3104831 -742428 -5736929
5389 -5736929 -9613675 -10915991 -9680107 -7217197 -4684817 -1951031 1410260 4568176
5381 4568176 6181746 6178315 5158797 2529012 -2649618 -9029608 -13499059 -14694515 -13843663
5372 -13843663 -11739543 -7463367 -1242247 3866939 5142163 3665591 2888325 4636535
5364D636535L310199L057870J690140j46411k133965l964638n218720n095312
5356c864302k730542J304553M467537M473147J743807j251282k504052j585128
5348E3738O17961K190813J416935j032337k328007j056945R99803J941454K454452
5339E257867L458604L371742O86939k485745k870728q99089K98178p0655p3441
5330F673672O84581K48390j884881l619659l606735k640190j057794J980359N437340
5321B215083N798894J564080l852360n788795l554464l13130J146102P85773j18942
5312b117759j172333k779301m229030l223360J176897N687354N526877P50175
5304c80480l067893k174398M72200M17649j351777q91586J602635K340117N92714
$$ plain form
5364 4636535 7946734 11004604 12694744 12548333 10414368 6449730 1231010 -3864302
5356 -3864302 -6594844 -5290291 -822754 3650393 5394200 4142918 1638866 53738
5348 53738 671699 2862512 4279447 3247110 919103 -137842 861961 2803415 5257867
5339 5257867 8716471 12088213 12775152 10289407 7418679 6519590 6817768 6747113 6673672
5330 6673672 7358253 7606643 5721762 2102103 -1504632 -4144822 -5202616 -3222257 2215083
5321 2215083 8013977 9578057 5725697 -63098 -3617562 -3930692 -2784590 -1998817 -2117759
5312 -2117759 -3290092 -6069393 -10298423 -13521783 -12344886 -6657532 -1130655 -380480
5304 -380480 -3448373 -5622771 -5150571 -4732922 -6084699 -6976285 -5373650 -3033533 -2440819
5295b440819m32502O00309J451905J054611J217452K393558K188042k00365j959487
5286C872704r89980J107154K072004J810467O36311j956951m995659n724120l491720
5277g659790r24576M57001K406800N736287P566378N636975K266436P97127N84395
5268A6867033j114330m119493n550553m041495j034517J431123K216511J196012
5260E850291m98159j196205p32929n44741j056629r54262K7481K3025j825904
5251i08032l475407k853799n48990J767102L337175L468724J363589j633907k358732
5242a842277q2478K324196K972732L283370L894701K361324k100822n493304m457616
5233H59826j472220n34806p75925R12854L429229K920609o66097l415299l222667
$$ plain form
5295 -2440819 -2873321 -2273012 -821107 233504 1450956 3844514 6032556 5832191 3872704
5286 3872704 2882724 3989878 6061882 7872349 8508660 6551709 1556050 -4168070 -7659790
5277 -7659790 -8584366 -8127365 -5720565 15722 7582100 13219075 15485511 16282638 16867033
5268 16867033 15752703 11633210 6082657 2041162 1006645 2437768 4654279 5850291
5260 5850291 5352132 4155927 3422998 2878257 1821628 867366 894847 917872 -908032
5251 -908032 -4383439 -7237238 -7786228 -6019126 -2681951 786773 2150362 516455 -1842277
5242 -1842277 -1924755 399441 3372173 6655543 10550244 12911568 10810746 5317442 859826
5233 859826 -612394 -1147200 -1923125 -1010271 2418958 5339567 4673470 1258171 -1964496
5224a964496j567829l3395J186937J771906J507259J303151J268369n09120m143936
5215a181154n431308j437966L744355M055358M07269j354065j27710l89690l378857
5206e093768m582123j623536J770760K234020J583856K162136K328025K32368
5198i88262j879545r48605K138833M309242M484530L352833J295804r89038k016522
5189H759270j807731k268213l405831k304167J616569L803134P66769l806672
5181A353128l772308M49300K634653M9178l079381k329264J039516L056764K653686
5172B055272J608004Q51014l24426k031673l109931k840317j815086q82293m32277
5163f921713q38443k157962k952770j125935K847584N106056K867309j317479
$$ plain form
5224 -1964496 -3532325 -3565720 -2378783 -606877 900382 2203533 3471902 2962782 -1181154
5215 -1181154 -6612462 -8050428 -4306073 -250715 156554 -1197511 -1325221 -1714911 -5093768
5206 -5093768 -9675891 -11299427 -9528667 -7294647 -5710791 -3548655 -1220630 -988262
5198 -988262 -2867807 -3816412 -1677579 2631663 7116193 10469026 11764830 10775792 8759270
5189 8759270 6951539 4683326 1277495 -1026672 589897 4393031 5159800 1353128
5181 1353128 -2419180 -1969880 664773 713951 -2365430 -4694694 -3655178 -598414 2055272
5172 2055272 3663276 4514290 4189864 2158191 -951740 -3792057 -5607143 -6489436 -6921713
5163 -6921713 -7760156 -9918118 -12870888 -13996823 -11149239 -6043183 -3175874 -4493353
5155d493353k381552N87407L511861L400597J780899Q41541j52685k058855k714456
5146a678596k62643K578606J722599j923503l424018q63514K455742L219858J947999
5137C772530P33566K13784J15767N10513J181105J263212L64387j013097k217473
5128D924294k521099j209334P50663M16068l172559o047796l923858J073092K721864
5119f988665j87480k119442M34313L572838K430483j201890j965204R57140L391112
5110a676795K864825J574802K197089L832412L505123K17721l689849m954092
5102C871236k766139M07240J602365N97029m83448m50295l34903j061598j591541
5093b10054n25692J578810K799021K219209O27938r28263k258832l377608l484645
$$ plain form
5155 -4493353 -6874905 -6287498 -2775637 624960 2405859 3247400 3094715 1035860 -1678596
5146 -1678596 -1941239 637367 2359966 436463 -2987555 -3851069 -1395327 1824531 3772530
5137 3772530 4506096 4719880 4835647 5346160 6527265 7790477 8154864 7141767 4924294
5128 4924294 2403195 1193861 1944524 2360592 -811967 -6859763 -10783621 -9710529 -6988665
5119 -6988665 -7176145 -9295587 -8861274 -5288436 -2857953 -4059843 -6025047 -5067907 -1676795
5110 -1676795 1188030 2762832 4959921 8792333 12297456 12515177 8825328 3871236
5102 3871236 1105097 1512337 3114702 3711731 3228283 2777988 2443085 1381487 -210054
5093 -210054 -735746 843064 3642085 5861294 6489232 5560969 3302137 -75471 -3560116
5084c560116j677063J128150K328368R63080l12828J127134L229496J861378k017715
5075C069884k661689J317628L481009r89434p176560p255513j859360J898851
5067a0175184J514398J013725K488704L011444R95488q09048n38670k7333m82488
5058c008964k34311J315160K094966J523173J730011K846684J791173k094600
5050E963292m834619l773742j476510j120651k069257k534225k566051j878660
5042a4290423J028612M823320M893985K93661l171935p33586M234224N184445
5034B262303J411258k298467k832120j498239q91447k043830l768686l329862
5026a2989090M73717M343752L858789L62655k07152L365995N235641K015598j623852
$$ plain form
5084 -3560116 -5237179 -4109029 -1780661 -817581 -1130409 -3275 3226221 5087599 3069884
5075 3069884 408195 1725823 5206832 4217398 -2959162 -10214675 -12074035 -10175184
5067 -10175184 -8660786 -7647061 -5158357 -2146913 -1151425 -1960473 -2499143 -2526476 -3008964
5058 -3008964 -3243275 -1928115 166851 1690024 3420035 6266719 8057892 5963292
5050 5963292 1128673 -2645069 -4121579 -5242230 -7311487 -9845712 -12411763 -14290423
5042 -14290423 -13261811 -8438491 -3544506 -3250845 -6422780 -7156366 -2922142 2262303
5034 2262303 3673561 1375094 -1457026 -2955265 -3846712 -5890542 -9659228 -12989090
5026 -12989090 -12515373 -8171621 -4312832 -3950177 -4157329 -791334 4444307 6459905 4836053
5017D836053r52940J179253R553k934100l253935j226158o502J99210N33796m10486
5007b026256l163294l733518L79626M151376J915304k981762l057191J328041
4999g187674L137680L25873k205134k071950k421457m381752m223083l22483L366938
4990a5983042L361129J168094l04689n09589K49677K095684L849155L440432J067535
4981a565614j004677j936273k497705k316403o12691J014403N89913k34801J403707
4972g160141M016321L587517M41648j047350L99507J487379M63980n24745o4340
4963A599776M06622J71537N66286J785164K280921J858956J577441O50085k376106
4954H520682n649389n787151l365945j939114k026183j189936M34239M43774k38908
$$ plain form
5017 4836053 3883113 5062366 5071919 2137819 -1116116 -2342274 -2348776 -2149566 -1615770 -2026256
5007 -2026256 -5189550 -8923068 -8543442 -4392066 -2476762 -5458524 -8515715 -7187674
4999 -7187674 -4049994 -3724121 -5929255 -8001205 -10422662 -14804414 -19027497 -19349980 -15983042
4990 -15983042 -12621913 -11453819 -11758508 -12268097 -12018420 -9922736 -6073581 -2633149 -1565614
4981 -1565614 -2570291 -4506564 -7004269 -9320672 -9933363 -8918960 -8329047 -8563848 -7160141
4972 -7160141 -3143820 443697 885345 -162005 237502 1724881 2188861 1664116 1599776
4963 1599776 2006398 2177935 2744221 4529385 6810306 8669262 10246703 10896788 8520682
4954 8520682 2871293 -2915858 -6281803 -8220917 -10247100 -11437036 -11002797 -10559023 -10797931
4945a0797931J659241M910180M504384K58854j850039J243462N307143N552624
4937A0787918K309640j867821n364045o025682k112210L207673L739336j094216
4929C580593m691310k655183J424355K199622k32108k273413j976717L52599L358466
4920i13096M556659K151468j945699l969504l384279k633776k304947q34971J437655
4911g840490K461964K119411J398656m80213l430008l735433K68243L224445M88980
4902e524445l291321j888066R26313j740371n924960k760069M939807O613399
4894h649713K256929J092430L429475J071235m606834l654109K613982K562434
4886c884171l498713l397081K616590J709887m587806j077511Q807474M119067
$$ plain form
4945 -10797931 -9138690 -4228510 275874 534728 -1315311 -71849 5235294 10787918
4937 10787918 13097558 11229737 5865692 -159990 -2272200 935473 4674809 3580593
4929 3580593 -1110717 -3765900 -2341545 -141923 -374031 -2647444 -4624161 -4271562 -913096
4920 -913096 3643563 5795031 3849332 -120172 -3504451 -6138227 -8443174 -9278145 -7840490
4911 -7840490 -5378526 -3259115 -1860459 -2340672 -5770680 -9506113 -9237870 -6013425 -5524445
4902 -5524445 -8815766 -10703832 -9777519 -11517890 -17442850 -20202919 -15263112 -8649713
4894 -8649713 -6392784 -5300354 -1870879 -799644 -5406478 -9060587 -6446605 -3884171
4886 -3884171 -7382884 -10779965 -8163375 -6453488 -11041294 -12118805 -3311331 807736
4878H07736j1869863r615666J2566034J8050243J583015J7370898Q9982874J43281730
4870B62157001Q8455841m0962988j19266590r0817686k6670172o555336j9586478
4863D6753592j6770024J687478M210551p845668q266655L157779M685508m694489
4855B2918072o595941L43481N65875o390843n632634L315518N061154l192638
4847A0392044p280950j663066L431784K600207K303121M613362K816140l535638
4839A3677004o064116l010855j778866l875848k556837K424003L050015j337754
4831E26746j834567L265806M481953j712523o234601l363661K41396j096132k354189
4822h079772J158182M395727K324526n95147J086780M006864K714746p43572j619843
$$ plain form
4878 807736 -11062127 -20677793 -8111759 9938484 11521499 28892397 118875271 262157001
4870 262157001 350612842 309649854 190383264 99565578 72895406 66340070 46753592
4863 46753592 29983568 31671046 35881597 28035929 19769274 22927053 27612561 22918072
4855 22918072 16322131 16665612 17231487 10840644 5208010 8523528 13584682 10392044
4847 10392044 3111094 1448028 4879812 7480019 9783140 14396502 17212642 13677004
4839 13677004 7612888 4602033 2823167 -1052681 -3609518 -1185515 1864500 526746
4831 526746 -1307821 1957985 6439938 4727415 -1507186 -4870847 -4629451 -5725583 -8079772
4822 -8079772 -6921590 -2525863 -201337 -796484 290296 4297160 7011906 6268334 4648491
4813D648491r24504j913823l180971j908875K94104P25887P66652K421338L649993
4804D578292K199649K34222K46784J92049k285382m413072k443281J695014L221609
4795C225884J788104Q96299J590638J477380n99998k762301k917234r13183J749392
4786C534981K868986J286940j301162k013364r25649q89313k425972k459874K09560
4777b114867K195822R54126q55909R8274K144780J499644j528254l390741k795793
4768c792918j377871O7848K078487L591810K274152j557132m170935k727930J335647
4759d278842M169813L762016J565118K53052M82496M50596j193112l090264l026273
4750i05400j153958M46341Q55055Q50206P79281L16344R7805R42932J620761M09248
$$ plain form
4813 4648491 3723987 1810164 -1370807 -3279682 -2985578 -2259691 -1493039 928299 4578292
4804 4578292 6777941 7012163 7258947 7450996 5165614 752542 -1690739 4275 3225884
4795 3225884 5013988 5910287 7500925 8978305 8378307 5616006 2698772 1785589 3534981
4786 3534981 6403967 7690907 6389745 4376381 3450732 2561419 135447 -2324427 -2114867
4777 -2114867 80955 1035081 179172 277446 2422226 3921870 2393616 -997125 -3792918
4768 -3792918 -5170789 -5102941 -3024454 567356 2841508 1284376 -2886559 -5614489 -4278842
4759 -4278842 -109029 3652987 5218105 5471157 5953653 6404249 5211137 2120873 -905400
4750 -905400 -2059358 -1613017 -757962 92244 871525 1187869 1285674 2228606 3849367 4258615
4740D258615j227904j68328K814031L226537j82908k994169j838895N20217j04868
4731D302328k993864m561686m133892l706248l541940j915593J257429L700056
4723a1593410L775770K104068K25372q69589j122976j231260j521798q20906J973980
4714i080749M987855M632044P22108k593603k592542j580797k524909m180861
4706a2211454l610996r87048J487785L329638M947209M946538K100866j276982
4698a274444j710133N36519K315578K331184J493410k41515l193515m899493k435971
4689g078380K131108L345535K05333k186238k97107K870564K792627k71143k739989
4680a227690k701918q06400J572307K687240J017213k278898l624038j869724
$$ plain form
4740 4258615 3030711 2862383 5676414 8902951 8720043 5725874 3886979 4407196 4302328
4731 4302328 1308464 -3253222 -7387114 -11093362 -14635302 -16550895 -15293466 -11593410
4723 -11593410 -7817640 -5713572 -5488200 -6357789 -7480765 -8712025 -10233823 -11054729 -9080749
4714 -9080749 -4092894 539150 1261258 -1332345 -3924887 -5505684 -8030593 -12211454
4706 -12211454 -15822450 -16809498 -15321713 -11992075 -7044866 -2098328 2538 -1274444
4698 -1274444 -2984577 -2448058 -132480 2198704 3692114 3450599 257084 -4642409 -7078380
4689 -7078380 -4947272 -1601737 -1396404 -3582642 -3879749 -1009185 1783442 1512299 -1227690
4680 -1227690 -3929608 -4736008 -3163701 -476461 540752 -1738146 -5362184 -7231908
4672g231908l60423j543534k422956O97332N274889N473175J144475j701774k9234
4663f99958K146134R05924j471652j236173J40619j002701l345690k186523K485018
4654d265002N195716L151785R461n48958k39325j830674l340036j252148K796082
4645c23099L696748N73114k000450r51678J411981J799632N27514k65835j46401
4636D321526M7294M3766l99369j985238m023397m076566j513521O12334j93339
4627g166510j584641L42255M587067N918951K156485k841943m572789l167921
4619f329046j480488m95372O75331J732472J242750l23354l05512K437945N443349
4610B598075N688973L466817J478446P98677p9765k008812l286886k274942k16942
$$ plain form
4672 -7231908 -7592331 -9135865 -11558821 -10861489 -5586600 -113425 1031050 -670724 -699958
4663 -699958 1446176 2352100 880448 -355725 -215106 -1217807 -4563497 -6750020 -4265002
4654 -4265002 930714 4082499 4091960 3543002 3303677 1473003 -1867033 -3119181 -323099
4645 -323099 3373649 3946763 1946313 994635 2406616 4206248 4733762 4467927 4321526
4636 4321526 4368820 4412586 4013217 2027979 -1995418 -6071984 -7585505 -6973171 -7166510
4627 -7166510 -8751151 -8408896 -3821829 2097122 4253607 1411664 -3161125 -6329046
4619 -6329046 -7809534 -8304906 -7629575 -5897103 -4654353 -4977707 -5283219 -2845274 2598075
4610 2598075 8287048 11753865 13232311 14030988 13951223 11942411 8655525 6380583 6163641
4601F163641M29608m91305j022627l31878L62102J18738n29283j076650j744757
4592A877589k039337o35072K196513L860311K595492j20906j891622k683237l754856
4583e95125m401367k478607J732464M676548L694820N24841q21730R86348L208228
4574F526420K697286k60004k645397k632556j429611r53623j126178o72831L40606
4565a55888M88509o81531j887511j924534r68112J86762J034141J272302Q90754
4556a745108M82458M41478K2065j447469k706175j802693P99176K516340K366265
4547a073663K030406K547065K574963J295723N33619J917507L795510L289562
4539A6910692K97607k606588l547440k917642k068799j753428j594213n34052
$$ plain form
4601 6163641 6593249 6101944 5079317 4747439 5109541 5228279 4698996 3622346 1877589
4592 1877589 -161748 -796820 1399693 5260004 7855496 7734590 5842968 3159731 -595125
4583 -595125 -4996492 -7475099 -5742635 -1066087 2628733 3153574 2331844 3318192 6526420
4574 6526420 9223706 8963702 6318305 3685749 2256138 1302515 176337 -496494 -155888
4565 -155888 332621 -348910 -2236421 -4160955 -5129067 -4942305 -3908164 -2635862 -1745108
4556 -1745108 -1262650 -821172 -799107 -2246576 -4952751 -6755444 -5956268 -3439928 -1073663
4547 -1073663 956743 3503808 6078771 7374494 7908113 9825620 13621130 16910692
4539 16910692 17208299 14601711 11054271 8136629 6067830 4314402 2720189 2186137
4531B186137J564301K848930J565409q27732j016266J284153K694684J331002
4523A1630618p24482j606531k609519m562672n038705k531240k6163m48656j619382
4514g536732k34298K007697J533334k45925O95327L268205K561499j524361l710171
4505c185425k026062l75696r44614p05122J967935L495646J451535q46092k56373
4496a424268N83277j677393m586357l721265L129K110706J476178N07793J36360
4487f591840n06367o16839J303573L654969L341980P95204p33816n41511r34018
4478h28665k454277l027222k254409k212345l040461j932860J962736N477270
4470h310233O161579N610137N753012N025472J260833l833952o312525m984128
$$ plain form
4531 2186137 3750438 6599368 8164777 7337045 6320779 7604932 10299616 11630618
4523 11630618 10906136 9299605 6690086 2127414 -2911291 -5442531 -5468694 -5917350 -7536732
4514 -7536732 -7771030 -5763333 -4229999 -4475924 -3780597 -512392 2049107 524746 -3185425
4505 -3185425 -5211487 -5587183 -6531797 -7236919 -5268984 -1773338 -321803 -1167895 -1424268
4496 -1424268 -840991 -2518384 -7104741 -10826006 -10822877 -8712171 -7235993 -6728200 -6591840
4487 -6591840 -7098207 -7715046 -6411473 -2756504 585476 1380680 646864 105353 -828665
4478 -828665 -3282942 -6310164 -8564573 -10776918 -13817379 -15750239 -13787503 -8310233
4470 -8310233 -2148654 3461483 9214495 14239967 15500800 11666848 5354323 370195
4462C70195k154086j19175P47932P97163J02162j054863j905541j650563J23256
4453d743520K918265M919782M266005J435370q59287j048733n95129j337201k526572
4444B428980k333318j037180m12922o24685j99426J026997J417395M89268J39975
4435H95084J832245M133843M274033J247254l361962o738170o604131k987122
4427g308926J037361J771737q77712k909445j188933K509845M154023K860396
4419D8346J233879R33286P49419m91885j739616j675698r30739q02960j046664
4410c722632m52575J134732K626471L041792K253525R42591K51341N76768M84199
4401G136212j588684m119943l442310P15972L429409J045014k944808k425131
$$ plain form
4462 370195 -1783891 -1903066 -1155134 -357971 -255809 -1310672 -3216213 -4866776 -4743520
4453 -4743520 -1825255 3094527 7360532 8795902 7936615 6887882 6292753 4955552 2428980
4444 2428980 95662 -941518 -1354440 -1979125 -2178551 -1151554 265841 755109 895084
4435 895084 2727329 6861172 11135205 12382459 9020497 2282327 -4321804 -7308926
4427 -7308926 -6271565 -4499828 -5377540 -8286985 -9475918 -6966073 -2812050 48346
4419 48346 1282225 2215511 2964930 2473045 733429 -942269 -1873008 -2675968 -3722632
4410 -3722632 -4175207 -3040475 -414004 2627788 4881313 5823904 6075245 6652013 7136212
4401 7136212 5547528 1427585 -2014725 -1298753 2130656 3175670 230862 -2194269
4393b194269K357285N044718K366018j778593k754918j225721k60707j41642N77964
4384A990135J346904N18658j363771k207528j460746j92582R24567J496294M87743
4375A539674k118936l882588k730045j90381R13557Q74055J978744L854323L704318
4366C942721J117564j064744j123618k74809M01509J301555J814217K08511k800360
4357C522546m027959k760671j883500k430282j442591K113971L952471R85442
4349a970573k836411k239925J076404J681419m19475m65279K232373L113990N53283
4340G25806j458542n29981M14082p19433j061212J563691L849416K316716o77128
4331D423415j127562k37950j658793m335690m085778j109633J81432j079951o04119
$$ plain form
4393 -2194269 163016 5207734 7573752 5795159 3040241 1814520 1553813 1412171 1990135
4384 1990135 3337039 3855697 2491926 284398 -1176348 -1368930 -444363 1051931 1539674
4375 1539674 -579262 -4461850 -7191895 -7382276 -6468719 -5594664 -3615920 238403 3942721
4366 3942721 5060285 3995541 2871923 2597114 2998623 4300178 6114395 6322906 3522546
4357 3522546 -505413 -3266084 -5149584 -7579866 -9022457 -6908486 -2956015 -1970573
4349 -1970573 -4806984 -7046909 -5970505 -4289086 -4708561 -5173840 -2941467 172523 725806
4340 725806 -732736 -1262717 -848635 -1568068 -2629280 -1065589 2783827 5100543 4423415
4331 4423415 3295853 3057903 1399110 -2936580 -7022358 -8131991 -7950559 -9030510 -9634629
4322i634629L438701O508209M194910j272355m229121k723416M60295K104441
4314a152965J240934j183710k996046k067233J166952L332269J991146j118505
4306g87158k558821j788566r53938r15188m26856O21950K33138k151650l613550
4297a2340639j419340K712781M398813K176730q99592j448222M49988K423145
4289c946336L098694K899447K590035K432571K252757J287008j275679m408528
4281D929969n051974j824537J970996J871173j451217k826023j99353K277264
4273c03702Q62345j804698j034260K250178K905313l49040l039353j665210J820921
4264c57506L693773L264817K038716N79647j454298l507851m309146l388044j502764
$$ plain form
4322 -9634629 -6195928 312281 4507191 3234836 -994285 -3717701 -3257406 -1152965
4314 -1152965 87969 -1095741 -4091787 -6159020 -4992068 -1659799 331347 -787158
4306 -787158 -3345979 -5134545 -6088483 -7003671 -7430527 -6808577 -6575439 -8727089 -12340639
4297 -12340639 -13759979 -11047198 -6648385 -4471655 -5371247 -6819469 -6369481 -3946336
4289 -3946336 -847642 2051805 4641840 7074411 9327168 10614176 9338497 4929969
4281 4929969 -122005 -1946542 24454 1895627 444410 -2381613 -2580966 -303702
4273 -303702 558643 -1246055 -2280315 -30137 2875176 2526136 -513217 -2178427 -357506
4264 -357506 3336267 6601084 8639800 9219447 7765149 4257298 -51848 -3439892 -4942656
4255d942656n7389k60678j854241k717515j141406J616712K807813K045931J374205
4246c129224J419758M17866k090440l622858k457858l40989N27718R00289K498051
4237e877687M492455M620072K658911M19919q83436j203618n07148Q34164J255865
4228E809497k73969k291130k612960j564671j297829k199404k299950n07640J701393
4219e536663K565202K304226K053591J756553M88773j580295k871899k339203
4211c159715q21928K21643O85260J377965K002072J366184j12336l71583P47700
4202A935262M48235k487395m671746k772590R58954J885805J94143R2138K427909
4193a989285L379964J014276j946230l130116l592246m368161m395157l467515
$$ plain form
4255 -4942656 -5000045 -5260723 -7114964 -9832479 -10973885 -9357173 -6549360 -4503429 -3129224
4246 -3129224 -1709466 -1291600 -3382040 -7004898 -9462756 -9803745 -9276027 -8375738 -5877687
4237 -5877687 -1385232 3234840 5893751 6313670 5430234 4226616 3719468 4553632 5809497
4228 5809497 5535528 3244398 631438 -933233 -2231062 -4430466 -6730416 -7238056 -5536663
4219 -5536663 -2971461 -667235 1386356 3142909 3631682 2051387 -820512 -3159715
4211 -3159715 -3981643 -3760000 -3074740 -1696775 305297 1671481 1559145 1187562 1935262
4202 1935262 2383497 -103898 -4775644 -7548234 -6589280 -4703475 -4509332 -4417194 -1989285
4193 -1989285 1390679 2404955 458725 -2671391 -6263637 -10631798 -15026955 -18494470
4185a8494470k965688k259927R11558N038975N192676Q79903k033090J6707L247569
4176a0465787L270696J295022J19004n01252p96255R62397L561848K271123k667583
4167b950787l969929J228327N365895K120001l616825m777536l383434m090394
4159a4074682l974844J090535O292890M799770p01308l651015m767915p022205
4151b2008774o636053j010880K231628k468068o244770j238601K365093n743696
4143d0754121j3447961q060124q466330l7679478o7924012m1211874M2706850
4136a74837050J05948186Q7816413K2355554j4933557o475225N755520k598565
4129B3031276j1292926l486828O180831K964430l563361j581970K376742l43738
$$ plain form
4185 -18494470 -21460158 -23720085 -22808527 -17769552 -12576876 -11696973 -13730063 -13713356 -10465787
4176 -10465787 -7195091 -5900069 -5781065 -6282317 -7078572 -6116175 -2554327 -283204 -2950787
4167 -2950787 -6920716 -5692389 -326494 1793507 -1823318 -6600854 -9984288 -14074682
4159 -14074682 -18049526 -16958991 -10666101 -5866331 -6567639 -10218654 -14986569 -22008774
4151 -22008774 -28644827 -29655707 -27424079 -29892147 -36136917 -37375518 -35010425 -40754121
4143 -40754121 -54202082 -62262206 -70728536 -108408014 -176332026 -217543900 -174837050
4136 -174837050 -68888864 18927549 41283103 26349546 19874321 25629841 23031276
4129 23031276 11738350 8251522 14432353 17396783 13833422 12251452 14628194 14284456
4121A4284456l856810r68469K966480J432253j406410m81994N97738j342164j747816
4112I477264J710198K853106j631327n150220k919213k01259j524031k254516
4104C60002J301103L742009P95812k152708l01317J390111j689030l868030N83014
4095A60966N801645L770498j802223k221834J559910K341013j10547n33872O36052
4086I601608j416003n525322n733256j694272J201716J270258J750165L251377
4078B706271K832961L43905j297122j714573k599868k668095K87620L360026J559297
4069B810422l565287n206026j313674L066635L812904K051149j483j734381j974882
4060b054623M89839L399210K972514K8028p02941K001684M095881K921789P57028
$$ plain form
4121 14284456 10427646 9459177 12425657 13857910 12451500 11969506 12567244 11225080 9477264
4112 9477264 11187462 14040568 12409241 7259021 4339808 4138549 2614518 360002
4104 360002 1661105 5403114 6198926 4046218 3744901 5135012 3445982 -422048 160966
4095 160966 5962611 9733109 7930886 5709052 7268962 9609975 9499428 8965556 9601608
4086 9601608 8185605 2660283 -3072973 -4767245 -3565529 -2295271 -545106 2706271
4078 2706271 5539232 5883137 4586015 2871442 271574 -2396521 -2108901 1251125 2810422
4069 2810422 -754865 -5960891 -7274565 -4207930 -395026 1656123 1654640 -79741 -2054623
4060 -2054623 -1564784 1834426 4806940 4834968 4132027 6133711 10229592 13151381 13908409
4051A3908409J71867K47316n59981j389556r96377j46780p8979m09351q463J181855
4041A1919960J938903P88286k391323n215695m644875j070063J393046K26108
4033B944347k233673k802499j912169j444255j039903J53004Q00044J6514m1587
4024e560177K013410L378974J697090j05957J325396L241682J143556k958109
4016D175865l431988l45372J299166N02817Q34492K363340J024331l021827m212218
4007h11394q00068J975215O35177j360331m84399J082576N57138j02304J477408
3998B169018K955408J241237j943710l028891k271905k139079k390962j159981
3990f568865O74081M16663j752399k562858k33222L246335M731145L273634O35493
$$ plain form
4051 13908409 14080276 14327592 13767611 12378055 11381678 11234898 11155919 10746568 10738105 11919960
4041 11919960 13858863 14647149 12255826 7040131 2395256 1325193 2718239 2944347
4033 2944347 710674 -2091825 -4003994 -5448249 -6488152 -6335148 -5535104 -5518590 -5560177
4024 -5560177 -3546767 -167793 1529297 1423340 2748736 5990418 7133974 4175865
4016 4175865 743877 398505 1697671 2200488 3034980 5398320 6422651 3400824 -811394
4007 -811394 -1611462 363753 998930 -361401 -845800 236776 793914 691610 2169018
3998 2169018 5124426 6365663 4421953 1393062 -878843 -3017922 -5408884 -6568865
3990 -6568865 -5894784 -5478121 -7230520 -9793378 -10026600 -6780265 -2049120 1224514 1860007
3981A860007q06087o11170n25329j593214k056235j2887K772322K715818j35048
3972A608177j944695q95656M44210k10671j318232o02920J226689K188641K207649
3963B703192K213370J718846l50391l230503m545612k875635N51475K618607J211489
3954A4838j993113k876096m01480J244121j235637m309035k361211L036817M543004
3945d337792L502m322877l463893o16032p56851k448165r20048L861098P254108
3936e746950O660245M019402K040191J115984J80781j322302k668438k536959
3928A741954q82503K64115o22951j856483r61389Q69771M43844j514896q81293
3919c399831K574175L740562K35067l297624k329386P84718J374644k36181q17211
$$ plain form
3981 1860007 1053920 442750 -82579 -1675793 -3732028 -3744915 -972593 1743225 1608177
3972 1608177 -336518 -1232174 -787964 -998635 -2316867 -2919787 -1693098 495543 2703192
3963 2703192 4916562 6635408 6285017 3054514 -1491098 -4366733 -3815258 -1196651 14838
3954 14838 -1978275 -4854371 -5255851 -4011730 -5247367 -9556402 -11917613 -8880796 -4337792
3945 -4337792 -4334290 -8657167 -12121060 -12737092 -13493943 -15942108 -16862156 -13001058 -5746950
3936 -5746950 913295 4932697 6972888 8088872 8269653 6947351 4278913 1741954
3928 1741954 859451 1123566 500615 -1355868 -2317257 -1447486 -1003642 -2518538 -3399831
3919 -3399831 -825656 2914906 3149973 -147651 -2477037 -1692319 -317675 -553856 -1371067
3910a371067l68089q54814j128008J307242M619595M184291k45926l630766k566906
3901e4448P46318K371376J243458j154385l093443l322844j394680J460914K825696
3892c72038J379041j624452l437772k416431J72470J213344n64484k553186j558533
3883i762041J537291L029490K040015J395392K263606J942320j191970m269530
3875c015427m110077j799253k81557M3354M90824J087042J146854J015803R73044
3866d449393L32933n43103J62954K310082L026389J413918M46334J622643J800578
3857F123335j189340l892388k583033M17894P57860q30267q23575M51364K93457
3848a274693m36524J063803L473047K980048Q5742j100378J94759Q67552m4856
$$ plain form
3910 -1371067 -1739156 -2593970 -3721978 -2414736 2204859 6389150 6143224 2512458 -54448
3901 -54448 691870 3063246 4306704 3152319 58876 -3263968 -4658648 -3197734 -372038
3892 -372038 1007003 -617449 -4055221 -6471652 -6299182 -5085838 -5650322 -8203508 -9762041
3883 -9762041 -8224750 -5195260 -3155245 -1759853 503753 2446073 1254103 -3015427
3875 -3015427 -7125504 -8924757 -9206314 -9162960 -8672136 -7585094 -6438240 -5422437 -4449393
3866 -4449393 -4116460 -4659563 -4496609 -2186527 839862 2253780 2700114 4322757 6123335
3857 6123335 4933995 1041607 -1541426 -1123532 -365672 -1195939 -2019514 -1568150 -1274693
3848 -1274693 -1711217 -647414 2825633 5805681 5891423 4791045 4985804 5853356 5808500
3839E808500n05487m67109j958311m016599l271884q5832J506704O44853P59160
3830a586005K918170L824022J881326k78309j001046j906366l171356k140712
3822a460276J000797J768325j370984l571595j088498K658193K796006O50351
3814A382319P89001L378071M525385K695865L32793m35211k47138n10268j191313
3805A0719504j036077P21266K753228K322775j009445l454295j636594J762445
3797A1142807J190777l181725n314713k703465o9212j121471k413676L63529M686395
3788B579246N090595J651718p80252q8572J210694Q09666o85074j752665j795152
3779F240204j168614j128960k720847m431751l091090J210184L912223K085278
$$ plain form
3839 5808500 5303013 4835904 2877593 -1139006 -4410890 -4496722 -2990018 -2345165 -1586005
3830 -1586005 1332165 5156187 7037513 6759204 5758158 3851792 680436 -1460276
3822 -1460276 -459479 1308846 -62138 -3633733 -4722231 -2064038 731968 1382319
3814 1382319 2171320 5549391 10074776 12770641 13103434 12668223 12421085 11910817 10719504
3805 10719504 9683427 10404693 13157921 15480696 14471251 11016956 9380362 11142807
3797 11142807 12333584 9151859 3837146 1133681 1064469 -57002 -2470678 -2107149 2579246
3788 2579246 7669841 9321559 8541307 8452735 9663429 10473095 9788021 8035356 6240204
3779 6240204 5071590 3942630 1221783 -3209968 -6301058 -5090874 -1178651 906627
3771I06627j257197j916803m77204J79068L04237J624376K610351O34962k526321
3762H2096k620665K54673J806115M08295j126304r84627o72685r43333n6616K292425
3752a560626L429790K057302O01245J129060K106071J465145N3721m37631n41691
3743H302386j391549k021227j030487M82174L38599j271947k208420j616742m45399
3734h62612Q53266K726156M521822M376233J827583j163451k649378k760867k483463
3725D385289j799615l85782Q99134Q91639j4367m89234m39061q34498j558800
3716F54705j528244j124185j955693l390068k256717K109159N317287L344337
3708A170581j584531l964042k331544J65082J392754K037169K115740M21782j845980
$$ plain form
3771 906627 -350570 -2267373 -2744577 -2565509 -2261272 -636896 1973455 2608417 82096
3762 82096 -2538569 -2283896 -477781 -69486 -1195790 -2180417 -2853102 -3796435 -3853051 -1560626
3752 -1560626 1869164 3926466 4527711 5656771 7762842 9227987 9281708 8844077 8302386
3743 8302386 6910837 4889610 3859123 4341297 4679896 3407949 1199529 -417213 -862612
3734 -862612 -9346 2716810 7238632 11614865 13442448 12278997 9629619 6868752 4385289
3725 4385289 2585674 2199892 3099026 3990665 3976298 3487064 3048003 2213505 654705
3716 654705 -873539 -1997724 -3953417 -7343485 -9600202 -7491043 -2173756 1170581
3708 1170581 -413950 -4377992 -6709536 -6544454 -5151700 -3114531 -998791 -577009 -2422989
3699b422989j405635J784395L663180K163144P6481j41018j82219j788334k901156
3690a154151j476748K16268r00307l462633l890254j906122m8503P34185J403084
3681a0485181K075586K252347K491873K854858J388826k542292n305352l262954
3673a0532289J499274L774171K353521L58506m98126j362807k327563j667712
3665h403025O19434K401478K853497K834476K012882n46398l139661k988283j029692
3656e385292o55099j552930N6706M239236N952304K801068j015679j279308M05033
3647C566039O26326k06353j57088j47172j677657k758977o01829L212540M416816
3638F272645K077009o52536j281813l63687N34834M42915j199092l789615m776854
$$ plain form
3699 -2422989 -3828624 -2044229 1618951 3782095 3858576 3717558 3535339 1747005 -1154151
3690 -1154151 -2630899 -2414631 -3314938 -6777571 -10667825 -12573947 -12622450 -11888265 -10485181
3681 -10485181 -8409595 -6157248 -3665375 -810517 578309 -1963983 -7269335 -10532289
3673 -10532289 -9033015 -5258844 -2905323 -2546817 -3044943 -4407750 -6735313 -8403025
3665 -8403025 -7783591 -5382113 -2528616 305860 2318742 1772344 -1367317 -4355600 -5385292
3656 -5385292 -6040391 -7593321 -7536615 -3297379 2654925 5455993 4440314 3161006 3566039
3647 3566039 4192365 3986012 3828924 3681752 2004095 -754882 -1356711 1855829 6272645
3638 6272645 8349654 7697118 6415305 6051618 6586452 7029367 5830275 2040660 -2736194
3629b736194k040387K779019N351819L386575j107008m233416l675400j28609
3621b403601L355951L745774R04736k259082l271376k629051j816440n42615J891642
3612c024062L890406L207513Q23086J22226J905308L052340J036071k684130m954203
3603C374555m491106j885295J783683M512100L562295j239591n535129m768405
3595d686893k73466J957840q92167m881710m994121j604881J235075J865783J980982
3586a0293558K495604K192073Q14205J40206Q71005J287747L64745m21360J5181
3577b534152K87440o74091j310302l46076M42491o41233j530755N44087L961513
3568a801078M645421K091615n46622j703484k493196k865975j278268J324314
$$ plain form
3629 -2736194 -4776581 -1997562 3354257 6740832 5633824 1400408 -2274992 -2403601
3621 -2403601 952350 4698124 5602860 3343778 72402 -2556649 -4373089 -4915704 -3024062
3612 -3024062 866344 4073857 4896943 5019169 6924477 9976817 11012888 8328758 3374555
3603 3374555 -1116551 -3001846 -1218163 3293937 6856232 5616641 81512 -4686893
3595 -4686893 -4960359 -3002519 -3894686 -8776396 -13770517 -15375398 -14140323 -12274540 -10293558
3586 -10293558 -7797954 -5605881 -4791676 -4651470 -3780465 -2492718 -2127973 -2549333 -2534152
3577 -2534152 -2246712 -2920803 -4231105 -4577181 -4134690 -4775923 -6306678 -5762591 -1801078
3568 -1801078 2844343 4935958 4389336 2685852 192656 -2673319 -3951587 -2627273
3560b627273J721449l41769j445107l18160J01325j709034k755029p79662J627857
3551f525403J614021R66193K361136L926022K314873j033623j840938m9607J91160
3542A923834k399780l979344j598627K352972L632866J559107r14021j079384
3534e02377R23023K622661J711479j434408l823048l188537p22517O69363J18652
3525c625709p94824q07369k18532M47413J115090J370739P16182j74254j0272
3516a981536J080423J551825O83272o24923j498759k024885k226413j624507l35782
3507g001285P25915J243146J805366K362461J830685L5894j316839p63778Q07009
3498b71426J378701M57258p22811j190245j112565p46378J76429J552840K349557
$$ plain form
3560 -2627273 -905824 -1247593 -2692700 -3010860 -2909535 -4618569 -7373598 -8153260 -6525403
3551 -6525403 -4911382 -3945189 -1584053 2341969 4656842 3623219 1782281 1732674 1923834
3542 1923834 -475946 -4455290 -6053917 -3700945 -68079 1491028 577007 -502377
3534 -502377 420646 3043307 4754786 3320378 -502670 -3691207 -4413724 -3744361 -3625709
3525 -3625709 -4420533 -5227902 -5446434 -4999021 -3883931 -2513192 -1797010 -1971264 -1981536
3516 -1981536 -901113 650712 1333984 709061 -789698 -2814583 -5040996 -6665503 -7001285
3507 -7001285 -6275370 -5032224 -3226858 -864397 966288 1002182 -314657 -1078435 -271426
3498 -271426 1107275 1564533 841722 -348523 -1461088 -2207466 -2031037 -478197 1871360
3489A871360J688590M2559j257071j360204k31135J759612L586408L428471M63691
3480I992281l035468l392791l08317J995502J70496l437809l978365r80509J284263
3471a690717K65063j598488j225611O07645J228251L26841k21242L89394J093148
3462h25716R60913K38931n59640j375364k268450k946386k741826j232502P56704
3453i993336J463868N99404N41714L169277O277139N977184K386367n56520j263009
3444H602088k324333m841477n495145k139164J693642J792689l16386l61328J599038
3435a790376J929039p9381j363126m51351P92853J101032J470651K208639J864221
3426E682201J45607j068670o70472K55249Q01845J596234K806990K994491J179192
$$ plain form
3489 1871360 3559950 3602509 2345438 985234 754099 2513711 6100119 9528590 9992281
3480 9992281 6956813 3564022 3255705 5251207 5421703 1983894 -1994471 -2974980 -1690717
3471 -1690717 -1425654 -3024142 -4249753 -3642108 -2413857 -2087016 -2308258 -1918864 -825716
3462 -825716 135197 374128 -185512 -1560876 -3829326 -6775712 -9517538 -10750040 -9993336
3453 -9993336 -8529468 -7930064 -7388350 -4219073 2058066 8035250 10421617 9865097 8602088
3444 8602088 6277755 1436278 -4058867 -6198031 -4504389 -2711700 -3028086 -3389414 -1790376
3435 -1790376 138663 59282 -1303844 -1755195 -962342 138690 1609341 3817980 5682201
3426 5682201 5827808 4759138 4088666 4343915 5145760 6741994 9548984 12543475 13722667
3417A3722667j417979k629769j482902J028189K467000Q51737k778114m681974
3409E078855k839212K87582J352911P57686R65861J951475J876313R84676Q05681
3400A1221828M33599j953260m461619l357942L50360J518748j072701k682112
3392c099l85193K383260J744253q50594j986091j440827n85035Q65572K951795
3383B694041L381720R42141j608007j507920l68163j035324k469478j696202Q85703
3374g81489K090697P46179j547056l495640m772486m498063k147773O38225J754978
3365a2012428J410288J043103P89506L61707P66239K389583L103470J371685m92604
3356a269451L26830K173453J289480k025016l895358k853800j072449N1895J216082
$$ plain form
3417 13722667 12304688 9674919 8192017 9220206 11687206 12538943 9760829 5078855
3409 5078855 2239643 2527225 3880136 4637822 5603683 7555158 9431471 10416147 11221828
3400 11221828 11655427 9702167 5240548 1882606 2232966 3751714 2679013 -3099
3392 -3099 -388292 1994968 3739221 2888627 902536 -538291 -1123326 -257754 2694041
3383 2694041 6075761 7017902 5409895 3901975 3533812 2498488 29010 -1667192 -781489
3374 -781489 1309208 2055387 508331 -2987309 -7759795 -12257858 -14405631 -13767406 -12012428
3365 -12012428 -10602140 -9559037 -8769531 -8407824 -7641585 -5252002 -2148532 -776847 -1269451
3356 -1269451 -942621 1230832 2520312 495296 -3400062 -6253862 -7326311 -7274416 -6058334
3347f058334K080071J215025k72135O90287L923389N231110K156513k793527n717517
3338D54882n001861r15292M749277P876512N072554j069383l816150j044754K102593
3329H408378J273705j161084j328212l50855j204911k722433j873591L51125N05601
3320A897723j317109k014436j159283j264532k524660k048581R98471L685932
3312c746475L817577K484133J011202j026283l198971l112289j90757K172405
3304a789458Q82869k346367l351922j140936J310790J287546p82362k664279k966055
3295a1560174k043330r63925M0174J746988M102355M962348K378086k005463m073338
3286g416279k336389M19281J565871K053775L529079M639350L216914M61327m57249
$$ plain form
3347 -6058334 -3978263 -2763238 -3035373 -2345086 1578303 6809413 8965926 6172399 454882
3338 454882 -4546979 -5462271 -712994 7163518 12236072 11166689 7350539 6305785 8408378
3329 8408378 9682083 8520999 7192787 6841932 5637021 2914588 1040997 1392122 1897723
3320 1897723 580614 -1433822 -2593105 -3857637 -6382297 -8430878 -7432407 -3746475
3312 -3746475 71102 2555235 3566437 2540154 -658817 -3771106 -3961863 -1789458
3304 -1789458 -906589 -3252956 -6604878 -7745814 -6435024 -5147478 -5929840 -8594119 -11560174
3295 -11560174 -13603504 -14567429 -14527255 -12780267 -8677912 -3715564 -1337478 -3342941 -7416279
3286 -7416279 -9752668 -9333387 -7767516 -5713741 -2184662 2454688 5671602 6132929 5675680
3277E675680Q04281J649039R40831K22198K83944k32332j893401k966577k118633
3268B365030l47144R09736J454908J156504n31897k679296k971579j156846J03838
3259a696746n38482q63404P51696J939822L10142j876092j075584J440965J561536
3250d6147o53439j050862J475674L139575J804590M98349K017748M134822L371357
3241A4691667N08061j179031j147337j532044k939645l580248k497383j101202
3233A222838r82950j786064j848101l33840J535331J572621n46485k178319r77300
3224d322269J277929P42420k459325l636183l49696L526898L080764r72592l894087
3215g006141l218788l73334K427935L734357K493476o85014k693225j285539J507101
$$ plain form
3277 5675680 6479961 8129000 9069831 9292029 9575973 9343641 7450240 4483663 2365030
3268 2365030 2017886 2927622 4382530 5539034 5007137 2327841 -643738 -1800584 -1696746
3259 -1696746 -2235228 -3098632 -2346936 -407114 -96972 -1973064 -3048648 -1607683 -46147
3250 -46147 -699586 -1750448 -274774 2864801 4669391 5167740 7185488 11320310 14691667
3241 14691667 15199728 14020697 12873360 11341316 8401671 4821423 2324040 1222838
3233 1222838 239888 -1546176 -3394277 -3728117 -2192786 -620165 -1166650 -3344969 -4322269
3224 -4322269 -3044340 -2301920 -4761245 -8397428 -8747124 -5220226 -2139462 -3112054 -7006141
3215 -7006141 -10224929 -10598263 -8170328 -4435971 -1942495 -2627509 -5320734 -6606273 -5099172
3206e099172K173523Q98767O29633J850000K150650P50780n28223j024623j939268
3197a37933k666493p33930L122201M037354l08869n518524o010693k217294Q88438
3188i545743O77873q68250q68790J212650L769109M581465K441017j316822l387683
3179c305174j882725J388174L047830J847553o85869k309300j703187R01780L520901
3170H19983L744867J384448j135829j916572j747235j985111k007721o83978J037708
3161b489440J399693Q53490J322558K771046K967847R51391j364317j722372j81299
3152D508597J389366J426298j16109j840024k022883l97035J264699J105336n72280
3143D745965j970741k332268k536795l221977l548249k198018R96703M472117
$$ plain form
3206 -5099172 -2925649 -2026882 -1397249 452751 2603401 3354181 2825958 1801335 -137933
3197 -137933 -2804426 -3538356 -416155 3621199 3312330 -2206194 -8216887 -10434181 -9545743
3188 -9545743 -8867870 -9736120 -10604910 -9392260 -5623151 -1041686 1399331 82509 -3305174
3179 -3305174 -5187899 -3799725 -751895 1095658 409789 -1899511 -3602698 -2700918 819983
3170 819983 4564850 5949298 4813469 2896897 1149662 -835449 -2843170 -3527148 -2489440
3161 -2489440 -1089747 -236257 1086301 3857347 6825194 7776585 6412268 4689896 4508597
3152 4508597 5897963 7324261 7208152 5368128 3345245 2948210 4212909 5318245 4745965
3143 4745965 2775224 442956 -2093839 -5315816 -8864065 -11062083 -10065380 -5593263
3135e593263N787402L790877L80658j134244k57818j21354k540650m531292k723796
3126f943480O46403N62983k612055l051324J422512N497833M464397J340301J471687
3117B799257L639077K367404k538666n022193j906468K465990K810075j04659
3109D509817j888103r81841N02068O68739l70005j787868k746190k153434M03584
3100c843233L546768N141395M238812J328148k394547n015954m461283p80181
3092b240075K898691L417194J115314j107544j488413m91162R45848K121769K031449
3083G203071L62877j186253q10622M06020j21662k182085k778268q91041Q65338
3074H67375M49795p28680p91703m96696j165594j768397o05923J653190K963428
$$ plain form
3135 -5593263 194139 3985016 4365674 3231430 2973612 2852258 311608 -4219684 -6943480
3126 -6943480 -6297077 -5734094 -8346149 -11397473 -9974961 -4477128 -12731 1327570 2799257
3117 2799257 6438334 8805738 6267072 1244879 -661589 1804401 4614476 4509817
3109 4509817 2621714 1639873 2141941 2810680 2440675 652807 -2093383 -4246817 -3843233
3100 -3843233 -296465 4844930 9083742 10411890 8017343 3001389 -1459894 -2240075
3092 -2240075 658616 4075810 5191124 4083580 2595167 2104005 3049853 5171622 7203071
3083 7203071 7565948 6379695 5569073 5975093 5853431 3671346 893078 2037 867375
3074 867375 1317170 588490 -203213 -699909 -1865503 -3633900 -4239823 -2586633 376795
3065C76795K736243J672582K5339j947403l001007k404793j326937r12888l75129
3056e157198J071176K085466J407575M38973P88546R80376r18800k855587j216174
3047c375647K895539M324428J273394k114821j753868J361069L599371L225310
3039I434775J014319j241917j684185K6111J461420J16198k523491k683292k98966
3030C620972O03501j504849k991415r62977K254993L280181K683115K582672K364092
3021A1930285M87927j822405k424357j969676k260206k512601q91569J417172
3013A954570J321165j499342m123639m301424k355453K14034J738931R11163j390013
3004g530008j952111O83189L465677K976782O74533M94473K524987L129413P83739
$$ plain form
3065 376795 3113038 4785620 4810959 2863556 -137451 -2542244 -3869181 -4782069 -5157198
3056 -5157198 -4086022 -2000556 -592981 -154008 634538 1614914 696114 -2159473 -3375647
3047 -3375647 -480108 3844320 5117714 3002893 1249025 2610094 6209465 9434775
3039 9434775 10449094 9207177 7522992 7549103 9010523 9126721 6603230 3919938 3620972
3030 3620972 4224473 2719624 -271791 -1234768 1020225 4300406 6983521 9566193 11930285
3021 11930285 12418212 10595807 8171450 6201774 3941568 1428967 537398 1954570
3013 1954570 3275735 1776393 -2347246 -6648670 -9004123 -8790089 -7051158 -6139995 -7530008
3004 -7530008 -9482119 -8798930 -5333253 -2356471 -1681938 -1187465 1337522 4466935 5250674
2995E250674k279329m164161n083105m787325k176507J733156L963879L618345
2987c924373K663290K121158R39967n97079j83071K308670L513201J429734j511973
2978F759524k297765j379733p05269m25716m6079m43487k018647k807341j210132
2969d574645J016513J293701L62786Q62031K641707K778645L69930j631555m53357
2960B665756K534719L319724j1319n066962p684785o118385k251272J201950L562645
2951g847929N360111N855148L620458m89526l317138l133265j513761o31220n35122
2942b632244k69407N6610j56638n96978o42416m51389l30895Q3633J073683K174471
2932a691570K974839L481793L151804J094416j979255l732760l200791k116400
$$ plain form
2995 5250674 2971345 -1192816 -6275921 -11063246 -13239753 -11506597 -7542718 -3924373
2987 -3924373 -1261083 860075 1800042 1202963 1019892 3328562 6841763 8271497 6759524
2978 6759524 4461759 3082026 2376757 1951041 1904962 1461475 -557172 -3364513 -4574645
2969 -4574645 -3558132 -2264431 -1901645 -1039614 1602093 4380738 4750668 3119113 2665756
2960 2665756 5200475 8520199 8508880 3441918 -4242867 -10361252 -12612524 -11410574 -7847929
2951 -7847929 -2487818 3367330 6987788 6498262 3181124 47859 -1465902 -2097122 -2632244
2942 -2632244 -2901651 -2845041 -3001679 -3598657 -4241073 -4692462 -5023357 -4939724 -3866041 -1691570
2932 -1691570 1283269 4765062 7916866 9011282 7032027 3299267 98476 -2017924
2924b017924k078095k252492j384253j74871K89167P82417K321998L644088K829518
2915A959553O24140l88023M09586J023050J04685j140297q27667J073156K582895
2906E421078J681086j408342l822606k896270L99276K368804J373094m19332r36620
2897A760168j127635k147483k453131n93860J456209J273370M16081J808256L997069
2888D389044K726385j987704n125802l798628p29136P74733J150648J782784J689817
2879H72141k3000j325798k33648J407086N42052j968272k430287j86463J113463
2870b232726r89859l793714k894906J780450N548899M541305Q8385l242856k977010
2861d172032p44929O82652N95245l2628m47524k65397J089355L347008M528960
$$ plain form
2924 -2017924 -4096019 -6348511 -7732764 -7907635 -7618468 -6836051 -4514053 -869965 1959553
2915 1959553 2583693 2195670 2605256 3628306 3732991 2592694 1765027 2838183 5421078
2906 5421078 7102164 5693822 1871216 -1025054 -625778 1743026 3116120 2696788 1760168
2897 1760168 632533 -1514950 -3968081 -4561941 -3105732 -1832362 -1416281 391975 4389044
2888 4389044 7115429 5127725 1923 -3796705 -4525841 -3751108 -2600460 -817676 872141
2879 872141 849141 -476657 -710305 696781 1238833 -729439 -3159726 -3346189 -2232726
2870 -2232726 -3222585 -7016299 -9911205 -8130755 -2581856 1959449 2047834 -1195022 -4172032
2861 -4172032 -4916961 -4234309 -3639064 -3671692 -4119216 -4384613 -3295258 51750 4580710
2852D580710K993480L024j580871j061055n58552j746421l611613l970897k088365
2843g040560N43930J435476m50878k792016j724732L014708O455204M329187q77603
2834B892716l152423j196116O79487l09876k017499k069910j460242j472895r74145
2825i080903P19522J635277M89929p21289j56535P39153L58550K46437J992563
2816c777296L555501K468084M08695N48182K257737K625652J533213P69783l59617
2807A0029934l482767o214676m399405O73707K987389O48880j578073l19074J439614
2798b14471L73082j257927J08025K918516L133984Q87173j86626R13473J400130
2789H075359n07463l165158m222361l128117o44751J981971L175635K190106K25991
$$ plain form
2852 4580710 7574190 7577214 5996343 4935288 4376736 2630315 -981298 -4952195 -7040560
2843 -7040560 -6496630 -5061154 -5512032 -8304048 -10028780 -7014072 -558868 3770319 2892716
2834 2892716 -259707 -1455823 -776336 -1086212 -3103711 -5173621 -6633863 -8106758 -9080903
2825 -9080903 -8361381 -6726104 -6236175 -6957464 -7113999 -6374846 -6016296 -5769859 -3777296
2816 -3777296 -221795 2246289 2654984 3203166 5460903 8086555 9619768 10389551 10029934
2807 10029934 6547167 332491 -4066914 -3393207 -405818 243062 -1335011 -1654085 -214471
2798 -214471 158611 -1099316 -991291 1927225 5061209 5948382 5761756 6675229 8075359
2789 8075359 7567896 4402738 180377 -2947740 -3592491 -1610520 1565115 3755221 3981212
2780C981212j063380j781530k822161l357269j674599J524349L140133J615092
2772d38153j173272k725085k753720k198142j148950O64543K344412K446177R33843
2763d048347o05039p66790K58069J071797N08722j183089k370225j534953R69765
2754g700090L004246K863623J133683j26025J59619J041614J018207n9611r69414
2745C65852o87767N57103J762766K165363J639537N70942l90685q27214j026248
2736D129649j504720j913650j247283M51648J719047J809404J816369K228944
2728G489408J015730l235328p413258o808837j953462J568000J212412R14556
2720g210779L939215O794010M710195j41030j664937N75550J072080k294840m927313
$$ plain form
2780 3981212 2917832 1136302 -1685859 -5043128 -6717727 -5193378 -2053245 -438153
2772 -438153 -1611425 -4336510 -7090230 -9288372 -10437322 -9772779 -7428367 -4982190 -4048347
2763 -4048347 -4653386 -5420176 -5162107 -4090310 -3581588 -4764677 -7134902 -8669855 -7700090
2754 -7700090 -4695844 -1832221 -698538 -824563 -664944 376670 1394877 1335266 365852
2745 365852 -321915 235188 1997954 4163317 5802854 6373796 5983111 5155897 4129649
2736 4129649 2624929 711279 -536004 -84356 1634691 3444095 5260464 7489408
2728 7489408 8505138 5269810 -2143448 -8952285 -10905747 -9337747 -8125335 -7210779
2720 -7210779 -3271564 3522446 8232641 8091611 6426674 7002224 8074304 5779464 852151
2711H52151l255933j65651L37971p95403o81848K13886J37727M02192K861685
2702i3223N073360L136643j608288l881710k361788j109830k283926k666519K83465
2693e511816L473720K785968m89841j723046L15614K426098J928841m33572k318218
2684D53748k089161M64408L581068M051365N23562l923901m804874j791191J087433
2675b447543R22383r94082k109305j850469o77039J483010L859883L978759O62544
2666B828141l339962m159069j540638J388656K448939K127431J299317r7047j618020
2657f62252j883878n96677P30194J006050J005484J621366K152571J541514J72660
2648E087032p61355q07790k06546P32967J277963M39968j372524k042022m45336
$$ plain form
2711 852151 -2403782 -2569433 -2231462 -3026865 -3708713 -3494827 -3357100 -2954908 -93223
2702 -93223 4980137 8116780 6508492 2626782 264994 -844836 -3128762 -5795281 -5511816
2693 -5511816 -2038096 747872 258031 -1465015 -1149401 1276697 3205538 2771966 453748
2684 453748 -1635413 -1171005 2410063 6461428 6984990 3061089 -1743785 -3534976 -2447543
2675 -2447543 -1525160 -2519242 -4628547 -6479016 -7156055 -5673045 -1813162 2165597 2828141
2666 2828141 -511821 -4670890 -6211528 -4822872 -2373933 -246502 1052815 955768 -662252
2657 -662252 -2546130 -3142807 -2412613 -1406563 -401079 1220287 3372858 4914372 5087032
2648 5087032 4325677 3517887 3311341 4044308 5322271 5762239 4389715 2347693 1902357
2639A902357J634391J837293L99704p75228j189240j729376k339208k172868j695277
2630d127452k003732k112570J78712M163352N933813L504499l06221j761520p85565
2621B683316K40624L32470K24364J21733m80859j292014j440123q66854j20545
2612e97888O52406J245131Q11763p66004j878119j253977j24397l92951j486091
2603c790127j295592K75516J244654R90226J186445K720865L910400K817003j96891
2594G862499l091747m195328l149273r61373N54196M78541K1840R16802K834605
2585A270762L922059L541321K492801Q73453j643171l375375j806280J848821
2577G124391K722996j052141m946564m165960n07292P49319r39918r86606K495594
$$ plain form
2639 1902357 3536748 5374041 5773745 4998517 3809277 2079901 -259307 -2432175 -4127452
2630 -4127452 -6131184 -8243754 -8065042 -3901690 2032123 5536622 5230401 3468881 2683316
2621 2683316 2923940 3256410 3480774 3602507 3121648 1829634 389511 -477343 -597888
2612 -597888 54518 1299649 2111412 1345408 -532711 -1786688 -1911085 -2304036 -3790127
2603 -3790127 -5085719 -4810203 -3565549 -2575323 -1388878 1331987 5242387 8059390 7862499
2594 7862499 4770752 575424 -2573849 -3535222 -2981026 -2502485 -2480645 -1563843 1270762
2585 1270762 5192821 8734142 11226943 12100396 10457225 7081850 5275570 7124391
2577 7124391 9847387 8795246 3848682 -317278 -824570 -75251 -1015169 -2001775 493819
2568D93819N177995K877325j998879l615553o79255K287313J668842n88971q10872
2559D811764L89484p15035m362644n825776k099714L231125M770794K564965P16284
2550C481247L26068j261435m245482m749664j146434K660690K996170J532937
2542d05903J454099K043209J027723n61471l26580P76684K94754o41293R55196
2533D616418L855050L481507q21312m325377l877152j830153j263107j344001
2525a508127L2532K174970K947269J998173K54844j954088m073758m327167j871089
2516f326441J257422K469925J960273J735194K108794J347275j228086l602019
2508b77663l227866p2414L115174L615292J576734m96383j148521j574028k863631
$$ plain form
2568 493819 5671814 8549139 6550260 2934707 2255452 4542765 6211607 5622636 4811764
2559 4811764 5201248 4486213 123569 -5702207 -7801921 -4570796 199998 2764963 3481247
2550 3481247 3807315 2545880 -1699602 -6449266 -7595700 -4935010 -1938840 -405903
2542 -405903 1048196 3091405 4119128 3557657 3231077 4007761 4302515 3661222 4616418
2533 4616418 8471468 11952975 11131663 6806286 2929134 1098981 -164126 -1508127
2525 -1508127 -1475595 699375 3646644 5644817 5899661 3945573 -128185 -4455352 -6326441
2516 -6326441 -5069019 -2599094 -638821 1096373 3205167 4552442 3324356 -277663
2508 -277663 -3505529 -3577943 -462769 3152523 4729257 4232874 3084353 1510325 -1353306
2499a353306l289596o68516L437815M848402K267565j034231j637627L38870K592549
2490E501925L243928J372803k495935n466327m358246J11948L607075L609041
2482E126212J896366N97455q05089k696294l147785j366703k56937k158374m564180
2473g375329l756146n85605J340869J532264K316467L740747L392679J191392
2465A797338m9054N42462M78444j549253l283963k655501r45320l26737n76915
2456f568499k18565P74046J365109J475221J845492K327067J701501n58392k953513
2447h10533k995238j18711K741573J983889j747771l468553j71421M732855N707248
2438E853338K249499j310838k190205j751383j817352k000510j593677j156432
$$ plain form
2499 -1353306 -4642902 -5311418 -1873603 2974799 5242364 4208133 2570506 2909376 5501925
2490 5501925 8745853 10118656 7622721 2156394 -2201852 -2089904 1517171 5126212
2482 5126212 7022578 7620033 6814944 4118650 970865 -395838 -652775 -2811149 -7375329
2473 -7375329 -11131475 -11717080 -10376211 -8843947 -6527480 -2786733 605946 1797338
2465 1797338 1748284 2290746 2769190 1219937 -2064026 -4719527 -5664847 -5991584 -6568499
2456 -6568499 -6787064 -6013018 -4647909 -3172688 -1327196 999871 2701372 2142980 -810533
2447 -810533 -3805771 -3924482 -1182909 800980 -946791 -4415344 -4586765 146090 5853338
2438 5853338 8102837 6791999 4601794 2850411 1033059 -967451 -2561128 -3717560
2430c717560r94493l97011M90755J18840j996375l980421l819982j560189J291184
2421a4565252L280390L730818L272917L447107M373665L773320M65045k568170
2413E209840k008361M0154j275328n363304o146132j392954L519282L722004J512678
2404b182121J307614K592789K442840J323652J312073J356860m02364j724915
2396F026428P31725M771649M766227J75858l546736l205425j806088k710213m452044
2387G51381l842516q80448J960653L025877K028343p09411l712154m662168k883988
2378h924431k77222J347798K378690L658676M225658K552763p25318k935797k291798
2369i90981O2765J210516k78782k436526k114756O95240K456738J077130q32995
$$ plain form
2430 -3717560 -4712053 -5109064 -4618309 -4499469 -6495844 -10476265 -14296247 -15856436 -14565252
2421 -14565252 -11284862 -7554044 -4281127 -834020 3539645 7312965 7778010 5209840
2413 5209840 3201479 3241633 1966305 -3396999 -9543131 -10936085 -7416803 -3694799 -2182121
2404 -2182121 -874507 1718282 4161122 5484774 6796847 8153707 7751343 6026428
2396 6026428 6758153 11529802 16296029 16471887 12925151 9719726 7913638 5203425 751381
2387 751381 -3091135 -3971583 -2010930 1014947 3043290 2333879 -1378275 -6040443 -8924431
2378 -8924431 -9201653 -7853855 -5475165 -1816489 2409169 4961932 4236614 1300817 -990981
2369 -990981 -928216 282300 3518 -2433008 -4547764 -3852524 -1395786 -318656 -1151651
2360a151651K3554K322002K266023j56824j216245M77328K247199K251674J710723
2351H773783J018979j776799o350051q216311m684606P80499L583354M207606
2343b663546N474388O498896M337821L7551k114486j043073L585r46926k098253
2334G485957j772581r86312q86244p98079k04381K8818l20257l3580J114608J475740
2324E103689K48186j197556j798062k155146k241173n30826K825539M675702L022986
2315G953339J71880q31524p04552j829316l496760k939521k46616J434885N91023
2306A02838r85837j520057j290690p79953M15882J877749J999919M75762q58471
2297e62858o93631P7411K33235j53521q60391k170121l260562k195940R12171
$$ plain form
2360 -1151651 -1128097 1193905 3459928 3303104 2086859 2564187 4811386 7063060 8773783
2351 8773783 9792762 8015963 1665912 -6550399 -11235005 -10454506 -6871152 -2663546
2343 -2663546 2810842 9309738 13647559 13685110 11570624 10527551 10531136 9584210 7485957
2334 7485957 5713376 4727064 3840820 3042741 2838360 2867178 2546921 2513341 3627949 5103689
2324 5103689 5351875 4154319 2356257 201111 -2040062 -2570888 254651 4930353 7953339
2315 7953339 8125219 7293695 6589143 4759827 1263067 -1676454 -1923070 -488185 102838
2306 102838 -882999 -2403056 -3693746 -4473699 -4057817 -2180068 -180149 295613 -562858
2297 -562858 -1256489 -1179078 -945843 -1099364 -1959755 -4129876 -7390438 -9586378 -8674207
2288h674207K889015J600426q21051j049993Q29503K258083K254328J731190Q69961
2279A887255p32801j844384o38876K054996L388279K495680J136621K89467q08711
2270G227526j872675j277808M30882K24466k579799m543891l336920j419615j608989
2261h756823k111667Q9696L301081L344451N64756l96450K082255M287909L233389
$$ plain form
2288 -8674207 -5785192 -4184766 -5005817 -6055810 -5226307 -2968224 -713896 1017294 1887255
2279 1887255 1154454 -689930 -1328806 726190 4114469 6610149 7746770 8036237 7227526
2270 7227526 5354851 4077043 4507925 4732391 2152592 -2391299 -5728219 -7147834 -8756823
2261 -8756823 -10868490 -10778794 -7477713 -4133262 -3568506 -3964956 -1882701 2405208 5638597
$$ [...]
##END NTUPLES=NMR SPECTRUM
##END=
