##TITLE=31Pdec_DE-76k-d3Cl
 CDCl3, 64 sc
 27.11.2024
##JCAMPDX= 6.0         $$ Bruker NMR JCAMP-DX V2.0
##DATA TYPE= NMR SPECTRUM
##DATA CLASS= NTUPLES
##ORIGIN= UXNMR, Bruker Analytische Messtechnik GmbH
##OWNER= root
$$ XWIN-NMR		Version 3.5
$$ Wed Nov 27 14:07:12 2024 Russian Standard Time (UT+4h)  she@DPX200
##.OBSERVE FREQUENCY= 81.013821
##.OBSERVE NUCLEUS= ^31P
##.ACQUISITION MODE= SIMULTANEOUS
##.ACQUISITION SCHEME= undefined
##.AVERAGES= 64
##.DIGITISER RES= 17
##SPECTROMETER/DATA SYSTEM= spect
##.PULSE SEQUENCE= zgpg30
##.SOLVENT NAME= DMSO
##.SHIFT REFERENCE= (INTERNAL, DMSO, 0, 198.062)
##AUDIT TRAIL= $$ (NUMBER, WHEN, WHO, WHERE, WHAT)
$$ ##TITLE= Audit trail, XWIN-NMR		Version 3.5
$$ ##JCAMPDX= 5.01
$$ ##ORIGIN= Bruker BioSpin GmbH
$$ ##OWNER= she
$$ F:/spectra/data/she/nmr/P31/2/pdata/1/auditp.txt
$$ ##AUDIT TRAIL=  $$ (NUMBER, WHEN, WHO, WHERE, WHAT)
(   1,<2024-11-27 14:06:11.54 +0400>,<she>,<DPX200>,
      <created by zg, POWCHK disabled, PULCHK disabled
       configuration hash MD5:
       00 E9 B6 7A A2 85 ED C7 34 08 36 98 17 FE 4E 26
       data hash MD5: 32K
       A2 46 DF E2 41 8B F1 A0 59 8D A4 EA BE 2A 86 E3>)
(   2,<2024-11-27 14:06:14.06 +0400>,<she>,<DPX200>,
      <Start of raw data processing
       efp BC_mod = 2 LB = 1.5 FT_mod = 6 PKNL = 1 PHC0 = 2332.608 PHC1 = -58.31174 SI = 64K 
       data hash MD5: 64K
       FE D1 2D 0D 72 08 4B 0B 32 45 FB 55 E4 B7 41 97>)
(   3,<2024-11-27 14:06:33.56 +0400>,<she>,<DPX200>,
      <pk PHC0 = -97.39721 PHC1 = 268.6 
       data hash MD5: 64K
       7A 32 A6 25 CD A6 FC FE E0 BE 80 16 DB 6A 52 25>)
$$ ##END=
$$ 
$$ hash MD5
$$ 51 94 65 91 3F 8A 50 A3 DE 55 B2 AD A6 3D DF A7
##$RELAX= 
##$RELAX= 
##$RELAX= 
##$RELAX= 
##$RELAX= 
##$RELAX= 
##$RELAX= 
##$RELAX= 
$$ Bruker specific parameters
$$ --------------------------
##$DU= <F:/spectra>
##$EXPNO= 2
##$NAME= <P31>
##$PROCNO= 1
##$TYPE= <nmr>
##$USER= <she>
##$AMP= (0..31)
100 100 100 100 100 100 100 100 100 100 100 100 100 100 100 100 100 100 
100 100 100 100 100 100 100 100 100 100 100 100 100 100 
##$AQSEQ= 0
##$AQ_mod= 1
##$AUNM= <au_zg>
##$AUTOPOS= <>
##$BF1= 81.014009
##$BF2= 200.13
##$BF3= 200.13
##$BF4= 200.13
##$BF5= 200.13
##$BF6= 200.13
##$BF7= 200.13
##$BF8= 200.13
##$BYTORDA= 1
##$CFDGTYP= 0
##$CFRGTYP= 5
##$CHEMSTR= <none>
##$CNST= (0..31)
1 1 145 1 1 1 1 1 1 1 1 1 1 1 1 1 1 1 1 1 1 1 1 1 1 1 1 1 1 1 1 1 
##$CPDPRG= <waltz16>
##$CPDPRG1= <>
##$CPDPRG2= <waltz16>
##$CPDPRG3= <>
##$CPDPRG4= <mlev>
##$CPDPRG5= <mlev>
##$CPDPRG6= <mlev>
##$CPDPRG7= <mlev>
##$CPDPRG8= <mlev>
##$CPDPRGB= <>
##$CPDPRGT= <>
##$D= (0..31)
0 1 0 0 0 0 0 0 0 0.06 0 0.03 2e-05 3e-06 0 0 0.0002 0 0 0 0 0 0 0 0 0 
0 0 0 0 0 0 
##$DATE= 1732701970
##$DBL= (0..7)
120 120 120 11 120 120 24 19 
##$DBP= (0..7)
150 150 150 150 150 150 150 150 
##$DBP07= 0
##$DBPNAM0= <>
##$DBPNAM1= <>
##$DBPNAM2= <>
##$DBPNAM3= <>
##$DBPNAM4= <>
##$DBPNAM5= <>
##$DBPNAM6= <>
##$DBPNAM7= <>
##$DBPOAL= (0..7)
0.5 0.5 0.5 0.5 0.5 0.5 0.5 0.5 
##$DBPOFFS= (0..7)
$$ [...]
##$SUBNAM3= <"">
##$SUBNAM4= <"">
##$SUBNAM5= <"">
##$SUBNAM6= <"">
##$SUBNAM7= <"">
##$SUBNAM8= <"">
##$SUBNAM9= <"">
##$SW= 400.765351723535
##$SWIBOX= (0..15)
0 1 3 0 0 0 0 0 0 0 0 0 0 0 0 0 
##$SW_h= 32467.5324675325
##$TD= 32768
##$TD0= 1
##$TE= 0
##$TE2= 300
##$TE3= 300
##$TEG= 300
##$TL= (0..7)
0 120 53 12 22 120 120 120 
##$TP= (0..7)
150 150 150 150 150 150 150 150 
##$TP07= 0
##$TPNAME0= <>
##$TPNAME1= <>
##$TPNAME2= <>
##$TPNAME3= <>
##$TPNAME4= <>
##$TPNAME5= <>
##$TPNAME6= <>
##$TPNAME7= <>
##$TPOAL= (0..7)
0.5 0.5 0.5 0.5 0.5 0.5 0.5 0.5 
##$TPOFFS= (0..7)
0 0 0 0 0 0 0 0 
##$TUNHIN= 0
##$TUNHOUT= 0
##$TUNXOUT= 0
##$USERA1= <user>
##$USERA2= <user>
##$USERA3= <user>
##$USERA4= <user>
##$USERA5= <user>
##$V9= 5
##$VALIST= <valist>
##$VCLIST= <CCCCCCCCCCCCCCC>
##$VD= 0
##$VDLIST= <DDDDDDDDDDDDDDD>
##$VPLIST= <PPPPPPPPPPPPPPP>
##$VTLIST= <TTTTTTTTTTTTTTT>
##$WBST= 1024
##$WBSW= 4
##$XGAIN= (0..3)
0 0 0 0 
##$XL= 0
##$YL= 0
##$YMAX_a= 6260
##$YMIN_a= -12578
##$ZGOPTNS= <>
##$ZL1= 120
##$ZL2= 120
##$ZL3= 120
##$ZL4= 120
##$ABSF1= 0
##$ABSF2= 0
##$ABSG= 0
##$ABSL= 0
##$ALPHA= 0
##$AQORDER= 0
##$ASSFAC= 0
##$ASSFACI= 0
##$ASSFACX= 0
##$ASSWID= 0
##$AUNMP= <proc_1d>
##$AZFE= 0.1
##$AZFW= 0.5
##$BCFW= 0
##$BC_mod= 2
##$BYTORDP= 0
##$COROFFS= 0
##$CY= -3
##$DATMOD= 1
##$DC= 0
##$DFILT= <>
##$DTYPP= 0
##$F1P= 0
##$F2P= 0
##$FCOR= 1
##$FTSIZE= 65536
##$FT_mod= 6
##$GAMMA= 0
##$GB= 0
##$INTBC= 1
##$INTSCL= 9.790993e-09
##$ISEN= 30
##$LB= 1.5
##$LEV0= 0
##$LPBIN= 0
##$MAXI= 10000
##$MC2= 0
##$MEAN= 0
##$ME_mod= 0
##$MI= 50
##$NCOEF= 0
##$NC_proc= -8
##$NLEV= 6
##$NOISF1= 182.463
##$NOISF2= 159.3651
##$NSP= 0
##$NTH_PI= 0
##$NZP= 0
##$OFFSET= 198.0616
##$PC= 4
##$PHC0= 2235.211
##$PHC1= 210.2883
##$PH_mod= 1
##$PKNL= yes
##$PPARMOD= 0
##$PSCAL= 0
##$PSIGN= 0
##$REVERSE= no
##$SF= 81.0140089999434
##$SI= 65536
##$SIGF1= 159.3651
##$SIGF2= -187.1042
##$SINO= 113.3802
##$SIOLD= 16384
##$SREGLST= <1H.CDCl3>
##$SSB= 0
##$STSI= 65536
##$STSR= 0
##$SW_p= 32467.5324675325
##$SYMM= 0
##$S_DEV= 0
##$TDeff= 32768
##$TDoff= 0
##$TI= <>
##$TILT= no
##$TM1= 0
##$TM2= 0
##$TOPLEV= 0
##$USERP1= <user>
##$USERP2= <user>
##$USERP3= <user>
##$USERP4= <user>
##$USERP5= <user>
##$WDW= 1
##$XDIM= 65536
##$YMAX_p= 130286840
##$YMIN_p= -260340682
$$ End of Bruker specific parameters
$$ ---------------------------------
##NTUPLES= NMR SPECTRUM
##VAR_NAME=  FREQUENCY,     SPECTRUM/REAL,   SPECTRUM/IMAG
##SYMBOL=    X,             R,               I
##VAR_TYPE=  INDEPENDENT,   DEPENDENT,       DEPENDENT
##VAR_FORM=  AFFN,          ASDF,            ASDF
##VAR_DIM=   65536,         65536,           65536
##UNITS=     HZ,            ARBITRARY UNITS, ARBITRARY UNITS
##FACTOR=    0.49542278885378, 1,            1
##FIRST=     16045.7642231865, 0,            0
##LAST=      -16421.768244346, 0,            0
##MIN=       -16421.768244346, -260340682,   0
##MAX=       16045.7642231865, 130286840,    0
$$ Real data points
##PAGE= N=1
##DATA TABLE= (X++(R..R)), XYDATA
$$ [...]
$$ plain form
7499 6075423 5380091 3410613 1374001 167037 57251 786765 1747293 2490657 3091507
7490 3091507 3498954 2802600 204697 -3223051 -5051873 -4353542 -3025013 -3542351 -6227047
7481 -6227047 -9419130 -11412064 -11260240 -8571027 -3939741 662108 3195799 3357587 2257595
7472 2257595 508116 -2179851 -5326438 -6925074 -5320801 -1336739 2397021 4268540
7464 4268540 5201182 7054700 9937645 11750266 10496531 6478754 1822393 -1606879
7456 -1606879 -3101062 -2502135 -86763 2778825 4248448 4024640 3846842 5160385 7106506
7447 7106506 7725912 6470219 4532192 3239751 3129878 4082035 5213863 5054663 3116918
7438 3116918 1086490 1087370 2767773 3550895 2082390 -7248 -494231 496102 1107032
$$ packed form
7499F075423o95332j969478k036612j206964j09786P29514R60528P43364O00850
7490C091507M07447o96354k597903l427748j828822O98331J328529n17338k684696
7481f227047l192083j992934J51824K689213M631286M601849K533691J61788j099992
7472B257595j749479k687967l146587j598636J604273L984062L733760J871519
7464D268540R32642J853518K882945J812621j253735m017777m656361l429272
7456a606879j494183N98927K415372K865588J469623k23808j77798J313543J946121
7447G106506O19406j255693j938027j292441j09873R52157J131828j59200j937745
7438C116918k030428Q80J680403P83122j468505k089638m86983R90333O10930
$$ plain form
7429 1107032 746650 1178162 4197563 8722988 10992878 8327744 2547592 -1500106 -1425793
7420 -1425793 -103135 -1722685 -6186856 -9558143 -9526234 -7723076 -6297791 -5135978 -3820934
7411 -3820934 -3648252 -5407319 -7152614 -6875257 -5937266 -6759401 -8013654 -5822912 12363
7402 12363 4683249 4633369 1970767 540447 389702 -789411 -2609346 -2281588 320609
7393 320609 1574226 -857295 -4657110 -6094480 -4608829 -2380171 -835587 364693
7385 364693 1628298 2612668 2891394 2135708 97671 -2286588 -2553260 650255 5059878
7376 5059878 7112431 6547025 6079809 6338395 4572137 -15629 -3049728 -338387 5588122
7367 5588122 8042640 4514505 -1145129 -4715867 -5926629 -5798960 -3439921 1832173
$$ packed form
7429A107032l60382M31512L019401M525425K269890k665134n780152m047698P4313
7420a425793J322658j619550m464171l371287L1909J803158J425285J161813J315044
7411c820934J72682j759067j745295K77357R37991q22135j254253K190742N835275
7402A2363M670886m9880k662602j430320j50745j179113j819935L27758K602197
7393C20609J253617k431521l799815j437370J485651K228658J544584J200280
7385C64693J263605R84370K78726p55686k038037k384259k66672L203515M409623
7376E059878K052553n65406m67216K58586j766258m587766l034099K711341N926509
7367E588122K454518l528135n659634l570738j210762J27669K359039N272094
$$ plain form
7359 1832173 7272704 8623855 4908607 -477204 -3352589 -2395964 378779 1795324
7351 1795324 400962 -2238969 -3474134 -2854054 -2390636 -3288370 -4130267 -3333605 -1689193
7342 -1689193 -763362 -146150 1530203 3635477 4023715 2416225 1115677 1867041 3733624
7333 3733624 4762207 4393933 3424659 2494572 1377735 -583754 -3530253 -6265125 -6773075
7324 -6773075 -4326102 -644785 2059912 3729222 5817482 8456600 10041796 9657783
7316 9657783 8100171 6188619 3868998 1465288 -56255 -820772 -2203929 -4353849
7308 -4353849 -5491930 -4870334 -4325141 -5158008 -5594247 -3875306 -2147892 -3888214 -8159463
7299 -8159463 -10105312 -7604481 -4058918 -3289452 -4584264 -4731431 -2587525 769207 4612948
$$ packed form
7359A832173N440531J351151l715248n385811k875385R56625K774743J416545
7351A795324j394362k639931j235165O20080M63418q97734q41897P96662J644412
7342a689193R25831O17212J676353K105274L88238j607490j300548P51364J866583
7333C733624J028583l68274r69274r30087j116837j961489k946499k734872n07950
7324f773075K446973L681317K704697J669310K088260K639118J585196l84013
7316I657783j557612j911552k319621k403710j521543p64517j383157k149920
7308d353849j138081O21596N45193q32867m36239J718941J727414j740322m271249
7299h159463j945849K500831L545563P69466j294812j47167K143906L356732L843741
$$ plain form
7290 4612948 8432718 10221886 7937919 2634310 -2428940 -5969096 -9379039 -12777550
7282 -12777550 -13370828 -9379009 -3171260 1647193 4323486 5758151 5237423 1886288
7274 1886288 -1682822 -1434810 1933151 2940765 -1067202 -5880414 -6300893 -2904675 96550
7265 96550 1092580 1333222 753216 -1951080 -5494992 -6603559 -5041838 -4240247 -5869368
7256 -5869368 -7435150 -6846391 -5815661 -6278636 -6472182 -3811583 352882 2302462 1231676
7247 1231676 -189163 -604 1281022 2946829 5117202 6869519 6031218 2208797 -1767874
7238 -1767874 -2892850 -1427834 -121273 -743758 -2510712 -3540750 -2817609 -600858 2347526
7229 2347526 5323189 7533388 8157409 7346931 6825432 8193586 10435756 10724365 8560917
$$ packed form
7290D612948L819770J789168k283967n303609n063250l540156l409943l398511
7282a2777550n93278L991819O207749M818453K676293J434665n20728l351135
7274A886288l569110K48012L367961J007614m007967m813212m20479L396218L001225
7265I6550R96030K40642n80006k704296l543912j108567J561721Q01591j629121
7256e869368j565782N88759J030730m62975j93546K660599M164465J949580j070786
7247A231676j420839J88559J281626J665807K170373J752317q38301l822421l976671
7238a767874j124976J465016J306561o22485j766954j030038P23141K216751K948384
7229B347526K975663K210199O24021q10478n21499J368154K242170K88609k163448
$$ plain form
7220 8560917 7321670 9858666 13979738 14996934 12259248 10021246 11136454 12876164
7212 12876164 10931069 5470765 633690 -1073181 -1218582 -2211190 -3945048 -4643348 -3455797
7203 -3455797 -849168 2686068 6805220 10468850 12409643 12718345 12791752 13296469 13407591
7194 13407591 12716956 12397043 13048614 12692607 9151261 3924326 1179816 2569630 5304917
7185 5304917 5986812 4124794 1039000 -2238858 -4489307 -4076394 -1265933 1044268 986735
7176 986735 339922 1236685 2275993 1028304 -1125480 -463455 3285089 6298614 5930362
7167 5930362 3237925 -61155 -3697785 -7104047 -8842564 -8989190 -9158806 -8995832 -5805970
7158 -5805970 634128 6015916 6629710 4082215 2400609 2615792 2999360 2872650 2954587
$$ packed form
7220H560917j239247K536996M121072J017196k737686k238002J115208J739710
7212A2876164j945095n460304m837075j706871j45401r92608j733858o98300J187551
7203c455797K606629L535236M119152L663630J940793L08702P3407N04717J11122
7194A3407591o90635l19913O51571l56007l541346n226935k744510J389814K735287
7185E304917O81895j862018l085794l277858k250449M12913K810461K310201n7533
7176I86735o46813Q96763J039308j247689k153784O62025L748544L013525l68252
7167E930362k692437l299080l636630l406262j738517j46626j69616J62974L189862
7158e805970O440098N381788O13794k547495j681606K15183L83568j26710Q1937
$$ plain form
7149 2954587 2801421 957019 -2325596 -4704815 -4258466 -1020770 3562073 7372426 8563209
7140 8563209 7409372 6657064 8406601 11159368 11615800 8995488 5862239 4807529 5879902
7131 5879902 7378995 7895499 7265038 6225120 5305138 4072390 2149247 846396 2106973
7122 2106973 5270822 6932750 5309581 2811867 2606055 4532475 6459878 7718633
7114 7718633 8575475 8086404 5734522 3988751 5607783 8876502 9115917 5018608 93728
7105 93728 -2583475 -3683182 -4803057 -5544918 -4996705 -3808789 -3241500 -3693991 -5004940
7096 -5004940 -6555996 -6627353 -3771282 445549 2154570 -486214 -5462167 -9825829 -12196634
7087 -12196634 -11844760 -8189220 -2735583 857492 570751 -1598223 -2347108 -617928 2568577
$$ packed form
7149B954587j53166j844402l282615k379219M46349L237696M582843L810353J190783
7140H563209j153837p52308J749537K752767M56432k620312l133249j054710J072373
7131E879902J499093N16504o30461j039918r19982j232748j923143j302851J260577
7122B106973L163849J661928j623169k497714k05812J926420J927403J258755
7114G718633Q56842m89071k351882j745771J619032L268719K39415m097309m924880
7105I3728k677203j099707j119875p41861N48213J187916N67289m52491j310949
7096e004940j551056p1357K856071M216831J709021k640784m975953m363662k370805
7087a2196634L51874L655540N453637L593075k86741k168974p48885J729180L186505
$$ plain form
7078 2568577 5910773 8100648 7955935 5663722 2757589 303250 -1326594 -920036 2559341
7069 2559341 6960223 8387231 6905979 7135471 11209325 15022087 14388191 11282966 10128362
7060 10128362 10843518 9919805 6223509 1415133 -3540561 -7840175 -8555804 -3882251 2340229
7051 2340229 4365113 2201155 512134 497285 -1136693 -4653063 -5234798 -676421 4483590
7042 4483590 5544522 3634127 1903309 209274 -2468512 -4095691 -2565705 130944
7034 130944 1093030 1586187 4395608 7839493 7326010 2284431 -2923396 -5042027 -4916233
7025 -4916233 -4213976 -3062370 -1866740 -2117438 -4022678 -5827834 -6519954 -6981130 -7741896
7016 -7741896 -7994396 -7613482 -7611530 -7618025 -5653992 -1863393 284937 -1363701 -4158994
$$ packed form
7078B568577L342196K189875j44713k292213k906133k454339j629844M06558L479377
7069B559341M400882J427008j481252K29492M073854L812762o33896l105225j154604
7060A0128362P15156r23713l696296m808376m955694m299614p15629M673553O222480
7051B340229K024884k163958j689021j4849j633978l516370n81735M558377N160011
7042D483590J060932j910395j730818j694035k677786j627179J529986K696649
7034A30944R62086M93157K809421L443885n13483n041579n207827k118631J25794
7025d916233P02257J151606J195630k50698j905240j805156o92120m61176p60766
7016g741896k52500L80914J952o495J964033L790599K148330j648638k795293
$$ plain form
7007 -4158994 -4355280 -2439512 -1787091 -3201068 -4000459 -2255519 973943 3851125 5661665
6998 5661665 6050295 4793570 3158331 3272640 5006364 5459940 2962168 -222503 -927675
6989 -927675 714011 2276079 3164948 5105596 8607927 11410869 11260969 8679534 6154861
6980 6154861 5567060 6829746 8123593 7252698 3812738 75027 -1556235 -1875613 -3788742
6971 -3788742 -7634420 -10013164 -8391873 -4430556 -815793 2904650 8349378 13623949
6963 13623949 14308220 9250757 2365668 -2028497 -3213987 -2729115 -1581849 -233428
6955 -233428 551550 500077 354263 492087 252580 -345251 302207 3119696 6425512 7909968
6945 7909968 7547830 6768569 5591151 2819135 -1127212 -3956787 -4748620 -5446035 -7772812
$$ packed form
7007d158994j96286J915768O52421j413977p99391J744940L229462K877182J810540
6998E661665L88630j256725j635239J14309J733724M53576k497772l184671p05172
6989i27675J641686J562068Q88869J940648L502331K802942j49900k581435k524673
6980F154861n87801J262686J293847q70895l439960l737711j631262l19378j913129
6971c788742l845678k378744J621291L961317L614763L720443N444728N274571
6963A3623949O84271n057463o885089m394165j185490M84872J147266J348421
6955b33428P84978n1473j45814J37824k39507n97831O47458K817489L305816J484456
6945G909968l62138p79261j177418k772016l946347k829575p91833o97415k326777
$$ plain form
6936 -7772812 -10062326 -9104941 -4792449 -894440 -468934 -2115861 -2445073 -1315801 -2036730
6927 -2036730 -5911071 -9365256 -8584701 -5064287 -3504470 -4997551 -5736225 -2830043 1939337
6918 1939337 5449818 7359367 8885649 9878247 9702605 9494987 10869965 13183465 14418014
6909 14418014 14279201 14249861 14806579 14569390 12387345 8969555 6492147 7279661 11865344
6900 11865344 17256297 18668643 14846856 10127601 8855054 9459054 7492233 3239750
6892 3239750 1653325 4507888 7473993 6733386 4271363 3828291 4976422 4687771 2514484
6883 2514484 598478 -166253 -592894 -519899 1120807 3584899 4426567 2710304 -51055
6874 -51055 -2426403 -4397448 -5716291 -5091336 -2046318 1979448 5482001 8627769 11984584
$$ packed form
6936g772812k289514R57385M312492L898009M25506j646927l29212J129272p20929
6927b036730l874341l454185P80555L520414J559817j493081p38674K906182M769380
6918A939337L510481J909549J526282R92598j75642k07618J374978K313500J234549
6909A4418014j38813k9340N56718k37189k182045l417790k477408P87514M585683
6900A1865344N390953J412346l821787m719255j272547O04000j966821m252483
6892C239750j586425K854563K966105p40607k462023m43072J148131k88651k173287
6883B514484j916006p64731m26641P2995J640706K464092Q41668j716263k761359
6874e1055k375348j971045j318843O24955L045018M025766L502553L145768L356815
$$ plain form
6865 11984584 14464468 14011352 10275693 5574324 2791318 2687237 3581511 3536212 2390386
6856 2390386 1335926 910283 323153 -1030483 -2310547 -2205952 -709724 775942 965355
6847 965355 -70067 -1023429 -546683 1421440 3612293 5173140 6932082 9639410 11347996
6838 11347996 8844038 2378043 -3405366 -4846443 -3560398 -3300352 -4401830 -4180253
6830 -4180253 -1691428 1116775 2675963 3155158 2454214 -75966 -3248582 -4278686 -2567545
6821 -2567545 -749217 -625264 -404494 2293644 6616299 9517914 9181146 5824599 661434
6812 661434 -4098662 -5582604 -2798607 1754088 4660327 5091206 4325530 2913626 447586
6803 447586 -2330519 -3367443 -1615761 1673157 4076427 3840722 1306363 -707168 875635
$$ packed form
6865A1984584K479884m53116l735659m701369k783006j04081Q94274m5299j145826
6856B390386j054460m25643n87130j353636j280064J04595J496228J485666J89413
6847I65355j035422r53362M76746J968123K190853J560847J758942K707328J708586
6838A1347996k503958o465995n783409j441077J286045K60046j101478K21577
6830d180253K488825K808203J559188M79195p00944k530180l172616j030104J711141
6821b567545J818328J23953K20770K698138M322655K901615l36768l356547n163165
6812F61434m760096j483942K783997M552695K906239M30879p65676j411904k466040
6803D47586k778105j036924J751682L288918K403270k35705k534359k013531J582803
$$ plain form
6794 875635 5499422 8636063 7023572 2839854 466383 600003 663559 -21140 490365
6785 490365 2242413 2415644 253839 -907787 1178654 3750267 3338390 1520495 2710857
6776 2710857 7475557 11692577 12198542 10146037 8308863 7710785 7896210 8520716 9376893
6767 9376893 9988980 10147205 10073377 9507935 7585905 4357998 1622901 1239844 2897184
6758 2897184 4429582 4448722 3988379 5036260 7687939 9582732 8678995 5996229 4523097
6749 4523097 5471729 6924013 6702446 5301750 4837768 5893565 6811577 5961726 3555645
6740 3555645 977219 -999665 -3015279 -6246932 -10602337 -13961459 -14075605 -11445183
6732 -11445183 -9152023 -9128415 -9753688 -8229238 -4264116 20352 3000447 4705255 5610835
$$ packed form
6794H75635M623787L136641j612491m183718k373471J33620O3556o84699N11505
6785D90365J752048J73231k161805j161626K086441K571613m11877j817895J190362
6776B710857M764700M217020N05965k052505j837174n98078J85425O24506Q56177
6767I376893O12087J58225p3828n65442j922030l227907k735097l83057J657340
6758B897184J532398J9140m60343J047881K651679J894793r03737k682766j473132
6749D523097R48632J452284k21567j400696m63982J055797R18012q49851k406081
6740C555645k578426j976884k015614l231653m355405l359122j14146K630422
6732a1445183K293160K3608o25273J524450L965122M284468K980095J704808R05580
$$ plain form
6723 5610835 6030677 6518632 7287686 7298003 5391922 2293389 131039 114430 1911274
6714 1911274 4708601 7156002 7025543 3500317 -397450 -591584 2433544 3883337 1471128
6705 1471128 -1333094 -779406 1560612 1668077 -672957 -2121803 -1287728 -399214 -1275933
6696 -1275933 -2547612 -1770588 1636030 6382352 10748131 13239899 12926553 10044465 5973216
6687 5973216 2302429 -59379 -1275556 -2418061 -4275850 -5910033 -5384402 -2590527
6679 -2590527 14295 679946 914557 2937598 5822759 6602562 4603267 2154920 1172782
6670 1172782 1579188 3205305 6417130 9981218 10883481 7812309 3063357 -386807 -2160314
6661 -2160314 -3526956 -4759980 -5197974 -4949055 -4794876 -4814479 -4390883 -3287213 -1790667
$$ packed form
6723E610835M19842M87955P69054J0317j906081l098533k162350j6609J796844
6714A911274K797327K447401j30459l525226l897767j94134L025128J449793k412209
6705A471128k804222N53688K340018J07465k341034j448846Q34075Q88514q76719
6696a275933j271679P77024L406618M746322M365779K491768l13346k882088m071249
6687E973216l670787k361808j216177j142505j857789j634183N25631K793875
6679b590527K604822O65651K34611K023041K885161P79803j999295k448347r82138
6670A172782M06406J626117L211825L564088R02263l071172m748952l450164j773507
6661b160314j366642j233024m37994K48919J54179j9603M23596J103670J496546
$$ plain form
6652 -1790667 -231924 791048 258666 -2226180 -5541205 -7912613 -8373722 -6982795 -4426932
6643 -4426932 -2165484 -2021196 -4267866 -6453281 -5444040 -877007 4188315 6274475
6635 6274475 4757685 2203308 1854390 4758975 9071012 12053739 12535959 11104381 8457927
6626 8457927 4852152 1276145 -436066 234223 1210038 48202 -2948932 -5075814 -4643814
6617 -4643814 -2987649 -2676418 -4390629 -6265390 -6381350 -5305671 -5302214 -6964519 -7969952
6608 -7969952 -6259556 -3285819 -2167755 -3272377 -4155695 -3879497 -4312346 -6087416 -6420965
6599 -6420965 -3289008 641277 1327814 -842983 -1879938 -257851 1190486 -87336
6591 -87336 -2763708 -4018065 -3544947 -3473293 -5096372 -7033567 -6772838 -3676328 -168277
$$ packed form
6652a790667J558743J022972n32382k484846l315025k371408m61109J390927K555863
6643d426932K261448J44288k246670k185415J009241M567033N065322K086160
6635F274475j516790k554377l48918K904585M312037K982727M82220j431578k646454
6626H457927l605775l576007j712211O70289R75815j161836k997134k126882M32000
6617d643814J656165L11231j714211j874761j15960J075679L457j662305j005433
6608g969952J710396K973737J118064j104622q83318K76198m32849j775070l33549
6599f420965L131957L930285O86537k170797j036955J622087J448337j277822
6591h7336k676372j254357M73118P1654j623079j937195K60729L096510L508051
$$ plain form
6582 -168277 631199 -1411352 -3187955 -2407222 -479419 60852 -378627 704666 3562079
6573 3562079 5305889 3854891 815617 -447385 1439389 4506058 5273175 2249375
6565 2249375 -1776169 -2059897 2202130 5904040 4236906 -693815 -2829323 -733095
6557 -733095 1182831 230497 -588662 1952813 6087527 8177805 7843734 6784835 5048407
6548 5048407 1970179 -942008 -1566456 -570532 -181071 -444568 242145 1517275 1146120
6539 1146120 -1258956 -3337470 -3116971 -953100 1696960 3487693 3403851 1879590 1454533
6530 1454533 4048785 7746500 8703215 6253763 3610412 3299051 4526403 5528098 5823233
6521 5823233 5294285 3620308 1821054 2095612 4864691 8008077 10091760 11980964 13873715
$$ packed form
6582a68277P99476k042551j776603P80733J927803N40271m39479J083293K857413
6573C562079J743810j450998l039274j263002J886774L066669P67117l023800
6565B249375m025544k83728M262027L701910j667134m930721k135508K096228
6557g33095J915926r52334q19159K541475M134714K090278l34071j058899j736428
6548E048407l078228k912187o24448R95924L89461k63497O86713J275130l71155
6539A146120k405076k078514K20499K163871K650060J790733q3842j524261m25057
6530A454533K594252L697715R56715k449452k643351l11361J227352J001695K95135
6521E823233n28948j673977j799254K74558K769079L143386K083683J889204J892751
$$ plain form
6512 13873715 13378770 8840371 2615104 -1463892 -2521194 -2252961 -1478752 254371 2447357
6503 2447357 3738136 4005383 4104204 3683538 1575945 -1512151 -2925829 -1246187 2127089
6494 2127089 4994736 6440316 6644991 6290993 6562901 8120068 9595587 8800729 6012230
6485 6012230 4200460 5012786 6412909 5819866 3923912 3284534 4254666 4864793 4550242
6476 4550242 5336784 8364345 11215507 10419072 5804313 836354 -1203206 -148112 1955489
6467 1955489 3335009 3391116 2200357 522137 61029 2185883 5770741 7470570 5277602
6458 5277602 1218582 -704398 940985 3730339 4685055 3569829 2359743 2448424 3251235
6449 3251235 3099255 862237 -3024133 -6742924 -8635199 -8756893 -8366152 -7815841 -6113081
$$ packed form
6512A3873715m94945m538399o225267m078996j057302K68233P74209J733123K192986
6503B447357J290779K67247R8821m20666k107593l088096j413678J679642L373276
6494B127089K867647J445580K04675l53998K71908J557167J475519p94858k788499
6485F012230j811770Q12326J400123n93043j895954o39378R70132O10127l14551
6476D550242P86542L027561K851162p96435m614759m967959k039560J055094K103601
6467A955489J379520N6107j190759j678220m61108K124854L584858J699829k192968
6458E277602m059020j922980J645383K789354R54716j115226j210086Q8681Q02811
6449C251235j51980k237018l886370l718791j892275j21694L90741N50311J702760
$$ plain form
6440 -6113081 -3198572 -1331901 -2673540 -6079233 -8003701 -6725790 -4318109 -3967863
6432 -3967863 -6320520 -9057858 -9549870 -7455244 -4831545 -3730538 -3812561 -3098295 -1280580
6423 -1280580 -630042 -2121960 -2326754 2796492 11383261 16499572 14524369 9468757 7097993
6414 7097993 7838460 8429016 8029462 8517334 9768543 9058662 5679703 2495539 1668612
6405 1668612 1732954 353795 -2417098 -5140048 -7114394 -7993623 -7288507 -5876030 -5999988
6396 -5999988 -7851490 -8091680 -4188467 1361253 3937996 2872522 1600065 2221100 3115668
6387 3115668 2437638 1138705 1243713 2948815 4605825 4459724 1886627 -1777841 -3325421
6378 -3325421 -356081 5317512 8570048 6432046 1459352 -1470228 -656282 1339094
$$ packed form
6440f113081K914509J866671j341639l405693j924468J277911K407681L50246
6432c967863k352657k737338m92012K094626K623699J101007q2023P14266J817715
6423a280580O50538j491918k04794N123246Q586769N116311j975203n055612k370764
6414G097993P40467N90556l99554M87872J251209p09881l378959l184164q26927
6405A668612O4342j379159k770893k722950j974346q79229P05116J412477j23958
6396e999988j851502k40190L903213N549720K576743j065474j272457O21035Q94568
6387C115668o78030j298933J05008J705102J657010j46101k573097l664468j547580
6378c325421K969340N673593L252536k138002m972694k929580Q13946J995376
$$ plain form
6370 1339094 1263198 -1494340 -4766464 -5755355 -3454773 383485 2814040 2538461 855704
6361 855704 -267706 -231584 387448 947976 858127 -557428 -3242296 -5853285 -6877266
6352 -6877266 -6137220 -4701588 -3609306 -3056147 -2421504 -775179 2208338 5730597 8867797
6343 8867797 11852270 15062045 16839472 14517447 8586314 3635638 3191958 5202723
6335 5202723 5039923 1946788 -281079 1208156 4933239 7758786 8590934 8270398 7583732
6326 7583732 6873214 6605448 6902078 6808619 4982397 1184460 -3197817 -6059107 -6128651
6317 -6128651 -4041567 -1850510 -1171352 -2016949 -3608721 -5456401 -6887269 -6560052 -3952156
6308 -3952156 -796681 537708 -173455 -1277077 -1754816 -1621124 -308746 2843337 6319411
$$ packed form
6370A339094p5896k757538l272124r88891K300582L838258K430555k75579j682757
6361H55704j123410L6122O19032N60528q9849j415555k684868k610989j023981
6352f877266P40046J435632J092282N53159O34643J646325K983517L522259L137200
6343H867797K984473L209775J777427k322025n931133m950676m43680K010765
6335E202723j62800l093135k227867J489235L725083K825547Q32148l20536o86666
6326G583732p10518k67766K96630r3459j826222l797937m382277k861290o9544
6317f128651K087084K191057O79158q45597j591772j847680j430868L27217K607896
6308c952156L155475J334389p11163j103622m77739J33692J312378L152083L476074
$$ plain form
6299 6319411 7248191 5265095 3207335 3017912 3346175 2459402 1027382 159121 -1064184
6290 -1064184 -3699575 -6273957 -6557900 -4905848 -3535480 -3474891 -4435289 -6590814 -9858720
6281 -9858720 -12160728 -11168648 -7519095 -3855692 -1096237 1679243 4024563 4059532 1940709
6272 1940709 238196 30013 -375899 -1703156 -1790873 700503 3278566 2727631 -497189
6263 -497189 -3194255 -3443600 -1821763 131668 774507 -1085827 -4452764 -5876936 -2929545
6254 -2929545 2691977 7171989 8835252 8724613 8051169 7283657 7039868 7558123 7679206
6245 7679206 6523558 5690293 7311381 10193395 10725412 7958159 5008939 4577989 5623985
6236 5623985 5764444 4795220 4244239 5004632 6812316 8815757 9630811 8213212 5574928
$$ packed form
6299F319411R28780j983096k057760j89423L28263q86773j432020q68261j223305
6290a064184k635391k574382k83943J652052J370368O0589r60398k155525l267906
6281i858720k302008R92080L649553L663403K759455K775480K345320L4969k118823
6272A940709j702513k08183m05912j327257q7717K491376K578063n50935l224820
6263d97189k697066k49345J621837J953431O42839j860334l366937j424172K947391
6254b929545N621522M480012J663263j10639o73444p67512k43789N18255J21083
6245G679206j155648q33265J621088K882014N32017k767253k949220m30950J045996
6236E623985J40459r69224n50981P60393J807684K003441Q15054j417599k638284
$$ plain form
6227 5574928 3998162 3647081 2118361 -1197758 -2813697 217155 5234416 6808631
6219 6808631 3754783 -7010 -1404151 -1625548 -2874648 -4844461 -6128300 -6918482 -8178237
6210 -8178237 -9307698 -8621884 -5854716 -2819243 -1515497 -2297268 -3875084 -4705324 -4430782
6201 -4430782 -4051960 -4495057 -5247066 -4984964 -3309627 -1015142 1128115 2748405 3261507
6192 3261507 2470127 1907428 3638193 6909909 7911036 4379428 -979575 -3489091 -1942783
6183 -1942783 863465 2383175 2899498 3774384 5112172 5947905 5629115 4417675 3389263
6174 3389263 3803019 5736986 7474873 7297973 5626663 3939792 1849394 -2488582 -8488800
6165 -8488800 -12178433 -10867087 -6956182 -4875515 -5440594 -5752079 -3978112 -1307317 1003669
$$ packed form
6227E574928j576766l51081j528720l316119j615939L030852N017261J574215
6219F808631l053848l761793j397141k21397j249100j969813j283839p90182j259755
6210h178237j129461O85814K767168L035473J303746p81771j577816q30240K74542
6201d430782L78822m43097p52009K62102J675337K294485K143257J620290N13102
6192C261507p91380n62699J730765L271716J001127l531608n359003k509516J546308
6183a942783K806248J519710N16323Q74886J337788Q35733l18790j211440j028412
6174C389263M13756J933967J737887j76900j671310j686871k090398m337976o000218
6165h488800l689633J311346L910905K080667n65079l11485J773967K670795K310986
$$ plain form
6156 1003669 3488252 6177018 7077112 5039895 2389209 2256153 4274562 5383215 4387178
6147 4387178 3050844 2568446 1854775 426804 307595 2941324 6018141 5953426 2680824
6138 2680824 -495096 -1441124 -1045155 -404724 1125215 4025184 6957525 8533705 9098917
6129 9098917 9223931 8020637 5005498 2425996 3114094 6262142 7809831 5533872 1758994
6120 1758994 193770 1673890 4046727 5052739 4251276 2923632 2954028 5119753 7830113
6111 7830113 8411253 6358315 4296271 4698761 6660362 7357973 5986289 4431101 4192938
6102 4192938 4579758 4541755 4627345 5772338 6956038 5609356 644361 -5737486 -9856251
6093 -9856251 -10049141 -7923016 -5957067 -4392285 -1398924 3628985 8197637 9101995 5992409
$$ packed form
6156A003669K484583K688766R00094k037217k650686j33056K018409J108653r96037
6147D387178j336334m82398p13671j427971j19209K633729L076817o4715l272602
6138B680824l175920r46028L95969O40431J529939K899969K932341J576180N65212
6129I098917J25014j203294l015139k579502O88098L148048J547689k275959l774878
6120A758994j565224J480120K372837J006012q01463j327644L0396K165725K710360
6111G830113N81140k052938k062044M02490J961601O97611j371684j555188k38163
6102D192938L86820l8003Q5590J144993J183700j346682m964995o381847m118765
6093i856251j92890K126125J965949J564782K993361N027909M568652R04358l109586
$$ plain form
6084 5992409 1443049 -2032035 -3726214 -3951284 -3382660 -3446479 -5421551 -8229487 -8757315
6075 -8757315 -5658971 -1456895 614111 474031 -65353 -1129945 -4327248 -8630047 -10082995
6066 -10082995 -6925719 -2346157 -129594 353068 2188593 5322976 6221947 3193745
6058 3193745 -972296 -2863321 -2661896 -2709318 -3327910 -2351781 1409700 6157669 9190710
6049 9190710 9910168 9867435 10206211 9939120 7219407 2143018 -2377794 -3174118 -180791
6040 -180791 3413798 4554982 3238976 1769905 1895258 3421200 5150862 6155114 6076088
6031 6076088 5026971 3607717 2663205 2705184 3594185 4739640 5497452 5550973 5133369
6022 5133369 4728958 4411072 3819533 3058939 3123654 4828673 7554825 9601132 9638987
$$ packed form
6084E992409m549360l475084j694179k25070N68624o3819j975072k807936n27828
6075h757315L098344M202076K071006j40080n39384j064592l197303m302799j452948
6066a0082995L157276M579562K216563M82662J835525L134383Q98971l028202
6058C193745m166041j891025K01425m7422o18592R76129L761481M747969L033041
6049I190710P19458m2733L38776k67091k719713n076389m520812p96324K993327
6040a80791L594589J141184j316006j469071J25353J525942J729662J004252p9026
6031F076088j049117j419254r44512M1979Q89001J145455P57812N3521m17604
6022E133369m04411l17886n91539p60594O4715J705019K726152K046307L7855
$$ plain form
6013 9638987 7497250 4018363 780181 -560335 381108 2198880 3275301 3447678 3179191
6004 3179191 1808065 -1640214 -6064413 -8703083 -8410266 -6768438 -5364622 -3923050
5996 -3923050 -2180617 -1540197 -2999405 -4932011 -5063736 -3642393 -2460329 -1574110 360188
5987 360188 2692149 2608697 -775468 -4411900 -4727258 -1558669 2420597 4820560 4838478
5978 4838478 2753094 -98640 -1355167 621164 4712024 7772639 7819398 5967777 4877322
5969 4877322 5632672 6694333 6104780 4267989 3703711 5899180 9432079 11906507 12687452
5960 12687452 12505921 11426370 9217194 7223078 7411438 9297445 10137904 8697297 6365798
5951 6365798 3802650 -448707 -6172512 -9328424 -6768337 -1095961 2605037 3547348
$$ packed form
6013I638987k141737l478887l238182j340516R41443J817772J076421J72377k68487
6004C179191j371126l448279m424199k638670K92817J641828J403816J441572
5996c923050J742433O40420j459208j932606j31725J421343J182064Q86219J934298
5987C60188K331961q3452l384165l636432l15358L168589L979266K399963J7918
5978D838478k085384k851734j256527J976331M090860L060615M6759j851621j090455
5969D877322P55350J061661n89553j836791n64278K195469L532899K474428P80945
5960A2687452j81531j079551k209176j994116J88360J886007Q40459j440607k331499
5951F365798k563148m251357n723805l155912K560087N672376L700998R42311
$$ plain form
5943 3547348 5004968 8002779 9459394 7267548 3499066 1083964 234063 -200715 -356517
5934 -356517 -173687 -499727 -1553888 -2108717 -1881259 -2720895 -5325190 -6755550 -4046770
5925 -4046770 968548 3494190 1956356 -498575 -720547 906065 2190772 2082335 874522
5916 874522 -881511 -2625678 -3928783 -4901052 -5563919 -4840144 -1688336 2482002 4315754
5907 4315754 2316631 -1263873 -3300264 -3233225 -2480646 -1708712 -488021 817249 653203
5898 653203 -1771146 -5185264 -7539156 -8156169 -8141691 -8786342 -10013144 -10686098 -10172129
5889 -10172129 -8860037 -6964458 -3831865 707285 5129761 7688833 8600153 9214085
5881 9214085 9311518 7232566 3055980 -397929 -846029 609260 1054158 -886176 -4201283
$$ packed form
5943C547348J457620K997811J456615k191846l768482k415102q49901m34778j55802
5934c56517J82830l26040j054161n54829K27458q39636k604295j430360K708780
5925d046770N015318K525642j537834k454931k21972J626612J284707j08437j207813
5916H74522j756033j744167j303105r72269o62867P23775L151808M170338J833752
5907D315754j999123l580504k036391O7039P52579P71934J220691J305270j64046
5898F53203k424349l414118k353892o17013J4478o44651j226802o72954N13969
5889a0172129J312092J895579L132593M539150M422476K559072R11320O13932
5881I214085R7433k078952m176586l453909m48100J455289M44898j940334l315107
$$ plain form
5872 -4201283 -6868606 -7103174 -4417592 -613028 1256319 23371 -2335856 -3348281
5864 -3348281 -2596146 -706742 2228369 5366050 6060091 2796880 -1818891 -3749764 -2600058
5855 -2600058 -1282746 -1113013 -401084 1938059 4641877 6718774 8667284 9835169 7640429
5846 7640429 1441599 -5294438 -9014134 -10310564 -11730147 -13122971 -12201191 -8883039
5838 -8883039 -6004739 -5492177 -6178982 -5999205 -4571125 -2877137 -1626018 -719479 229199
5829 229199 1255408 1770613 1205748 221300 520706 2671268 4855114 4904757 3015238
5820 3015238 1169594 306329 -451602 -1820430 -3120202 -3439518 -2959063 -2533507 -2503552
5811 -2503552 -2301060 -1065403 1281342 3484731 4003002 2849947 1548850 807625 -476434
$$ packed form
5872d201283k667323k34568K685582L804564J869347j232948k359227j012425
5864c348281P52135J889404K935111L137681O94041l263211m615771j930873J149706
5855b600058J317312J69733P11929K339143K703818K076897J948510J167885k194740
5846G640429o198830o736037l719696j296430j419583j392824R21780L318152
5838h883039K878300N12562o86805J79777J428080J693988J251119R06539R48678
5829B29199J026209N15205n64865r84448K99406K150562K183846M9643j889519
5820C015238j845644q63265p57931j368828j299772l19316M80455M25556K9955
5811b503552K02492J235657K346745K203389N18271j153055j301097p41225j284059
$$ plain form
5802 -476434 -2873696 -4519894 -3413158 -735414 271636 -1539082 -4183182 -5505170
5794 -5505170 -5057557 -2896849 1203611 6494963 10905606 12867625 12415577 10277174 7436068
5785 7436068 5804175 7247570 11037242 13955113 13856447 11628054 8987487 6338236 3827309
5776 3827309 2322214 1679979 -7580 -3428537 -6001537 -5167840 -2430422 -1486718 -3079924
5767 -3079924 -4294953 -2649194 1521162 6537833 10744268 12356848 10627416 7791323
5759 7791323 7408906 9735247 10946103 8351517 4405430 3627645 6858842 10602473 11345915
5750 11345915 8586437 3924329 -731451 -3592762 -3440353 -944512 1236181 919638
5742 919638 -1167318 -2367554 -1517560 -270726 -458735 -1299496 -655589 1496309 2823543
$$ packed form
5802d76434k397262j646198J106736K677744J007050j810718k644100j321988
5794e505170M47613K160708M100460N291352M410643J962019m52048k138403k841106
5785G436068j631893J443395L789672K917871r8666k228393k640567k649251k510927
5776C827309j505095o42235j687559l420957k573000Q33697K737418R43704j593206
5767c079924j215029J645759M170356N016671M206435J612580j729432k836093
5759G791323l82417K326341J210856k594586l946087p77785L231197L743631P43442
5750A1345915k759478m662108m655780k861311J52409K495841K180693l16543
5742I19638k086956j200236Q49994J246834j88009q40761O43907K151898J327234
$$ plain form
5733 2823543 2170321 1268991 1793030 2657371 2293757 2144393 4973596 10064940 13228173
5724 13228173 12379709 10430705 11181792 14578284 17907449 19759808 20279867 18809946 14452660
5715 14452660 8910686 5824838 6395553 7887686 7524695 5729115 4035974 2038837
5707 2038837 -939424 -2567692 463742 6829699 10417064 7540504 1790698 -796569
5699 -796569 375864 662251 -2377279 -5462937 -4698324 -1205156 711917 -543727 -2332502
5690 -2332502 -1691672 1387769 4816404 6773675 6458707 3737086 -580470 -4171769 -4089124
5681 -4089124 609630 6931478 9788392 6944893 1597968 -1379060 -1269848 -1467078 -3665849
5672 -3665849 -5211443 -3679776 -1141747 -1088335 -3134928 -4113997 -3266073 -2793496 -3668892
$$ packed form
5733B823543o53222r01330N24039Q64341l63614j49364K829203N091344L163233
5724A3228173q48464j949004P51087L396492L329165J852359N20059j469921m357286
5715A4452660n541974l085848N70715J492133l62991j795580j693141j997137
5707B038837k978261j628268L031434O365957L587365k876560n749806k587267
5699g96569J172433K86387l039530l085658P64613L493168J917073j255644j788775
5690b332502O40830L079441L428635J957271l14968k721621m317556l591299Q2645
5681d089124M698754O321848K856914k843499n346925k977028J09212j97230k198771
5672c665849j545594J531667K538029N3412k046593r79069Q47924M72577q75396
$$ plain form
5663 -3668892 -4457165 -4494621 -4731867 -4733889 -2383615 2054325 4861962 3814108 1397454
5654 1397454 916628 1998502 2579585 3020786 4947490 7452853 7884548 5875288 3613654
5645 3613654 2296784 1038916 -573435 -1316997 -202697 2321640 5235936 7402326
5637 7402326 7452353 5309343 3636587 5289551 9110153 10907930 9283014 7666914 9196154
5628 9196154 12174844 12803611 10512373 8028951 7200587 7246608 6827582 5686004 4099970
5619 4099970 2399315 1291288 1346313 1988529 2210478 2352378 3766138 6460216 8663289
5610 8663289 9425172 10060648 11676709 12522356 9813867 3892993 -1425393 -3108545 -1905069
5601 -1905069 -377033 457332 1145032 1696890 1445841 630572 194955 -133588 -1749292
$$ packed form
5663c668892p88273l7456k37246k022K350274M437940K807637j047854k416654
5654A397454m80826J081874N81083M41201J926704K505363M31695k009260k261634
5645C613654j316870j257868j612351p43562J114300K524337K914296K166390
5637G402326N0027k143010j672756J652964L820602J797777j624916j616100J529240
5628I196154K978690O28767k291238k483422q28364M6021m19026j141578j586034
5619D099970j700655j108027N5025O42216K21949J41900J413760K694078K203073
5610H663289P61883O35476J616061Q45647k708489n920874n318386j683152J203476
5601a905069J528036Q34365O87700N51858k51049q15269m35617l28543j615704
$$ plain form
5592 -1749292 -4633448 -6644317 -6306324 -4918597 -4769030 -6405293 -8776802 -10833792 -11603930
5583 -11603930 -9961208 -6257859 -3340066 -3732485 -6131114 -6854801 -4698801 -2021851
5575 -2021851 -726573 213463 2024553 3259081 1772014 -1643683 -3761385 -2801103 -175873
5566 -175873 1741477 2334268 2765107 3979379 5295239 5112624 2966980 460777 -445095
5557 -445095 119565 120524 -1562846 -3453801 -3102433 297576 5324090 9681208 11789017
5548 11789017 11783776 11347571 11852436 12491974 11302480 8296195 6067200 6450003 8057331
5539 8057331 8399507 7113958 5466222 3786779 1453918 -1244465 -3415972 -5431385
5531 -5431385 -8194133 -10463524 -9416931 -4761918 -165938 741968 -1761646 -4835202
$$ packed form
5592a749292k884156k010869L37993J387727J49567j636263k371509k056990p70138
5583a1603930J642722L703349K917793l92419k398629p23687K156000K676950
5575b021851J295278R40036J811090J234528j487067l415697k117702R60282K625230
5566a75873J917350N92791M30839J214272J315860j82615k145644k506203r05872
5557d45095N64660R59j683370j890955L51368L400009N026514M357118K107809
5548A1789017n241m36205N04865O39538j189494l006285k228995L82803J607328
5539H057331L42176j285549j647736j679443k332861k698383k171507k015413
5531e431385k762748k269391J046593M655013M595980R07906k503614l073556
$$ plain form
5523 -4835202 -6662728 -7128088 -6397990 -5038362 -4780548 -6882572 -9857796 -10875301 -9482103
5514 -9482103 -7851171 -7045746 -5465243 -2087230 1031943 1379192 -540868 -2475332 -3811894
5505 -3811894 -5149011 -5510714 -3336976 -322517 -732187 -5569047 -10411703 -11035945 -8647160
5496 -8647160 -6994796 -6491448 -4645701 -1209259 925419 206655 -1401796 -1596522 -515298
5487 -515298 684986 1734446 2416117 1760380 -338128 -2042541 -1617014 273767 1370448
5478 1370448 258548 -2507108 -4696026 -3530440 1847058 8311182 10863173 7816336
5470 7816336 2298416 -2268454 -5974538 -10122804 -13450879 -13416927 -10109389 -6247940 -3781666
5461 -3781666 -2603250 -2096284 -1831768 -1091152 309926 1031070 -80185 -1655795 -1133852
$$ packed form
5523d835202j827526m65360P30098J359628K57814k102024k975224j017505J393198
5514i482103J630932Q05425J580503L378013L119173L47249j920060j934464j336562
5505c811894j337117l61703K173738L014459m09670m836860m842656o24242K388785
5496h647160J652364N03348J845747L436442K134678p18764j608451j94726J081224
5487e15298J200284J049460O81671o55737k098508j704413M25527J890781J096681
5478A370448j111900k765656k188918J165586N377498O464124K551991l046837
5470G816336n517920m566870l706084m148266l328075L3952L307538L861449K466274
5461c781666J178416N06966K64516P40616J401078P21144j111255j575610N21943
$$ plain form
5452 -1133852 1846230 5216254 7280785 7844929 7018495 5062737 3141981 2074093 674185
5443 674185 -2383199 -5576559 -6222968 -4874652 -4747679 -6455518 -6783482 -3733825 453175
5434 453175 2829848 3496294 4210556 5699361 7789675 9748411 9267903 4178580 -3092289
5425 -3092289 -6149346 -2336350 3208932 4266625 1424165 -476860 -233976 -868226 -3520039
5416 -3520039 -5587348 -5119641 -3172148 -1327424 -174986 -642543 -3644895 -7796402 -10342784
5407 -10342784 -10942908 -11790535 -13524737 -13995974 -11916476 -8892883 -6753968 -5396264 -4289571
5398 -4289571 -3618990 -2927082 -1154264 976844 1334985 210836 677250 3566156 5389040
5389 5389040 3573713 654759 264604 1654682 1725285 332696 -402660 -604470 -2225976
$$ packed form
5452a133852K980082L370024K064531N64144q26434j955758j920756j067888j399908
5443F74185l057384l193360o46409J348316J26973j707839l27964L049657M187000
5434D53175K376673O66446P14262J488805K090314J958736m80508n089323p270869
5425c092289l057057L812996N545282J057693k842460j901025K42884o34250k651813
5416c520039k067309M67707J947493J844724J152438m67557l002352m151507k546382
5407a0342784o00124q47627j734202m71237K079498L023593K138915J357704J106693
5398d289571O70581O91908J772818K131108L58141j124149M66414K888906J822884
5389E389040j815327k918954l90155J390078P0603j392589p35356k01810j621506
$$ plain form
5380 -2225976 -4808560 -5851290 -5413419 -6283514 -8988534 -10576740 -9530816 -8083448 -7775297
5371 -7775297 -6273294 -1454448 4035192 5755498 3586161 1605435 2395374 4300275
5363 4300275 4364391 1634309 -2695726 -6384841 -7108220 -4357381 -983048 -983753 -4898744
5354 -4898744 -9014440 -9988130 -8391517 -6354832 -3828943 224025 4196555 4802005 1955264
5345 1955264 -352129 760885 3556335 5054177 5528211 6953392 8566957 7415289
5337 7415289 3140943 -943590 -2238520 -1633402 -883726 179555 2084307 3546825 3289977
5328 3289977 2756801 4477502 8181998 10781096 10236006 7532695 4562377 1812647 -1165593
5319 -1165593 -4302749 -6864814 -8105702 -7662299 -5902457 -4049823 -3254281 -3377343 -3385573
$$ packed form
5380b225976k582584j042730M37871q70095k705020j588206J045924J447368L08151
5371g775297J502003M818846N489640J720306k169337j980726P89939J904901
5363D300275O4116k730082m330035l689115p23379K750839L374333p05l914991
5354d898744m115696r73690J596613K036685K525889M052968L972530O05450k846741
5345A955264k307393J113014K795450J497842M74034J425181J613565j151668
5337G415289m274346m084533j294930O05118P49676J063281J904752J462518k56848
5328C289977n33176J720701L704496K599098n45090k703311k970318k749730k978240
5319a165593l137156k562065j240888M43403J759842J852634P95542j23062q230
$$ plain form
5310 -3385573 -2980714 -2960675 -3821248 -4976343 -5706799 -5935219 -5549657 -3889163 -763506
5301 -763506 2563068 4328646 4089084 2924791 1916338 1084882 4841 -1168001 -1859266
5292 -1859266 -2009795 -2059637 -1813536 -253215 2658575 4692589 3382393 -651395 -3970095
5283 -3970095 -4380080 -3215976 -2857475 -3697197 -4895789 -6478420 -8602264 -9801924 -8356882
5274 -8356882 -5067950 -2502042 -1541641 -738441 826706 2161687 2288275 1680003 1162057
5265 1162057 882550 755821 413373 -1417304 -5560501 -10082427 -11523476 -9248565 -6547469
5256 -6547469 -6429691 -8266308 -9654683 -9527820 -7976310 -4989259 -1314705 872604 178093
5247 178093 -1914250 -2591241 -645655 3002809 6479196 7721014 5629536 1656402 -1174805
$$ packed form
5310c385573M04859K0039q60573j155095p30456k28420L85562J660494L125657
5301g63506L326574J765578k39562j164293j008453q31456j080041j172842o91265
5292a859266j50529m9842K46101J560321K911790K034014j310196m033788l318700
5283c970095m09985J164104L58501q39722j198592j582631k123844j199660J445042
5274h356882L288932K565908R60401Q03200J565147J334981J26588o08272n17946
5265A162057k79507j26729l42448j830677m143197m521926j441049K274911K701096
5256f547469J17778j836617j388375J26863J551510K987051L674554K187309o94511
5247A78093k092343o76991J945586L648464L476387J241818k091478l973134k831207
$$ plain form
5238 -1174805 -1741848 -1526928 -1190733 641326 3636692 4278287 1001567 -2340277 -1932229
5229 -1932229 -200554 -1867737 -5791470 -6320399 -2180416 1725272 2093240 1417287 2610516
5220 2610516 4120946 3164592 432605 -1274449 -869630 781189 2646083 3933470 4411901
5211 4411901 5368368 8227997 11451735 11395826 7295370 2589169 32137 -1463562 -3524197
5202 -3524197 -5178665 -5347541 -5402115 -6377616 -6221423 -2989476 1231153 2790554 1389356
5193 1389356 -341449 -807936 -288679 856867 2118885 2167798 710544 -354651 5667
5184 5667 -350063 -3039697 -5116596 -2537633 3531498 7787338 7557536 4891069 2488212
5175 2488212 1327115 1983868 4303828 5582233 2924793 -2112105 -4884393 -4086616 -2904645
$$ packed form
5238a174805n67043K14920L36195J832059K995366O41595l276720l341844M08048
5229a932229J731675j667183l923733n28929M139983L905688L67968o75953J193229
5220B610516J510430r56354k731987j707054M04819J650819J864894J287387M78431
5211D411901R56467K859629L223738n5909m100456m706201k557032j495699k060635
5202c524197j654468j68876n4574r75501J56193L231947M220629J559401j401198
5193A389356j730805m66487N19257J145546J262018M8913j457254j065195L60318
5184E667l55730k689634k076899K578963O069131M255840k29802k666467k402857
5175B488212j161097O56753K319960J278405k657440n036898k772288P97777J181971
$$ plain form
5166 -2904645 -3036120 -1974565 1844389 5126152 3853981 -1146362 -5340700 -5521482 -1988445
5157 -1988445 2452985 4106450 990182 -4384991 -6495039 -2689924 3797502 7870512
5149 7870512 7831681 5489772 3172826 2343011 3354023 4739048 4170137 1644821 139310
5140 139310 1572413 3879230 3921668 1678817 -504787 -1491372 -2048018 -2961752 -4378847
5131 -4378847 -6241760 -7813521 -7709154 -5857599 -4244873 -4119262 -3812647 -1244660 2706408
5122 2706408 5525762 6592394 6838769 5714616 1556813 -4731789 -9021957 -8150080 -3387648
5113 -3387648 1095418 2345670 719046 -1382148 -2218611 -2108672 -2177621 -2306158 -1411167
5104 -1411167 391443 1593819 1706291 2001757 2969782 2993383 947269 -1685235 -2887501
$$ packed form
5166b904645j31475J061555L818954L281763j272171n000343m194338j80782L533037
5157a988445M441430J653465l116268n375173k110048L805115O487426M073010
5149G870512l8831k341909k316946q29815J011012J385025n68911k525316j505511
5140A39310J433103K306817M2438k242851k183604r86585n56646r13734j417095
5131d378847j862913j571761J04367J851555J612726J25611L06615K567987L951068
5122B706408K819354J066632K46375j124153m157803o288602m290168Q71877M762432
5113c387648M483066J250252j626624k101194q36463J09939o8949j28537Q94991
5104a411167J802610J202376J12472K95466R68025K3601k046114k632504j202266
$$ plain form
5095 -2887501 -2570950 -1317165 1213884 4251355 4384265 -519148 -6921038 -8722474 -4706409
5086 -4706409 155051 1042513 -1817693 -5015424 -6105079 -5052189 -3552035 -3732769 -6098113
5077 -6098113 -8433864 -8137531 -5473171 -2761009 -693381 2109628 5743370 7920507
5069 7920507 7124481 4605922 2146272 -175789 -2772285 -4944174 -5999406 -6578023 -7334680
5060 -7334680 -7329972 -5227912 -1445987 2203005 4609128 5923547 6178815 4553775 672641
5051 672641 -3667768 -4932248 -1006778 5834717 10180939 8742194 3845288 633528
5043 633528 1242490 3067596 2651972 -191502 -2610388 -2076771 1168232 4761088 6878873
5034 6878873 7857228 8748340 8827897 6058704 334186 -5395285 -8085174 -7286012 -4184713
$$ packed form
5095b887501L16551J253785K531049L037471J32910m903413o401890j801436M016065
5086d706409M861460Q87462k860206l197731j089655J052890J500154j80734k365344
5077f098113k335751K96333K664360K712162K067628K803009L633742K177137
5069G920507p96026k518559k459650k322061k596496k171889j055232n78617p56657
5060g334680M708K102060L781925L648992K406123J314419K55268j625040l881134
5051F72641m340409j264480L925470O841495M346222j438745m896906l211760
5043F33528O08962J825106m15624k843474k418886N33617L245003L592856K117785
5034F878873R78355Q91112P9557k769193n724518n729471k689889P99162L101299
$$ plain form
5025 -4184713 138877 4337535 6740744 7346190 8007346 8992549 7667619 2814114 -2268161
5016 -2268161 -4016989 -3735619 -4896835 -7269115 -7836182 -6037465 -3512827 318778 7271942
5007 7271942 15058140 18067086 14424249 8034334 2888238 -405588 -1823198 -575913
4999 -575913 1919799 2287388 346029 -126607 2304204 3964558 1992669 -1095862 -1593573
4990 -1593573 340368 2722084 5260760 7566206 7144035 2957645 -1442487 -1924983 911220
4981 911220 3384013 3741082 2686023 908216 -883141 -1112573 554271 1491200 -1083718
4972 -1083718 -6656468 -12335532 -15501864 -14336081 -8492453 -1184068 2317058 623440
4964 623440 -2074476 -2392706 -2335063 -4667844 -7607632 -8211808 -7815147 -9301495 -11303125
$$ packed form
5025d184713M323590M198658K403209O05446O61156R85203j324930m853505n082275
5016b268161j748828K81370j161216k372280n67067J798717K524638L831605O953164
5007G271942P786198L008946l642837o389915n146096l293826j417610J247285
4999e75913K495712L67589j941359m72636K430811J660354j971889l088531m97711
4990a593573J933941K381716K538676K305446m22171m186390m400132m82496K836203
4981I11220K472793L57069j055059j777807j791357k29432J666844R36929k574918
4972a083718n572750n679064l166332J165783N843628P308385L501126j693618
4964F23440k697916l18230N7643k332781k939788o04176L96661j486348k001630
$$ plain form
4955 -11303125 -10106993 -5967161 -2922581 -3104849 -5109610 -7150915 -8200488 -6972308
4947 -6972308 -3427408 -556699 -1370575 -4803283 -7314247 -7293450 -5269988 -1692513 2401561
4938 2401561 4570034 4127553 3900429 5456211 5491691 1263549 -3417601 -3144046 329217
4929 329217 371784 -4556133 -9155503 -9255026 -6193071 -3198611 -2168647 -4055989 -8064496
4920 -8064496 -10544377 -8627300 -4413467 -1909442 -1335468 -718809 -1086335 -4773173 -10164400
4911 -10164400 -13635622 -15273386 -17124170 -17636996 -14205062 -9618857 -9144501 -12443886
4903 -12443886 -15351628 -18147048 -24135508 -30991502 -32118213 -26775877 -20862163 -17636954
4895 -17636954 -15700339 -15662108 -19728632 -24594449 -24190543 -20024059 -19440309 -23485510 -26480416
$$ packed form
4955a1303125J196132M139832L044580j82268k004761k041305j049573J228180
4947f972308L544900K870709q13876l432708k510964K0797K023462L577475M094074
4938B401561K168473m42481k27124J555782L5480m228142m681150K73555L473263
4929C29217M2567m927917m599370r9523L061955K994460J029964j887342m008507
4920h064496k479881J917077M213833K504025N73974O16659l67526l686838n391227
4911a0164400l471222j637764j850784n12826L431934M586205M74356l299385
4903a2443886k907742k795420n988460o855994j126711N342336N913714L225209
4895a7636954J936615L8231m066524m865817M03906M166484N83750m045201k994906
$$ plain form
4886 -26480416 -27407601 -30514276 -34724308 -34833753 -33274168 -37224944 -44526654 -48020191
4878 -48020191 -52449141 -67218847 -83971865 -88963770 -100086282 -153122351 -233301123
4871 -233301123 -260340682 -179096778 -39873453 54306955 66300330 46865844 46474635
4864 46474635 57194639 52729329 38582047 34772712 39019482 36482006 28297115 25378125
4856 25378125 25985627 21188469 13880034 13350385 17630415 18082291 15894507 18309892 23142192
4847 23142192 22247462 17186136 17000121 22135686 23945728 19684679 15800682 15821107 15922652
4838 15922652 13811768 12378707 12783535 12151673 9878707 9079339 10265698 10004891 7213106
4829 7213106 5023427 5282677 6433100 7612342 9740171 11798057 10940965 7194192 3701332
$$ packed form
4886b6480416r27185l106675m210032j09445J559585l950776p301710l493537
4878d8020191m428950j4769706j6753018m991905j1122512n3036069q0178772
4871b33301123k7039559Q1243904J39223325R4180408J1993375j9434486l91209
4864D6474635J0720004m465310j4147282l809335M246770k537476q184891k918990
4856B5378125O07502m797158p308435n29649M280030M51876k187784K415385M832300
4847B3142192q94730n061326j86015N135565J810042m261049l883997K0425J01545
4838A5922652k110884j433061M04828o31862k272966p99368J186359k60807k791785
4829G213106k189679K59250J150423J179242K127829K057886q57092l746773l492860
$$ plain form
4820 3701332 1763486 -158806 -2195734 -2212041 149092 2548983 3740030 4699145 5620284
4811 5620284 5346619 4146452 3584388 3339573 1606477 -1055259 -1837964 -204159 1186941
4802 1186941 999875 1511392 4997909 10169625 13577514 13216139 10068243 7006672 6086698
4793 6086698 6161988 4098107 -680859 -4552867 -4271101 -1292877 718356 939679 1318170
4784 1318170 3028864 5781569 9299612 12779955 14253521 13132536 11847778 12284128
4776 12284128 12511117 10119489 6715530 5485366 6209622 6638285 7021034 8929787 11086602
4767 11086602 10992949 9577674 9521779 9915182 7524316 2769335 -603499 -1500652 -2066235
4758 -2066235 -2486227 -627631 2762229 3938814 2190751 914976 1666943 2235265 1800878
$$ packed form
4820C701332j937846j922292k036928j6307K361133K399891J191047R59115R21139
4811E620284k73665j200167n62064k44815j733096k661736p82705J633805J391100
4802A186941j87066N11517L486517N171716L407889l61375l147896l061571r19974
4793F086698P5290k063881m778966l872008K81766K978224K011233K21323L78491
4784A318170J710694K752705L518043L480343J473566j120985j284758M36350
4776A2284128K26989k391628l403959j230164P24256M28663L82749J908753K156815
4767A1086602r3653j415275n5895L93403k390866m754981l372834q97153n65583
4758b066235m19992J858596L389860J176585j748063j275775P51967N68322m34387
$$ plain form
4749 1800878 2673103 5211759 6328308 5197721 5285340 8123682 10164194 8882250 7022333
4740 7022333 7031544 6023670 1037091 -4458032 -4638052 379863 5175028 6430110 5361611
4731 5361611 3969799 3149811 4037524 7363178 11317413 13084535 12636194 12455544 13478863
4722 13478863 13783251 11646363 7893007 4720794 3627819 4752646 7022660 8660653
4714 8660653 8427654 6666776 4803409 3924962 3993666 4111544 3568296 3028400 4161104
4705 4161104 7216157 9855867 10023221 9041445 9439513 10424277 8878837 4953953 2776082
4696 2776082 4357991 6536260 6095912 4655595 5590898 8566055 10287295 9217522 6791505
4687 6791505 4942617 4616562 5723188 6659362 5060658 876230 -2640531 -2961732 -1842469
$$ packed form
4749A800878Q72225K538656J116549j130587Q7619K838342K040512j281944j859917
4740G022333R211j007874m986579n495123j80020N017915M795165J255082j068499
4731E361611j391812q19988Q87713L325654L954235J767122m48341j80650J023319
4722A3478863L04388k136888l753356l172213j092975J124827K270014J637993
4714H660653k32999j760878j863367q78447O8704J17878n43248n39896J132704
4705D161104L055053K639710J67354r81776L98068R84764j545440l924884k177871
4696B776082J581909K178269m40348j440317R35303K975157J721240j069773k426017
4687F791505j848888l26055J106626R36174j598704m184428l516761l21201J119263
$$ plain form
4678 -1842469 -2520252 -4601019 -4483362 -427471 5250225 9088510 9707513 7989531 5513028
4669 5513028 3154586 642160 -2380715 -4898593 -5383918 -4410030 -4468416 -6202007 -7028642
4660 -7028642 -5300760 -3741938 -6003877 -10944282 -13309461 -10146149 -4262305 -780543
4652 -780543 -1682816 -4298268 -4434622 -680226 4238125 6474482 5147096 2682965 1572007
4643 1572007 2210992 3609937 4224940 2198872 -2712351 -7134349 -6747209 -1659643 3650184
4634 3650184 6384105 8082447 10325322 11863117 11958729 12448273 13716918 12601869 7731469
4625 7731469 3213718 3016186 5164845 6000052 6694931 10026132 13563170 12558811 7988365
4616 7988365 5119236 4907001 3627574 1080699 1933682 7322103 11793313 11370745 8951714
$$ packed form
4678a842469o77783k080767J17657M055891N677696L838285O19003j717982k476503
4669E513028k358442k512426l022875k517878m85325R73888n8386j733591q26635
4660g028642J727882J558822k261939m940405k365179L163312N883844L481762
4652g80543r02273k615452j36354L754396M918351K236357j327386k464131j110958
4643A572007O38985J398945O15003k026068m911223m421998L87140N087566N309827
4634C650184K733921J698342K242875J537795R5612M89544J268645j115049m870400
4625G731469m517751j97532K148659Q35207O94879L331201L537038j004359m570446
4616G988365k869129k12235j279427k546875Q52983N388421M471210m22568k419031
$$ plain form
4607 8951714 8347725 7947274 4378927 -1280240 -5167578 -6014045 -5268835 -3822398 -1833015
4598 -1833015 -306140 -5493 140611 1457388 3601515 5836864 8375937 10556471 9849569
4589 9849569 5379537 838637 849203 5091889 8724274 8449331 5860428 4514897 5532962
4580 5532962 6864503 6097596 3340621 1115284 1287087 2854374 3874402 4710129 7061413
4571 7061413 9952843 9788169 5530899 1055630 500454 3468558 6718844 8380973 8135370
4562 8135370 5363270 410179 -3414255 -2533429 2165237 6004839 6208475 4551412 3888754
4553 3888754 4435881 4763405 4788118 5885713 8244189 9405909 6283481 -1190919 -8866560
4544 -8866560 -11700300 -8567353 -3063888 679588 1877907 2260263 2855611 3136582 2617222
$$ packed form
4607H951714o03989m00451l568347n659167l887338q46467P45210J446437J989383
4598a833015J526875L00647J46104J316777K144127K235349K539073K180534p06902
4589I849569m470032m540900J0566M242686L632385k74943k588903j345531J018065
4580E532962J331541p66907k756975k225337J71803J567287J020028Q35727K351284
4571G061413K891430j64674m257270m475269n55176K968104L250286J662129k45603
4562H135370k772100m953091l824434Q80826M698666L839602K03636j657063o62658
4553C888754N47127L27524K4713J097595K358476J161720l122428p474400p675641
4544h866560k833740L132947N503465L743476J198319L82356N95348K80971n19360
$$ plain form
4535 2617222 1633314 631941 -4354 591025 3246271 7337168 10777266 11830487 10434851
4526 10434851 7608949 4237528 862048 -1805175 -2889378 -2111090 -228370 1689711
4518 1689711 3371849 5178739 6757331 6841080 5140363 3519050 3907000 5489829 5653131
4509 5653131 3814762 2569895 4242134 7559284 8860516 6151111 1318888 -1511425
4501 -1511425 209215 4936610 8600117 9093736 8269134 8421639 8296250 5159645 176085
4492 176085 -1725167 1798962 7221474 9687507 8420638 5957988 4330042 4165864 5728617
4483 5728617 8351534 9984837 9471900 8309382 8246998 8426615 7244893 5849169 6721686
4474 6721686 9132865 9217078 5332869 773128 -238527 2427530 5220911 5373208 3582110
$$ packed form
4535B617222r83908j001373o36295N95379K655246M090897L440098J053221j395636
4526A0434851k825902l371421l375480k667223j084203P78288J882720J918081
4518A689711J682138J806890J578592Q3749j700717j621313L87950J582829J63302
4509E653131j838369j244867J672239L317150J301232k709405m832223k830313
4501a511425J720640M727395L663507M93619q24602J52505j25389l136605m983560
4492A76085j901252L524129N422512K466033j266869k462650j627946j64178J562753
4483E728617K622917J633303n12937j162518o2384J79617j181722j395724Q72517
4474F721686K411179Q4213l884209m559741j011655K666057K793381J52297j791098
$$ plain form
4465 3582110 2469882 3373768 5186953 6288958 6886135 8368477 10414591 10428851 6909022
4456 6909022 2079521 -347243 733783 3336609 5114445 4867223 2110667 -2548644
4448 -2548644 -6565525 -7140430 -4426688 -1542160 -807319 -1315688 -774417 1622200 4880866
4439 4880866 7490789 8099993 6050974 2507049 420754 2073054 6615796 10797928
4431 10797928 12115206 10737835 8577675 7314342 7547224 9106681 11407192 13533328
4423 13533328 14571285 14194429 12803494 11079161 9733880 9657206 11417936 13986546 14742872
4414 14742872 11975024 7144809 3506869 2606400 3452614 5032571 7655880 11024138
4406 11024138 12874074 11277698 7350003 4014863 2579423 2083858 1742346 2170507 3602018
$$ packed form
4465C582110j112228R03886J813185J102005N97177J482342K046114J4260l519829
4456F909022m829501k426764J081026K602826J777836k47222k756556m659311
4448b548644m016881n74905K713742K884528P34841n08369N41271K396617L258666
4439D880866K609923O09204k049019l543925k086295J652300M542742M182132
4431A0797928J317278j377371k160160j263333K32882J559457K300511K126136
4423A3533328J037957l76856j390935j724333j345281p6674J760730K568610P56326
4414A4742872k767848m830215l637940r00469Q46214J579957K623309L368258
4406A1024138J849936j596376l927695l335140j435440m95565l41512M28161J431511
$$ plain form
4397 3602018 4298446 2073654 -2797945 -7200227 -8185982 -5940681 -3063040 -1101361 919801
4388 919801 3890546 5985964 4550888 231244 -2833511 -1471278 3301761 7971752
4380 7971752 10033606 9254876 6877978 4515865 2988566 1662684 -380824 -2595151
4372 -2595151 -3660748 -3786722 -4396131 -5263559 -4268105 -861304 2484861 3597214 3311998
4363 3311998 3379863 3667008 3239669 2433286 1842997 823580 -928605 -1727711 -21933
4354 -21933 3047264 5343238 6789055 8525123 10286217 11147331 11782780 13122274 13523374
4345 13523374 10493086 5180762 2019885 3179684 5907133 6326348 3730176 -98077
4337 -98077 -4050814 -8405024 -12884681 -15435888 -13666988 -7602158 -496247 3943087 5022192
$$ packed form
4397C602018O96428k224792m871599m402282r85755K245301K877641J961679K021162
4388I19801K970745K095418j435076m319644l064755J362233M773039M669991
4380G971752K061854p78730k376898k362113j527299j325882k043508k214327
4372b595151j065597j25974o09409q67428R95454L406801L346165J112353k85216
4363C311998O7865K87145m27339q06383n90289j019417j752185p99106J705778
4354b1933L069197K295974J445817J736068J761094Q61114O35449J339494M01100
4345A3523374l030288n312324l160877J159799K727449M19215k596172l828253
4337i8077l952737m354210m479657k551207J768900O064830P105911M439334J079105
$$ plain form
4328 5022192 4746410 4529474 4246406 4386090 6036781 7851762 6533365 2202009 -374273
4319 -374273 1262366 2803129 -250808 -4901247 -4961613 -787192 1633573 501669 357290
4310 357290 3450923 5400729 2271160 -2889542 -4064532 321404 6874661 11630928
4302 11630928 12569753 9946314 6392867 5035476 5885431 5814894 3264685 724338 1093063
4293 1093063 3822327 6271809 6758598 4697824 102237 -4945543 -6386686 -2321660
4285 -2321660 4058022 7723806 7176988 5034065 4240704 5240356 6194532 4848424 861226
4276 861226 -3036404 -3332750 135464 3749999 4604899 3749314 3745451 4745540 4985728
4267 4985728 4255837 4686374 7737771 11656286 12849832 9901703 5647032 4217542 5968032
$$ packed form
4328E022192k75782k16936k83068J39684J650691J814981j318397m331356k576282
4319c74273J636639J540763l053937m650439o0366M174421K420765j131904j44379
4310C57290L093633J949806l129569n160702j174990M385936O553257M756267
4302A1630928R38825k623439l553447j357391Q49955p0537k550209k540347L68725
4293A093063K729264K449482M86789k060774m595587n047780j441143M065026
4285b321660O379682L665784n46818k142923p93361R99652R54176j346108l987198
4276H61226l897630k96346L468214L614535Q54900q55585l863J000089K40188
4267D985728p29891M30537L051397L918515J193546k948129m254671j429490J750490
$$ plain form
4258 5968032 7058994 4921637 1851032 1102908 1689325 432726 -2271884 -2843016 -253441
4249 -253441 2665337 3916597 4531767 5529539 6356707 7077059 8503714 9375263 7148689
4240 7148689 2594977 -213393 318775 1425907 1166464 1296327 3172052 5019810 5633419
4231 5633419 6798961 9354612 10620427 8777602 6400036 6501259 8202375 9422671
4223 9422671 10679879 12756880 13616431 11635872 9560894 11041359 14705583 15656962 12269487
4214 12269487 8188839 7476704 9926369 11494965 8632133 2447150 -1822179 -807662
4206 -807662 2675377 3929430 3330678 4514526 6906834 6412514 3693484 4421867 9458529
4197 9458529 12245211 9131722 5062558 4878089 5951365 4458574 2412842 2846284 3995069
$$ packed form
4258E968032J090962k137357l070605p48124N86417j256599k704610n71132K589575
4249b53441K918778J251260O15170R97772Q27168P20352J426655Q71549k226574
4240G148689m553712k808370N32168J107132k59443J29863J875725J847758O13609
4231E633419J165542K555651J265815j842825k377566J01223J701116J220296
4223I422671J257208K077001Q59551j980559k074978J480465L664224R51379l387475
4214A2269487m080648p12135K449665J568596k862832o184983m269329J014517
4206h07662L483039J254053n98752J183848K392308m94320k719030P28383N036662
4197I458529K786682l113489m069164j84469J073276j492791k045732M33442J148785
$$ plain form
4188 3995069 4029299 5643790 9882327 11390702 6509634 434506 -536830 1841341 3388568
4179 3388568 5891568 11685613 16156512 15008052 13301235 17217657 22220586 20419499
4171 20419499 14947226 15053683 20547715 23398624 22045122 21697293 22461289 19642574 14576047
4162 14576047 13207620 15218796 16033229 17209939 22508533 26827960 23009060 16478557
4154 16478557 17914097 24773940 26944669 26530329 32110506 37709904 31880919 24711493
4146 24711493 36323856 58851712 65739258 63343832 87603692 130286840 118159300
4139 118159300 7646453 -134891562 -199997718 -164430722 -101995660 -74752164 -70628645
4132 -70628645 -56386650 -36659966 -32291372 -37950927 -34829203 -24402396 -21167724 -25087974
$$ packed form
4188C995069L4230J614491M238537J508375m881068o075128r71336K378171J547227
4179C388568K503000N794045M470899j148460j706817L916422N002929j801087
4171B0419499n472273J06457N494032K850909j353502l47829P63996k818715n066527
4162A4576047j368427K011176Q14433J176710N298594M319427l818900o530503
4154A6478557J435540O859843K170729m14340N580177N599398n828985p169426
4146B4711493J1612363K2527856O887546k395426K4259860M2683148j2127540
4139A18159300j10512847j42538015o5106156L5566996O2435062K7243496M123519
4132g0628645J4241995J9726684M368594n659555L121724J0426807L234672l920250
$$ plain form
4124 -25087974 -25091217 -20959118 -21384314 -26324365 -28392742 -27282268 -28191570 -29633227 -25830656
4115 -25830656 -18472844 -14677609 -15332309 -15172250 -12428491 -9847851 -8187281 -6317431
4107 -6317431 -5540163 -6883457 -6813596 -2480155 1628939 -676862 -7478074 -11547312 -10926475
4098 -10926475 -9866685 -10719801 -11574626 -11368485 -11495437 -12339875 -12727127 -12493452 -12085823
4089 -12085823 -10801893 -8686544 -8238517 -10760411 -13244072 -12434988 -9454397 -6764652
4081 -6764652 -3697093 624567 3117118 769059 -3610491 -5016919 -3596486 -3072395
4073 -3072395 -3804072 -3219816 -1856816 -2908710 -5991039 -6864858 -3767212 562899 3329734
4064 3329734 3870699 1563174 -3770760 -8904051 -9132800 -4376652 96672 49499 -3438842
$$ packed form
4124b5087974l243M132099m25196m940051k068377J110474r09302j441657L802571
4115b5830656P357812L795235o54700J60059K743759K580640J660570J869850
4107f317431P77268j343294O9861M333441M109094k305801o801212m069238O20837
4098a0926475J059790q53116q54825K06141j26952q44438l87252K33675M07629
4089a2085823J283930K115349M48027k521894k483661Q09084K980591K689745
4081f764652L067559M321660K492551k348059m379550j406428J420433N24091
4073c072395p31677N84256J363000j051894l082329q73819L097646M330111K766835
4064C329734N40965k307525n333934n133291k28749M756148M473324m7173l488341
$$ plain form
4055 -3438842 -6538219 -6712330 -3782637 424639 3056646 2934327 2154493 3077660 4642694
4046 4642694 4259655 2353724 1760426 3004004 3442037 1301765 -2055362 -4032687 -2957306
4037 -2957306 1138053 5880415 7721157 5976870 4382010 6199022 9629073 11070150
4029 11070150 10675364 10607033 9749059 5222693 -1821589 -7097244 -9456055 -11147364 -12094730
4020 -12094730 -9700837 -5035516 -3272195 -6055893 -8665451 -7126607 -3429871 -1087268
4012 -1087268 -5563 1135558 1445190 238057 -477876 616087 1274543 -364332 -1859113
4003 -1859113 -314528 2401942 2553316 683767 246612 1267364 367443 -2817492 -4064015
3994 -4064015 -832301 3782403 5542365 4521932 3361148 2216159 -1050651 -6126159
$$ packed form
4055c438842l099377j74111K929693M207276K632007j22319p79834R23167J565034
4046D642694l83039j905931n93298J243578M38033k140272l357127j977325J075381
4037b957306M095359M742362J840742j744287j594860J817012L430051J441077
4029A1070150l94786o8331q57974m526366p044282n275655k358811j691309r47366
4020a2094730K393893M665321J763321k783698k609558J538844L696736K342603
4012a087268J081705J141121L09632j207133p15933J093963O58456j638875j494781
4003a859113J544585K716470J51374j869549m37155J020752q99921l184935j246523
3994d064015L231714M614704J759962j020433j160784j144989l266810n075508
$$ plain form
3986 -6126159 -9097535 -7242230 -2681481 547997 1488804 1987639 2428170 969157 -2577346
3977 -2577346 -5419587 -5940605 -6234387 -8060960 -9001088 -6249332 -2343712 -2570833 -7102376
3968 -7102376 -10303456 -8628957 -4958532 -3371265 -3367640 -1958593 1188827 3757893 4499370
3959 4499370 4251329 3852493 3159824 2117114 1454883 2055099 3864508 5216004 3703609
3950 3703609 -1033504 -5682444 -6178691 -2374372 1961587 3726418 2800960 -157931 -4998507
3941 -4998507 -10099049 -12367780 -11229789 -9953518 -10735286 -10983241 -7351407 -1399218 2196290
3932 2196290 1885463 271483 -533783 -1034247 -1461487 -32329 4376498 9748474 12660679
3923 12660679 11632709 7968906 4136280 2027390 2157434 3772246 5769720 7669483
$$ packed form
3986f126159k971376J855305M560749L229478R40807M98835M40531j459013l546503
3977b577346k842241n21018k93782j826573r40128K751756L905620k27121m531543
3968g102376l201080J674499L670425J587267L625J409047L147420K569066P41477
3959D499370k48041l98836o92669j042710o62231O00216J809409J351496j512395
3950C703609m737113m648940m96247L804319M335959J764831r25458k958891m840576
3941d998507n100542k268731J137991J276271p81768k47955L631834N952189L595508
3932B196290l10827j613980q05266n00464m27240J429158M408827N371976K912205
3923A2660679j027970l663803l832626k108890J30044J614812J997474J899763
$$ plain form
3915 7669483 9601415 11585971 13256401 14184589 14075916 12699144 9975424 6216393 2221362
3906 2221362 -873010 -2156017 -1772678 -943472 -636640 -588974 -334060 -560802 -2198673
3897 -2198673 -4657364 -6633526 -8338056 -10768404 -12657109 -10770667 -4372375 2773927
3889 2773927 6339307 5681448 2885038 -378078 -3026049 -3439704 -1072255 1389883 200735
3880 200735 -4697711 -9013009 -8874524 -5027448 -1578431 -1360346 -3361293 -4658285 -4162433
3871 -4162433 -3515690 -4116924 -4748098 -3709763 -2254538 -3335441 -7031117 -10039715 -10423307
3862 -10423307 -10086966 -11293274 -13381068 -14631580 -14806423 -13713756 -9822263 -3171540
3854 -3171540 2359510 3009727 186081 -1485102 -170378 2173653 3912962 5277798
$$ packed form
3915G669483J931932J984556J670430R28188j08673j376772k723720l759031l995031
3906B221362l094372j283007L83339Q29206L06832M7666K54914k26742j637871
3897b198673k458691j976162j704530k430348j888705J886442O398292P146302
3889B773927L565380o57859k796410l263116k647971m13655K367449K462138j189148
3880B00735m898446m315298J38485L847076L449017K18085k000947j296992M95852
3871d162433O46743o01234o31174J038335J455225j080903l695676l008598l83592
3862a0423307L36341j206308k087794j250512j74843J092667L891493O650723
3854c171540N531050O50217k823646j671183J314724K344031J739309J364836
$$ plain form
3846 5277798 5887164 4262383 656887 -2370700 -3267259 -3259013 -3819481 -4079619 -1868013
3837 -1868013 3540903 10171030 14311135 13243084 8054880 3043826 1113812 836876
3829 836876 -400293 -2013894 -1629878 443551 1581115 1225535 1420341 2889599 4064976
3820 4064976 4524791 5954378 8718117 10695310 10745472 10338797 10491530 10147390 9073769
3811 9073769 9167095 10912850 11606073 9517986 7081424 7169928 8619680 8499209 6791175
3802 6791175 5480823 4553072 2526463 203320 354111 3567439 7213107 8837775 8421195
3793 8421195 7191030 6233702 6319957 7203489 7053848 4300847 -47353 -3503351 -5113672
3784 -5113672 -5662299 -5610329 -5187965 -6023650 -9692022 -14242085 -14963486 -9655121 -1055098
$$ packed form
3846E277798O09366j624781l605496l027587q96559Q246n60468k60138K211606
3837a868013N408916O630127M140105j068051n188204n011054j930014k76936
3829H36876j237169j613601L84016K073429J137564l55580J94806J469258J175377
3820D064976M59815J429587K763739J977193N0162m06675J52733l44140j073621
3811I073769R3326J745755O93223k088087k436562Q8504J449752j20471j708034
3802F791175j310352r27751k026609k323143J50791L213328L645668J624668m16580
3793H421195j230165r57328Q6255Q83532j49641k753001m348200l455998j610321
3784e113672n48627N1970M22364q35685l668372m550063p21401N308365Q600023
$$ plain form
3775 -1055098 6722509 11965744 14767729 15252319 14122568 13053086 12643885 11347915 8076243
3766 8076243 4520755 3121685 3892349 5061290 5767799 6176685 5995777 5232689 5653882
3757 5653882 8740124 12392381 12668223 9380443 7059275 8998186 12891117 14310904
3749 14310904 12366885 9406087 6743414 3900939 1520397 1609550 4142854 6181009
3741 6181009 5761150 4555025 4971656 6265098 5614917 2238567 -1557471 -3196572 -2155206
3732 -2155206 362075 2597214 3069116 1628124 5142 287595 2581719 4967047 5754528
3723 5754528 4899662 3356141 2260257 2754813 5177457 8087313 9497375 9565562 10565495
3714 10565495 13369917 15507498 14136475 9891912 6116692 4780333 4794925 4330257 3275338
$$ packed form
3775a055098P777607N243235K801985M84590j129751j069482m09201j295970l271672
3766H076243l555488j399070P70664J168941P06509M08886j80908p63088M21193
3757E653882L086242L652257K75842l287780k321168J938911L892931J419787
3749A4310904j944019k960798k662673k842475k380542Q9153K533304K038155
3741F181009m19859j206125M16631J293442o50181l376350l796038j639101J041366
3732b155206K517281K235139M71902j440992j622982K82453K294124K385328P87481
3723E754528q54866j543521j095884M94556K422644K909856J410062O8187R99933
3714A0565495K804422K137581j371023m244563l775220j336359J4592m64668j054919
$$ plain form
3705 3275338 2883520 3942538 5964773 7789874 8511778 7887586 6115891 3519211 723876
3696 723876 -1112883 -1082388 229049 1121131 946303 1049451 2660095 4578533 4327257
3687 4327257 1504678 -1317882 -1491430 758380 2810984 2601979 618979 -842124 -111503
3678 -111503 2103170 3329769 1800948 -1718368 -4696217 -5265409 -3627962 -1247226 761999
3669 761999 2210764 3258987 3880058 4070118 4187156 4523175 4509320 3031812 80783
3660 80783 -2410955 -2308963 156885 2436549 2481864 740076 -986796 -1845140 -2458174
3651 -2458174 -3684619 -5539350 -7182828 -7608698 -6496156 -4499815 -2425370 -294057
3643 -294057 2048053 3549082 2547527 -651469 -3020969 -1778844 2468128 6408654
$$ packed form
3705C275338l91818J059018K022235J825101P21904o24192j771695k596680k795335
3696G23876j836759L0495J311437Q92082j74828J03148J610644J918438k51276
3687D327257k822579k822560j73548K249810K052604k09005j983000j461103P30621
3678a11503K214673J226599j528821l519316k977849n69192J637447K380736K009225
3669G61999J448765J048223O21071J90060J17038L36019j3855j477508k951029
3660H0783k491738J01992K465848K279664M5315j741788j726872q58344o13034
3651b458174j226445j854731j643478m25870J112542J996341K074445K131313
3643b94057K342110J501029j001555l198996k369500J242125M246972L940526
$$ plain form
3635 6408654 7298362 4829141 606138 -3015918 -4097879 -2540275 -484093 -480752 -3198335
3626 -3198335 -7226154 -10458619 -11024822 -7968720 -2560030 1627048 1680210 -1627129 -5153272
3617 -5153272 -7428511 -9523020 -11866233 -12565224 -10013097 -5430885 -1358614 1182745
3609 1182745 2592460 2866998 1784147 487584 926669 3353063 5838861 6870320 7173186
3600 7173186 8057209 8949113 7993269 4915995 1991316 1712218 4203667 7241461 8175047
3591 8175047 5685356 775686 -3301467 -3355827 89597 2305285 -694452 -7145429 -11479938
3582 -11479938 -11069623 -8544851 -7066855 -6330924 -4815385 -3186121 -2769282 -2463972 -209527
3573 -209527 3408382 5884349 6604072 7123542 7834563 7216731 4731511 1792315 -803259
$$ packed form
3635F408654Q89708k469221m223003l622056j081961J557604K056182L341k717583
3626c198335m027819l232465n66203L056102N408690M187078N3162l307339l526143
3617e153272k275239k094509k343213o98991K552127M582212M072271K541359
3609A182745J409715K74538j082851j296563M39085K426394K485798J031459L02866
3600G173186Q84023Q91904r55844l077274k924679k79098K491449L037794R33586
3591H175047k489691m909670m077153n4360L445424K215688k999737o450977m334509
3582a1479938M10315K524772J477996P35931J515539J629264M16839L05310K254445
3573b09527L617909K475967P19723N19470P11021o17832k485220k939196k595574
$$ plain form
3564 -803259 -3942463 -7762638 -10353515 -10093569 -7582155 -4270282 -813214 2316870 4309305
3555 4309305 5205019 6132102 7415468 7942478 7208112 6228347 5470451 3873205 1265445
3546 1265445 -261992 760834 2587033 2576753 850204 -368664 33411 1522380 3681708
3537 3681708 6372652 8579406 8966885 7504771 5421089 4080310 4686769 7687660 11135519
3528 11135519 11377406 7420176 3082091 2411905 4421615 5191108 3811837 2623046 2281083
3519 2281083 783357 -2181941 -3899398 -2946578 -1488935 -1548054 -1793183 9283 3609406
3510 3609406 7248971 10170002 12374523 13433108 13063471 11522360 8427496 3123948
3502 3123948 -2677780 -5158623 -3169799 -389593 -381880 -1759068 -1137988 1139962 1909663
$$ packed form
3564h03259l139204l820175k590877K59946K511414L311873L457068L130084J992435
3555D309305Q95714R27083J283366N27010p34366r79765p57896j597246k607760
3546A265445j527437J022826J826199j0280j726549j218868M02075J488969K159328
3537C681708K690944K206754L87479j462114k083682j340779O06459L000891L447859
3528A1135519K41887l957230m338085o70186K009710P69493j379271j188791l41963
3519B281083j497726k965298j717457R52820J457643n9119k45129J802466L600123
3510C609406L639565K921031K204521J058585l69637j541111l094864n303548
3502C123948n801728k480843J988824K780206P713j377188O21080K277950P69701
$$ plain form
3493 1909663 565146 -469131 -357412 -969252 -2811077 -3557415 -2039215 -568568 -1313890
3484 -1313890 -2693696 -1545279 2653791 7586232 10818315 10996688 7617418 1719058
3476 1719058 -3851016 -6825545 -7910774 -9189481 -10600770 -10081813 -7272678 -4764528
3468 -4764528 -4642437 -5645371 -5421658 -4386375 -5164154 -8379520 -11064259 -9952483 -4900744
3459 -4900744 1850284 8398727 13609124 15769021 13162616 6588806 -197412 -3622529
3451 -3622529 -3397796 -2137794 -2553553 -5248777 -8354611 -8886661 -5394584 157310 4026730
3442 4026730 4718136 4262417 4882689 6039160 6239196 6200344 7704048 9851285 9236430
3433 9236430 4568423 -884399 -2635189 307326 4834732 6944749 4928122 213289
$$ packed form
3493A909663j344517j034277J11719o11840j841825p46338J518200J470647p45322
3484a313890j379806J148417M199070M932441L232083J78373l379270n898360
3476A719058n570074k974529j085229j278707j411289N18957K809135K508150
3468d764528J22091j002934K23713J035283p77779l215366k684739J111776N051739
3459d900744O751028O548443N210397K159897k606405o573810o786218l425117
3451c622529K24733J260002m15759k695224l105834n32050L492077N551894L869420
3442D026730O91406m55719O20272J156471K00036l8852J503704K147237o14855
3433I236430m668007n452822j750790K942515M527406K110017k016627m714833
$$ plain form
3425 213289 -4188772 -6357886 -6754230 -6575041 -5482684 -2299752 2264724 5416712 5407332
3416 5407332 3462487 1940465 1881061 3038297 4799389 5900414 4492944 21505 -5500910
3407 -5500910 -9132120 -9469810 -7014118 -3215410 -28275 903923 -46233 -684937 -233946
3398 -233946 -1010400 -4927287 -9536506 -10293877 -6456270 -2009345 -473555 -1413265 -2744226
3389 -2744226 -3687328 -3858327 -1841063 2884836 7912977 10217287 9855229 9196850 8930834
3380 8930834 7412313 4327611 2327449 3425320 5645428 5521227 3027992 1478121
3372 1478121 2482616 3767903 3253682 2772956 5021078 8193472 7333014 1446743 -4163077
3363 -4163077 -4481972 -1005833 1246755 937772 1074822 3185298 4759203 3540547 1271286
$$ packed form
3425B13289m402061k169114l96344J79189J092357L182932M564476L151988r380
3416E407332j944845j522022n9404J157236J761092J101025j407470m471439n522415
3407e500910l631210l37690K455692L798708L187135R32198r50156o38704M50991
3398b33946p76454l916887m609219p57371L837607M446925J535790r39710j330961
3389b744226r43102j70999K017264M725899N028141K304310l62058o58379k66016
3380H930834j518521l084702k000162J097871K220108j24201k493235j549871
3372A478121J004495J285287n14221m80726K248122L172394q60458n886271n609820
3363d163077l18895L476139K252588l08983J37050K110476J573905j218656k269261
$$ plain form
3354 1271286 1122359 3192081 4599310 3159416 -626586 -4607262 -6576104 -5278172
3346 -5278172 -1314699 2749100 4108840 2053789 -1459375 -3515842 -2703674 -367632
3338 -367632 676223 -727038 -2518340 -1991217 476072 1894792 846320 -914722 -1569441
3329 -1569441 -1543410 -1410820 92794 3726160 7202862 7675722 5711150 4227823 4303845
3320 4303845 4668792 4592901 4188551 2210997 -2818317 -8726683 -10533976 -6737224 -1811531
3311 -1811531 -583122 -2688624 -4708692 -5260167 -5117791 -4180689 -1736886 1006657 1808395
3302 1808395 778360 264166 1180280 1862224 1020837 -382440 -931347 -469126 866612
3293 866612 3479537 6838459 8459100 5940892 -305702 -7153493 -11209089 -10860889 -6830204
$$ packed form
3354A271286j48927K069722J407229j439894l786002l980676j968842J297932
3346e278172L963473M063799J359740k055051l513164k056467Q12168K336042
3338c67632J043855j403261j791302N27123K467289J418720j048472j761042o54719
3329a569441K6031J32590J503614L633366L476702M72860j964572j483327P6022
3320D303845L64947p5891m04350j977554n029314n908366j807293L796752M925693
3311a811531J228409k105502k020068n51475J42376R37102K443803K743543Q01738
3302A808395j030035n14194R16114O81944q41387j403277n48907M62221J335738
3293H66612K612925L358922J620641k518208o246594o847791m055596L48200M030685
$$ plain form
3284 -6830204 -1574520 2260094 3495342 2626625 699018 -1246574 -1877138 -231308 2783412
3275 2783412 4800068 4581867 3070995 1275973 -1274036 -4731351 -7156283 -6545711 -3795317
3266 -3795317 -1576640 -696111 300807 1987611 2837822 1775819 -2284 -757867 -264497
3257 -264497 889738 2695295 5114813 6981376 6757959 3965320 -803409 -6422495 -11000695
3248 -11000695 -12303120 -9873440 -6092998 -3730850 -2921715 -1930002 -319713 491772 -181002
3239 -181002 -999347 -454090 1305011 2981919 3313075 1392975 -2745108 -7144398 -8839389
3230 -8839389 -6846997 -3401022 -1315926 -1008467 -1090126 -853611 -599140 13230 2163650
3221 2163650 6062675 10067856 12103916 11389932 8635207 5234579 2519322 1151507
$$ packed form
3284f830204N255684L834614J235248q68717j927607j945592o30564J645830L014720
3275B783412K016656k18201j510872j795022k550009l457315k424932O10572K750394
3266c795317K218677Q80529R96918J686804Q50211j062003j778103p55583M93370
3257b64497J154235J805557K419518J866563k23417k792639m768729n619086m578200
3248a1000695j302425K429680L780442K362148Q09135R91713J610289Q11485o72774
3239a81002q18345N45257J759101J676908L31156j920100m138083m399290j694991
3230h839389J992392L445975K085096L07459q1659K36515K54471O12370K150420
3221B163650L899025M005181K036060p13984k754725l400628k715257j367815
$$ plain form
3213 1151507 749476 259370 -1107826 -3291808 -5474062 -6455283 -5258895 -1996545 1821805
3204 1821805 4328243 4834555 4178775 3676765 4034661 5093687 6110852 6247535 5227627
3195 5227627 3683822 2605698 2320684 2143881 1101247 -978787 -3032463 -3613785 -2559430
3186 -2559430 -1609162 -2628147 -5206252 -7032693 -6919447 -6114764 -5766708 -4498495 -244644
3177 -244644 6169151 11215658 12535202 11133924 9544427 9189771 9913462 10809710 10903445
3168 10903445 9909724 8758455 8637517 9444747 10187246 10875169 12558745 15180317 17010599
3159 17010599 16939073 15832844 14753296 13380901 11381218 9744541 9112993 8153809 5692971
3150 5692971 3426148 3906487 6180156 6299531 2851019 -550780 302137 5097693 9902125
$$ packed form
3213A151507m02031m90106j367196k183982k182254r81221J196388L262350L818350
3204A821805K506438N06312o55780n02010L57896J059026J017165J36683j019908
3195E227627j543805j078124k85014j76803j042634k080034k053676n81322J054355
3186b559430R50268j018985k578105j826441J13246Q04683L48056J268213M253851
3177b44644O413795N046507J319544j401278j589497l54656P23691Q96248R3735
3168A0903445r93721j151269j20938Q07230P42499O87923J683576K621572J830282
3159A7010599p1526j106229j079548j372395j999683j636677o31548r59184k460838
3150E692971k266823M80339K273669J19375l448512l401799Q52917M795556M804432
$$ plain form
3141 9902125 11722229 10336959 6715264 2018419 -1956660 -3562174 -3092826 -2150652 -807913
3132 -807913 2536029 7408184 9661368 6018227 -1048751 -5706471 -5483088 -2779407 5232
3123 5232 3092846 6095094 6234463 2611567 -813577 -227897 2059375 837594 -3850498
3114 -3850498 -6299379 -3076291 2810973 6619877 6993561 5031394 1809960 -1177470
3106 -1177470 -2001290 -761984 310885 722525 2660578 6158302 6820581 1576057 -6045756
3097 -6045756 -10005403 -9101389 -6699459 -5000732 -3523428 -2037879 -1032931 96466
3089 96466 1847415 2457058 501841 -1474443 -111810 2843868 2531549 -1381627 -4177608
3080 -4177608 -3624634 -2638930 -3127061 -2635599 446238 3256216 3179745 2117385 2756909
$$ packed form
3141I902125J820104j385270l621695m696845l975079j605514M69348R42174J342739
3132h07913L343942M872155K253184l643141p066978m657720K23383K703681K784639
3123E232L087614L002248J39369l622896l425144N85680K287272j221781m688092
3114c850498k448881L223088N887264L808904L73684j962167l221434k987430
3106a177470q23820J239306J072869M11640J938053L497724O62279n244524p621813
3097f045756l959647R04014K401930J698727J477304J485549J004948J129397
3089I6466J750949O09643j955217j976284J362633K955678l12319l913176k795981
3080d177608N52974R85704m88131M91462L081837K809978p6471j062360O39524
$$ plain form
3071 2756909 4183303 4507803 4447670 4788268 3595679 -142798 -3120805 -2178702 507898
3062 507898 1127360 561654 2053656 4746505 5194686 3923118 4458087 6364920 5532125
3053 5532125 1828379 112782 2079714 3299812 1107137 -310626 3286729 8921598
3045 8921598 10744290 8440132 6321750 6101065 5617694 3943774 2954266 3329755 2898082
3036 2898082 230284 -2869229 -3836669 -2358823 342149 3651494 7399525 10245137
3028 10245137 9858341 5453578 -231718 -2572583 329326 5044227 6267127 2940314
3020 2940314 -891439 -1822803 -1213521 -1928560 -3430905 -3262264 -2065071 -3215300 -7179119
3011 -7179119 -9850273 -7983248 -3489185 -353127 457359 483762 -147267 -2848273 -7013658
$$ packed form
3071B756909J426394L24500o0133L40598j192589l738477k978007R42103K686600
3062E07898O19462n65706J492002K692849M48181j271568N34969J906833q32795
3053E532125l703746j715597J966932J220098k192675j417763L597355N634869
3045H921598J822692k304158k118382k20685m83371j673920r89508L75489m31673
3036B898082k667798l099513r67440J477846K700972L309345L748031K845612
3028A0245137l86796m404763n685296k340865K901909M714901J222900l326813
3020B940314l831753r31364O09282p15039j502345J68641J197193j150229l963819
3011g179119k671154J867025M494063L136058Q10486K6403o31029k701006m165385
$$ plain form
3002 -7013658 -9423660 -8118978 -4621742 -1161308 2184411 5795211 7821870 6056903
2994 6056903 1927376 -373194 690156 2054523 771741 -1721366 -2090679 -101151
2986 -101151 1501249 1230796 261251 -279016 -788937 -1447319 -1241693 308454 2167853
2977 2167853 3382309 4083166 4088681 2252575 -1531852 -5086906 -6108101 -4593512 -2092104
2968 -2092104 226096 1515505 640658 -2529828 -5839095 -6455479 -3604717 1075929 5101974
2959 5101974 6335764 4187333 1113257 1290671 5591187 9204693 6996588 286050
2951 286050 -4913042 -5888548 -5558226 -6326948 -6042593 -2409376 2170061 3761708 2761922
2942 2761922 2687786 4130928 4051163 1417943 -387584 1420401 4580060 4962221 2444772
$$ packed form
3002g013658k410002J304682L497236L460434L345719L610800K026659j764967
2994F056903m129527k300570J063350J364367j282782k493107l69313J989528
2986a01151J602400k70453r69545n40267n09921o58382K05626J550147J859399
2977B167853J214456P00857N515j836106l784427l555054j021195J514589K501408
2968b092104K318200J289409q74847l170486l309267o16384K850762M680646M026045
2959E101974J233790k148431l074076J77414M300516L613506k208105o710538
2951B86050n199092r75506L30322p68722K84355L633217M579437J591647r99786
2942B761922p4136J443142p9765k633220j805527J807985L159659L82161k517449
$$ plain form
2933 2444772 667641 1575993 3199045 3340648 2843490 3747093 6081668 8359283 9998689
2924 9998689 11164715 10993225 8406043 4564102 2026335 1074509 -563594 -3397369 -4336993
2915 -4336993 -1149788 3448516 4792300 2004097 -1873673 -4399288 -5430364 -4857684
2907 -4857684 -1919072 2738315 6957892 9701899 11523379 11994715 9341763 3673740
2899 3673740 -1863655 -4536190 -4639950 -3608146 -1900847 -328529 -968061 -4338996 -7406443
2890 -7406443 -6901324 -3462092 -272793 1238619 2048675 2995575 4096215 5597552 7206450
2881 7206450 6982957 3715773 -46521 -261559 3240054 6373359 6019103 2970756 -599699
2872 -599699 -3632620 -5328753 -4788824 -2942784 -2300918 -3169143 -2462835 1823555 7076573
$$ packed form
2933B444772j777131R08352J623052J41603m97158R03603K334575K277615J639406
2924I998689J166026j71490k587182l841941k537767r51826j638103k833775r39624
2915d336993L187205M598304J343784k788203l877770k525615j031076N72680
2907d857684K938612M657387M219577K744007J821480M71336k652952n668023
2899C673740n537395k672535j03760J031804J707299J572318o39532l370935l067447
2890g406443N05119L439232L189299J511412Q10056R46900J100640J501337J608898
2881G206450k23493l267184l762294k15038L501613L133305l54256l048347l570455
2872e99699l032921j696133N39929J846040O41866q68225P06308M286390N253018
$$ plain form
2863 7076573 9175235 7475863 4503841 2130901 409864 -878648 -1879575 -3123428
2855 -3123428 -4247805 -3148917 1254537 6142196 7276422 4062768 -334332 -3545170
2847 -3545170 -5694871 -6483010 -4101859 1468477 6860387 9044902 8825037 8817583 9595278
2838 9595278 9789894 8738540 6972301 4925980 3070593 2671382 4513593 7209055 8416550
2829 8416550 7472820 5440131 3227634 1459407 1511512 4234745 7671033 8523000 6347426
2820 6347426 3920848 2817490 1328971 -1859589 -4582850 -4049742 -854029 2353269
2812 2353269 4660409 6642463 7660096 6806102 5951880 8021181 11793183 12319734 8066397
2803 8066397 4018426 4931949 8276011 7602274 1582833 -4248346 -4920591 -1813733 224738
$$ packed form
2863G076573K098662j699372k972022k372940j721037j288512j000927j243853
2855c123428j124377J098888M403454M887659J134226l213654m397100l210838
2847c545170k149701p88139K381151N570336N391910K184515k19865p454P77695
2838I595278J94616j051354j766239k046321j855387l99211J842211K695462J207495
2829H416550r43730k032689k212497j768227N2105K723233L436288Q51967k175574
2820F347426k426578j103358j488519l188560k723261N33108L195713L207298
2812B353269K307140J982054J017633q53994q54222K069301L772002N26551m253337
2803H066397m047971R13523L344062o73737o019441n831179o72245L106858K038471
$$ plain form
2794 224738 -819880 -2537751 -1728101 1953894 5856217 6997829 4712612 882325 -2147577
2785 -2147577 -3413353 -3175518 -2016476 -737560 -104776 265195 1680316 3855135 4050890
2776 4050890 671593 -3634872 -5208835 -4727602 -5772683 -8343172 -8230402 -4065068 -481260
2767 -481260 -1465440 -4311821 -4085817 -1369464 -936056 -4155250 -7511930 -8411723 -7849387
2758 -7849387 -6652885 -3487561 1639820 5508691 5719847 4026320 3322211 3426793 2259170
2749 2259170 -468352 -3193186 -4967682 -5713090 -4953660 -2506189 275179 2010432 3331577
2740 3331577 5263550 6412568 4591929 1040899 -146631 2416372 5279391 5018660
2732 5018660 2771793 1907672 3081293 4089236 3541927 2152905 866826 145675 1002408
$$ packed form
2794B24738j044618j717871Q09650L681995L902323J141612k285217l830287l029902
2785b147577j265776K37835J159042J278916O32784L69971J415121K174819J95755
2776D050890l379297m306465j573963M81233j045081k570489J12770M165334L583808
2767d81260r84180k846381K26004K716353M33408l219194l356680q99793N62336
2758g849387J196502L165324N127381L868871K11156j693527p04109J04582j167623
2749B259170k727522k724834j774496p45408P59430K447471K781368J735253J321145
2740C331577J931973J149018j820639l551030j187530K563003K863019k60731
2732E018660k246867q64121J173621J007943n47309j389022j286079p21151Q56733
$$ plain form
2723 1002408 4131089 7404569 6774643 1189703 -5180726 -7460776 -5639801 -3771361
2715 -3771361 -4418119 -5997039 -5552860 -2298709 1988956 4758698 4569935 2343161 834812
2706 834812 1671427 3037174 1928403 -1388241 -3429854 -2477166 -840899 -792328 -901549
2697 -901549 1147296 4164644 5041510 3617498 2637211 3129341 3103473 1351221 -398687
2688 -398687 -238063 1320967 2758398 3707137 4487870 5067862 5650613 6916859 8607681
2679 8607681 9198113 8030090 6465302 5843271 5597659 4591551 3100659 2138366 1782183
2670 1782183 1402440 688510 -600916 -2844587 -5269247 -5462428 -1700208 4657793 10071076
2661 10071076 11617014 8522281 2386631 -3088957 -4253366 -1182467 1796999 857766
$$ packed form
2723A002408L128681L273480o29926n584940o370429k280050J820975J868440
2715c771361o46758j578920M44179L254151M287665K769742j88763k226774j508349
2706H34812Q36615J365747j108771l316644k041613R52688J636267M8571j09221
2697i01549K048845L017348Q76866j424012r80287M92130k5868j752252j749908
2688c98687J60624J559030J437431R48739P80733N79992N82751J266246J690822
2679H607681N90432j168023j564788o22031k45612j006108j490892r62293l56183
2670A782183l79743p13930j289426k243671k424660j93181L762220O358001N413283
2661A0071076J545938l094733o135650n475588j164409L070899K979466r39233
$$ plain form
2653 857766 -3023966 -5996272 -6201281 -4649356 -2457131 24504 1718768 1236732 -797823
2644 -797823 -1989248 -1294079 -187669 -277910 -1407325 -2695122 -3973731 -5370540 -6436653
2635 -6436653 -6429040 -5078043 -2908218 -1003332 -15283 890736 3076118 5779851 6042684
2626 6042684 2778740 -635272 -68934 4105619 7803593 8351899 6234625 2617501 -1564705
2617 -1564705 -4160721 -2912635 1098445 3821784 3045556 713713 -154244 1272298 3814663
2608 3814663 5408422 3751740 -1588890 -7291055 -9141074 -7166809 -5078046 -4461808
2600 -4461808 -3257760 -707133 558367 -774975 -2039569 -1203971 -393699 -1736781 -3112955
2591 -3112955 -1615776 1584548 3542721 4238476 5183895 5559242 3760512 981585 -756283
$$ packed form
2653H57766l881732k972306k05009J551925K192225K481635J694264m82036k034555
2644g97823j191425O95169J106410r0241j129415j287797j278609j396809j066113
2635f436653P613J350997K169825J904886R88049R06019K185382K703733K62833
2626F042684l263944l414012N66338M174553L697974N48306k117274l617124m182206
2617a564705k596016J248086M011080K723339p76228k331843q67957J426542K542365
2608C814663J593759j656682n340630n702165j850019J974265K088763O16238
2600d461808J204048K550627J265500j333342j264594Q35598Q10272j343082j376174
2591c112955J497179L200324J958173O95755R45419L75347j798730k778927j737868
$$ plain form
2582 -756283 -2437344 -5712944 -8398988 -7130914 -3488406 -2354737 -4410791 -5319420 -2734970
2573 -2734970 845565 3080291 4636091 5467320 3147417 -2352186 -6181832 -4228086
2565 -4228086 1512093 6191279 8528324 10909117 14628833 18098304 19311870 17876777
2557 17876777 14702670 11109194 8156902 6121496 4870602 4670906 5452776 5355013 2032939
2548 2032939 -3809303 -8032877 -7369581 -2766460 2409113 5935355 7491844 7489863 6658808
2539 6658808 5853501 5115456 3622441 1178397 -1282976 -3188615 -4931109 -6201978 -5164980
2530 -5164980 -558263 6133194 11516073 12952911 10389619 6481202 4800371 6598705
2522 6598705 9331289 9639119 7307184 4485079 1815392 -1748683 -5499368 -6918496
$$ packed form
2582g56283j681061l275600k686044J268074L642508J133669k056054r08629K584450
2573b734970L580535K234726J555800Q31229k319903n499603l829646J953746
2565d228086N740179M679186K337045K380793L719716L469471J213566j435093
2557A7876777l174107l593476k952292k035406j250894j99696P81870r7763l322074
2548B032939n842242m223574O63296M603121N175573L526242J556489j981q31055
2539F658808q05307p38045j493015k444044k461373j905639j742494j270869J036998
2530e164980M606717O691457N382879J436838k563292l908417j680831J798334
2522F598705K732584L07830k331935k822105k669687l564075l750685j419128
$$ plain form
2514 -6918496 -5839762 -5260868 -6724814 -8125922 -7637621 -6514000 -6017361 -4785319 -1635615
2505 -1635615 1974990 4717221 7457853 9808540 8184964 1283390 -5479066 -5803306
2497 -5803306 -953209 2353476 1187044 -1262946 -1777480 -490213 1849703 5138127
2489 5138127 7659948 6931088 3938066 2617412 3914439 4345856 2140592 769287 3616506
2480 3616506 8310930 9729853 6801623 3185969 2151858 3569489 5791398 8130931
2472 8130931 10658135 12707513 12714065 9834848 5362364 1637582 -651399 -2782949 -4937390
2463 -4937390 -4837255 -1438672 1829797 674790 -4023738 -7162026 -6256799 -3929633 -3258063
2454 -3258063 -4192627 -5497659 -6763742 -6970343 -4212882 1168548 5788666 7436209 7647561
$$ packed form
2514f918496J078734N78894j463946j401108M88301J123621M96639J232042L149704
2505a635615L610605K742231K740632K350687j623576o901574o762456l24240
2497e803306M850097L306685j166432k449990n14534J287267K339916L288424
2489E138127K521821p28860k993022j320654J297027M31417k205264j371305K847219
2480C616506M694424J418923k928230l615654j034111J417631K221909K339533
2472H130931K527204K049378O552k879217m472484l724782k288981k131550k154441
2463d937390J00135L398583L268469j155007m698528l138288R05227K327166O71570
2454c258063r34564j305032j266083k06601K757461N381430M620118J647543K11352
$$ plain form
2445 7647561 8210076 7787032 4569059 79661 -2573079 -2819630 -2403355 -2213572 -1824136
2436 -1824136 -1245805 -757056 345697 2714864 5253911 6316688 5944151 5198767 4209294
2427 4209294 2849288 2418041 4255829 7126301 8315304 7296314 6251084 6863652 8508632
2418 8508632 9878397 10638880 10897652 10353835 8703914 6311423 4191449 3478077 4446159
2409 4446159 5786080 5773569 4602095 4169213 4856693 4600949 2740389 2403243 6082232
2400 6082232 10463233 9598036 2996067 -3366679 -4966214 -4015394 -4889395 -7206033 -6560835
2391 -6560835 -1027602 5963491 9611101 8865449 6714896 6132677 6806169 6247993 3508345
2382 3508345 620963 107513 2204411 5261364 7708312 8551029 7164171 4291466 2434767
$$ packed form
2445G647561N62515m23044l217973m489398k652740k46551M16275J89783L89436
2436a824136N78331M88749J102753K369167K539047J062777l72537p45384r89473
2427D209294j360006m31247J837788K870472J189003j018990j045230O12568J644980
2418H508632J369765P60483K58772n43817j649921k392491k119974p13372R68082
2409D446159J339921j2511j171474m32882O87480k55744j860560l37146L678989
2400F082232M381001q65197o601969o362746j599535R50820q74001k316638O45198
2391f560835N533233O991093L647610p45652k150553n82219O73492n58176k739648
2382C508345k887382n13450K096898L056953K446948Q42717j386858k872705j856699
$$ plain form
2373 2434767 3359471 5635110 6412560 5207112 3994915 3902320 4021869 3619074 3383671
2364 3383671 4033693 5388717 7113100 8784598 9229914 7591261 4937946 2840283 786068
2355 786068 -2279498 -4241442 -1528546 4648700 7954516 5036089 386279 84687 3654286
2346 3654286 5908867 4830900 3281421 3532744 4178288 3130631 746596 -1060673 -1014596
2337 -1014596 823910 3250519 4681483 4790919 4973052 6013883 6256908 3820953 -341121
2328 -341121 -3786232 -6095962 -8408482 -10094400 -9138788 -5996060 -3865356 -4375031 -5886235
2319 -5886235 -6967865 -8499839 -10864415 -11937366 -9939162 -6073307 -2434591 518237
2311 518237 2495258 1982366 -902072 -2385812 633219 5666085 7686339 6198251 5322480
$$ packed form
2373B434767R24704K275639P77450j205448j212197r2595J19549m02795k35403
2364C383671O50022J355024J724383J671498M45316j638653k653315k097663k054215
2355G86068l065566j961944K712896O177246L305816k918427m649810l01592L569599
2346C654286K254581j077967j549479K51323O45544j047657k384035j807269M6077
2337a014596J838506K426609J430964J09436J82133J040831K43025k435955m162074
2328c41121l445111k309730k312520j685918R55612L142728K130704n09675j511204
2319e886235j081630j531974k364576j072951J998204L865855L638716K952828
2311E18237J977021n12892k884438j483740L019031N032866K020254j488088q75771
$$ plain form
2302 5322480 7084553 8890393 8522438 7543824 7795638 7903580 5897241 2830725 1017671
2293 1017671 496666 55275 281162 2453973 5243990 5863382 4515167 4470097 6918867
2284 6918867 8705651 6870948 3226506 2104543 4667467 7754658 8255558 6717472
2276 6717472 5920066 6976566 7985805 6641875 3488391 1666317 3096450 5828324
2268 5828324 6382999 4283196 2475307 2930673 3830946 2449493 -733979 -2803882 -2525520
2259 -2525520 -1543670 -1552816 -2343493 -3215609 -4585114 -7111188 -10247296 -12591933 -13089672
$$ packed form
2302E322480J762073J805840l67955r78614K51814J07942k006339l066516j813054
2293A017671n21005m41391K25887K172811K790017O19392j348215m5070K448770
2284F918867J786784j834703l644442j121963K562924L087191N00900j538086
2276F717472p97406J056500J009239j343930l153484j822074J430133K731874
2268E828324N54675k099803j807889M55366R00273j381453l183472k069903K78362
2259b525520R81850r146p90677q72116j369505k526074l136108k344637m97739
$$ [...]
##END NTUPLES=NMR SPECTRUM
##END=
