##TITLE=31Pdec_DE-76H_2_PH9
 D2O, 24 sc
 13.12.2024
##JCAMPDX= 6.0         $$ Bruker NMR JCAMP-DX V2.0
##DATA TYPE= NMR SPECTRUM
##DATA CLASS= NTUPLES
##ORIGIN= UXNMR, Bruker Analytische Messtechnik GmbH
##OWNER= root
$$ XWIN-NMR		Version 3.5
$$ Mon Jan 13 14:46:56 2025 Russian Standard Time (UT+4h)  she@DPX200
##.OBSERVE FREQUENCY= 81.013821
##.OBSERVE NUCLEUS= ^31P
##.ACQUISITION MODE= SIMULTANEOUS
##.ACQUISITION SCHEME= undefined
##.AVERAGES= 24
##.DIGITISER RES= 17
##SPECTROMETER/DATA SYSTEM= spect
##.PULSE SEQUENCE= zgpg30
##.SOLVENT NAME= CDCl3
##.SHIFT REFERENCE= (INTERNAL, CDCl3, 0, 198.062)
##AUDIT TRAIL= $$ (NUMBER, WHEN, WHO, WHERE, WHAT)
$$ ##TITLE= Audit trail, XWIN-NMR		Version 3.5
$$ ##JCAMPDX= 5.01
$$ ##ORIGIN= Bruker BioSpin GmbH
$$ ##OWNER= she
$$ F:/spectra/data/she/nmr/P31/2/pdata/1/auditp.txt
$$ ##AUDIT TRAIL=  $$ (NUMBER, WHEN, WHO, WHERE, WHAT)
(   1,<2025-01-13 14:45:35.29 +0400>,<she>,<DPX200>,
      <created by zg, POWCHK disabled, PULCHK disabled
       configuration hash MD5:
       00 E9 B6 7A A2 85 ED C7 34 08 36 98 17 FE 4E 26
       data hash MD5: 32K
       82 82 89 BC 3B 26 19 DD 0B 06 BE 89 64 CC 78 08>)
(   2,<2025-01-13 14:45:39.92 +0400>,<she>,<DPX200>,
      <Start of raw data processing
       efp BC_mod = 2 LB = 1.5 FT_mod = 6 PKNL = 1 PHC0 = 2120.58 PHC1 = 89.0856 SI = 64K 
       data hash MD5: 64K
       7E EB 1A FA 3F 27 14 56 3A 2B 01 7D 6E AD 39 3B>)
(   3,<2025-01-13 14:46:13.06 +0400>,<she>,<DPX200>,
      <pk PHC0 = -3.18972 PHC1 = -48.80001 
       data hash MD5: 64K
       73 49 3D 7E F7 87 A2 21 F1 0A FA 88 8C 22 71 8F>)
(   4,<2025-01-13 14:46:16.01 +0400>,<she>,<DPX200>,
      <abs ABSG = 5 
       data hash MD5: 64K
       B5 E2 12 9D 67 04 C2 28 5A 76 4E 42 D7 49 4A A4>)
$$ ##END=
$$ 
$$ hash MD5
$$ 35 69 F3 48 9D 9F BA 0A 48 32 8B 05 2B 84 5E 2E
##$RELAX= 
##$RELAX= 
##$RELAX= 
##$RELAX= 
##$RELAX= 
##$RELAX= 
##$RELAX= 
##$RELAX= 
$$ Bruker specific parameters
$$ --------------------------
##$DU= <F:/spectra>
##$EXPNO= 2
##$NAME= <P31>
##$PROCNO= 1
##$TYPE= <nmr>
##$USER= <she>
##$AMP= (0..31)
100 100 100 100 100 100 100 100 100 100 100 100 100 100 100 100 100 100 
100 100 100 100 100 100 100 100 100 100 100 100 100 100 
##$AQSEQ= 0
##$AQ_mod= 1
##$AUNM= <au_zg>
##$AUTOPOS= <>
##$BF1= 81.014009
##$BF2= 200.13
##$BF3= 200.13
##$BF4= 200.13
##$BF5= 200.13
##$BF6= 200.13
##$BF7= 200.13
##$BF8= 200.13
##$BYTORDA= 1
##$CFDGTYP= 0
##$CFRGTYP= 5
##$CHEMSTR= <none>
##$CNST= (0..31)
1 1 145 1 1 1 1 1 1 1 1 1 1 1 1 1 1 1 1 1 1 1 1 1 1 1 1 1 1 1 1 1 
##$CPDPRG= <waltz16>
##$CPDPRG1= <>
##$CPDPRG2= <waltz16>
##$CPDPRG3= <>
##$CPDPRG4= <mlev>
##$CPDPRG5= <mlev>
##$CPDPRG6= <mlev>
##$CPDPRG7= <mlev>
##$CPDPRG8= <mlev>
##$CPDPRGB= <>
##$CPDPRGT= <>
##$D= (0..31)
0 1 0 0 0 0 0 0 0 0.06 0 0.03 2e-05 3e-06 0 0 0.0002 0 0 0 0 0 0 0 0 0 
0 0 0 0 0 0 
##$DATE= 1736765134
##$DBL= (0..7)
120 120 120 11 120 120 24 19 
##$DBP= (0..7)
150 150 150 150 150 150 150 150 
##$DBP07= 0
##$DBPNAM0= <>
##$DBPNAM1= <>
$$ [...]
##$SUBNAM3= <"">
##$SUBNAM4= <"">
##$SUBNAM5= <"">
##$SUBNAM6= <"">
##$SUBNAM7= <"">
##$SUBNAM8= <"">
##$SUBNAM9= <"">
##$SW= 400.765351723535
##$SWIBOX= (0..15)
0 1 3 0 0 0 0 0 0 0 0 0 0 0 0 0 
##$SW_h= 32467.5324675325
##$TD= 32768
##$TD0= 1
##$TE= 0
##$TE2= 300
##$TE3= 300
##$TEG= 300
##$TL= (0..7)
0 120 53 12 22 120 120 120 
##$TP= (0..7)
150 150 150 150 150 150 150 150 
##$TP07= 0
##$TPNAME0= <>
##$TPNAME1= <>
##$TPNAME2= <>
##$TPNAME3= <>
##$TPNAME4= <>
##$TPNAME5= <>
##$TPNAME6= <>
##$TPNAME7= <>
##$TPOAL= (0..7)
0.5 0.5 0.5 0.5 0.5 0.5 0.5 0.5 
##$TPOFFS= (0..7)
0 0 0 0 0 0 0 0 
##$TUNHIN= 0
##$TUNHOUT= 0
##$TUNXOUT= 0
##$USERA1= <user>
##$USERA2= <user>
##$USERA3= <user>
##$USERA4= <user>
##$USERA5= <user>
##$V9= 5
##$VALIST= <valist>
##$VCLIST= <CCCCCCCCCCCCCCC>
##$VD= 0
##$VDLIST= <DDDDDDDDDDDDDDD>
##$VPLIST= <PPPPPPPPPPPPPPP>
##$VTLIST= <TTTTTTTTTTTTTTT>
##$WBST= 1024
##$WBSW= 4
##$XGAIN= (0..3)
0 0 0 0 
##$XL= 0
##$YL= 0
##$YMAX_a= 7217
##$YMIN_a= -7574
##$ZGOPTNS= <>
##$ZL1= 120
##$ZL2= 120
##$ZL3= 120
##$ZL4= 120
##$ABSF1= 198.0616
##$ABSF2= -202.7028
##$ABSG= 5
##$ABSL= 3
##$ALPHA= 0
##$AQORDER= 0
##$ASSFAC= 0
##$ASSFACI= 0
##$ASSFACX= 0
##$ASSWID= 0
##$AUNMP= <proc_1d>
##$AZFE= 0.1
##$AZFW= 0.5
##$BCFW= 0
##$BC_mod= 2
##$BYTORDP= 0
##$COROFFS= 0
##$CY= -3
##$DATMOD= 1
##$DC= 0
##$DFILT= <>
##$DTYPP= 0
##$F1P= 0
##$F2P= 0
##$FCOR= 1
##$FTSIZE= 65536
##$FT_mod= 6
##$GAMMA= 0
##$GB= 0
##$INTBC= 1
##$INTSCL= 9.790993e-09
##$ISEN= 30
##$LB= 1.5
##$LEV0= 0
##$LPBIN= 0
##$MAXI= 10000
##$MC2= 0
##$MEAN= 0
##$ME_mod= 0
##$MI= 50
##$NCOEF= 0
##$NC_proc= -8
##$NLEV= 6
##$NOISF1= 182.463
##$NOISF2= 159.3651
##$NSP= 0
##$NTH_PI= 0
##$NZP= 0
##$OFFSET= 198.0616
##$PC= 4
##$PHC0= 2117.39
##$PHC1= 40.28559
##$PH_mod= 1
##$PKNL= yes
##$PPARMOD= 0
##$PSCAL= 0
##$PSIGN= 0
##$REVERSE= no
##$SF= 81.0140089999434
##$SI= 65536
##$SIGF1= 159.3651
##$SIGF2= -187.1042
##$SINO= 113.3802
##$SIOLD= 16384
##$SREGLST= <1H.CDCl3>
##$SSB= 0
##$STSI= 65536
##$STSR= 0
##$SW_p= 32467.5324675325
##$SYMM= 0
##$S_DEV= 0
##$TDeff= 32768
##$TDoff= 0
##$TI= <>
##$TILT= no
##$TM1= 0
##$TM2= 0
##$TOPLEV= 0
##$USERP1= <user>
##$USERP2= <user>
##$USERP3= <user>
##$USERP4= <user>
##$USERP5= <user>
##$WDW= 1
##$XDIM= 65536
##$YMAX_p= 272614543
##$YMIN_p= -77361619
$$ End of Bruker specific parameters
$$ ---------------------------------
##NTUPLES= NMR SPECTRUM
##VAR_NAME=  FREQUENCY,     SPECTRUM/REAL,   SPECTRUM/IMAG
##SYMBOL=    X,             R,               I
##VAR_TYPE=  INDEPENDENT,   DEPENDENT,       DEPENDENT
##VAR_FORM=  AFFN,          ASDF,            ASDF
##VAR_DIM=   65536,         65536,           65536
##UNITS=     HZ,            ARBITRARY UNITS, ARBITRARY UNITS
##FACTOR=    0.49542278885378, 1,            1
##FIRST=     16045.7642231865, 0,            0
##LAST=      -16421.768244346, 0,            0
##MIN=       -16421.768244346, -77361619,    0
##MAX=       16045.7642231865, 272614543,    0
$$ Real data points
##PAGE= N=1
##DATA TABLE= (X++(R..R)), XYDATA
$$ [...]
41649I010226J642584j10524j506548k290433k511116k104242j255369m11305
41641D63273K59304P31733M76918j007297k798848k946882r57100J234431J715530
41632b828938R80639O35709P58041L52627j86924O27606K450972K766500M02758
41623E958990k487880l229860j894932l87134L89990Q01671R68174P82804P48514
41614A650337J092875O97469j264943l212357k810641n06298Q97868L67477n2314
41605c140527J221172K690767K070468l73052k271037k083194m53855Q07391M43121
41596a088746j009276j493430K08249K492787K701155Q24156m86464O6829P35222
41587B950482k6738j074010r51031n27649j109072j749573r28433N14419P70773
$$ plain form
41649 9010226 10652810 10542286 9035738 6745305 4234189 2129947 874578 463273
41641 463273 722577 1454310 1931228 923931 -1874917 -4821799 -5778899 -4544468 -2828938
41632 -2828938 -1848299 -1212590 -454549 -101922 -288846 338760 2789732 5556232 5958990
41623 5958990 3471110 241250 -1653682 -2040816 -1650826 -849155 119019 901823 1650337
41614 1650337 2743212 3440681 2175738 -1036619 -3847260 -4353558 -3455690 -3088213 -3140527
41605 -3140527 -1919355 771412 2841880 2468828 197791 -1885403 -2339258 -1531867 -1088746
41596 -1088746 -2098022 -3591452 -3383203 -890416 1810739 2634895 2148431 2215260 2950482
41587 2950482 2923744 1849734 898703 371054 -738018 -2487591 -3416024 -2901605 -2130832
41578b130832L15947R48348K285112K204762N70982m91320k85131n35009j919617
41569I63242k416823n24708K079188K771501J315752n56029j633748j842591j345233
41560a189449m40083K23538L61673M66301Q15552Q70817L93217K12357R27380
41551B641303J707615J480729N87705P4392p4803o91893j744455k222878j706503
41542E1212r02986m65454k57300m9694k7424j48964K03513J233604J910382J059106
41532B605995p86077j562930j85703J824793K079051L68028j150923r57455q2108
41523B152671k58010j264465j453789l78715O19836M74420k78169n76426k16256
41514a178903L17693O57195P26369N82119L61128J10003k62394n45167j75889
$$ plain form
41578 -2130832 -1814885 -866537 1418575 3623337 4194319 3702999 3417868 2882859 963242
41569 963242 -1453581 -1978289 100899 2872400 4188152 3632123 1998375 155784 -1189449
41560 -1189449 -1629532 -1405994 -1044321 -578020 237532 1108349 1501566 1713923 2641303
41551 2641303 4348918 5829647 6417352 6491744 6416941 5725048 3980593 1757715 51212
41542 51212 -851774 -1317228 -1574528 -1624222 -1651646 -1800610 -1597097 -363493 1546889 2605995
41532 2605995 1819918 256988 71285 1896078 3975129 4343157 3192234 2234779 2152671
41523 2152671 1894661 630196 -823593 -1202308 -582472 -108052 -386221 -962647 -1178903
41514 -1178903 -861210 -204015 522354 1104473 1465601 1575604 1313210 768043 592154
41505E92154P57314J108369K74146n01197J26505J190355P30164q19861j050141
41496B407808L86949R78266m01612j301916L56434K635614K474100L67066q25072
41487G077637n16640o01928j564645j756205q28039o95496k106385l029284j909409
41478e930394j88185J97370j26639M85319J595683J550302N90676N44344J554665
41469B73141J589784k48050k085744k020013p47619k5067J00816O48918J183683
41460a330151K62323j624267j941218J73818K127963J391764p25604r32368J258370
41451a339370K997607K289409L44847q40039j079166j011539m00980Q71512J424563
41442C256844j5958k243692k713363r29657R86516J271048N10081J83524N41398
$$ plain form
41505 592154 1349468 2457837 2731983 2230786 2357291 3547646 4277810 3457949 2407808
41496 2407808 2794757 3773023 3371411 2069495 2425929 5061543 7535643 7902709 7077637
41487 7077637 6560997 5959069 4394424 2638219 1810180 1114684 -991701 -4020985 -5930394
41478 -5930394 -6118579 -5921209 -6047848 -5562529 -3966846 -2416544 -1825868 -1281524 273141
41469 273141 1862925 1614875 -470869 -2490882 -3238501 -3263568 -3162752 -2513834 -1330151
41460 -1330151 -1067828 -2692095 -4633313 -4459495 -2331532 -939768 -1665372 -2597740 -1339370
41451 -1339370 1658237 3947646 4292493 3452454 2373288 1361749 960769 1832281 3256844
41442 3256844 3240886 997194 -1716169 -2645826 -1659310 -388262 121819 305343 846741
41433H46741P76000M79441Q369k74040l85518l61495J2119Q68124J770362J826817
41423E566920N49364j440804k876431l033792k136200o99002Q40950J781917J398199
41414d8879K3977r00121m98028M96864R53387P90726M82599L8864m78925k87904
41404E72560R42082J910587J188193n45558j348253p95557j89969j25306J74193
41395A782972P94047M87343j044798k062381j254337J47506K32806o69785o42842
41386b229469P92598K002732J634505K98040n60735n22441l37903o68647j227371
41377h18691j176487j65192J194578J952022J734968Q07914n15914j931941k701351
41368a620094j988971J0828J917373K568021K096857J261010L24734p72115j655572
$$ plain form
41433 846741 1622741 2102182 2110551 1836511 1450993 1089498 1101617 1969741 3740103 5566920
41423 5566920 6116284 4675480 1799049 -1234743 -3370943 -4069945 -3228995 -1447078 -48879
41414 -48879 -24902 -925023 -1423051 -926187 27200 817926 1300525 1339389 860464 572560
41404 572560 1514642 3425229 4613422 4067864 2719611 1924054 1734085 1608779 1782972
41395 1782972 2577019 3064362 2019564 -42817 -1297154 -1149648 -916842 -1586627 -2229469
41386 -2229469 -1436871 565861 2200366 2498406 1937671 1415230 1077327 408680 -818691
41377 -818691 -1995178 -2160370 -965792 986230 2721198 3529112 3013198 1081257 -1620094
41368 -1620094 -3609065 -3598237 -1680864 887157 2984014 4245024 4569758 3797643 2142071
41359B142071j795029j399199j237331j446163j192225J00385J628789J922019
41351a276683O82541o34112n02369P10922J172909L9456j361843j323689J1575
41342b481293J095502J115366N45202j79360j138312j895766j438874J54385J195630
41333c027520N62623n23562j82067J245291J544223j25663j870930j612511J88062
41324c802054J454557J416126J135699J221626O94653j033379k387698j395284
41316b695754J342161L131575K640212J214791M23484L3687o98713j335274j179858
41307B876311o75661m41894L9956J209006J840098N24973j865355l076443k456564
41298b025573j243765k61043O54538J132937M25184p31436n78121Q81770J625548
$$ plain form
41359 2142071 347042 -1052157 -2289488 -3735651 -4927876 -4827491 -3198702 -1276683
41351 -1276683 -594142 -1228254 -1730623 -1019701 153208 192664 -1169179 -2492868 -2481293
41342 -2481293 -1385791 -270425 274777 95417 -1042895 -2938661 -4377535 -4223150 -3027520
41333 -3027520 -2464897 -2988459 -3170526 -1925235 -381012 -506675 -2377605 -3990116 -3802054
41324 -3802054 -2347497 -931371 204328 1425954 2120607 1087228 -1300470 -2695754
41316 -2695754 -1353593 1777982 4418194 5632985 6056469 6090156 5391443 4056169 2876311
41307 2876311 2200650 1758756 1798712 3007718 4847816 5372789 3507434 430991 -2025573
41298 -2025573 -3269338 -3530381 -2875843 -1742906 -1317722 -2049158 -2627279 -1745509 -119961
41289a19961P39811k26189J28027R92357R64525J35657n29160o15731k08965M24445
41279A684816N82475j43329o59972M09133K140704K128474K17864j185128j168032
41270D007005j609586l244125l816277k137025o12335j023953j020781J678859
41262g778218M451037L476971K20043o72466J180532J651263p86484k776421j918120
41253b951863l04299l32972q07879K63729J828666J554888k40956r77525N33109
41244a435102K569231K559067n7969k919277k912417J19536K662626J858690n68157
41235A876228r41947Q31713J557542J99284q13286l50007o41666k869917m328959
41226e481015k543811O39684J932657J332705J030407J383254J112776L32163
$$ plain form
41289 -119961 619850 393661 521688 1514045 2478570 2614227 2085067 1469336 1260371 1684816
41279 1684816 2267291 2123962 1463990 1873123 4013827 6142301 6360165 5175037 4007005
41270 4007005 2397419 -846706 -4662983 -6800008 -7412343 -8436296 -9457077 -7778218
41262 -7778218 -3327181 149790 369833 -302633 877899 2529162 1742678 -1033743 -2951863
41253 -2951863 -3256162 -3589134 -4397013 -4133284 -2304618 -749730 -990686 -1968211 -1435102
41244 -1435102 1134129 3693196 3635227 715950 -2196467 -2076931 585695 2444385 1876228
41235 1876228 934281 1765994 3323536 3522820 2709534 2359527 1717861 -1152056 -5481015
41226 -5481015 -8024826 -7385142 -5452485 -4119780 -3089373 -1706119 -593343 -261180
41218b61180K60500N13580m04737k045628k139715j15095J807483J755513O57623
41209B8344N79273J742876K270808O20886k327095l890310k436080O52562K486274
41200b72462J941451M18198n22697p46305n24782K32359R49596L74606j282945
41191E67019j901047n14720Q01886j47897k272647k699289p64698J432187J904455
41182c594751N81673j249386j953996o33615J620153K443357J277188L76620J331328
41173A98571K327149J055578j229374j431910N45575J740775N81535j521924l023934
41164g57959l818753l658007j801508R82272K489827K059448J395633J653605
41156a455442J828358R81794o650j26979J07844l3884j01170L41263M75416m66061
$$ plain form
41218 -261180 -680 512900 108163 -1937465 -4077180 -4192275 -2384792 -629279 28344
41209 28344 607617 2350493 4621301 5242187 2915092 -975218 -3411298 -2758736 -272462
41200 -272462 1668989 2087187 1564490 818185 293403 525762 1475358 1849964 567019
41191 567019 -1334028 -1848748 -1046862 -1194759 -3467406 -6166695 -6931393 -5499206 -3594751
41182 -3594751 -3013078 -4262464 -6216460 -6850075 -5229922 -2786565 -1509377 -1132757 198571
41173 198571 2525720 3581298 2351924 920014 1465589 3206364 3787899 2265975 -757959
41164 -757959 -4576712 -8234719 -10036227 -9053955 -6564128 -4504680 -3109047 -1455442
41156 -1455442 372916 1354710 1348060 1221081 1328925 1295041 1193871 1535134 2010550 1544489
41146A544489j729276k083530j430302l52888R51376K173857K257587O12986j498230
41137D46069k013304m45502J567163K096146Q46185p63383j232949n99607j55554
41128b54736n10968p57795j71890K81570n60827j869209j855667n63789K94424
41119e968887J36330Q5889O06015O90071n8940n41973j01942M40372M41056L97870
41109c874139N23190J51502n84180l44839J100363J960166J050465l19839m02098
41100g39409N45991J141787Q10628l04530j887685k819952j678737R32775K331751
41091a667381J312963j88883l88490k88109j142531j746824q16640J48765n68423
41082e345553j406785p5417J971936J570495o33874r83739J100703K194886N93367
$$ plain form
41146 1544489 -184787 -2268317 -3698619 -4051507 -3100131 -926274 1331313 1944299 446069
41137 446069 -1567235 -2012737 -445574 1650572 2496757 1733374 500425 -99182 -254736
41128 -254736 -765704 -1523499 -1695389 -1413819 -1974646 -3843855 -5699522 -6263311 -5968887
41119 -5968887 -5832557 -5746668 -5140653 -4450582 -4509522 -5051495 -5153437 -4713065 -4272009 -3874139
41109 -3874139 -3350949 -3199447 -3783627 -4128466 -3028103 -1067937 -17472 -337311 -739409
41100 -739409 -193418 948369 1758997 1454467 -433218 -3253170 -4931907 -3999132 -1667381
41091 -1667381 -354418 -543301 -931791 -1219900 -2362431 -4109255 -4925895 -4777130 -5345553
41082 -5345553 -6752338 -6827755 -4855819 -3285324 -3919198 -4902937 -3802234 -1607348 -1013981
41073a013981j205245r81215J9384J35324J92713J178519J760774N28818j372956
41064g57865k089841j809799j606391j122349M63224K407016L322309L122408
41056A928712K407835J100756o45459j483847p07301J60354m34001j519052j422141
41047f14144q33964j334572j911515k96048K554639L001331L87629j455204L1523
41038d70325K102607R73704k322297l559884j505470Q84472J253167O96644J037453
41029i09929J809666J532562L73921k40370P4194L25066j01027o22299n42852
41020A698932k3535L16946J72978l21931q12280q82453l48847M58482R50308Q45357
41010B053957K57449o21101j475469j659548p31361O89146J285099N57386n95566
$$ plain form
41073 -1013981 -2219226 -3200441 -3181057 -3045733 -2853020 -1674501 86273 615091 -757865
41064 -757865 -2847706 -4657505 -6263896 -7386245 -6923021 -4516005 -1193696 1928712
41056 1928712 4336547 5437303 4791844 3307997 2600696 2761050 2327049 807997 -614144
41047 -614144 -1448108 -2782680 -4694195 -4990243 -2435604 565727 953356 -501848 -470325
41038 -470325 1632282 2605986 283689 -3276195 -4781665 -3897193 -2644026 -1947382 -909929
41029 -909929 899737 2432299 2806220 2565850 2640044 2965110 2864083 2241784 1698932
41020 1698932 1675397 1992343 2165321 1843390 1031110 148657 -200190 258292 1208600 2053957
41010 2053957 2311406 1690305 214836 -1444712 -2176073 -1486927 -201828 355558 -240008
41001b40008j098795q85385m80365o3068M51316Q88761J033037J027862R99354
40992A632709O55798j37576q04594q01806n35427o87779r41206m12837P16025
40983a316693J140888K92752p13482n31904O76138J565659J323172N36184M03605
40974C376319J310788K236838J720874m27538k681839l446254k815809k094356
40966b820977j894312j636361q61273L1506O24036J085063J480298J358499O29480
40957b004041O1673J56928K43897l73063r76643l93229R01256J113266j89855
40948a459811j219156n78246N77474L71620p10157m59153J529083L034249K452637
40939C538540Q94007l0871n99910j448604j425742M83529K296886J244462j587120
$$ plain form
41001 -240008 -1338803 -2224188 -2704553 -2767621 -2316305 -1427544 -394507 633355 1632709
40992 1632709 2288507 2150931 1346337 544531 9104 -678675 -1619881 -2032718 -1316693
40983 -1316693 -175805 116947 -596535 -1128439 -452301 1113358 2436530 2972714 3376319
40974 3376319 4687107 6923945 8644819 8217281 5535442 2089188 -726621 -2820977
40966 -2820977 -4715289 -6351650 -7212923 -7181417 -6557381 -5472318 -3992020 -2633521 -2004041
40957 -2004041 -1942368 -1785440 -1541543 -1914606 -2891249 -3284478 -2383222 -1269956 -1459811
40948 -1459811 -2678967 -3257213 -2679739 -2308119 -3018276 -3477429 -1948346 1085903 3538540
40939 3538540 4432547 4401676 3801766 2353162 927420 1410949 3707835 4952297 3365177
40930C365177k280948p5433J389598k196j502742l64654J473969Q98601r61511
40921A939861q67314P91064P63587j369971k571777j388235L10787J019042J347152
40912b5804J460400L29509j526412j924223p05300k17267r95166n69219J847168
40903b326314L238148J624242m91916l14510P90418K56898j082093j029710l70837
40894B94326j195082k507346j593762J178336K786233K234684J213640M71009
40886B882038q55066k325691k142554l66447R02115Q91529P54546O02384q12167
40877d69313k893711k976798l86136K138824K273026Q34169l76356r39096q81996
40868c677387J71606J652038K031390J238080Q77888J213681N72239j197034j704101
$$ plain form
40930 3365177 1084229 1008796 2398394 2396198 893456 528802 2002771 2901372 1939861
40921 1939861 1072547 1863611 2627198 1257227 -1314550 -2702785 -2391998 -1372956 -25804
40912 -25804 1434596 1764105 237693 -1686530 -2391830 -2609097 -3604263 -4173482 -2326314
40903 -2326314 911834 2536076 2044160 1729650 2520068 2776966 1694873 665163 294326
40894 294326 -900756 -3408102 -5001864 -3823528 -1037295 1197389 2411029 2882038
40886 2882038 2026972 -298719 -2441273 -2807720 -1905605 -1014076 -259530 342854 -469313
40877 -469313 -3363024 -6339822 -6725958 -4587134 -2314108 -1479939 -1856295 -2795391 -3677387
40868 -3677387 -3505781 -1853743 177647 1415727 2293615 3507296 4079535 2882501 1178400
40859A178400n2791J163713J7917j532546j198141m21144j664838l757275l530176
40850i796881q30222J533367K130225K086914K323654K415741K058969J353448
40842C275215m9416k022826k926059j743267k96666o97849j624991l33809K404106
40833d015562L130907J302154L8766P50091J072420n48974k086542j668671o41517
40824b666928n56750k07571J565322K803162J347832j228278j896463p87668j85420
40815a812762j73684J034144L000546L050339O09508j755355k261917j870148
40807a79329j503549l46664J687341K538503J004951r86447j243418o65150j346368
40798a040130k687087k180786M37974K560167K451358J300637Q46644R41173N47809
$$ plain form
40859 1178400 1125609 2289322 2307239 774693 -423448 -844592 -2509430 -6266705 -9796881
40850 -9796881 -10627103 -9093736 -6963511 -4876597 -2552943 -137202 1921767 3275215
40842 3275215 3225799 1202973 -1723086 -3466353 -3763019 -4460868 -6085859 -6419668 -4015562
40833 -4015562 -884655 417499 456265 1206356 2278776 1729802 -356740 -2025411 -2666928
40824 -2666928 -3223678 -3431249 -1865927 937235 2285067 1056789 -839674 -1627342 -1812762
40815 -1812762 -1986446 -952302 2048244 5098583 5708091 3952736 1690819 -179329
40807 -179329 -1682878 -2029542 -342201 2196302 3201253 2214806 971388 306238 -1040130
40798 -1040130 -3727217 -5908003 -5470029 -2909862 -458504 842133 1688777 2629950 3177759
40789C177759l63735j211517k011463k836868k776533q64579K162355M246029
40781d78552M198679K626142P34350p55883j401008r00001K66413Q79601L18766
40772E488507o99095j216947j222936j120874p52516R6484P65438M92068j42036
40763A688093J35702J150206J229201k33191j530593r09528R32320J801965Q69376
40754E133551o34151j289055q95573j5529Q43910J326927J267885R40879P93973
40745G472817Q15435O04452M6221n95374j141801j406453q08878R70673K889043
40736H846135L170141J440101o97309j721705j917443k348140k968709k765176
40728A037895j358871M05516J323708Q11900o02003j418529n13221J166127J269755
$$ plain form
40789 3177759 2814024 1602507 -408956 -3245824 -6022357 -6886936 -4724581 -478552
40781 -478552 3720127 6346269 7080619 6324736 4923728 4023727 4290140 5169741 5488507
40772 5488507 4789412 3572465 2349529 1228655 476139 572623 1338061 1830129 1688093
40763 1688093 1823795 2974001 4203202 3970011 2439418 1529890 2462210 4264175 5133551
40754 5133551 4499400 3210345 2314772 2299243 3143153 4470080 5737965 6678844 7472817
40745 7472817 8288252 8892704 8938925 8343551 7201750 5795297 4986419 5957092 8846135
40736 8846135 12016276 13456377 12759068 11037363 9119920 6771780 3803071 1037895
40728 1037895 -320976 84540 1408248 2220148 1618145 199616 -313605 852522 2122277
40719B122277p49228k356892j324979P97461P95478j339425k434746j140941J49054
40710e481941m99380j346503r4080K041468K200959M85864l82778M87069J142417
40701a446905N20485K50063J557840K803298J908993l56779j497964p93545J76304
40692C121790R6881p01676j423766j834068j749350p90812O79519J308060L21577
40683i71845j151074j235836L40541J894283J932906R03511K99704N79278P95015
40674C386483J68839q56192j414392j340491j001429n66006p0888J59387j72859
40665a707548p96560j183488j163831p30714L37674J894127K849748K225999O62009
40656B387416j94514J57809O01776K15123o09977j180116j429636j300816l96240
$$ plain form
40719 2122277 1373049 -983843 -2308822 -1511361 -715883 -2055308 -4490054 -5630995 -5481941
40710 -5481941 -5981321 -7327824 -7421904 -5380436 -3179477 -2693613 -3076391 -2589322 -1446905
40701 -1446905 -926420 -676357 881483 3684781 5593774 5236995 3739031 2945486 3121790
40692 3121790 3218671 2516995 1093229 -740839 -2490189 -3281001 -2601482 -1293422 -971845
40683 -971845 -2122919 -3358755 -3018214 -1123931 808975 1712486 2012190 2591468 3386483
40674 3386483 3555322 2699130 1284738 -55753 -1057182 -1623188 -1694076 -1534689 -1707548
40665 -1707548 -2504108 -3687596 -4851427 -5582141 -5244467 -3350340 -500592 1725407 2387416
40656 2387416 2192902 2350711 2952487 3167610 2557633 1377517 -52119 -1352935 -1749175
40647a749175R47864J339853J54211j177730r05491O08080J456061Q34316j83947
40638A324042m76032k42689k42746n71525p00604k83649M16627P53851L50035
40629C27310l40551l82556M56195J249509J030733p2379j287743k206862k641244
40620c867588k078735l42327J516830K120511J533745J134030J668081K390246
40612D074793K248418J043635p06271k209565k640499j835920q09524o32027q48408
40603b315368k02119J094936J433546M99267K3440Q97900J377425k43675k621645
40594e6293l064403j329607M45671J097459J383269J628505R19046o87737j414636
40585a078726m51847M71376k59684j463050j016320P01834J368813K07811j208683
$$ plain form
40647 -1749175 -801311 538542 692753 -484977 -1390468 -782388 673673 1507989 1324042
40638 1324042 848010 605321 362575 -208950 -909554 -1193203 -776576 -22725 327310
40629 327310 -13241 -395797 60398 1309907 2340640 2268261 980518 -1226344 -3867588
40620 -3867588 -5946323 -6288650 -4771820 -2651309 -1117564 16466 1684547 4074793
40612 4074793 6323211 7366846 6660575 4451010 1810511 -25409 -834933 -1466960 -2315368
40603 -2315368 -2517487 -1422551 10995 510262 533702 1431602 2809027 2565352 -56293
40594 -56293 -3120696 -4450303 -4004632 -2907173 -1523904 104601 1023647 335910 -1078726
40585 -1078726 -1530573 -1059197 -1318881 -2781931 -3798251 -3096417 -1727604 -1519793 -2728476
40576b728476j601078j388849j110715l74946Q35015J440427Q69124Q4076K8168
40567c947254K95621M20891J110802K672371L403672J538003j834824l798023
40559a38741l296334j867873q46697j7566O47410J96073j385852k310177j270212
40550a0289969P86410K231352K728478K535905J355898o02649j714095r10544
40542c879214L49583j4055j465460j531043N18619K649865K932871J713872M75984
40533A751022m3564J49K05351J07302n36942j236138j143456j89579P13076P29177
40523C56398j06745j119385j555604j096160k42749J51552J06170N29979J468694
40514a507850J505039R636j273088n84562R65405J015669l06495p69548J64970
$$ plain form
40576 -2728476 -4329554 -5718403 -6829118 -7204064 -6369049 -4928622 -4059498 -3975422 -3947254
40567 -3947254 -3651633 -3230742 -2119940 552431 3956103 5494106 3659282 -138741
40559 -138741 -3435075 -5302948 -6149645 -6167211 -5519801 -5323728 -6709580 -9019757 -10289969
40550 -10289969 -9503559 -7272207 -4543729 -2007824 -651926 -1254575 -2968670 -3879214
40542 -3879214 -3529631 -3543686 -5009146 -6540189 -6021570 -3371705 -438834 1275038 1751022
40533 1751022 1707458 1707607 1912958 2020260 1483318 247180 -896276 -1085855 -372779 356398
40523 356398 249653 -869732 -2425336 -3521496 -3764245 -3612693 -3506523 -2976544 -1507850
40514 -1507850 -2811 6825 -1266263 -1850825 -885420 130249 -176246 -945794 -780824
40505g80824O55174k13335j115794j052126o47944j26602J383919L402153L574900
40496E079521J187394j135493j028151M17459R68040P26158J012414J469040Q15146
40487I511528o22706j471142j576738j688977j726740j249681p31046n57779P9294
40478c3987J401003J649997j30846j507706J11993K920572K962068K09715j545107
40469F037702p78726l2540r30476j570749m92936M87123l47118j501924j060683
40460a90327m366q5835n87902l7188O88838J7250r79991j76634J532978J175565
40450A352388j380406k724159p86603K339896L550286K452600O56546p97414j713625
40441B949509j734854p40204L54333N28057O1646l1652L18311J85672p80093j679697
$$ plain form
40505 -780824 -125650 -338985 -1454779 -2506905 -3154849 -3281451 -1897532 1504621 5079521
40496 5079521 6266915 5131422 4103271 4520730 5488770 6214928 7227342 8696382 9511528
40487 9511528 8888822 7417680 5840942 4151965 2425225 1175544 444498 -113281 -33987
40478 -33987 1367016 3017013 2886167 1378461 1490454 4411026 7373094 7582809 6037702
40469 6037702 5258976 5226436 4295960 2725211 2232275 2719398 2372280 870356 -190327
40460 -190327 -194693 -280528 -868430 -905618 -216780 -199530 -1179521 -1356155 176823 1352388
40450 1352388 -28018 -2752177 -3538780 -1198884 2351402 4804002 5460548 4663134 2949509
40441 2949509 1214655 474451 828784 1356841 1418487 1386835 1705146 1890818 1110725 -568972
40431e68972j503780l42505P85113R39339M254j205327j519954m76828J145559
40422b743101K219603K581029K787147K637541J121358j593572l352993k469410
40414A187602j85270Q81855K79095j62908L44260L39107j073347k279330j389913
40405b058849J065193L049835L413777K149561l55022k832315l256194j223703
40397d7717R00482R58025j18718k98553J59438j88868q29733l35324L98003n77549
40387A9486k257418j729950P86443J959100Q93094M17006J666956J823310o64089
40378B913938k808427j940401j00336j27954o65143Q60332K923699K220277l81922
40369B894063r85505R28847J801471j35706k353646k184759j79542J643895K236941
$$ plain form
40431 -568972 -2072752 -2415257 -1630144 -690805 -686551 -1891878 -3411832 -3888660 -2743101
40422 -2743101 -523498 2057531 4844678 7482219 8603577 7010005 3657012 1187602
40414 1187602 1002332 1884187 2163282 2000374 2344634 2683741 1610394 -668936 -2058849
40405 -2058849 -993656 2056179 5469956 7619517 7264495 4432180 1175986 -47717
40397 -47717 852765 1810790 1692072 1393519 1552957 1364089 534356 199032 597035 19486
40387 19486 -2237932 -3967882 -3181439 -1222339 -329245 87761 1754717 3578027 2913938
40378 2913938 105511 -1834890 -1935226 -2063180 -2728323 -1867991 1055708 3275985 2894063
40369 2894063 1908558 2837405 4638876 4503170 2149524 -35235 -214777 1429118 3666059
40360C666059J403128m58716j879324j612468o56251r09351j888635j331264Q27934
40351b838888J973084R07167m15487l08401J25657o44959j846702j681210R3467
40342d636272K126255K937855J777728p03523k288756j265292J080426J819018
40334H47439L64477j049595j038882n66012k82188N95809J699835R62839j665742
40325a32020k967014j076848J406570J462939J89747K51624J026266l9524k576113
40316b454373l560443k014494r8642N74106Q36118J758445K889144L250152K399610
40307C579623L03795k344774l776501k672750M1899K249375L049124K797621J633941
40298D861353j99925j401439j105009o47565j592760k771900j965954R7583O07589
$$ plain form
40360 3666059 5069187 4610471 2731147 1118679 462428 -446923 -2335558 -3666822 -2838888
40351 -2838888 -865804 41363 -374124 -682525 -556868 -1201827 -3048529 -4729739 -4636272
40342 -4636272 -2510017 427838 2205566 1502043 -786713 -2052005 -971579 847439
40334 847439 1211916 162321 -876561 -1442573 -1724761 -1128952 570883 1533722 -132020
40325 -132020 -3099034 -4175882 -2769312 -1306373 -1116626 -865002 161264 121740 -2454373
40316 -2454373 -6014816 -8029310 -8127952 -7553846 -6717728 -4959283 -2070139 1180013 3579623
40307 3579623 3883418 1538644 -2237857 -4910607 -4868708 -2619333 429791 3227412 4861353
40298 4861353 4661428 3259989 2154980 1507415 -85345 -2857245 -4823199 -4725616 -4118027
40289d118027o27180q10213J037697K437180J734851O73120J003971J586692R95565
40280C913656L52023J020301J619436J13552k601763l869144k973721j254419
40272c680079N12333K295482L073047J647339q45067j677796j65970J428036J080570
40263C667895o19771j838313j750438p64829L45341Q67798N22289j35534l02247
40254g809m1161n4780l59081k05628N04734Q21838J89958o43248p13840q8928
40244e97945N42003Q83813J008623P92136Q9707p01816q50033j15932R44223J574846
40234C569625J529096J097302N69875o3626p53924j048322o07441L5869p4188
40225D254266r73291j665582j671636j737629k322769k375943q26095J365805
$$ plain form
40289 -4118027 -4745207 -5555420 -4517723 -2080543 -345692 327428 1331399 2918091 3913656
40280 3913656 4265679 5285980 6905416 7018968 4417205 548061 -2425660 -3680079
40272 -3680079 -3167746 -872264 2200783 3848122 3003055 1325259 1159289 2587325 3667895
40263 3667895 3048124 1209811 -540627 -1305456 -960115 -92317 429972 294438 -7809
40254 -7809 -48970 -103750 -462831 -668459 -163725 658113 848071 204823 -509017 -597945
40244 -597945 -55942 827871 1836494 2628630 2718337 2016521 1166488 1050556 1994779 3569625
40234 3569625 5098721 6196023 6765898 6702272 5948348 4900026 4292585 4328454 4254266
40225 4254266 3280975 1615393 -56243 -1793872 -4116641 -6492584 -7318679 -5952874
40217e952874K146628J180234K09116M34632J012635P40187m6715k35013K32103
40208b79067L75536k63285r71684q33817J41038J001007Q47925j50408q52032
40199i84787m48306N32249R44670N08860q5480l85888o06301p99174n60201J51425
40189a732933P65069J016868J274467J596935J411496N83344k05521p10033j588918
40180B410774k795851k798264p37212J687602K171400R54347J97263O30976Q84918
40171B605953K06405k83533L09753J150497J247045J006243J076829R30713r2608
40162H157297j324585j721123j531409j652980j915648j445790l72723K83071
40154a523890K86319L52565O28590M17040l48318p08628k17079L52590M13778
$$ plain form
40217 -5952874 -3806246 -2626012 -2416896 -1982264 -969629 -229442 -276157 -511170 -279067
40208 -279067 96469 -166816 -1138500 -1972317 -1831279 -830272 17653 -132755 -984787
40199 -984787 -1433093 -900844 43826 552686 467206 81318 -524983 -1324157 -1884358 -1732933
40189 -1732933 -967864 49004 1323471 2920406 4331902 4915246 4709725 3999692 2410774
40180 2410774 -385077 -3183341 -3920553 -2232951 -61551 892796 1090059 1721035 2605953
40171 2605953 2812358 2528825 2838578 3989075 5236120 6242363 7319192 8249905 8157297
40162 8157297 6832712 5111589 3580180 1927200 11552 -1434238 -1806961 -1523890
40154 -1523890 -1237571 -885006 -256416 160624 -187694 -896322 -1113401 -760811 -347033
40145c47033N02895J015847J110414j124j433213j601605m69828M28300J82761
40136f12586m28054l41870K76917M82429p7116q12533r96397n16448J11751L27972
40126b585935J98171M37316J442003K347362J673340p36311k964685k915727p93726
40117c898192J043668Q38209o45805j347905m89662Q03814J269140J050823J168490
40108b07420J969435K616861K001161j07279k700819m160890l476422j158525
40100e223898J122782K004746J456073L21998p16285j384177j445332p78204K24870
40091d417427R11004J117943J261561J622490J938157J771480R74539j84932j053624
40082C941191r48284J7639O58351n3802j564468k288055j564058k64657N35443
$$ plain form
40145 -347033 155862 1171709 2282123 2280999 847786 -753819 -1223647 -795347 -612586
40136 -612586 -1040640 -1382510 -1105593 -623164 -700280 -1512813 -2509210 -3025658 -2913907 -2585935
40126 -2585935 -2387764 -1950448 -508445 1838917 3512257 2775946 -188739 -3104466 -3898192
40117 -3898192 -2854524 -2016315 -2662120 -4010025 -4499687 -3695873 -2426733 -1375910 -207420
40108 -207420 1762015 4378876 6380037 6272758 3571939 -588951 -4065373 -5223898
40100 -5223898 -4101116 -2096370 -640297 -318299 -1034584 -2418761 -3864093 -4642297 -4417427
40091 -4417427 -3506423 -2388480 -1126919 495571 2433728 4205208 5179747 4994815 3941191
40082 3941191 2992907 3010546 3668897 3615095 2050627 -237428 -1801486 -2066143 -1530700
40073a530700N42414j44751j218353j687669n44796J529241K443822J437717J53299
40064I80224J3784J34933o37020j204188M880J822335J631335n00936j786163
40055D59184j005846k8066l10668o78950L7360O80153M226q32641k76267P74911
40045a176604O00003j79578J61949R50105j4311k266096k644837j23314K354099
40036b338584K190086O67359L40129J098036J135456K54735l48828o15555j323081
40027A059753j767567m65061J752334K063739j76453k082731j319038O33976J023385
40018G22337j86179j084578j277747j929959k844483k242753J58667K194145K230598
40009d259952J206373O85206O05721K69073P5701O52421J285547Q88548j58798
$$ plain form
40073 -1530700 -988286 -1133037 -2351390 -4039059 -4583855 -3054614 -610792 826925 980224
40064 980224 994008 1128941 491921 -712267 -707387 1114948 2746283 2245347 459184
40055 459184 -546662 -574728 -885396 -1564346 -1526986 -846833 -842607 -1675248 -1951515 -1176604
40045 -1176604 -576601 -756179 -594230 355875 341564 -1924532 -4569369 -4692683 -2338584
40036 -2338584 -148498 518861 858990 1957026 3092482 3347217 2998389 2382834 1059753
40027 1059753 -707814 -1172875 579459 2643198 2466745 384014 -935024 -301048 722337
40018 722337 536158 -548420 -1826167 -3756126 -6600609 -8843362 -8684695 -6490550 -4259952
40009 -4259952 -3053579 -2368373 -1762652 -1493579 -1417878 -765457 520090 1408638 1249840
40000A249840o93166o90846q95598j018582j23120J351610J775953P17158m74070
39991A199179p04367k35142M50492J197299J305613q371j744769j745943l1642
39982c17651O92141q44314k176004r55015J043694O19458j638970k249262m03051
39973f228974R13896k00569j839789j633879o9768J176148J985707K924127L298302
39964C25201K193859L98517n89662o93128p18674m93637O15535J871492J791805
39955D701308M46602o13161o75330m43755l18072Q6908M83791j24730j460545
39946B083016j790601o02434L11945l40340j130917j82140J639078J899113L13533
39937B200253q79884k44942J083165J361748M04140q34220j593998j558993p20207
$$ plain form
40000 1249840 556674 -134172 -1029770 -2048352 -2171472 -819862 956091 1673249 1199179
39991 1199179 494812 259670 710162 1907461 3213074 3204703 1459934 -286009 -317651
39982 -317651 374490 -469824 -2645828 -3600843 -2557149 -1937691 -3576661 -5825923 -6228974
39973 -6228974 -5315078 -5515647 -7355436 -8989315 -9059083 -7882935 -5897228 -2973101 325201
39964 325201 2519060 2917577 2327915 1634787 916113 422476 1038011 2909503 4701308
39955 4701308 5147910 4534749 3859419 3415664 3097592 3184500 3668291 3543561 2083016
39946 2083016 292415 -310019 1926 -338414 -1469331 -1651471 -12393 1886720 2200253
39937 2200253 1320369 1075427 2158592 3520340 3924480 3090260 1496262 -62731 -782938
39928g82938L76267R57345R78016R86887Q76688o4670j444912j529654L25667
39919F78696K225849K032361K31111r47383o56733p4487j70822n15274n42691
39910B260627n53666q71312j057644o32973J08870N27310L85883j48332p67649
39901g48886j032438o01095K96085R84451J072092P32865L43982K44198O15979
39892A907233J072327P68610k84066n65380J025328K966973K563818l02048k712789
39883F440006k559530j019598k65677m99347o99983q04160j268913j463569n04379
39874b645150P90306O94778p75504j740400j128400Q2930O39116N99342N60826
39865b922156M72958P1836k32770K34187J384405K344529K413686J685520O80339
$$ plain form
39928 -782938 -406671 550674 1528690 2515577 3392265 3327595 1882683 353029 678696
39919 678696 2904545 4936906 5168017 4220634 3563901 3489414 3318592 2803318 2260627
39910 2260627 1706961 835649 -221995 -854968 -746098 -218788 167095 18763 -748886
39901 -748886 -1781324 -2382419 -2086334 -1101883 -29791 703074 1047056 1291254 1907233
39892 1907233 2979560 3748170 3464104 2898724 3924052 6891025 9454843 9152795 6440006
39883 6440006 3880476 2860878 2595201 2095854 1395871 591711 -677202 -2140771 -2645150
39874 -2645150 -1854844 -1160066 -1935570 -3675970 -4804370 -4721440 -4082324 -3482982 -2922156
39865 -2922156 -2449198 -2377362 -2610132 -2375945 -991540 1352989 3766675 5452195 6132534
39856F132534l60508j500046k443826k440000j354770k98411k18307l02412P91103
39847a994643K336101K158524J79856r95658n2414R44571J66106p51890K73992
39838B264545J673933O56697j656006j640590P16917J502880p07971k423031q91273
39829e03899J633902J779844R7990p56185n29911p83158j335420o35531J007924
39820b4444J556545M60231p43958j032278q37916l45820Q87222K237032K085218
39811D241832L42453r27570l81751O46827K67871j114682j570533o15823J78224
39802A066848l85125j439740j452606m14561M15631N85936R09519J537920J071153
39793A894975j179579l151882k210382R50994K737904J385698q14112j001860
$$ plain form
39856 6132534 5772026 4271980 1828154 -611846 -1966616 -2265027 -2483334 -2785746 -1994643
39847 -1994643 341458 2499982 2679838 1684180 1631766 2576337 2742443 1990553 2264545
39838 2264545 3938478 4595175 2939169 1298579 2015496 3518376 2810405 387374 -503899
39829 -503899 1130003 2909847 3007837 2251652 1721741 938583 -396837 -1032368 -24444
39820 -24444 1532101 1992332 1248374 216096 -621820 -967640 -80418 2156614 4241832
39811 4241832 4584285 3656715 3274964 3921791 4189662 3074980 1504447 888624 1066848
39802 1066848 681723 -758017 -2210623 -2625184 -2209553 -1623617 -714098 823822 1894975
39793 1894975 715396 -2436486 -4646868 -3695874 -957970 427728 -386384 -1388244
39785a388244M03876R39163j03561r86221k21369J511149K222027P35646j881403
39776A231063k925093r20310K076154K540234J93354j431249j16683J796341J276989
39767C720800n50578l90701J847510L048578J731458m02811j824300k917849l795504
39758D66603l317506j416246N3201P4598J4709J097293K231345J873273N15676
39749A592946k49042K525N87376J056199J177940M79746r04924j642642p12131
39740A387993R54818J420429M0508j971491k983874k369215q34587K52530K40102
39731c862787R550P61200K040865K166414Q52153o9061P47747K220942K531353
39722G398376J568617N03285j19195n68396q95979r27131q31665p59889m31474
$$ plain form
39785 -1388244 -984368 -45205 -148766 -1134987 -1356356 154793 2376820 3112466 1231063
39776 1231063 -1694030 -2614340 -538186 2002048 2195402 764153 647470 2443811 3720800
39767 3720800 3170222 2779521 4627031 7675609 9407067 9004256 7179956 4262107 466603
39758 466603 -2850903 -4267149 -4213948 -4139350 -4124641 -3027348 -796003 1077270 1592946
39749 1592946 1343904 1346429 1933805 2990004 4167944 4647690 3742766 2100124 1387993
39740 1387993 2342811 3763240 3803748 1832257 -1151617 -3520832 -4355419 -4102889 -3862787
39731 -3862787 -3853237 -3092037 -1051172 1115242 1967395 1898334 2646081 4867023 7398376
39722 7398376 8966993 9470278 9351083 8782687 7886708 6959577 6127912 5368023 4936549
39713D936549J10998Q5796p68599j367223q33429m1378k69580j058330r72620
39704a77816K1838O42244M67747K58183J39039o10830j592338j088224J171207
39695g68950K721736J411601j297203j903795N21717L069250K782812K74777j524454
39686E287491j314492n46922o63642r16496P8569J745036K062079L90962j679611
39677D442974k481562j968097q96027L85280J562384J855930R47780k40156o67008
39668B941498n76810q23617j211070o52629J009214K363323K016566K79127j148652
39659D196950r89250L79050J495328J412771M75656m24020q18369o41701M8988
39650E135403O75746J75581j528032k682294j674243N79772J754753J257412L63227
$$ plain form
39713 4936549 5047547 5133343 4364744 2997521 2164092 2122714 1853134 794804 -177816
39704 -177816 -155978 486266 954013 1212196 1351235 740405 -851933 -1940157 -768950
39695 -768950 1952786 3364387 2067184 163389 685106 3754356 6537168 6811945 5287491
39686 5287491 3972999 3426077 2762435 1845939 1924508 3669544 5731623 6122585 4442974
39677 4442974 1961412 -6685 -902712 -517432 1044952 2900882 3848662 3608506 2941498
39668 2941498 2364688 1541071 330001 -322628 686586 3049909 5066475 5345602 4196950
39659 4196950 3207700 3586750 5082078 6494849 6970505 6546485 5728116 5086415 5135403
39650 5135403 5811149 5986730 4458698 1776404 102161 681933 2436686 3694098 4057325
39641D057325m94534k043996l477908k389650J279669L889048K658510n45095
39633B933369k114977j465331m58804J77943R33780J174898j27719j794907j494822
39624b236570O47537K115118J720351P32328J35798o26604j660306j819103p44769
39615a736220L17763N25892M53350N06046K11930l09232j57506L74679k34526
39606d7824j879360k162688M7494K461087K525242J046694O57042J899151K946360
39597G493198K530172J205754n1237r08791j331423j350505j252256j251371j128994
39588C954547p58238n83936r51562j400371j247039m39892O67122J782665K367412
39579C390708J619007m13863k292327k624028j619014m63242L79564J313986K292597
$$ plain form
39641 4057325 3562791 1518795 -1959113 -4348763 -3069094 819954 3478464 2933369
39633 2933369 818392 -646939 -1105743 -927800 5980 1180878 1053159 -741748 -2236570
39624 -2236570 -1589033 526085 2246436 2978764 3114562 2487958 827652 -991451 -1736220
39615 -1736220 -1418457 -892565 -439215 66831 278761 -30471 -187977 186702 -47824
39606 -47824 -1927184 -4089872 -4042378 -1581291 943951 1990645 2647687 4546838 7493198
39597 7493198 10023370 11229124 11177887 10269096 8937673 7587168 6334912 5083541 3954547
39588 3954547 3196309 2612373 1660811 260440 -986599 -1426491 -759369 1023296 3390708
39579 3390708 5009715 4595852 2303525 -320503 -1939517 -2402759 -2023195 -709209 1583388
39570A583388K333425O98243j809614l095996j641279J689239M080347L544585
39562G382338R60115j245572j873508j447627o29841K68532N29437l47762j229630
39553B366482m66149J385548K007777Q29637k17052o2328m0082r65846j353294
39544C484693k27359Q09680M23716Q4163J228796K089416M42499k158305k355112
39535C822187j68436J262921N99386m56270p10097q94741j196256n48492Q71722
39526B581924J297389L94172j6916P76129R97274m77361k003607j723190k29553
39517A596261Q38364J101094Q86854Q4248r17037p40062Q63852J844563N70654
39508F128791j502953j754284l2889J519441J622613R38971L13324k89549r78885
$$ plain form
39570 1583388 3916813 4615056 2805442 -290554 -1931833 -242594 3837753 7382338
39562 7382338 8342453 7096881 5223373 3775746 3145905 3414437 3943874 3596112 2366482
39553 2366482 1900333 3285881 5293658 6123295 5906243 5843915 5803833 4837987 3484693
39544 3484693 3257334 4067014 4490730 4574893 5803689 7893105 8335604 6177299 3822187
39535 3822187 3653751 4916672 5516058 5059788 4349691 3454950 2258694 1710202 2581924
39526 2581924 3879313 4273485 4256569 5032698 6029972 5552611 3549004 1825814 1596261
39517 1596261 2434625 3535719 4422573 4506821 3589784 2849722 3713574 5558137 6128791
39508 6128791 4625838 2871554 2838665 4358106 5980719 6919690 7233014 6943465 5964580
39499E964580j413303j325941p39475L18290J604648K355857J896083M15901j272513
39490G804127k347180k079889k82453J708100J660449p70794k907361k182456
39482F02543L94266J709030R65653M41588J635974K881109J896551q10653k585117
39473G130944j987646k41873N47698k82096j563127j747810n37845Q80898J222638
39464C421781N31516j42233l62794q41387j993724k704473j461046J422033L670076
39455A539749L512703J599611j18132q29120j222484j688591j522629l77432P01717
39446A595392O49301o7656l67682k91213m70534m71770N81461J917741J611419
39437D686459n08835k318088k354678j437935n04166J044959L325165M279647
$$ plain form
39499 5964580 4551277 3225336 2485861 2804151 4408799 6764656 8660739 9076640 7804127
39490 7804127 5456947 3377058 3094605 4802705 6463154 5692360 2784999 602543
39482 602543 996809 2705839 3671492 4113080 5749054 8630163 10526714 9716061 7130944
39473 7130944 5143298 4901425 5449123 5167027 3603900 1856090 1318245 2199143 3421781
39464 3421781 3953297 3811064 3448270 2606883 613159 -2091314 -3552360 -2130327 1539749
39455 1539749 5052452 6652063 6533931 5704811 4482327 2793736 1271107 893675 1595392
39446 1595392 2244693 2177037 1809355 1518142 1047608 575838 1157299 3075040 4686459
39437 4686459 4177624 1859536 -495142 -1933077 -2437243 -1392284 1932881 6212528
39429F212528K260035r68997k209374j062452J71993K57420M6029j23634j147975
39420C435573k626218k358466K51202K541916K108645K03333l69395O02906R94508
39411D784004j2244r63180q30882n02391r53134j630527j596825j076710q09778
39402c591667o64915k194J016628J555327J436034J336731J469257J037662l59906
39393C232957j545215j053350O25372J366319L05592q62674m16374O72191J57632
39384B482450j853649k727880j079073J225328J824763R77024M35636N28097K89882
39375B102578k25777P1217J099065J401943N18706k53560o7967J97617k57052
39366D586770o57652j31160O85354R06149J107409K125310L000818K021326n14071
$$ plain form
39429 6212528 8472563 7503566 5294192 4231740 4403733 4661153 4707182 4583548 3435573
39420 3435573 809355 -1549111 -1297909 1244007 3352652 3555985 3186590 3789496 4784004
39411 4784004 4771760 3808580 2977698 2475307 1522173 -108354 -1705179 -2781889 -3591667
39402 -3591667 -4256582 -4258776 -3242148 -1686821 -250787 1085944 2555201 3592863 3232957
39393 3232957 1687742 634392 1259764 2626083 2931675 2069001 1652627 2324818 2482450
39384 2482450 628801 -2099079 -3178152 -1952824 -128061 848963 1284599 1812696 2102578
39375 2102578 1876801 1948018 3047083 4449026 4967732 4714172 4646205 4843822 4586770
39366 4586770 3929118 3797958 4483312 5389461 6496870 8622180 11622998 13644324 13130253
39357A3130253k372620k276777j152518l12860J34162O59958J317973J849098
39349A0976669J921657J121550l77260j258564m55782R94687J091865p5742l69395
39340A3569685Q89381J697454O74370o77768o47661j82076q78079j768683p91901
39331A1884722J529793K666765J900384Q65583L82549m93704j881574k242110
39323A4612408j116275l76019j402099k834597k591810p58439R25477J414700
39315G873346R88388L87657L28866J093247J840667J273875l35393j009371J49034
39306A2590316J370706O60921j379901k636457k351648j302185K5333J565975
39298H543060K485520J814530K48747m13792J71205M67067m37081j337181o45826
$$ plain form
39357 13130253 10757633 8480856 7328338 7015478 7149640 7809598 9127571 10976669
39349 10976669 12898326 14019876 13642616 12384052 11928270 12922957 14014822 13939080 13569685
39340 13569685 14459066 16156520 16830890 16153122 15505461 15323385 14445306 12676623 11884722
39331 11884722 13414515 16081280 17981664 18847247 19229796 18736092 16854518 14612408
39323 14612408 13496133 13120114 11718015 8883418 6291608 5533169 6458646 7873346
39315 7873346 8861734 9249391 9578257 10671504 12512171 13786046 13450653 12441282 12590316
39306 12590316 13961022 14621943 13242042 10605585 8253937 6951752 6977085 8543060
39298 8543060 11028580 12843110 13091857 12678065 12849270 13316337 12879256 11542075 10896249
39289A0896249J383061K914382K511593M44665j598815j972757o48739P07806
39281A4637445O66661k74621o31204j43984J10040k90007m00202L95262J196703
39272A5266093Q57895l62753j193989q89857K36220J380204J798977J182509J8430
39263A8293729p01386n68173k04483j96676p7614Q67668K082428K059947M13785
39254B1969225j273428j319655r9985N64036K0298k67300J136566L355183M029743
39245B8114683K257965k01104r03571O98898K967801L920283K978026J120355
39237D0953336k96640p23365m24364M28681J992390L787786M406677L219419J812731
39228E5156651K287578M240857N047176L479742J448750J381308L284921N413578
$$ plain form
39289 10896249 12279310 15193692 17705285 18149950 16551135 14578378 13929639 14637445
39281 14637445 15304106 15029485 14398281 14254297 14364337 14074330 13674128 14069390 15266093
39272 15266093 16123988 15761235 14567246 13677389 13913609 15293813 17092790 18275299 18293729
39263 18293729 17592343 17024170 16819687 16623011 16545397 17413065 19495493 21555440 21969225
39254 21969225 20695797 19376142 19276157 19840193 19860491 19593191 20729757 24084940 28114683
39245 28114683 30372648 30171544 29267973 29966871 32934672 36854955 39832981 40953336
39237 40953336 40656696 39933331 39508967 39937648 41930038 45717824 50124501 53343920 55156651
39228 55156651 57444229 61685086 66732262 70212004 71660754 73042062 76326983 81740561
39220H1740561O604069O736921N919513M634097M048466M859644O232403O922578
39212A27698252O937664P095617P603300Q199185R011304R986105J0132438Q824766
39204A95488631P339300P439714Q679769Q744802O438286K830535n30231l008579
39196B33422227m443453m977945n676584p807029j0957585j3093766j3003306
39189A73462559j1621916j0505418j0032793r611707q781332p632963o711708
39182A08564722o612932p122640p072613n891008m721245m718231m907254l643523
39174F3875276j809330k084917m692739o401406m834282j612921K06291J7975
39166D2663947o67566j002663j337397j750400j762896j316833r23907r74194
$$ plain form
39220 81740561 88344630 95081551 101001064 105635161 109683627 114543271 120775674 127698252
39212 127698252 134635916 141731533 149334833 157534018 166545322 176531427 186663865 195488631
39204 195488631 202827931 210267645 218947414 227692216 234130502 236961037 236430806 233422227
39196 233422227 228978774 224000829 218324245 210517216 199559631 186465865 173462559
39189 173462559 161840643 151335225 141302432 131690725 122909393 115276430 108564722
39182 108564722 101951790 94829150 87756537 81865529 77144284 72426053 67518799 63875276
39174 63875276 62065946 59981029 55288290 48886884 44052602 42439681 42645972 42663947
39166 42663947 41996381 40993718 39656321 37905921 36143025 34826192 33902285 32928091
39158C2928091j487007k163808k353217j633643o53374m53793q22856o43225p3363
39149B2643805n68160k110765k504478o47859J452850J609803O50747O79082J568656
39140B2773681J497493M8376j497772k384500k782169k428104r58652O81158J164830
39131A6114341Q98699J216209J729710Q20502j127365j530059N52683K605623
39123B1280343J988504n84615k333092j999224p06792N0057m8352l48518k9619
39114A7268692J182273K531289K679397J121829j066027k313189k163962j410469
39106A7829833q34632l56114M50533J370696J522594M53227j022409j495916n00315
39097A7417497R65046J487571N35705j177697k169708j244290J164193K841386
$$ plain form
39158 32928091 31441084 29277276 26924059 25290416 24637042 24183249 23360393 22717168 22643805
39149 22643805 22075645 19964880 17460402 16812543 18265393 19875196 20525943 21205025 22773681
39140 22773681 24271174 24319550 22821778 20437278 17655109 15227005 14268353 14949511 16114341
39131 16114341 17013040 18229249 19958959 20779461 19652096 18122037 18674720 21280343
39123 21280343 23268847 22684232 20351140 18351916 17645124 17695181 17646829 17298311 17268692
39114 17268692 18450965 20982254 23661651 24783480 23717453 21404264 19240302 17829833
39106 17829833 16995201 16639087 17089620 18460316 19982910 20436137 19413728 17917812 17417497
39097 17417497 18382543 19870114 20405819 19228122 17058414 15814124 16978317 19819703
39089A9819703J999628l57614j502619n65967M94307L9004q95677n58378P17378
39080A9189765J274330O60607k17046p33829q29432k72851Q88712J668274J292929
39071B2921459M82644K83836L31484k58922r94393o99604M39462J262722J609576
39062B5378264K145750K654539K379209J745314J804465K211725J774453Q13127
39054D0906846P58038J398435R34862q42275j789284n86068J419987K474314K648955
39045D7323810K775889K799415K385235J959817K101267K733844L523833M255648
39037F9858758M604599M532667M849324O115601P251150O889386N821886O002376
39029A15925747P292374P727425P151888P683040R913049J1682551J1771860J1774630
$$ plain form
39089 19819703 21819331 21461717 19959098 19393131 19887438 19926442 19030765 18472387 19189765
39080 19189765 20464095 21124702 20907656 20173827 19344395 19071544 19960256 21628530 22921459
39071 22921459 23404103 23687939 24019423 23760501 22766108 22066504 22505966 23768688 25378264
39062 25378264 27524014 30178553 32557762 34303076 36107541 38319266 40093719 40906846
39054 40906846 41664884 43063319 43998181 43155906 41366622 40780554 42200541 44674855 47323810
39045 47323810 50099699 52899114 55284349 57244166 59345433 62079277 65603110 69858758
39037 69858758 74463357 78996024 83845348 89960949 97212099 104101485 109923371 115925747
39029 115925747 123218121 130945546 138097434 145780474 155693523 167376074 179147934 190922564
39021A90922564J2708979J2805292J0870740R079522R624509J0774494R300548
39014B66086648N247765J280130j556078m398177p613503j0181134j1818559j3244445
39006B23802647j4341114j4193439j3017321j2223527j2485225j3174639j3502081
38999A30865301j2875292j0655143p125271m234630l741817m949288n733795n360668
38991G6189397m797842m764665n013515n101910m518629k708122l08259O32022
38983D9608477p47641k481915k598257k169624l155413m606863m166023k414767
38975B7267974k086237l169693k663660K08694K293701J367165o01726r03392
38967B1712826l2360L8300o15233n00054M26676P08428l79453k067737l178294
$$ plain form
39021 190922564 203631543 216436835 227307575 236387097 246011606 256786100 266086648
39014 266086648 271334413 272614543 271058465 266660288 259046785 248865651 237047092 223802647
39006 223802647 209461533 195268094 182250773 170027246 157542021 144367382 130865301
38999 130865301 117990009 107334866 100209595 95974965 92233148 87283860 81550065 76189397
38991 76189397 71391555 66626890 61613375 56511465 51992836 49284714 48976455 49608477
38983 49608477 48860836 46378921 43780664 41611040 38455627 33848764 29682741 27267974
38975 27267974 25181737 22012044 19348384 19557078 21850779 23217944 22616218 21712826
38967 21712826 21680466 21718766 21103533 20603479 21030155 21738583 21359130 19291393 16113099
38958A6113099l065621j965286q84454m87729o8817J235898K418998J629777o96375
38949A4229490k016237j470074r53979j493434j372847M58400J863306Q46110
38941A0090735q35052l18920J705787K196610O53907m96206j98850k32452j796705
38932A0768854l368721l096846j344183L51119J357660J815092J552833L88599
38924H424407j068428j870717j719689r17983L30397J929988L272646L224033
38916A1604654J240128j471361k508495p62000J816322K031692o31812l100099
38908H219029k536769N2931J400863L79193r63971p05623M00393M01051j003731
38899E643366k147437j563308L24305J756522J515374m060j544801k367285k386813
$$ plain form
38958 16113099 13047478 11082192 10197738 9710009 9641192 10877090 13296088 14925865 14229490
38949 14229490 12213253 10743179 9789200 8295766 6922919 7381319 9244625 10090735
38941 10090735 9255683 8936763 10642550 12839160 13493067 12996861 12798011 12565559 10768854
38932 10768854 7400133 4303287 2959104 3310223 4667883 6482975 8035808 8424407
38924 8424407 7355979 5485262 3765573 2847590 3177987 5107975 8380621 11604654
38916 11604654 12844782 11373421 8864926 8102926 9919248 11950940 11319128 8219029
38908 8219029 5682260 5735191 7136054 7515247 6551276 5845653 6246046 6647097 5643366
38899 5643366 3495929 1932621 2256926 4013448 5528822 5524762 3979961 1612676 -774137
38890g74137j328353J042924L554357L902028J405795j504911k007336m60416
38882C829951L99396m66024j136894n587J601965J347833p56283k423271k078412
38873C12674m53346P80406Q79866K48689m06974o40132l89357K278L0002m52459
38863h8353j045288j232693p80994L55531K020650L382451L108897R22466j379496
38854E263171j724512o05988n70125k342782l298038j185838K231928L471706
38846A239522K231025J276903J726635J551597m41248k109823j256936Q18766
38838E036441J305445o3980j280915j473323j638570k201957k028736l05009K041200
38829f09404L291320K557490M58094j208142q90640Q49716J586916J00837j736784
$$ plain form
38890 -774137 -2102490 -1059566 2494791 6396819 7802614 6297703 4290367 3829951
38882 3829951 4229347 3763323 2626429 2620842 4222807 5570640 4814357 2391086 312674
38873 312674 -140672 639734 1519600 1768289 1361315 721183 331826 334104 364106 -88353
38863 -88353 -1133641 -2366334 -3147328 -2791797 -771147 2611304 5720201 6642667 5263171
38854 5263171 3538659 2932671 2362546 19764 -3278274 -4464112 -2232184 1239522
38846 1239522 3470547 4747450 6474085 8025682 7584434 5474611 4217675 5036441
38838 5036441 6341886 6277906 4996991 3523668 1885098 -316859 -2345595 -2650604 -609404
38829 -609404 2681916 5239406 5697500 4489358 3598718 4448434 6035350 6136187 4399403
38820D399403j555862M49L52184j008136j930024j036512N99032J669425K303418
38811C793377K680342K030929K60750j089681q98246j94113n02285j551000j973865
38802B556208j392124m77539L22420Q91608R49041N91630O18285J165607R00596
38793F125732r76839k765878k165726L11935J889098J446755P42548J220532J745856
38784G574013P08389j268614k294094j866962j018865m20607J24891N36606K38861
38775B313618p49339j604169j823551j698257j470815r03813N686O97913Q69059
38766d363668R42121J279703J568487J485096J341171J432537J302384M34666
38758E422497o90640j057604m39582M83581J180655J660891J876885J562770P93931
$$ plain form
38820 4399403 2843541 2843990 3196174 2188038 258014 -778498 -179466 1489959 3793377
38811 3793377 6473719 8504648 8765398 7675717 6777471 6583358 6081073 4530073 2556208
38802 2556208 1164084 686545 1008965 1900573 2849614 3441244 4059529 5225136 6125732
38793 6125732 5148893 2383015 217289 529224 2418322 3865077 4607625 5828157 7574013
38784 7574013 8282402 7013788 4719694 2852732 1833867 1413260 1538151 2074757 2313618
38775 2313618 1564279 -39890 -1863441 -3561698 -5032513 -5936326 -5930640 -5232727 -4363668
38766 -4363668 -3421547 -2141844 -573357 911739 2252910 3685447 4987831 5422497
38758 5422497 4731857 3674253 3234671 3718252 4898907 6559798 8436683 9999453 10793384
38749A0793384J6194o16014j276038j729863j334295r8696R14948P57709k09086
38740G218243p03791M5231J467862K176438J380298q8309m78510Q04338K292982
38731A4114782K228561P05680q18293j572431j775717j370730j45491R64941N68721
38722A2900023q91879j412058m93141O5428p49663j458130p90741j969o16286
38713F551584j655413j354566k36342J8310k49351O67257K477814K894709J092305
38704A0206307j197742k376974k655779k585786j897528n65273M91745N47866
38696c3164q0558o50752n78493M67583J990023K559281J569184M85803P46726
38687F475633J283013L71691q61291J68868K815717L379359O26648k251283k437092
$$ plain form
38749 10793384 10809578 10193564 8917526 7187663 5853368 5754672 6669620 7427329 7218243
38740 7218243 6514452 6559683 8027545 10203983 11584281 11495972 11017462 11821800 14114782
38731 14114782 16343343 17049023 16230730 14658299 12882582 11511852 11366361 12331302 12900023
38722 12900023 12008144 10596086 10102945 10168373 9418710 7960580 7169839 7167870 6551584
38713 6551584 4896171 3541605 3305263 3323573 3074222 3741479 6219293 9114002 10206307
38704 10206307 9008565 6631591 3975812 1390026 -507502 -1072775 -581030 -33164
38696 -33164 -113722 -764474 -1342967 -875384 1114639 3673920 5243104 5728907 6475633
38687 6475633 7758646 8130337 7269046 7437914 10253631 13632990 14259638 12008355 9571263
38678I571263j061927l51562k43387N0007j62645j253236j597835k04678J074804
38669E820804M71167o82886n75436l48482j635702k682064q65612K291191K954324
38660D747304J158836O65471K562936L576245J745715m83368o19911J37130j97959
38651A3292399q69284l88975L69667j28512j079224p41075M65908Q26334L35567
38642A2082805L77892J021663R71757o4026j061837j615318k225955k619809j672802
38633E194370N95494K513856K744484J575073o9815j617395k409115j600251O28592
38624G555293K601811K777636J437228J50755q9009L22564M04134k93143j362367
38615A3504902k096376k269184k226694k112508j403541K67709K115647K843140
$$ plain form
38678 9571263 8509336 8157774 7914387 7964394 7801749 6548513 4950678 4746000 5820804
38669 5820804 6291971 5609085 5033649 4685167 3049465 367401 -498211 1792980 4747304
38660 4747304 5906140 6571611 9134547 12710792 14456507 13973139 13353228 13490358 13292399
38651 13292399 12423115 12034140 12403807 12275295 11196071 10454996 10920904 11747238 12082805
38642 12082805 12460697 13482360 14454117 14390091 13328254 11712936 9486981 6867172 5194370
38633 5194370 5789864 8303720 11048204 12623277 12553462 10936067 8526952 6926701 7555293
38624 7555293 10157104 12934740 14371968 14522723 14433714 14756278 15160412 14867269 13504902
38615 13504902 11408526 9139342 6912648 4800140 3396599 3664308 5779955 8623095
38607H623095K309580J696025J731940J651747N56187r07502j230799k03734N99382
38598A4825921k21566k089902l084314k110899K209J594401J980844J816813J728672
38589A4442179J215397m47075k485900k923217j097875R90942Q51007j441648
38581I103810l452541l463428k065542n50846Q30726K255770L167843K918857
38573H744649J922470J076679M94740j66954n93271k34475M45324M49143j07098
38564A2031207j61587M03132M41146n40526j487333j393203o36851j04614k4911
38555H526460k50859o13623m32551J034129K897426K869456L48646k120677j966205
38546A0292202O9471J441314J490566J419314J412403M70771r66154r68316O56827
$$ plain form
38607 8623095 10932675 12628700 14360640 16012387 16568574 15661072 14430273 14226539 14825921
38598 14825921 14604355 12514453 9430139 7319240 7321449 8915850 10896694 12713507 14442179
38589 14442179 15657576 15210501 12724601 9801384 8703509 9694451 10545458 9103810
38581 9103810 5651269 2187841 122299 -428547 402179 2657949 5825792 8744649
38573 8744649 10667119 11743798 12238538 12071584 11478313 11243838 11689162 12138305 12031207
38564 12031207 11869620 12272752 12713898 12173372 10686039 9292836 8655985 8551371 8526460
38555 8526460 8275601 7661978 7229427 8263556 11160982 14030438 14379084 12258407 10292202
38546 10292202 10361673 11802987 13293553 14712867 16125270 16596041 15629887 14661571 15318398
38537A5318398J511658J50808j545124j084169J041009K207912J242108m90332
38529A8352268j220876p14011p5963m21256j748155k854647k674577j737752j524754
38520E380277k237591k386984j078061O16856J397783J503415J582189J138986
38512E916870k74487j396536p38253R23069J528094P64506Q652m07129j345045
38503D979741k193550r69551J957637L090212N56333k720658k932927n94192Q86446
38494B059491M08621k64376m27786j275834k493723j613121J785075M237480K924487
38485E340314k20430j387684k14569N10795n34246j805832j935741j464754j040869
38476b753016j58933J368100K379523J867028L74695q93770j420476j262474n97350
$$ plain form
38537 15318398 16830056 16980864 15435740 14351571 15392580 17600492 18842600 18352268
38529 18352268 17131392 16417381 16341418 15920162 14172007 11317360 8642783 6905031 5380277
38520 5380277 3142686 755702 -322359 294497 1692280 3195695 4777884 5916870
38512 5916870 5642383 4245847 3507594 4430663 5958757 6723263 6731915 6324786 4979741
38503 4979741 2786191 1816640 3774277 6864489 7420822 4700164 1767237 1173045 2059491
38494 2059491 2468112 2203736 1775950 500116 -1993607 -3606728 -1821653 2415827 5340314
38485 5340314 5119884 3732200 3517631 4028426 3494180 1688348 -247393 -1712147 -2753016
38476 -2753016 -2911949 -1543849 835674 2702702 3077397 2183627 763151 -499323 -1096673
38467a096673O3621J63512P0060P34762J969818K320487J283063L00542N90044
38458F399236J198851M59536j503193k970276k759926j153797P57640J800256
38450B228327J401887L21968N666O07927O98056l81634j315134j065494o66584
38441A834985j122010j196627L88912J969774J090230j157888j301753J014731
38433A520354K165441O5634k616687k436721J64958K213579K358564J533005O94608
38424E662735p351m26242m61615n96998j214703j755273j453752l56354J137792
38415E28239K866097M126043L434474N06296k340001k480551m08217P56666p44232
38406F244814l227512l863105j941431P42996K086906J647631O54957M40920R46808
$$ plain form
38467 -1096673 -1033052 -869540 -799480 -64718 1905100 4225587 5508650 5809192 6399236
38458 6399236 7598087 8057623 6554430 3584154 824228 -329569 428071 2228327
38450 2228327 3630214 3952182 3957848 4565775 5263831 4882197 3567063 2501569 1834985
38441 1834985 712975 -483652 -94740 1875034 2965264 1807376 505623 1520354
38433 1520354 3685795 3751429 1134742 -1301979 -1137021 1076558 3435122 4968127 5662735
38424 5662735 5655384 5229142 4767527 4170529 2955826 1200553 -253199 -609553 528239
38415 528239 3394336 7520379 10954853 11461149 9121148 6640597 6232380 6989046 6244814
38406 6244814 3017302 -845803 -2787234 -2044238 42668 1690299 2345256 2786176 3732984
38397C732984Q76884o27408k744561l672178k474013p3324J574588J376027K64373
38388a766628J67514J556803K644991J742736k66396j060686n9618J148712J460804
38379E568232J437450J468259P83792p60423j726109j210604m10377o50044j213747
38370C286429p55268K90678N19304m1869j85546K89554L61503m22685j339036
38361B003064j570590q86021M01553J305143P82956m97778j77874K514320M739501
38352H614274L378821n74553l390161l680004l252017l100327j859839Q94718
38344b969088K857847K222744M72192K5968P63450R17949K85550L80757J743160
38335F700529K895662K284036K47963j300494q79162Q79979J663591J00785k291396
$$ plain form
38397 3732984 4609868 3982460 1237899 -2434279 -4908292 -4981616 -3407028 -2031001 -1766628
38388 -1766628 -1599114 -42311 2602680 4345416 4079020 3018334 2958716 4107428 5568232
38379 5568232 7005682 8473941 9257733 8497310 6771201 5560597 5150220 4500176 3286429
38370 3286429 2531161 2821839 3341143 3299274 3113728 3403282 3764785 3342100 2003064
38361 2003064 432474 -453547 -51994 1253149 2036105 1538327 1360453 3874773 8614274
38352 8614274 11993095 11418542 8028381 4348377 1096360 -2003967 -3863806 -2969088
38344 -2969088 -111241 2111503 2583695 2609663 3373113 4291062 4576612 4957369 6700529
38335 6700529 9596191 11880227 12128190 10827696 9948534 10828513 12492104 12592889 10301493
38326A0301493k856923j403181m23071j276461k115760r51008R30541P43248j485913
38317A462965k760247j286581J287549K435114J888363J178823J161308J277067
38309F644361Q55294J0560q42532j580457k147549k206273j464105k37192O81141
38300b86752P98881L57558q5665k72370l07894l69212n77531r34374j094525m37805
38290c209689J189115K881071L294619J996600m7196j387293j325193k84013Q00800
38281C908821J373756J578570J669181J302691r7343k196905l598962l250362
38273F89447j572682J96406J318306J753279J576569Q84395J2126p11800j211841
38264B934205j332874p65704K28441O40534o5020j084184j314742p30650n2057
$$ plain form
38326 10301493 7444570 6041389 5618318 4341857 2226097 1275089 2205630 2948878 1462965
38317 1462965 -1297282 -2583863 -1296314 1138800 3027163 4205986 5367294 6644361
38309 6644361 7499655 7510215 6667683 5087226 2939677 733404 -730701 -967893 -286752
38300 -286752 512129 869687 784022 511652 203758 -165454 -742985 -1677359 -2771884 -3209689
38290 -3209689 -2020574 860497 4155116 6151716 6104520 4717227 3392034 3108021 3908821
38281 3908821 5282577 6861147 8530328 9833019 9735676 7538771 3939809 689447
38273 689447 -883235 -686829 631477 2384756 3961325 4845720 4857846 4146046 2934205
38264 2934205 1601331 835627 1064068 1704602 1639582 555398 -759344 -1489994 -1542051
38255a542051L14385K84361j89055n86766P7904J638943K333210J267248J42188
38246C740367P92043K140603J835188M2709j021350q84928j185584k192718k122579
38237A143751o60371o6678j362401k203516n28742J968808K364564Q37335m106
38228A488644Q57715J878033J645257N41923l98553q56190j120353j384119j371615
38219A280742o07957O18188Q73308p23703k591821k231355O0001J191522j46325
38210b277400j326088J24262K484633K360024k49968k139508j460632M44870J579590
38201d60217J428868M74613n51251p10953L27761J398913J045030m69806j644143
38192H38815j975776k177703k292341j350991P20580K343706K098827L80194j211573
$$ plain form
38255 -1542051 -1227666 -943305 -1132360 -1719126 -1641222 -2279 2330931 3598179 3740367
38246 3740367 4532410 6673013 8508201 8550910 7529560 6644632 5459048 3266330 1143751
38237 1143751 483380 416702 -945699 -3149215 -3677957 -1709149 655415 1492750 1488644
38228 1488644 2346359 4224392 5869649 6411572 6013019 5156829 4036476 2652357 1280742
38219 1280742 672785 1290973 2164281 1440578 -1151243 -3382598 -3322597 -2131075 -2277400
38210 -2277400 -3603488 -3479226 -994593 1365431 1115463 -1024045 -2484677 -2039807 -460217
38201 -460217 968651 1443264 892013 181060 508821 1907734 2952764 2482958 838815
38192 838815 -1136961 -3314664 -5607005 -6957996 -6237416 -3893710 -1794883 -1414689 -2626262
38183b626262j486153m98382O56105Q61901K27761j018P83751J579571J330806
38174H28080N53457K25969o0536j221989k540404k320756o13146N81306J63383
38165d404636o26135k35589J022042J628599R14196k42349m61052O56381J967263
38156B18720J934799N48745n12799j12305Q11005P47970k52088j095411j441025
38147H47611j579512j172835L07440K201102L115544K541400R44146j152109k955471
38138C097316l144013j422191L97593N73225r5802J63225J020934Q90060L2322
38129A512669M3557P18230M92298j43421R16076L158715L295663M62139j925721
38120H530205j319529J28522p26901l128978m056628k831429j156436J50137J533130
$$ plain form
38183 -2626262 -4112415 -4610797 -3954692 -3092791 -2865030 -2866048 -2082297 -502726 828080
38174 828080 1381537 1607506 1546970 324981 -2215423 -4536179 -5149325 -4568019 -4404636
38165 -4404636 -5030771 -5266360 -4244318 -2615719 -1701523 -1943872 -2404924 -1748543 218720
38156 218720 2153519 2702264 2189465 2077160 2888165 3636135 3384047 2288636 847611
38147 847611 -731901 -1904736 -1597296 603806 3719350 6260750 7204896 6052787 3097316
38138 3097316 -46697 -1468888 -1071295 -498070 -593872 -430647 590287 1480347 1512669
38129 1512669 1556226 2274456 2766754 2623333 3539409 6698124 9993787 10455926 8530205
38120 8530205 7210676 7339198 6612297 3483319 -573309 -3404738 -4561174 -4411037 -2877907
38111b877907K486920J769300j21100r77957J17903J518284J361586L8838m73761
38102B842106P58410K356684K201327Q0147j882722j861145n69063J49634J19231
38093D194609M85439J083637M40807j430897k563749j990587j030259q31226p54378
38084b396604j69400K54238J98765N70529J468866J391384j05480j091274k58466
38075a37442Q76075O26366j04852J29506N23605k46179j196509o12761Q96572
38066G54381J502649J091003N75077m01272k285269l335702j625022J445093K674657
38057C95595J554962K72354j82094o99609j224308o68132L08427j43395j409027
38048a795227q25444J576654K345836r5737k803374k727277p90596N34656J067356
$$ plain form
38111 -2877907 -390987 1378313 1257213 279256 397159 1915443 3277029 3315867 2842106
38102 2842106 3600516 5957200 8158527 8238674 6355952 4494807 3925744 4075378 4194609
38093 4194609 4680048 5763685 6204492 4773595 2209846 219259 -811000 -1642226 -2396604
38084 -2396604 -2566004 -2311766 -2113001 -1542472 -73606 1317778 1212298 121024 -137442
38075 -137442 738633 1364999 1260147 1389653 1913258 1667079 470570 -142191 754381
38066 754381 2257030 3348033 3923110 3521838 1236569 -2099133 -3724155 -2279062 395595
38057 395595 1950557 2222911 2040817 1341208 116900 -551232 -242805 -386200 -1795227
38048 -1795227 -2620671 -1044017 1301819 1206082 -1597292 -4324569 -5115165 -4580509 -3513153
38039c513153J846523K320206J339554l43894j059701q49293r41255j258443n68447
38030c027903J130223K234657J670611O9919j262458j530303o54039P11581J354268
38021F96556N94026o66890p22251Q33366K298751J625565j106974l428566l083286
38012b959703o87179R98731N96418k17217O66620K650088L359259J974627r2572
38003F289072j481353j982213j451521L10880K154624J974991n75988l208715
37995B029777l706968k346330q67691k13831j23723L502O40621J769472K472545
37986c42626J720574o9103j243008j012630k50036J15835J89054J49086l61141
37977a103995j179623j275685k72449Q22516J098831P64679J02356j105985k264393
$$ plain form
38039 -3513153 -1666630 653576 1993130 1649236 589535 -259758 -1201013 -2459456 -3027903
38030 -3027903 -1897680 336977 2007588 2077507 815049 -715254 -1369293 -657712 696556
38021 696556 1290582 623692 -98559 734807 3033558 4659123 3552149 123583 -2959703
38012 -2959703 -3646882 -2648151 -2051733 -2268950 -1602330 1047758 4407017 6381644 6289072
38003 6289072 4807719 2825506 1373985 1684865 3839489 5814480 5238492 2029777
37995 2029777 -1677191 -4023521 -4891212 -5105043 -5228766 -5225264 -4584643 -2815171 -342626
37986 -342626 1377948 1308845 65837 -946793 -1196829 -1080994 -891940 -742854 -1103995
37977 -1103995 -2283618 -3559303 -3831752 -3009236 -1910405 -1145726 -1043370 -2149355 -4413748
37968d413748j697869R75076L493070L452324J270847o26404p90204K55708J235069
37959C153869J198341J1348j327905j545591q76575q73193j753802j581851O47067
37950b948292K830047K601243R51561O04701J673620J679232k45580j924753j589860
37941C631919m42959m94010j499490j675244n87718L25968O6907m56654J14597
37932a016684J470158K001334J146710J70314J28811K80130m13849j314055j272699
37923A180170q69276j288636j577258J41819K725307K652173m70283k537280r46071
37914i89335J358073N96977j951264k358337l07892J051254M43392l08899j07367
37905b573398L8531l35053l89892l10472j332862k859576k482643K53405K785290
$$ plain form
37968 -4413748 -6111617 -5136541 -1643471 1808853 3079700 2453296 1663092 1918800 3153869
37959 3153869 4352210 4363558 3035653 1490062 613487 -259706 -2013508 -3595359 -2948292
37950 -2948292 -118245 2482998 3434559 4039260 5712880 7392112 7146532 5221779 3631919
37941 3631919 3188960 2694950 1195460 -479784 -1067502 -741534 -674627 -1131281 -1016684
37932 -1016684 453474 2454808 3601518 3771832 3900643 4180773 3766924 2452869 1180170
37923 1180170 310894 -977742 -2555000 -2413181 312126 2964299 2494016 -43264 -989335
37914 -989335 368738 965715 -985549 -3343886 -3651778 -2600524 -2157132 -2466031 -2573398
37905 -2573398 -2534867 -2869920 -3259812 -3570284 -4903146 -7762722 -10245365 -9991960 -7206670
37896g206670L171748K306913J557388P43111l13040o53345r0807j33410j482843
37887b100955k516292j762589q4041J083855J814830K432158K108045O42182j71857
37878A445336Q08364J660621J82567k205468k282310l8047J275559J31985j303713
37869c25106r81064J0361k39740j147338o31621J600378L581732L575201J719435
37860G162238o36770k120562j919760l04640J184293J004397n03339j284333j79895
37851B401629J420988J425218j07857j228440r36512k08975j156O1257K38534
37842C064686l61196j973159k731034r48204J989287L058904J542975m64673j294008
37833A883578j293694j059957l44352N96022N93618n07518j256722r28321p40266
$$ plain form
37896 -7206670 -4034922 -1728009 -170621 572490 259450 -393895 -484702 -618112 -2100955
37887 -2100955 -4617247 -6379836 -6463877 -5380022 -3565192 -1133034 975011 1617193 1445336
37878 1445336 2253700 3914321 4096888 1891420 -390890 -428937 846622 978607 -325106
37869 -325106 -1306170 -1295809 -1535549 -2682887 -3314508 -1714130 1867602 5442803 7162238
37860 7162238 6525468 4404906 2485146 2180506 3364799 4369196 3865857 2581524 2401629
37851 2401629 3822617 5247835 5139978 3911538 2975026 2766051 2764895 2826152 3064686
37842 3064686 2703490 730331 -2000703 -2948907 -959620 2099284 3642259 3177586 1883578
37833 1883578 589884 -470073 -814425 -218403 375215 -132303 -1389025 -2317346 -3057612
37824c057612j542441j986065o33250J447861K070010J049138J02281J48121M98411
37815a903546N44788N41404N21401q6477j226002j670388m57325J618654K563923
37806D46432J229613j411936l135497k641842p19335R03222J455046J370381J134001
37797a369915Q85454R48700J522556J811681P91912r68728j702521j017961n09646
37788C91532j212437k119791k085115j477953q38217L40718K027575K608824J307925
37779a056939Q8491Q99847K324865J612239p98420j729420r8252J574620R89512
37770C806543j094172k679437l053508k428029q56768J205451K510282K309763
37762b79875J176878j35383j546118k642520k159168K67175K694494K694105L74906
$$ plain form
37824 -3057612 -4600053 -6586118 -7219368 -5771507 -3701497 -2652359 -2550078 -2401957 -1903546
37815 -1903546 -1358758 -817354 -295953 -382430 -1608432 -3278820 -3736145 -2117491 446432
37806 446432 1676045 264109 -2871388 -5513230 -6232565 -5329343 -3874297 -2503916 -1369915
37797 -1369915 -484461 464239 1986795 3798476 4590388 3621660 1919139 901178 391532
37788 391532 -820905 -2940696 -5025811 -6503764 -7341981 -7001263 -4973688 -2364864 -1056939
37779 -1056939 -968448 -68601 2256264 3868503 3070083 1340663 1242411 2817031 3806543
37770 3806543 2712371 32934 -3020574 -5448603 -6305371 -5099920 -2589638 -279875
37762 -279875 897003 761620 -784498 -3427018 -5586186 -5319011 -2624517 69588 444494
37753D44494j562107r59669J386785K847858K090120M73428R4936R77368J136090
37744F929303n28417k630584l250560k346475j149968j73453P35404J135505N08296
37735g70949l93182m04909J53645J58527j27134M33263J386421J128558o8146
37726A496094j10615J212111J347868r28274l144242k728484q32273l19056j530414
37717e537285k413741j805601l35178J257118K645360L204571K562244J517008
37709A094496R53778M66523m58772q21562M00064J922666J594642k69301j344489
37700C538045r04825m95813q70163q67170n292K86862q41998k032508j861814
37691d054676q61840j00009N93328J547024J921245J077783M4301m216L59115
$$ plain form
37753 444494 -1117613 -2077282 -690497 2157361 4247481 4720909 4815845 5793213 6929303
37744 6929303 6400886 3770302 519742 -1826733 -2976701 -3150154 -2414750 -1279245 -770949
37735 -770949 -1164131 -1569040 -1415395 -1256868 -1384002 -950739 435682 1564240 1496094
37726 1496094 1385479 2597590 3945458 3017184 -127058 -2855542 -3687815 -4006871 -5537285
37717 -5537285 -7951026 -9756627 -10091805 -8834687 -6189327 -2984756 -422512 1094496
37709 1094496 2048274 2514797 2056025 1234463 1634527 3557193 5151835 4882534 3538045
37700 3538045 2633220 2137407 1267244 400074 394782 681644 -160354 -2192862 -4054676
37691 -4054676 -4916516 -5016525 -4423197 -2876173 -954928 122855 167156 162940 522055
37682E22055M2234n18809l22506J55812j37187o94513l98095K6730r36383k306469
37672d567131j293126K155258M375446K920243n1228j230125q43956j294127k578449
37663b407195k253372K71066K394068K044462M13734k22008L84014R81080J114953
37654B720802J125179O16980j125423l207823l371120q68719K080685K704409
37646F74970R28864p75222n83144O67580R31112l74413j837165j883651m44323
37637b695392J212572J739368P31021r01546j421152J15207K319105K421960m12681
37628C108462l505012l637716j101170Q92604P53220M07787J868501L870240L673692
37619F330608J064177j481860k232785j864331j526000j021231K88121J907811
$$ plain form
37682 522055 564289 45480 -277026 -121214 -258401 -952914 -1351009 -1324279 -2260662 -4567131
37672 -4567131 -5860257 -3704999 670447 3590690 3539462 2309337 1465381 171254 -2407195
37663 -2407195 -4660567 -4389501 -1995433 49029 462763 240755 624769 1605849 2720802
37654 2720802 3845981 4462961 3337538 129715 -3241405 -4110124 -2029439 674970
37646 674970 1603834 828612 245468 913048 1844160 1469747 -367418 -2251069 -2695392
37637 -2695392 -1482820 256548 987569 86023 -1335129 -1219922 1099183 3521143 3108462
37628 3108462 -396550 -4034266 -5135436 -4242832 -3489612 -3081825 -1213324 2656916 6330608
37619 6330608 7394785 5912925 3680140 1815809 289809 -731422 -443301 1464510
37611A464510K516453J451038n94330k111054j982035o11567K60219m51766j577560
37602a636092j107880Q78208K110938J309280o8686j48441O51535N99837n94726
37593A993973j608800j660562j291161j020195n97453J42020P66657R45449Q43890
37584a486182O09510K56017K01035R82624K135782K296507R41670p53155j353990
37575C829818q03362p3392J64585q1752m94346n81293L890P35031N26665n69203
37565B656641r36527K75752J399756M49550j645489k136533n94863N09060j25423
37556a48076n98484P49524K247988J522820m81044q73526O70782J664288Q52634
37547E606906l42492p58958j086699j658638j307599J35740N72986j191043k918072
$$ plain form
37611 1464510 3980963 5432001 4837671 2726617 744582 133015 393234 -58532 -1636092
37602 -1636092 -2743972 -1865764 245174 1554454 1485768 1337327 1988862 2588699 1993973
37593 1993973 385173 -1275389 -2566550 -3586745 -4184198 -4042178 -3275521 -2330072 -1486182
37584 -1486182 -876672 -620655 -419620 563004 2698786 4995293 5936963 5183808 3829818
37575 3829818 3026456 2953064 3117649 3035897 2541551 1960258 1964148 2699179 3225844 2656641
37565 2656641 1720114 1995866 3395622 3845172 2199683 63150 -531713 -22653 -148076
37556 -148076 -746560 2964 2250952 3773772 3292728 2419202 3089984 4754272 5606906
37547 5606906 5264414 4505456 3418757 1760119 452520 588260 1161246 -29797 -2947869
37538b947869j860677J152573K962050K500104J521586J390205J573166J362888
37530G654026R31793L74093m92459j133251q20740k82861r51808k344158k298504
37521F36131l87393J102400N97216m50922j20064R33897Q34236m01803j085340
37512A658358m99800M29646P82411N70109K48714L54091J254539K367807K223548
37503I389423L00893j867288k499060j730590q07028k1229R52306J421916L68665
37494E508008j446756j994937p50971O98519J014865M99086r1878n15294n06963
37485B413679J12500L98921r19654k999973l089946k40586K862765L203503J225071
37476B966280k96083j19129N84073O85183N02012N80134N86244J7217q15738j058433
$$ plain form
37538 -2947869 -4808546 -3655973 -693923 1806181 3327767 4717972 6291138 7654026
37530 7654026 8585819 8959912 8467453 7334202 6513462 6230601 5278793 2934635 636131
37521 636131 248738 1351138 1948354 1497432 1377368 2311265 3145501 2743698 1658358
37512 1658358 1158558 1588204 2370615 2940724 3189438 3543529 4798068 7165875 9389423
37503 9389423 9690316 7823028 5323968 3593378 2786350 2765121 3717427 5139343 5508008
37494 5508008 4061252 2066315 1315344 2013863 3028728 3527814 3435936 2920642 2413679
37485 2413679 2526179 2925100 2005446 -994527 -4084473 -4325059 -1462294 1741209 2966280
37476 2966280 2670197 2551068 3135141 3820324 4322336 4902470 5488714 5505931 4690193 3631760
37466C631760k83657R92175J678392J143632p7998r87719j452834k032076k452309
37457A59366j602260L91825J586321Q34800m12841m20136J01758l87129j075261
37448h23557M7057K387695L159375J744006M76394L18076q28289l767240n313830
37439b600313k862260Q90544J453881p62473j308959J230818L210866J750549
37431A002653j093786j740763N4582J795175J798590K44152j897810l245260k502652
37422e585119j62830J354958O72229o39883n53857M68997Q99026J051180K071231
37413d24068K986035J690363j313752k991161j949352o682R84497J352728J656190
37404A984798R72985j185112l062962k677443n67983J091682J339972R57916P90780
$$ plain form
37466 3631760 3348103 4340278 6018670 7162302 7084304 6096585 4643751 2611675 159366
37457 159366 -1442894 -1051069 535252 1370052 957211 537075 638833 251704 -823557
37448 -823557 -776500 1611195 4770570 6514576 6990970 7309046 6480757 2713517 -2600313
37439 -2600313 -5462573 -4572029 -3118148 -3880621 -5189580 -3958762 -747896 1002653
37431 1002653 -91133 -1831896 -1777314 17861 1816451 2060603 162793 -3082467 -5585119
37422 -5585119 -5747949 -4392991 -3720762 -4360645 -4914502 -4445505 -3546479 -2495299 -424068
37413 -424068 2561967 4252330 2938578 -52583 -2001935 -2008617 -1024120 328608 1984798
37404 1984798 2957783 1772671 -1290291 -3967734 -4535717 -3444035 -2104063 -1146147 -355367
37395c55367Q86288R44492N89231m61813j708418j883172m88867J216993J629804
37386C69171P22512k15556k87865L08721Q44531O57242l56667j344919j196923
37377d99753o4628O51468L02729j28676J70631M58739j19883r48874j063971p36821
37367a979039n74319j76037P74145J246297N11563n7444J022261K481384J901754
37358E150565m02428j773692j271189n89847p93152r61552o38752q02415j441300
37349c523762q89930J075140K057390P03821q11031j21902J536701J468431n5301
37340A439557m47259Q00949J322472l22293k514368l044602j951365q89720p56158
37331f362787r04329k93126J144801K209628J570987n29572k050722j263543J081674
$$ plain form
37395 -355367 530921 1475413 2064644 1602831 -105587 -1988759 -2477626 -1260633 369171
37386 369171 1091683 876127 588262 896983 1741514 2398756 2042089 697170 -499753
37377 -499753 -564381 87087 389816 261140 431771 890510 770627 -178247 -1242218 -1979039
37367 -1979039 -2553358 -2729395 -1955250 -708953 -197390 -254834 767427 3248811 5150565
37358 5150565 4748137 2974445 1703256 1113409 320257 -641295 -1280047 -2082462 -3523762
37349 -3523762 -4413692 -3338552 -1281162 -577341 -1388372 -1510274 26427 1494858 1439557
37340 1439557 992298 1793247 3115719 2793426 279058 -2765544 -4716909 -5606629 -6362787
37331 -6362787 -7267116 -7560242 -6415441 -4205813 -2634826 -3164398 -5215120 -6478663 -5396989
37322e396989K422177J263763j193974k467943j421186P24445J842694J172890
37314c054123p3043m31772L4235L36330M22576J126984K237478K196395M24664
37305C219724j425718j616586o54065k37772p27553j089591q82390q10561j308853
37296e533365j757887j354468p1615J327854J831825J007128k72609m24238R54614
37287d292761K408057K498609J565374O99472r6078j319602k255694j638760J34806
37278b296577J195793P94912J45171L23454Q35529Q64562N79891L67336j18022
37269B692049j121362j798815j117622O04222J846430J428650m78629k517892
37261d62969k987710j115652J897909L540880K408212k28700j849170j465466
$$ plain form
37322 -5396989 -2974812 -1711049 -2905023 -5372966 -6794152 -6069707 -4227013 -3054123
37314 -3054123 -3127166 -3558938 -3524703 -3188373 -2765797 -1638813 598665 2795060 3219724
37305 3219724 1794006 177420 -476645 -714417 -1441970 -2531561 -3413951 -4224512 -5533365
37296 -5533365 -7291252 -8645720 -8717335 -7389481 -5557656 -4550528 -4823137 -5247375 -4292761
37287 -4292761 -1884704 613905 2179279 2878751 2782673 1463071 -792623 -2431383 -2296577
37278 -2296577 -1100784 -305872 -160701 162753 998282 1862844 2442735 2810071 2692049
37269 2692049 1570687 -228128 -1345750 -741528 1104902 2533552 2054923 -462969
37261 -462969 -3450679 -4566331 -2668422 872458 3280670 3051970 1202800 -262666
37253b62666k92853K43753K19338M78345R48324O65841n83353j613092j290465
37244a486828K8239J185084J805668K232489K181715P79819j765966l694171l545122
37235b279073j720542L24013J609912J808701Q98385m40587r00724n3404Q42463
37226H9144N13066n06551p95258j36137N49019P83233O99343J11460j089328j975043
37216a757052j597743o88213o36233j033520k98609J229099J282387n73436j695893
37207e769213l00926J604412J301802l62368m10531J495782K619076J518840J10364
37198A807238L79936J265558N34497j568287k577364j344023N14839J021515K20860
37189B54769n83752q29396p98083m43910M87713J362847J103791k1918l71179
$$ plain form
37253 -262666 -555519 -311766 -92428 385917 1334241 2000082 1416729 -196363 -1486828
37244 -1486828 -1458589 -273505 1532163 3764652 5946367 6726186 4960220 1266049 -2279073
37235 -2279073 -3999615 -3675602 -2065690 -256989 641396 200809 -699915 -753319 89144
37226 89144 602210 95659 -699599 -835736 -286717 496516 1195859 1307319 217991 -1757052
37216 -1757052 -3354795 -4043008 -4679241 -5712761 -6011370 -4782271 -3499884 -4073320 -5769213
37207 -5769213 -6070139 -4465727 -3163925 -3526293 -3936824 -2441042 178034 1696874 1807238
37198 1807238 2187174 3452732 3987229 2418942 -158422 -1502445 -987606 33909 254769
37189 254769 -328983 -1158379 -1956462 -2400372 -1912659 -549812 553979 532061 160882
37180A60882P55044J939614J603596J21538r89873j137053q01462l47413R6607
37171A401480R7947m80930p38551J44118J342789J262028j86458j445003j391897
37162E523l87703O90695J309659J235494P11818N14363Q02838M23577j276144
37153D030120k598939j428690J307423K399455P36775j389437j845238j141366
37145G0103m98782K04429J154403J281154o7736j604252j860643j265072r88447
37136c574843q62678J5614J469923K400868K099895M85840j996727l851854l231469
37127g045431l53145K029068J836532J16975r44648r54179o53770J02123J579632
37118d286843K498473J462253n35038j145612J48858J741652K400316K254776
$$ plain form
37180 160882 915926 2855540 4459136 4580674 3590801 2453748 1652286 1304873 1401480
37171 1401480 1499427 1018497 279946 424064 1766853 3028881 2842423 1397420 5523
37162 5523 -382180 308515 1618174 2853668 3565486 4079849 4882687 5306264 4030120
37153 4030120 1431181 2491 1309914 3709369 4446144 3056707 1211469 70103
37145 70103 -428679 -224250 930153 2211307 2143571 539319 -1321324 -2586396 -3574843
37136 -3574843 -4437521 -4421907 -2951984 -551116 1548779 2034619 37892 -3813962 -7045431
37127 -7045431 -7398576 -5369508 -3532976 -3416001 -4360649 -5314828 -5968598 -5866475 -4286843
37118 -4286843 -1788370 -326117 -861155 -2006767 -1857909 -116257 2284059 4538835
37110D538835J619382N92453l48497q25739j286859j949819j791185j66064J467179
37101A849686J335144K1284o75842o16791p33675o00994N24225J052815j066937
37092A088915m073148l832629q8777K625686J590875l57361K64433K328748K582180
37083B128922Q50558m04895j65489M60324O94478O60489J16371j120691j932495
37074A287572j134634L69903N80759o44205j434357p37356L35305K92270q71547
37065a956290j982760k035593r69468M02534J195712J381186J555846J701994
37057g06839J078521k63980j031036n39354J21190j84011q44383o82572J17225
37048b935239P02505J221455K118243K524275J259210r53077k129217j717147
$$ plain form
37110 4538835 6158217 6750670 6402173 5576434 4289575 2339756 548571 382507 1849686
37101 1849686 3184830 3206114 2530272 1913481 1179806 578812 1103037 2155852 1088915
37092 1088915 -2984233 -6816862 -6905639 -4279953 -2689078 -3046439 -2782006 -453258 2128922
37083 2128922 2979480 2574585 2409096 2869420 3563898 4224387 4340758 3220067 1287572
37074 1287572 152938 522841 1103600 459395 -974962 -1712318 -1377013 -1084743 -1956290
37065 -1956290 -3939050 -5974643 -6944111 -6541577 -5345865 -3964679 -2408833 -706839
37057 -706839 371682 107702 -923334 -1462688 -1341498 -1525509 -2369892 -3052464 -2935239
37048 -2935239 -2232734 -1011279 1106964 3631239 4890449 3937372 1808155 91008
37040I1008q95775l55895K99052Q79191M02452r27690j428995m16039O97466P00894
37030i54331M01655Q99788J411564M27791j749699l241806l054048j918778p69223
37021h547087K98602J282863J646272J081031K35097j2359L24900N47600M20462
37012b722619M15130P03215O59396r5193p27297j84858J050451J341692K78282
37003G18199n12651L01407J636009J433496l62925j753076j525075o81596o01431
36994a347643j069210j012064l16795K20608L94590Q71647J799154K119301R59412
36985B619000q20207j434379n61086J06819o78376j617819n49238K103417L306212
36976B474343J377276j621996k640683j546073o21201r12333j126979k33508P89995
$$ plain form
37040 91008 -804767 -1160662 -861610 17581 420033 -507657 -1936652 -2352691 -1655225 -954331
37030 -954331 -552676 347112 1758676 2186467 436768 -2805038 -5859086 -7777864 -8547087
37021 -8547087 -8248485 -6965622 -5319350 -4238319 -4003222 -4015581 -3690681 -3143081 -2722619
37012 -2722619 -2307489 -1604274 -944878 -1040071 -1767368 -1952226 -901775 439917 718199
37003 718199 205548 506955 2142964 3576460 3213535 1460459 -64616 -746212 -1347643
36994 -1347643 -2416853 -3428917 -3745712 -3525104 -3130514 -2258867 -459713 1659588 2619000
36985 2619000 1798793 364414 -196672 -89853 -768229 -2386048 -2935286 -831869 2474343
36976 2474343 3851619 2229623 -411060 -1957133 -2578334 -3490667 -4617646 -4851154 -4061159
36967d061159O05830m39728r41982l04572Q94318J832756J964564J043372o04369
36958a0970k012026k334947j597649m22477O82627J479725J842938J828988J578971
36949A035180Q85646n98864k316085k701349j002695J294431J991865R85855L06192
36940a19824J107921J950910R86209j083517j655471K61617K509108K361150j36163
36931F181940k290494k010863o0803J214089P43403m23912r64103r98454j374772
36922A6031j873476j298209N26291K007203J785423O62270M33667J277192J649893
36913E186285P46044m15088q17485r93199j815089k781725k683121j379731J67523
36904d785586J226549J665033J381588M04169o53921j101650r02417k81772P18496
$$ plain form
36967 -4061159 -3455329 -3895057 -4837039 -5141611 -4247293 -2414537 -449973 593399 -10970
36958 -10970 -2022996 -4357943 -5955592 -6378069 -5695442 -4215717 -2372779 -543791 1035180
36949 1035180 1920826 1321962 -994123 -3695472 -4698167 -3403736 -1411871 -426016 -119824
36940 -119824 988097 2939007 3925216 2841699 1186228 1447845 3956953 6318103 6181940
36931 6181940 3891446 1880583 1819780 3033869 3777272 3353360 2389257 1390803 16031
36922 16031 -1857445 -3155654 -2629363 -622160 1163263 1825533 2259200 3536392 5186285
36913 5186285 5932329 5517241 4699756 3706557 1891468 -890257 -3573378 -4953109 -4785586
36904 -4785586 -3559037 -1894004 -512416 -108247 -762168 -1863818 -2766235 -3048007 -2329511
36895b329511J468125O22702j753677l012491j028237K195495K673876P7399j743490
36886b829809m57487J581127J284214p68842j894874j143130N77981K423413L457776
36877B230369K233626j029519l233030j974509Q15004J546725K27309j43597J212499
36868A884877J855485N40598r38055j261644j671885l005503l508652j681290
36860g786069R11140J921132J632285J763687K139850J133450j080748k190226
36852a555499r63519J061936J764031J017788L04969N35213J121640J038024J40383
36843D464966q38395j347740j563966j700481j302709J57905K198002L482049
36835C549631L093966J277449q82640k115751j756196n27071o1542q93533j547906
$$ plain form
36895 -2329511 -861386 -238684 -1992361 -5004852 -6033089 -3837594 -1163718 -1086319 -2829809
36886 -2829809 -3287296 -1706169 -421955 -1190797 -3085671 -4228801 -3650820 -1227407 2230369
36877 2230369 4463995 3434476 201446 -1773063 -958059 588666 815975 672378 1884877
36868 1884877 3740362 4280960 3342905 2081261 409376 -2596127 -6104779 -7786069
36860 -7786069 -6874929 -4953797 -3321512 -1557825 582025 1715475 634727 -1555499
36852 -1555499 -2519018 -1457082 306949 1324737 1629706 2164919 3286559 4324583 4464966
36843 4464966 3626571 2278831 714865 -985616 -2288325 -2130420 67582 3549631
36835 3549631 6643597 7921046 7038406 4922655 3166459 2639388 2577846 1684313 136407
36826A36407o06890J096860J750701J292922J020775R59291q6738j811822k176294
36817A575212n29131J209390J337665L52635p15979j809829k541678j612699Q42450
36808a891964K291797J100199q72484r92857L33515Q39389J45884j97657L02841
36799A058663N71384J82488j22566q7501j46529k9623R18742J989723J603992
36790E938773j85387j473614j208002m85959o01525j244475j361483p02347J91507
36781a132512P85226Q71426O61358P22972J278218J663406J166191J53811m58077
36772E712019n51342o63241q40727p38369n58882p04339p55099o4422Q66720R61881
36762B664199L16118o5291j05909o48877j629862j926460j222973m40889n0354
$$ plain form
36826 136407 -470483 626377 2377078 3670000 4690775 5650066 5563328 3751506 1575212
36817 1575212 1046081 2255471 3593136 3945771 3229792 1419963 -1121715 -2734414 -1891964
36808 -1891964 399833 1500032 627548 -365309 -31794 807595 953479 755822 1058663
36799 1058663 1630047 1812535 1689969 1602468 1455939 1426316 2345058 4334781 5938773
36790 5938773 5753386 4279772 3071770 2585811 1984286 739811 -621672 -1324019 -1132512
36781 -1132512 -347286 524140 1185498 1908470 3186688 4850094 6016285 6170096 5712019
36772 5712019 5160677 4497436 3656709 2918340 2359458 1655119 900020 835598 1702318 2664199
36762 2664199 2980317 2915026 2809117 2160240 530378 -1396082 -2619055 -3059944 -3110298
36753c110298M97439J340269J724388J310530N60887l59510j541078k141738j124922
36744b844033N88627Q06405o46037j568111r66176m69496j065243j098394O65519
36735f596939K396454J967170M52761K57617J183076J135197j42690q07793o2432
36726b17579Q55952Q00032j40133j502016k686247k578244p04396J527731K447496
36717b197404K426577K642764K363564J33287k741595l073302n41632J540146
36709E52405J083400j92700l63458m04717j584664k439740j175166P99620P92895
36700b932125q46049j338265J49025J638630J791562J481599J522302J296613
36692B763292M61508n6741K19456K85737o41937j805588k216355j941988j194070
$$ plain form
36753 -3110298 -2612859 -1272590 451798 1762328 2323215 1963705 422627 -1719111 -2844033
36744 -2844033 -2255406 -1449001 -2095038 -3663149 -4629325 -5098821 -6164064 -7262458 -6596939
36735 -6596939 -4200485 -2233315 -1780554 -1522937 -339861 795336 652646 -155147 -217579
36726 -217579 638373 1438405 1298272 -203744 -2889991 -5468235 -6172631 -4644900 -2197404
36717 -2197404 229173 2871937 5235501 5368788 2627193 -446109 -987741 552405
36709 552405 1635805 1443105 1079647 674930 -909734 -3349474 -4524640 -3725020 -2932125
36700 -2932125 -3778174 -5116439 -4967414 -3328784 -1537222 -55623 1466679 2763292
36692 2763292 3224800 3168059 3387515 3673252 3031315 1225727 -990628 -2932616 -4126686
36683d126686L87063K377499K986159J423275l01461K12020K308086L163056J689020
36674A0118031m57000j716400k417347l214656l553559k680335j007056M44805
36666d483517J177794J217876Q10422N84797J104199J811539J479184J96210l56120
36657C542384O61355J878228J766134O91556l35531j530345l202577l988159k439903
36648b956858L22189J861550J908438K135999K638740J527549j364469l234561
36640B838577k162759J29871J081587Q50028J058186J622756J228013P510o12693
36631F041076l55473l03086q18441j121801r16916o76649k35490J108666K759968
36622E481854K839197P41764j698846k398033j312809J03459P10447K65186q23405
$$ plain form
36683 -4126686 -3739623 -1362124 1624035 3047310 2745849 2957869 5265955 8429011 10118031
36674 10118031 9661031 7944631 5527284 2312628 -1240931 -3921266 -4928322 -4483517
36666 -4483517 -3305723 -2087847 -1277425 -692628 411571 2223110 3702294 3898504 3542384
36657 3542384 4203739 6081967 7848101 8539657 8204126 6673781 3471204 -516955 -2956858
36648 -2956858 -2634669 -773119 1135319 3271318 5910058 7437607 6073138 2838577
36640 2838577 675818 805689 1887276 2737304 3795490 5418246 6646259 6653769 6041076
36631 6041076 5685603 5382517 4564076 3442275 2525359 1848710 1613220 2721886 5481854
36622 5481854 8321051 9062815 7363969 4965936 3653127 3756586 4467033 4732219 3908814
36613C908814j559266j029209K50813N17891q95606k312223j875365j67164P09182
36604b452133J60932l85417K4292N29180J56741n09536l47235N08437R71658O44963
36594f98118J68780J57155O01974J139277J140733j48888k540489m159165l089492
36585g428233L9362K418572K411083J160225K76775l50291j175927j146127O59415
36576c135146K605214K226842O827j098185J9749J344029J289124Q59257J106953
36567E224664R50127o68176k415483k433096j115280m4262N52159J213304J322276
36558B586233R8052j376612j513204r00992j116552j458418J56466L074420L868182
36549C417575J201271k100540l048891k055577j001360p4095J394008K582997
$$ plain form
36613 3908814 2349548 1320339 1571152 2089043 1193437 -1118786 -2994151 -3161315 -2452133
36604 -2452133 -2291201 -2676618 -2652326 -2123146 -1966405 -2475941 -2823176 -2314739 -1343081 -698118
36594 -698118 -529338 -372183 229791 1369068 2509801 2360913 -179576 -4338741 -7428233
36585 -7428233 -7388871 -4970299 -2559216 -1398991 -1122216 -1472507 -2648434 -3794561 -3135146
36576 -3135146 -529932 1696910 1703737 605552 625301 1969330 3258454 4117711 5224664
36567 5224664 6174791 5506615 3091132 658036 -457244 -501506 50653 1263957 2586233
36558 2586233 2684285 1307673 -205531 -1106523 -2223075 -3681493 -3525027 -450607 3417575
36549 3417575 4618846 2518306 -530585 -2586162 -3587522 -3661617 -2267609 315388
36541C15388J966310k87087k402634l032285k067577j84197J319594J116516n09866
36532c765838j451745l66461J448698J989559J246603M58820j83019j100715j475748
36523c199846k13026J576132J511862m61193j759004r53652L77399M81362m9021
36514b688987P7596N60579N88844P34459J752082K494046J246308j263933k395744
36505A105250j262041J51897Q2827o65419n10132L10680M26997k93441o81556
36496a334938k27194L83667P10734J181534J935945K220080J525004M28624l45506
36487F477950r10515j502367j546991n06329P89342Q63631l78157j423090j166882
36478F96592k19679J99201j03607l37234P5720R05997J521423J507540R65211
$$ plain form
36541 315388 2281698 1994611 -408023 -3440308 -5507885 -5692082 -4372488 -3255972 -3765838
36532 -3765838 -5217583 -5584044 -4135346 -2145787 -899184 -440364 -623383 -1724098 -3199846
36523 -3199846 -3412872 -1836740 -324878 -786071 -2545075 -3498727 -3121328 -2639966 -2688987
36514 -2688987 -2611391 -2050812 -1461968 -727509 1024573 3518619 4764927 3500994 1105250
36505 1105250 -156791 -4894 77933 -587486 -1097618 -786938 -359941 -653382 -1334938
36496 -1334938 -1562132 -1178465 -467731 713803 2649748 4869828 6394832 6823456 6477950
36487 6477950 5567435 4065068 2518077 2011748 2801090 3664721 3286564 1863474 696592
36478 696592 476913 676114 572507 235273 310993 1216990 2738413 4245953 5211164
36469E211164L49630n2299l93194p85588q09394p1071Q64534Q76074k22811j317168
36459C649877j409419p52439k06000q4378j18978o9725J38700N51169J033028
36450B731835J249657J075242P46034M67227K42808J22140N5037m71030j806416
36441D412534l069856k806681j067915L78799N06632L61668R93571J449726L46863
36432A505341j589530k364207j517432l14881M74968J083935J161478j80078k288738
36423d029144k906214j115451J159265J662048O30864K2534Q40798K324454L131656
36414A720810K390632J74355k178532k797903j287311M53383L22028j461410k824444
36405e488392k431298p58910J114382K520815K922841J922560J46190q21019k05380
$$ plain form
36469 5211164 5560794 5508495 5115301 4329713 3520319 3449248 4313782 5189856 4967045 3649877
36459 3649877 2240458 1488019 1282019 1197641 1078663 1008938 1147638 1698807 2731835
36450 2731835 3981492 5056734 5802768 6269995 6512803 6634943 6689980 6218950 4412534
36441 4412534 1342678 -1464003 -2531918 -2153119 -1646487 -1284819 -291248 1158478 1505341
36432 1505341 -84189 -2448396 -3965828 -4280709 -3805741 -2721806 -1560328 -1740406 -4029144
36423 -4029144 -6935358 -8050809 -6891544 -5229496 -4598632 -4576098 -3735300 -1410846 1720810
36414 1720810 4111442 4285797 2107265 -690638 -1977949 -1524566 -1202538 -2663948 -5488392
36405 -5488392 -7919690 -8678600 -7564218 -5043403 -2120562 -198002 -51812 -872831 -1078211
36396a078211P98927M89981j028543j945088j205740J06791L95422k72924o31448
36387d370833m18740o80464j621979j704307O1476K103674K186409O89302R3230
36378c662232J229476K080768R92996p85599j100834p6745L75254m75845j386488
36369b809249j160705m9764J018069J499912J280047N07250l44596q58669j181806
$$ plain form
36396 -1078211 -279284 210697 -817846 -2762934 -3968674 -3861883 -3466461 -3739385 -4370833
36387 -4370833 -4789573 -5470037 -7092016 -8796323 -8734847 -6631173 -4444764 -3755462 -3662232
36378 -3662232 -2432756 -351988 641008 -144591 -1245425 -1322170 -946916 -1422761 -2809249
36369 -2809249 -3969954 -4019718 -3001649 -1501737 -221690 285560 -59036 -917705 -2099511
$$ [...]
##END NTUPLES=NMR SPECTRUM
##END=
