##TITLE=31Pdec_DE-76H_2_PH10
 D2O, 24 sc
 13.12.2024
##JCAMPDX= 6.0         $$ Bruker NMR JCAMP-DX V2.0
##DATA TYPE= NMR SPECTRUM
##DATA CLASS= NTUPLES
##ORIGIN= UXNMR, Bruker Analytische Messtechnik GmbH
##OWNER= root
$$ XWIN-NMR		Version 3.5
$$ Mon Jan 13 15:58:18 2025 Russian Standard Time (UT+4h)  she@DPX200
##.OBSERVE FREQUENCY= 81.013821
##.OBSERVE NUCLEUS= ^31P
##.ACQUISITION MODE= SIMULTANEOUS
##.ACQUISITION SCHEME= undefined
##.AVERAGES= 24
##.DIGITISER RES= 17
##SPECTROMETER/DATA SYSTEM= spect
##.PULSE SEQUENCE= zgpg30
##.SOLVENT NAME= D2O
##.SHIFT REFERENCE= (INTERNAL, D2O, 0, 198.062)
##AUDIT TRAIL= $$ (NUMBER, WHEN, WHO, WHERE, WHAT)
$$ ##TITLE= Audit trail, XWIN-NMR		Version 3.5
$$ ##JCAMPDX= 5.01
$$ ##ORIGIN= Bruker BioSpin GmbH
$$ ##OWNER= she
$$ F:/spectra/data/she/nmr/P31/2/pdata/1/auditp.txt
$$ ##AUDIT TRAIL=  $$ (NUMBER, WHEN, WHO, WHERE, WHAT)
(   1,<2025-01-13 15:57:11.06 +0400>,<she>,<DPX200>,
      <created by zg, POWCHK disabled, PULCHK disabled
       configuration hash MD5:
       00 E9 B6 7A A2 85 ED C7 34 08 36 98 17 FE 4E 26
       data hash MD5: 32K
       AB 57 D7 2B A8 80 E1 8E 44 0A A6 52 F7 84 CC D4>)
(   2,<2025-01-13 15:57:13.42 +0400>,<she>,<DPX200>,
      <Start of raw data processing
       efp BC_mod = 2 LB = 1.5 FT_mod = 6 PKNL = 1 PHC0 = 2117.39 PHC1 = 40.28559 SI = 64K 
       data hash MD5: 64K
       21 3A A0 B6 79 9F A5 EC 65 41 12 AE 74 87 77 1F>)
(   3,<2025-01-13 15:57:32.17 +0400>,<she>,<DPX200>,
      <pk PHC0 = -43.27842 PHC1 = 106.2 
       data hash MD5: 64K
       8D E5 39 58 53 27 32 70 95 4B 20 13 80 8C 95 36>)
(   4,<2025-01-13 15:57:45.12 +0400>,<she>,<DPX200>,
      <abs ABSG = 5 
       data hash MD5: 64K
       D2 64 39 1A 9D 64 35 A6 3E CD 1F 3B 3A 40 7D 78>)
$$ ##END=
$$ 
$$ hash MD5
$$ C3 8A 80 7D 6A 09 29 67 40 AE E0 01 C5 8B 8E 8D
##$RELAX= 
##$RELAX= 
##$RELAX= 
##$RELAX= 
##$RELAX= 
##$RELAX= 
##$RELAX= 
##$RELAX= 
$$ Bruker specific parameters
$$ --------------------------
##$DU= <F:/spectra>
##$EXPNO= 2
##$NAME= <P31>
##$PROCNO= 1
##$TYPE= <nmr>
##$USER= <she>
##$AMP= (0..31)
100 100 100 100 100 100 100 100 100 100 100 100 100 100 100 100 100 100 
100 100 100 100 100 100 100 100 100 100 100 100 100 100 
##$AQSEQ= 0
##$AQ_mod= 1
##$AUNM= <au_zg>
##$AUTOPOS= <>
##$BF1= 81.014009
##$BF2= 200.13
##$BF3= 200.13
##$BF4= 200.13
##$BF5= 200.13
##$BF6= 200.13
##$BF7= 200.13
##$BF8= 200.13
##$BYTORDA= 1
##$CFDGTYP= 0
##$CFRGTYP= 5
##$CHEMSTR= <none>
##$CNST= (0..31)
1 1 145 1 1 1 1 1 1 1 1 1 1 1 1 1 1 1 1 1 1 1 1 1 1 1 1 1 1 1 1 1 
##$CPDPRG= <waltz16>
##$CPDPRG1= <>
##$CPDPRG2= <waltz16>
##$CPDPRG3= <>
##$CPDPRG4= <mlev>
##$CPDPRG5= <mlev>
##$CPDPRG6= <mlev>
##$CPDPRG7= <mlev>
##$CPDPRG8= <mlev>
##$CPDPRGB= <>
##$CPDPRGT= <>
##$D= (0..31)
0 1 0 0 0 0 0 0 0 0.06 0 0.03 2e-05 3e-06 0 0 0.0002 0 0 0 0 0 0 0 0 0 
0 0 0 0 0 0 
##$DATE= 1736769430
##$DBL= (0..7)
120 120 120 11 120 120 24 19 
##$DBP= (0..7)
150 150 150 150 150 150 150 150 
##$DBP07= 0
##$DBPNAM0= <>
##$DBPNAM1= <>
$$ [...]
##$SUBNAM3= <"">
##$SUBNAM4= <"">
##$SUBNAM5= <"">
##$SUBNAM6= <"">
##$SUBNAM7= <"">
##$SUBNAM8= <"">
##$SUBNAM9= <"">
##$SW= 400.765351723535
##$SWIBOX= (0..15)
0 1 3 0 0 0 0 0 0 0 0 0 0 0 0 0 
##$SW_h= 32467.5324675325
##$TD= 32768
##$TD0= 1
##$TE= 0
##$TE2= 300
##$TE3= 300
##$TEG= 300
##$TL= (0..7)
0 120 53 12 22 120 120 120 
##$TP= (0..7)
150 150 150 150 150 150 150 150 
##$TP07= 0
##$TPNAME0= <>
##$TPNAME1= <>
##$TPNAME2= <>
##$TPNAME3= <>
##$TPNAME4= <>
##$TPNAME5= <>
##$TPNAME6= <>
##$TPNAME7= <>
##$TPOAL= (0..7)
0.5 0.5 0.5 0.5 0.5 0.5 0.5 0.5 
##$TPOFFS= (0..7)
0 0 0 0 0 0 0 0 
##$TUNHIN= 0
##$TUNHOUT= 0
##$TUNXOUT= 0
##$USERA1= <user>
##$USERA2= <user>
##$USERA3= <user>
##$USERA4= <user>
##$USERA5= <user>
##$V9= 5
##$VALIST= <valist>
##$VCLIST= <CCCCCCCCCCCCCCC>
##$VD= 0
##$VDLIST= <DDDDDDDDDDDDDDD>
##$VPLIST= <PPPPPPPPPPPPPPP>
##$VTLIST= <TTTTTTTTTTTTTTT>
##$WBST= 1024
##$WBSW= 4
##$XGAIN= (0..3)
0 0 0 0 
##$XL= 0
##$YL= 0
##$YMAX_a= 9076
##$YMIN_a= -9929
##$ZGOPTNS= <>
##$ZL1= 120
##$ZL2= 120
##$ZL3= 120
##$ZL4= 120
##$ABSF1= 198.0616
##$ABSF2= -202.7028
##$ABSG= 5
##$ABSL= 3
##$ALPHA= 0
##$AQORDER= 0
##$ASSFAC= 0
##$ASSFACI= 0
##$ASSFACX= 0
##$ASSWID= 0
##$AUNMP= <proc_1d>
##$AZFE= 0.1
##$AZFW= 0.5
##$BCFW= 0
##$BC_mod= 2
##$BYTORDP= 0
##$COROFFS= 0
##$CY= -3
##$DATMOD= 1
##$DC= 0
##$DFILT= <>
##$DTYPP= 0
##$F1P= 0
##$F2P= 0
##$FCOR= 1
##$FTSIZE= 65536
##$FT_mod= 6
##$GAMMA= 0
##$GB= 0
##$INTBC= 1
##$INTSCL= 9.790993e-09
##$ISEN= 30
##$LB= 1.5
##$LEV0= 0
##$LPBIN= 0
##$MAXI= 10000
##$MC2= 0
##$MEAN= 0
##$ME_mod= 0
##$MI= 50
##$NCOEF= 0
##$NC_proc= -8
##$NLEV= 6
##$NOISF1= 182.463
##$NOISF2= 159.3651
##$NSP= 0
##$NTH_PI= 0
##$NZP= 0
##$OFFSET= 198.0616
##$PC= 4
##$PHC0= 2074.112
##$PHC1= 146.4856
##$PH_mod= 1
##$PKNL= yes
##$PPARMOD= 0
##$PSCAL= 0
##$PSIGN= 0
##$REVERSE= no
##$SF= 81.0140089999434
##$SI= 65536
##$SIGF1= 159.3651
##$SIGF2= -187.1042
##$SINO= 113.3802
##$SIOLD= 16384
##$SREGLST= <1H.CDCl3>
##$SSB= 0
##$STSI= 65536
##$STSR= 0
##$SW_p= 32467.5324675325
##$SYMM= 0
##$S_DEV= 0
##$TDeff= 32768
##$TDoff= 0
##$TI= <>
##$TILT= no
##$TM1= 0
##$TM2= 0
##$TOPLEV= 0
##$USERP1= <user>
##$USERP2= <user>
##$USERP3= <user>
##$USERP4= <user>
##$USERP5= <user>
##$WDW= 1
##$XDIM= 65536
##$YMAX_p= 383090763
##$YMIN_p= -31196606
$$ End of Bruker specific parameters
$$ ---------------------------------
##NTUPLES= NMR SPECTRUM
##VAR_NAME=  FREQUENCY,     SPECTRUM/REAL,   SPECTRUM/IMAG
##SYMBOL=    X,             R,               I
##VAR_TYPE=  INDEPENDENT,   DEPENDENT,       DEPENDENT
##VAR_FORM=  AFFN,          ASDF,            ASDF
##VAR_DIM=   65536,         65536,           65536
##UNITS=     HZ,            ARBITRARY UNITS, ARBITRARY UNITS
##FACTOR=    0.49542278885378, 1,            1
##FIRST=     16045.7642231865, 0,            0
##LAST=      -16421.768244346, 0,            0
##MIN=       -16421.768244346, -31196606,    0
##MAX=       16045.7642231865, 383090763,    0
$$ Real data points
##PAGE= N=1
##DATA TABLE= (X++(R..R)), XYDATA
$$ [...]
43090e529965J97019n30373n77329N79580K353227L136635J983163p7018j235841
43081B99098j096130o47426l74560K29413J194804J604493J142097Q41050J422932
43072D615771J868162P76850j346284k361709j158773Q10784J186967m30418j940457
43063B020893j350920O54745J672086R03169Q6109N64797J071016j22827k152319
43054C346749k781862j944734j566320j965637j204707J254818K933806J925363
43046b524n7297k46181J145328J734174Q22450J2251K69444O80860M91064M44790
43036E294359J245106K018256J407867m47014j972438k048187j178112o07717
43028C712120o65904n12995L41259R52622J89095j315746j743100p75015k42824
$$ plain form
43090 -5529965 -5332946 -5863319 -6440648 -5861068 -3507841 -371206 1611957 1534939 299098
43081 299098 -797032 -1444458 -1819018 -1589605 -394801 1209692 2351789 3192839 4615771
43072 4615771 6483933 7260783 5914499 3552790 2394017 3204801 4391768 3961350 2020893
43063 2020893 669973 1324718 2996804 3899973 3986082 4550879 5621895 5499068 3346749
43054 3346749 564887 -1379847 -2946167 -4911804 -6116511 -4861693 -1927887 -2524
43046 -2524 -59821 -306002 839326 2573500 3395950 3408201 3677645 4358505 4849569 5294359
43036 5294359 6539465 8557721 9965588 9518574 7546136 5497949 4319837 3712120
43028 3712120 3046216 2533221 2874480 3827102 4016197 2700451 957351 182336 -60488
43019f0488j364334k689444k064516K80298K064149J889376M76412p59095j041492
43010c269134k29603J254838K328316K092416R58270J02840j80888o12730j368567
43001A075758j564876p06072L50619N20156q0281m52038n7333O72339R29975L01749
42991I89996q45764j538119j016651L92867J451633J236520M1235j051305j293927
42982a633515q22148k30630J46444M07993O29389N75699J51174j61384J02739
42973h34239M76672N6367r59757j186579j3895J238287R61403n54495j510242
42964b326478q54332O74862J587258J074585m05916j483396j114552J37792O32806
42955b077371j06012n97088L43356J617105J453188J42627n42719j40148K19666
$$ plain form
43019 -60488 -1424822 -4114266 -6178782 -5898484 -3834335 -1944959 -1468547 -2227642 -3269134
43010 -3269134 -3498737 -2243899 84417 2176833 3135103 3237943 3057055 2444325 1075758
43001 1075758 -489118 -1195190 -844571 -324415 -404696 -856734 -914067 -241728 688247 989996
42991 989996 144232 -1393887 -2410538 -2017671 -566038 670482 711717 -339588 -1633515
42982 -1633515 -2455663 -2686293 -2539849 -2131856 -1502467 -926768 -775594 -936978 -834239
42973 -834239 -357567 -301200 -1260957 -2447536 -2461431 -1223144 -261741 -816236 -2326478
42964 -2326478 -3180810 -2505948 -918690 155895 -250021 -1733417 -2847969 -2710177 -2077371
42955 -2077371 -2183383 -2780471 -2437115 -820010 633178 775805 233086 92938 312604
42946C12604J39580M58962J133842P49091r96712k206341j461556q9113k06239
42937b165882j545611j922934l95929J598857K255381J352213J2655o22043k18732
42928a652025O68078J073250M59976p85211j781842j986432j514534q59628m39582
42919f817950k28622K16642J107048J863143J706714Q38428L63035Q04955J371833
42910A225226J111953J94660n35360q01016r80099j179792r56462p8518R14214
42901a085194J213504O85289P4581J43753P35982J031944P46226N05110P67095
42892D818290J072380R45084P66316Q06676J81258j767887l560105k939703j76058
42883A46251J976887K036591J439694J599084J528245K8315j593556j234669O31295
$$ plain form
42946 312604 452184 911146 2044988 2794079 1797367 -408974 -1870530 -1959643 -2165882
42937 -2165882 -3711493 -5634427 -6030356 -4431499 -2176118 -823905 -811250 -1433293 -1652025
42928 -1652025 -983947 89303 549279 -235932 -2017774 -4004206 -5518740 -6378368 -6817950
42919 -6817950 -7046572 -6829930 -5722882 -3859739 -2153025 -1314597 -951562 -146607 1225226
42910 1225226 2337179 2531839 1996479 1195463 215364 -964428 -1920890 -1999408 -1085194
42901 -1085194 128310 813599 888180 1031933 1767915 2799859 3546085 4051195 4818290
42892 4818290 5890670 6835754 7602070 8408746 8590004 6822117 3262012 322309 146251
42883 146251 2123138 4159729 5599423 7198507 8726752 8755067 7161511 5926842 6558137
42874F558137J559680O13840q42302j593515j786669j642100r08382P3L3015p60418
42864A231359j002825r9297P99076O29446r4755m67067o59022j167737j540299
42855b371121j005850J90179J067680J116787M60085o72984j812115k072677j043532
42846f143548M23708J099288P90297J91319k58585n13376l05207N51841J413314
42837b750949J414670P71863M15020L77354j64917j070790r74478M43988J352589
42828a85650J81557j862364k239817n29823J191906J382909Q19646Q75809J432330
42819A066503J488144R41774N61425N17640P6212j090515k112731j902643n50869
42810a005060P03795Q51187J49709l37512o6320M28277L58466k51968o50842l73734
$$ plain form
42874 6558137 8117817 8731657 7889355 6295840 4509171 2867071 1958689 1958762 1991777 1231359
42864 1231359 228534 129237 928313 1557759 1463004 995937 336915 -830822 -2371121
42855 -2371121 -3376971 -3186792 -2119112 -1002325 -542240 -1215224 -3027339 -5100016 -6143548
42846 -6143548 -5719840 -4620552 -3830255 -3638936 -3897521 -4410897 -4716104 -4164263 -2750949
42837 -2750949 -1336279 -564416 -149396 227958 63041 -1007749 -1982227 -1538239 -185650
42828 -185650 -4093 -1866457 -4106274 -4636097 -3444191 -2061282 -1241636 -365827 1066503
42819 1066503 2554647 3496421 4057846 4575486 4651698 3561183 1448452 -454191 -1005060
42810 -1005060 -301265 549922 699631 362119 295799 724076 1082542 830574 179732 -194002
42800a94002J90069L00392k86089j028872j111336l48740M34761L47633j93656
42791a889840J56285J458096J754570k31079k567049k220376N47977K160912O45748
42782a84756j648825j553974N51773J750468P98675o91353q51296L41872J513283
42773B5867J337970k70487j733629j275220N11450R13781r06609j982282K35513
42764c143646L393466L182202j12162j836217J0221J915481M38391k792636l944009
42755b888909k253211J48291J829075K791565K791380J502712j35728p59504l91123
42746B634548J32939Q22417J920522K423144J238691o44404j233853n71591n94121
42737F128292j894695k774076k021032o56737j1557K62047J032889J775939J260919
$$ plain form
42800 -194002 -3933 296459 10370 -1018502 -2129838 -2478578 -2043817 -1696184 -1889840
42791 -1889840 -1733555 -275459 1479111 1248032 -1319017 -3539393 -2991416 -830504 -184756
42782 -184756 -1833581 -3387555 -2835782 -1085314 -286639 -977992 -1829288 -1487416 25867
42773 25867 1363837 1093350 -640279 -1915499 -1404049 -490268 -1396877 -3379159 -3143646
42764 -3143646 249820 3432022 3319860 1483643 1493864 3409345 3847736 1055100 -2888909
42755 -2888909 -5142120 -4993829 -3164754 -373189 2418191 3920903 3785175 3025671 2634548
42746 2634548 2767487 3589904 5510426 7933570 9172261 8527857 7294004 6722413 6128292
42737 6128292 4233597 1459521 -561511 -1218248 -1229805 -967758 65131 1841070 3101989
42728C101989m02089j674987j504396m74158R1406l30512j013893q65007L95970
42719b675677J911106K492634J723532K89940o99956p59653m44773n73770r88913
42710B74470o34070P15458J554383N33203j277477j523438J16877J461005R81124
42701B201535l52960j061783j166898j154769o72102L23766O41204k99116j059576
42692b600699l76939N76117J64884o79226J35105K192282K973716J724673L63142
42683D473055L09437P35307M99568j72602o25424p93555p20992l61325j18404
42674C225065l30404l10380N85369J231402P9851j896413k016418M7559J581887
42665B197518R73077m8057L72162J120258J77068j924617k808180j543431M56055
$$ plain form
42728 3101989 2699900 1024913 -479483 -953641 -862235 -1192747 -2206640 -3071647 -2675677
42719 -2675677 -764571 1728063 3451595 3741535 3041579 2281926 1837153 1263383 274470
42710 274470 -359600 355858 1910241 2443444 1165967 -357471 -240594 1220411 2201535
42701 2201535 1848575 786792 -380106 -1534875 -2206977 -1883211 -1242007 -1541123 -2600699
42692 -2600699 -2977638 -2401521 -2236637 -2915863 -2780758 -588476 2385240 4109913 4473055
42683 4473055 4782492 5517799 6017367 5844765 5219341 4425786 3704794 3343469 3225065
42674 3225065 2894661 2584281 3169650 4401052 4480903 2584490 568072 615631 2197518
42665 2197518 3170595 3122538 3494700 4614958 4792026 2867409 59229 -1484202 -1028147
42656a028147J366311O72622o31228r68057J04958R89609l0247k034247k433402
42647c991828q44235L68919O3456N5435J499320K380885Q68814j281884j458313
42638b339431l55228l02777r65298j91247J730655K301526J129093N28029J431836
42629B967158J991203J112159L63866J026809J852988J398457L85708p7125p40777
42620A0280446k543982m085180l174652l52452J374637M45916j366925j525263
42612i47455J05230J480825J087298m85768j599082j459213n36105N22246J557784
42603b74240K266169J772649k75993k604110l340706k177057n79484K80137Q20794
42594d111841J835170K867265K692409J106271n91864j071243m58079j0201m58028
$$ plain form
42656 -1028147 338164 1010786 379558 -588499 -483541 506068 475821 -1558426 -3991828
42647 -3991828 -4836063 -4467144 -4403688 -4348253 -2848933 -468048 400766 -881118 -2339431
42638 -2339431 -2694659 -2997436 -3962734 -4153981 -2423326 -121800 1007293 1535322 2967158
42629 2967158 4958361 6070520 6434386 7461195 9314183 10712640 11098348 11021223 10280446
42620 10280446 7736464 3651284 476632 124180 1498817 1944733 577808 -947455
42612 -947455 -842225 638600 1725898 1240130 -358952 -1818165 -2354270 -1832024 -274240
42603 -274240 1991929 3764578 3488585 884475 -2456231 -4633288 -5212772 -4932635 -4111841
42594 -4111841 -2276671 590594 3283003 4389274 3797410 2726167 2268088 2257887 1799859
42585A799859j132281r99452j60465L58319K01802J53264P02138J073999L68790
42576B365973j044334k066741k241276j779389q01684M77249J282135J074560
42568b733507M87210M00843M55777k63618j324050j234807K22397J406529J018880
42559a564346k93343j059771p13125K99590J196516J155794j68458j880456k394922
42550e422521j256290L62740J373493K010438K786725L256559K724338J406570
42542G242052m0664j471258k738794k887580j144128J475658K747616J616543
42534D799445p94479k641266l080277k397476j182491J56918J361012K145321
42526a633293K129907J127398l18706j030145l45377R68841J503358Q50760r9771
$$ plain form
42585 1799859 667578 -331874 -492339 -134020 67782 221046 923184 1997183 2365973
42576 2365973 1321639 -745102 -2986378 -4765767 -5567451 -5090202 -3808067 -2733507
42568 -2733507 -2246297 -1845454 -1389677 -1653295 -2977345 -4212152 -3989755 -2583226 -1564346
42559 -1564346 -1857689 -2917460 -3630585 -3330995 -2134479 -978685 -1147143 -3027599 -5422521
42550 -5422521 -6678811 -6316071 -4942578 -2932140 -145415 3111144 5835482 7242052
42542 7242052 7201388 5730130 2991336 103756 -1040372 435286 3182902 4799445
42534 4799445 4004966 1363700 -1716577 -4114053 -5296544 -5139626 -3778614 -1633293
42526 -1633293 496614 1624012 1305306 275161 -70216 898625 2401983 3252743 3152972
42517C152972m87905l81814j35025L99093J408049K335853K322280J358456L71904
42508A0343863M6410O5869k62253j067353j898941k293179j986149q77445O81737
42499B752559J695254J248839l81392j772176j756500n26316Q25742J545209J701768
42490E332987J636503J324231M57228q92904j903670j645025k63332Q46240M95858
42481E388116r04285j970450k162167k171231k443900k267016q62629J245623
42473f147939K659195K649080J726862P55745n1667j064826k307758k947695k152807
42464f881810m22350P04610O13814L43514O49218N86927n37614j040404R28595
42455e055500L640539L275437m56098l270296k137505P24079J603863M65716k58159
$$ plain form
42517 3152972 2665067 2283253 2148228 2547321 3955370 6291223 8613503 9971959 10343863
42508 10343863 10390273 10456142 10193889 9126536 7227595 4934416 2948267 2070822 2752559
42499 2752559 4447813 5696652 5315260 3543084 1786584 1260268 2086010 3631219 5332987
42490 5332987 6969490 8293721 8750949 7858045 5954375 4309350 4046018 4892258 5388116
42481 5388116 4483831 2513381 351214 -1820017 -4263917 -6530933 -7393562 -6147939
42473 -6147939 -3488744 -839664 887198 1642943 1591276 526450 -1781308 -4729003 -6881810
42464 -6881810 -7304160 -6599550 -5985736 -5642222 -4993004 -4406077 -4943691 -5984095 -5055500
42455 -5055500 -1414961 1860476 1404378 -1865918 -4003423 -3279344 -1675481 -1209765 -1467924
42446a467924n3508l67917j317473j437047m79544J37547k04184n14250k2518
42437e726818Q64044J490931J507780P78113n2840L59422K030826K818528J357749
42428E427735n37663o40565L7635p28733k099340j583983J62142K01341j246928
42419a008359q53009J726337K574971r9422k849490k577296j092218j165800j763057
42410g107343p48356P04442L17930r48496p02527M23700M5728j384751j136241
42401a0535914J172724L036292L034556K217209J510866O62895m2090K88874J149171
42392B494583R32922m00370j140310o11088j9634j40375j92831M30432J110198
42383B463527J244974J037499O07096l22403j555822k470295k953371l049870
$$ plain form
42446 -1467924 -1521432 -1889349 -3206822 -4643869 -5123413 -4985866 -5190050 -5704300 -5726818
42437 -5726818 -4862774 -3371843 -1864063 -1085950 -1138790 -779368 1251458 4069986 5427735
42428 5427735 4890072 4249507 4287142 3558409 1459069 -124914 37228 238569 -1008359
42419 -1008359 -1861368 -135031 2439940 2340518 -508972 -3086268 -4178486 -5344286 -7107343
42410 -7107343 -7855699 -7151257 -6833327 -7781823 -8484350 -8060650 -8014922 -9399673 -10535914
42401 -10535914 -9363190 -6326898 -3292342 -1075133 435733 1098628 1056538 1345412 2494583
42392 2494583 3427505 3027135 1886825 1275737 1256103 1115728 922897 1353329 2463527
42383 2463527 3708501 4746000 5353096 5030693 3474871 1004576 -1948795 -4998665
42375d998665j980703P98221L718672M250792K206156J05984j79306M63001J84956
42366D569108j298995k595245k151320K42457K695624K479036p01947l455098
42358b16380k547590P11287K305570J220273K75819J081211J592919N086j999130
42349B429065j994070n28110K33389r0515m34728q13270j971717l043931k006493
42340h220380J217324L914625L562240O48050k083530k639919j508004n44493
42332e654087o39135r61109n22310L58399Q36558J010099J430632J737525J328456
42323a074972J007093J995374L300243K409402o91707k589674j023605J589727
42315D921881J323152j804949l885706k284276J311391L313354K213072m57667
$$ plain form
42375 -4998665 -6979368 -6181147 -2462475 1788317 3994473 4100457 3921151 4384152 4569108
42366 4569108 3270113 674868 -1476452 -1233995 1461629 3940665 3238718 -216380
42358 -216380 -2763970 -2052683 252887 1473160 1748979 2830190 4423109 4428195 2429065
42349 2429065 434995 -93115 140274 49759 -384969 -1198239 -3169956 -6213887 -8220380
42340 -8220380 -7003056 -3088431 473809 1121859 -961671 -3601590 -5109594 -5654087
42332 -5654087 -6293222 -7254331 -7776641 -7418242 -6581684 -5571585 -4140953 -2403428 -1074972
42323 -1074972 -67879 1927495 5227738 7637140 6945433 4355759 3332154 4921881
42315 4921881 6245033 4440084 554378 -1729898 -418507 2894847 5107919 4650252
42307D650252k209658j932684m80819N18134K28637r10597j872360j885139r00301
42298d794535K96087O95566K72712J23361P73467J111977J14353j173266j008866
42289c589144K72726Q92628P05272J166106K062799J139792j965253m102976k754072
42280f172122K77852J432517J52036j137099q24521L00259R11607P57911K99717
42271d001843r3084m23359r89867j730239j596568L60011L015801L782493J885854
42262B09199n03804j302361r82388q39108n96617N38879J873550K138122J372119
42253A907591L24232q88183j992562j804683n6228J347664Q35843l85382m48183
42244a159891R8188k10158o05638N46444K256444K102585M19543j00146J047628
$$ plain form
42307 4650252 2440594 507910 27091 545225 773862 -136735 -2009095 -3894234 -4794535
42298 -4794535 -4498448 -3802882 -3530170 -3406809 -2633342 -1521365 -1407012 -2580278 -3589144
42289 -3589144 -3316418 -2423790 -1718518 -552412 1510387 2650179 684926 -3418050 -6172122
42280 -6172122 -5894270 -4461753 -4309717 -5446816 -6271337 -5971078 -5059471 -4301560 -4001843
42271 -4001843 -4094927 -4518286 -5508153 -7238392 -8834960 -8474949 -5459148 -1676655 209199
42262 209199 -294605 -1596966 -2579354 -3418462 -4015079 -3476200 -1602650 535472 1907591
42253 1907591 2231823 1343640 -648922 -2453605 -2509833 -1162169 -326326 -711708 -1159891
42244 -1159891 -1061703 -1271861 -1877499 -1331055 925389 3027974 3447517 3347371 4394999
42235D394999J434106n9109j509690j332140m30959R3487O45428J281574P30244
42226E247940j222772k601063k067202r08049o29529m71731Q74452K630829K925383
42217C778258J420214n87309j842753j748352l16904J353270J594456K40108q82242
42208C008746m97689L61246K52839m62438p44895q45467j393913j606768l75913
42199b304252J506792K121433J103479j34399o72533r74539j505438j900146j714672
42190d474275r31957L36915J681456K028801O11271j594578k493640j271080O60647
42181e446440J446146Q38140O8987J38680P07819O86265k72274j157078p99321
42172c789076N35578J443279J243652O00037P4645o88031j635996j456557O12808
$$ plain form
42235 4394999 5829105 5769996 4260306 2928166 2497207 2590694 3236122 4517696 5247940
42226 5247940 4025168 1424105 -643097 -1551146 -2180675 -2652406 -1777954 852875 3778258
42217 3778258 5198472 4611163 2768410 1020058 703154 2056424 3650880 3890988 3008746
42208 3008746 2511057 2872303 3125142 2662704 1917809 1072342 -321571 -1928339 -2304252
42199 -2304252 -797460 1323973 2427452 2293053 1620520 645981 -859457 -2759603 -4474275
42190 -4474275 -5406232 -5069317 -3387861 -1359060 -747789 -2342367 -4836007 -6107087 -5446440
42181 -5446440 -4000294 -3162154 -3093167 -2954487 -2246668 -1560403 -1832677 -2989755 -3789076
42172 -3789076 -3253498 -1810219 -566567 33470 108115 -579916 -2215912 -3672469 -3059661
42163c059661K938787L057405Q54736j254597j418543l81908j22212j425856l236367
42154d048216l770625k043397J116979L415002L116268R74116m94168O6388J330704
42145c36949J209798l27913j258067k30239J653518K292564J207496j61031o09043
42136C440134n45537p92527j025382m32025O21072Q24284k10024j378543j532535
42127a031083o33842N93673J270440O37060j148754k384797j327048J290445K613844
42118a20062J207804j093631j748880o18496O59880J238642J467023J471080R72101
42109C435461L00184J99555O02077O80869J66901l08097k45505R6795J58212m09886
42099D676566j559493k635336k608891j183195N21025J012330L5089j348094k014478
$$ plain form
42163 -3059661 -120874 2936531 3791267 2536670 1118127 736219 614007 -811849 -4048216
42154 -4048216 -7818841 -9862238 -8745259 -5330257 -2213989 -1239873 -1734041 -1667653 -336949
42145 -336949 872849 544936 -713131 -943370 710148 3002712 4210208 4049177 3440134
42136 3440134 2894597 2102070 1076688 644663 1265735 2090019 1879995 501452 -1031083
42127 -1031083 -1664925 -1071252 199188 836248 -312506 -2697303 -4024351 -2733906 -120062
42118 -120062 1087742 -5889 -1754769 -2373265 -1713385 -474743 992280 2463360 3435461
42109 3435461 3735645 3935200 4537277 5218146 5385047 5076950 4831445 4928240 5086452 4676566
42099 4676566 3117073 481737 -2127154 -3310349 -2789324 -1776994 -1741905 -3089999 -5104477
42090e104477j611649m49723Q24462J587027J681597J374875Q13499M2315m25822
42081a267896J572Q10142P62466p9748j42255J058353J708348M13803j403804
42072A860981j625746o87681n61580j398882j608166q28819l14485l51009K36867
42063e278520J591703K165271J325765N50585R93168J653761J180630Q029o12060
42054C578332n61607n40031o42341m74303j26745J3701P1192M60762J074687J289549
42044D143196O96915m16291j180160q67054R4913K12992j168831k498884j804061
42035b787265L84438J468593K78069j526587j953328r18892O14696K003151K512263
42026G5138J295905r18387j681219N7896K021973J625434k25280n89312R04279
$$ plain form
42090 -5104477 -6716126 -7165849 -6341387 -4754360 -3072763 -1697888 -884389 -842074 -1267896
42081 -1267896 -1266324 -456182 306284 226536 84281 1142634 2850982 3264785 1860981
42072 1860981 235235 -452446 -1014026 -2412908 -4021074 -4849893 -5164378 -5515387 -5278520
42063 -5278520 -3686817 -1521546 -195781 354804 1347972 3001733 4182363 4190392 3578332
42054 3578332 3016725 2476694 1834353 1360050 1233305 1247006 1318198 1778960 2853647 4143196
42044 4143196 4840111 4423820 3243660 2376606 2471519 2684511 1515680 -983204 -2787265
42035 -2787265 -2402827 -934234 -656165 -2182752 -4136080 -5054972 -4440276 -2437125 75138
42026 75138 1371043 452656 -1228563 -1170667 851306 2476740 2251460 1662148 2566427
42017B566427J496066l99606k714872k689292o61251O67934K587j072130m67054
42008c271191J686994L307910K861948Q89119r20476j486980q77974K90370J317973
41999C797693J586358R72258L6806o74988j260453j851773j898539r62723K16724
41990c8637O02766M57105P13596J035195J70308j707869k806816k225467r75785
41981d775604q6730N34112Q63321L96378k48462M53875K058910J852313j000226
41972D7887l341747k225378P94014K109431J118883k957k45162l15255q6571J199398
41962i47457K438280J594058p10909j612194m35978L58518n42570j194132K9865
41953a022519J546093J227359k11655o68999Q2855P45280R67449J334773J536205
$$ plain form
42017 2566427 4062493 3662887 948015 -1741277 -2402528 -1734594 -1732007 -2804137 -3271191
42008 -3271191 -1584197 1723713 4585661 5474780 4554304 3067324 2189350 2479720 3797693
41999 3797693 5384051 6356309 6393115 5718127 4457674 2605901 707362 -255361 -38637
41990 -38637 564129 1021234 1734830 2770025 2940333 1232464 -1574352 -3799819 -4775604
41981 -4775604 -4862334 -4328222 -3464901 -3068523 -3316985 -2863110 -804200 1048113 47887
41972 47887 -3293860 -5519238 -4725224 -2615793 -1496910 -1499867 -1745029 -2060284 -2146855 -947457
41962 -947457 1490823 3084881 2373972 761778 325800 684318 141748 -1052384 -1022519
41953 -1022519 523574 1750933 1539278 870279 953134 1698414 2665863 4000636 5536841
41944E536841N62809j347613k531853j893663j13261J249453J223407L6800j220632
41935A502288j529063p54143M70453J412131J398515j15035k577200l876942k429025
41926f498021L24348J306243n0147j101285o1014J556345J840912J515056J996115
41917H28552K328430P49292j748609k259059j42652K090795K249188P32155r39549
41908C888543j935208j937339q30649O96423J411830R24421q4577j068953j910462
41899h45971k093773j112062J88161L61720k26911L54633K314464L167051J325646
41890C432958j218770j638812k78732K58497p86122j483469m12210J370430K012615
41881A256385R85027r73552k720629l034128j352366J121779K156739J110479
$$ plain form
41944 5536841 6099650 4752037 2220184 326521 213260 1462713 2686120 2722920 1502288
41935 1502288 -26775 -780918 -310465 1101666 2500181 2385146 -192054 -4068996 -6498021
41926 -6498021 -6173673 -4867430 -4917577 -6018862 -6079876 -4523531 -2682619 -1167563 828552
41917 828552 3156982 3906274 2157665 -101394 -244046 1846749 4095937 4828092 3888543
41908 3888543 1953335 15996 -814653 -118230 1293600 2218021 2133444 1064491 -845971
41899 -845971 -2939744 -4051806 -3863645 -3501925 -3728836 -3374203 -1059739 2107312 3432958
41890 3432958 2214188 575376 296644 555141 -230981 -1714450 -2126660 -756230 1256385
41881 1256385 2241412 1267860 -1452769 -4486897 -5839263 -4717484 -2560745 -1450266
41873a450266j79647P990Q42344M13246j098967j482634K57803K378576K778719
41864B467164J628868N98881L43764Q0177o76966j361159j542456j609729j656862
41855a728318q07201J256178K871686K076554m24225j672655m04486J034226j5907
41846B185852k569304l254213j013195J639577K322509J582760J009690N39071
41838B442747n94567j604270j090082L73112Q36920R1528m2824J090795J709669
41829C213028M63421j337701j739468q89703k37612j88277k13872l77600r74734
41820b282518j269160l71912R59929J106500p220r01083q10197l37191P1837N50610
41810c290405O85592j39919j066225m69454J182817J410682m65009j893994r21074
$$ plain form
41873 -1450266 -1629913 -1621923 -779579 -366333 -1465300 -2947934 -2690131 -311555 2467164
41864 2467164 4096032 4694913 5038677 5118854 4441888 3080729 1538273 -71456 -1728318
41855 -1728318 -2535519 -1279341 1592345 3668899 3244674 1572019 1167533 2201759 2185852
41846 2185852 -383452 -3637665 -4650860 -3011283 -688774 893986 1903676 2442747
41838 2442747 1848180 243910 -846172 -473060 363860 455388 412564 1503359 3213028
41829 3213028 3676449 2338748 599280 -290423 -528035 -716312 -930184 -1307784 -2282518
41820 -2282518 -3551678 -3923590 -2963661 -1857161 -1864381 -2765464 -3575661 -3912852 -3841015 -3290405
41810 -3290405 -2604813 -2744732 -3810957 -4280411 -3097594 -1686912 -2151921 -4045915 -4966989
41801d966989P46825N69606p09325m20107J565319K578082J292233m10188l09991
41792f4535J307480K496957K040682K92064j426266j781388n69318Q18661Q06618
41783C920955m12445j212986q28909j64729r3290j88957K41967Q83555R52583
41774C097744L61997l52429q17702j002683r86846r45567j013809r24382k48387
41765b832064P85874J298890R17626L67518M90947J134399J439478R07551j45430
41756D364789r03962o74036L91041J097618L50683j333970k176893j331184K0601
41747a95313K81741n43541j139417o63275M91015J380336J330892L49559p60425
41738E31572j036725n78423o00394j647113k427329j449508O68609J822756J203978
$$ plain form
41801 -4966989 -4220164 -3650558 -4359883 -4779990 -3214671 -636589 655644 245456 -64535
41792 -64535 1242945 3739902 5780584 6072648 4646382 2864994 2295676 3114337 3920955
41783 3920955 3508510 2295524 1466615 1301886 1208596 1019639 1261606 2145161 3097744
41774 3097744 3459741 3107312 2289610 1286927 300081 -645486 -1659295 -2583677 -2832064
41765 -2832064 -2046190 -747300 170326 537844 1028791 2163190 3602668 4510219 4364789
41756 4364789 3460827 2786791 3177832 4275450 4626133 3292163 1115270 -215914 -195313
41747 -195313 86428 -457113 -1596530 -2259805 -1768790 -388454 942438 1291997 531572
41738 531572 -505153 -1083576 -1683970 -3331083 -5758412 -7207920 -6539311 -4716555 -3512577
41729c512577O0932m68287p49991j222380j032173O02080K576840K984630J676697
41720I15771L31949M1823K65918L83814P01593J208905Q51518p00006j789396
41711B211889r90269K92874l77695k394780k465300L27136K510548R93135k326863
41702b219325l226752j049802J025233J057722M79823P28292Q67156R573m77397
41693b805477O76265J952694J207278o37201p57389J145701K333903J274374j70949
41684D219199J26440J359032J369375l523j102234j211927j157157j313047r65653
41675A320505p9038M6982j152355k159491j444961R3541M09520n26896p86135
41666d278328K68073R09727L5449p74648K54026K067082K358698J263066R92090
$$ plain form
41729 -3512577 -3451645 -3919932 -4669923 -5892303 -6924476 -6322396 -3745556 -760926 915771
41720 915771 1247720 1289543 1555461 1939275 2640868 3849773 4701291 4001285 2211889
41711 2211889 1221620 1514494 1136799 -1257981 -3723281 -3396145 -885597 107538 -2219325
41702 -2219325 -5446077 -6495879 -5470646 -4412924 -3933101 -3204809 -2337653 -2328080 -2805477
41693 -2805477 -2129212 -176518 1030760 393559 -363830 781871 3115774 4390148 4219199
41684 4219199 4345639 5704671 7074046 7070523 5968289 4756362 3599205 2286158 1320505
41675 1320505 1241467 1288449 136094 -2023397 -3468358 -3374817 -2965297 -3492193 -4278328
41666 -4278328 -4010255 -3100528 -3065079 -3839727 -3585701 -1518619 840079 2103145 3095235
41657C095235J934429J734551r37548l915479m278392k040970M57391J748679
41649b202104K150886K180246J806131J181950O84822J01857j073792k385350
41641B444646k553273j241639K10007L42870p18905j615056j411445m35518L85744
41632d592569N90979M59342M15916M62944L42521R491m00282q66502j252149r87412
41622e817721K49146J609834J825714J012478N90072J043545J099908r4383j320443
41613A98150j043135K54603R68713Q02051O71880P40656L13497m55913m62150
41604A988352N68497J588024J714119J009611k35612j688312k420660j614324
41596I09695K6943R41920Q39183O17807K11107j403108l625538m019660j786931
$$ plain form
41657 3095235 5029664 6764215 5826667 1911188 -2367204 -4408174 -3950783 -2202104
41649 -2202104 -51218 2129028 3935159 5117109 5801931 5903788 4829996 2444646
41641 2444646 -108627 -1350266 -1140259 -797389 -1516294 -3131350 -4542795 -4978313 -4592569
41632 -4592569 -4001590 -3542248 -3126332 -2663388 -2320867 -2311376 -2711658 -3578160 -4830309 -5817721
41622 -5817721 -5568575 -3958741 -2133027 -1120549 -530477 513068 1612976 1518593 198150
41613 198150 -844985 -590382 378331 1180382 1852262 2592918 2906415 2450502 1988352
41604 1988352 2556849 4144873 5858992 6868603 6632991 4944679 2524019 909695
41596 909695 936638 1878558 2717741 3335548 3546655 2143547 -1481991 -5501651 -7288582
41587g288582O50201J022135K56278L58254J062839R42692M72101J162513K303701
41578I42132J562783j010488k411620r90713J097853J189356o0046m6055J725835
41569A999037L044561K201912M729j762107k490855k593023k127345p76064R56554
41560a542601J643426N87127j039529j449367l81601P78925R31229M15352Q3750
41551B6711J74460N70605J285366J961693J636724n8017j949966k537681j836586
41542g26691j095761r38735q01598j44191P89346J549483J978161J966442J448884
41533D025340P75576M12852K07984l30917j013481j111492o45224n14865r95291
41524H10482j115439j63267J053178J257550L89676o06558j190181j480426j403998
$$ plain form
41587 -7288582 -6638381 -5616246 -5359968 -5001714 -3938875 -2996183 -2524082 -1361569 942132
41578 942132 2504915 1494427 -917193 -1907906 -810053 379303 319257 273202 1999037
41569 1999037 5043598 7245510 7250239 5488132 2997277 404254 -1723091 -2499155 -1542601
41560 -1542601 100825 687952 -351577 -1800944 -2182545 -1403620 -472391 -57039 26711
41551 26711 201171 771776 2057142 4018835 5655559 5597542 3647576 1109895 -726691
41542 -726691 -1822452 -2761187 -3562785 -3706976 -2917630 -1368147 610014 2576456 4025340
41533 4025340 4800916 5213768 5421752 5090835 4077354 2965862 2320638 1805773 810482
41524 810482 -304957 -468224 584954 1842504 2232180 1625622 435441 -1044985 -2448983
41515b448983o38927N01234J040083N79496m4033J94647J191633J913714J688837
41506C977701P97497j49801q47297j101207n51964Q20030K099639K031116M13559
41497G489273j516061k301143j561500k3793J224116J332170J82723j285836j777824
41488A762125j118635m79389o29558p22429L10571J827373K164676R55924m97571
41479C573087j099255r67617n27106J05737N39221J49563q20027j272631q13517
41470a132545k20131N3692N70542J485218J811793J075931L94076O62069Q46173
41461E546818l84043k238391k744285j515463J04352J186666J725699J395153
41453C076506j35802j674134j454787M6349M17340r57581j748143l48083J560647
$$ plain form
41515 -2448983 -3087910 -2586676 -1546593 -967097 -1011130 -816483 375150 2288864 3977701
41506 3977701 4775198 4625397 3778100 2676893 2124929 2944959 5044598 7075714 7489273
41497 7489273 5973212 3672069 2110569 2086776 3310892 4643062 4825785 3539949 1762125
41488 1762125 643490 164101 -465457 -1187886 -877315 950058 3114734 4070658 3573087
41479 3573087 2473832 1506215 979109 1084846 1624067 1773630 953603 -319028 -1132545
41470 -1132545 -1352676 -1298984 -728442 756776 2568569 3644500 4038576 4700645 5546818
41461 5546818 5162775 2924384 180099 -1335364 -1231012 -44346 1681353 3076506
41453 3076506 2940704 1266570 -188217 -141868 275472 -682109 -2430252 -2778335 -1217688
41444a217688J781522R51099R44212J504055J030372k80495q27019o21849j089765
41435B174444j932669j200351R84122J797257K6694j785960j276796K01155K79748
41426g32356l94390K11018J424294Q44114j263383k031071n88298O98875K95810
41417a535387k85111L96432J168093O04270l74658k94927L27637L25341J63805
41408D95495P11896J164866N66502J23306J296217K562173J175760k224488m009206
41399A862521k782855j007829o33146l10960J441284L112918K546841M77182p17208
41390C988748n50648l90621o66418m08698O13573J239479O26605p31820j879791
41381A840409k312127k025996j466469j220996j076283M4770K239939L488742
$$ plain form
41444 -1217688 563834 1514933 2459145 3963200 4993572 4713077 3886058 3264209 2174444
41435 2174444 241775 -958576 25546 1822803 1849497 63537 -1213259 -1012104 -732356
41426 -732356 -1126746 -915728 508566 1352680 89297 -1941774 -2530072 -1831197 -1535387
41417 -1535387 -1820498 -1424066 -255973 348297 -26361 -321288 6349 331690 495495
41408 495495 1207391 2372257 2938759 3062065 4358282 6920455 8096215 5871727 1862521
41399 1862521 -920334 -1928163 -2561309 -2872269 -1430985 1681933 4228774 4705956 3988748
41390 3988748 3438100 3047479 2381061 1972363 2585936 3825415 4452020 3720200 1840409
41381 1840409 -471718 -2497714 -3964183 -5185179 -6261462 -6216692 -3976753 -488011
41373d88011J903223j253095k587090q06287J710180K110733L92851j343503j794067
41364b155066j360836p21238K07497J629550K926480K920711J116243j541731
41356C021610l369195l414631k053098k41868J297627K109699J997314J416396
41348G63854J178792J208450L64609j709879l391776k931865r50537L23194L6758
41339e108400n62755l72223K28396O73913J281120K184265K469774J487359J79462
41330B460911o3902O13252Q21557N297q37882o93086P7440L88686m482l20246
41320B447545j22580j03481q98479j660566r43328J006098K200467J667182P69616
41311D362474P13328L06390j852092m102216l358410J65956K698357K021356J95864
$$ plain form
41373 -488011 1415212 162117 -2424973 -3231260 -1521080 589653 982504 -360999 -2155066
41364 -2155066 -3515902 -4237140 -4029643 -2400093 526387 3447098 4563341 3021610
41356 3021610 -347585 -3762216 -5815314 -6057182 -4759555 -2649856 -652542 763854
41348 763854 1942646 3151096 3515705 1805826 -1585950 -4517815 -5468352 -5145158 -5108400
41339 -5108400 -5671155 -6043378 -5814982 -5141069 -3859949 -1675684 794090 2281449 2460911
41330 2460911 2397009 3010261 3831818 3837115 2999233 2306147 2383587 2772273 2767791 2447545
41320 2447545 2324965 2221484 1323005 -337561 -1280889 -274791 1925676 3592858 4362474
41311 4362474 5075802 5382192 3530100 -572116 -3930526 -3764570 -1066213 955143 1151007
41302A151007j03375N03861n9459j430827j416590K99639J629986J296722M39902
41293B310866M87570J068245R23661j06482r44680p67087L624K83611k74944p65352
41283B219032k58152O90780O42580m95778j033620N0543J372264J006249p44935
41274C448963j840335j333482l17007p8095m90972m68075O99604K497171L279638
41265E397410J676174j494286l449447k560131m92513M4510j008502j309214K92544
41256b903455K278729K725186J399867o73627k258105k254706n47897J153086
41248a080922Q43685j021366j895112o79050R14260J206687P80440P42867O95256
41239E06745M0818k80712P16604J994588J887544P58751K89154O46952L79440
$$ plain form
41302 1151007 1047632 1551493 1492034 61207 -1355383 -1055744 574242 1870964 2310866
41293 2310866 2798436 3866681 4790342 4683860 3739180 2972093 2975717 3259328 2984384 2219032
41283 2219032 1960880 2651660 3294240 2798462 1764842 1815385 3187649 4193898 3448963
41274 3448963 1608628 275146 -41861 -119956 -610928 -1079003 -379399 2117772 5397410
41265 5397410 7073584 5579298 2129851 -430280 -922793 -878283 -1886785 -3195999 -2903455
41256 -2903455 -624726 2100460 3500327 2826700 568595 -1686111 -2234008 -1080922
41248 -1080922 -237237 -1258603 -3153715 -3832765 -2918505 -1711818 -931378 -188511 506745
41239 506745 547563 266851 983455 2978043 4865587 5624338 5913492 6560444 6939884
41230F939884r85189k056159j556569J53745J728244K008729O57147j370134k232688
41221C287010j170440K96225K81176q85046j422667r00089m42712m39263q4668
41212a480474P15790J021477P24122P39358R68184K30176j181733j237226N19485
41203A019159J734073P60395p84645p75660J47460K25630k48567J20754J044985
41194C243584J251562R21043R03084N26055j048447k237960j026814J070941P00824
41185D303872j734405k215428L78405K090542N6285k998433l150046r91044L34655
41176c925597L56364Q66839J897357J844655Q27816M89178Q30642M24904m55602
41167C156556j36520R98033O57033j263144k030457m99547R77137N29546k78959
$$ plain form
41230 6939884 5954695 3898536 2341967 2495712 4223956 6232685 6889832 5519698 3287010
41221 3287010 2116570 2412795 2693971 1808925 386258 -513831 -956543 -1395806 -1480474
41212 -1480474 -764684 256793 980915 1720273 2688457 2918633 1736900 499674 1019159
41203 1019159 2753232 3513627 2728982 1953322 2100782 2326412 2077845 2198599 3243584
41194 3243584 4495146 5416189 6319273 6845328 5796881 3558921 2532107 3603048 4303872
41185 4303872 2569467 354039 732444 2822986 2879271 -119162 -3269208 -4260252 -3925597
41176 -3925597 -3569233 -2702394 -805037 1039618 1867434 2356612 3187254 3612158 3156556
41167 3156556 3020036 4018069 4675102 3411958 1381501 881954 1859091 2388637 2109678
41158B109678M96307J661861R10975j337726k622818j932556l90878P61333J027645
41149F83821K43804r70527j059668N33599K058514J744097M78632K40226P39093
41140D691591R4275j557837j897546j91636J359496R57469l00930n34243Q4543
41131B705182J38864n79192r88583m70850N44496J395499J677177J226075L22794
41122E971462l97692p42969j199661j886573j955463q22695N72435P69111k05655
41113A02300q94033n23312R42l27006r51316o15189N32073R15795r4408r61701
41103b815855q6547J668848K029180O49357k98369P22864K523435L103539K172551
41094I669003O33533r99678k220687j954686j99744R58666P7061j048564n6002
$$ plain form
41158 2109678 2605985 4267846 5178821 3841095 1218277 -714279 -1105157 -343824 683821
41149 683821 927625 -42902 -1102570 -568971 1489543 3233640 3712272 3952498 4691591
41140 4691591 4785866 3228029 1330483 1138847 2498343 3455812 3154882 2620639 2705182
41131 2705182 2844046 2264854 1276271 805421 1349917 2745416 4422593 5648668 5971462
41122 5971462 5573770 4830801 3631140 1744567 -210896 -1033591 -461156 307955 102300
41113 102300 -791733 -1315045 -1314103 -1641109 -2592425 -3207614 -2675541 -1759746 -1854154 -2815855
41103 -2815855 -2902402 -1233554 795626 1444983 1146614 1869478 4392913 7496452 9669003
41094 9669003 10302536 9302858 7082171 5127485 4927741 5886407 5963468 4914904 4858902
41085D858902J752674J127596j626637k687813p40984R78991P3988j370934p70361
41076A595422P20770Q83576N05000J292221J915020L0856l092835l935960k069853
41067b155783l66424p9719M83014K012387K639892J415827J09890O5084K8698
41058D152866j160076k106471j102440R27809J747532R37812O221J34374J109308
41049D646935J900027J486541j67093j570663j267027j49525m75345k113732k131757
41040A58361O50815L137897K072039j307646l281422k850434k017246j732359
41032e169995p38771J433880L130116K987583J634071K29654r39393j701491j495695
41023f30041n48025j80989r39529j500827n09972J312884K003466Q74702p58086
$$ plain form
41085 4858902 6611576 7739172 6112535 3424722 2683738 3662729 3736717 2365783 1595422
41076 1595422 2316192 3199768 3704768 4996989 6912009 6942865 3850030 -85930 -2155783
41067 -2155783 -2522207 -2601926 -2118912 -106525 2533367 3949194 4059084 4124168 4152866
41058 4152866 2992790 886319 -216121 711688 2459220 3397032 3403253 3537627 4646935
41049 4646935 6546962 8033503 7866410 6295747 5028720 4879195 4403850 2290118 158361
41040 158361 809176 3947073 6019112 4711466 1430044 -1420390 -3437636 -5169995
41032 -5169995 -5908766 -4474886 -1344770 1642813 3276884 3506538 2567145 865654 -630041
41023 -630041 -1178066 -1359055 -2298584 -3799411 -4309383 -2996499 -993033 -118331 -876417
41014h76417j324598p90492m37432j046177j678704p67852J564796L173152K506568
41005C22844O97634j12707J42864l00525j879176k692630j291910J080057K133405
40996a900144J430989M77482M31080Q36528O33623l23587j097169q99577k53298
40987f64073m74121j778385k570169j398551Q75679K002639J224285k2814k93977
40978c099487L14281J023292J398252J075255j60018j363496q35221J559982L608811
40969C521651L304746J262745l92158o64253j82798J50588p6478p93435j326825
40960D803783q99532O1353R3119r86485j247743N03568K340500J627926j021473
40951E275016k427023j187027Q33590J501815Q87314K27758Q5032K00046L321
$$ plain form
41014 -876417 -2201015 -2991507 -3428939 -4475116 -6153820 -6921672 -5356876 -2183724 322844
41005 322844 1020478 907771 1050635 750110 -1129066 -3821696 -5113606 -4033549 -1900144
40996 -1900144 -469155 8327 439407 1275935 1909558 1585971 488802 -410775 -664073
40987 -664073 -1138194 -2916579 -5486748 -6885299 -6009620 -4006981 -2782696 -2805510 -3099487
40978 -3099487 -2785206 -1761914 -363662 711593 551575 -811921 -1647142 -87160 3521651
40969 3521651 6826397 8089142 7696984 7032731 6849933 7000521 6924043 6130608 4803783
40960 4803783 3904251 3965604 4058723 3072238 1824495 2328063 4668563 6296489 5275016
40951 5275016 2847993 1660966 2494556 3996371 4883685 5111443 5196475 5396521 5399842
40942E399842j102851k883626l661854j974879J066727K675071J888600N03058
40934A910088J68976M48103L91466Q7714l39719j389025k591927k088252O43961
40925b758615L221068L280865J624348N84930N45157K37287m82140n88777j47391
40916E516732k73164r62250j114889p31490r55308j722899j497739J40678J567163
40907c3166J439216K68486r43874j928946k309799j319866O49796J798765J272915
40898a106473L26572J29716M1934o33537q49741M30226J989045J912557N24498
40889B764797k79024k5755R3706l38058m39406j7474n1449p62410r80458r0063
40879a25594Q59158P01260l40053j264158j385348m46944J212246K271139J484785
$$ plain form
40942 5399842 4296991 1413365 -2248489 -4223368 -3156641 -481570 1407030 1910088
40934 1910088 2079064 2527167 2918633 3006347 2666628 1277603 -1314324 -3402576 -2758615
40925 -2758615 462453 3743318 5367666 5952596 6497753 6735040 6252900 5664123 5516732
40916 5516732 5243568 4281318 3166429 2434939 1479631 -243268 -1741007 -1600329 -33166
40907 -33166 1406050 1674536 730662 -1198284 -3508083 -4827949 -4178153 -2379388 -1106473
40898 -1106473 -779901 -650185 -608251 -1241788 -2091529 -1661303 327742 2240299 2764797
40889 2764797 2485773 2460018 2553724 2215666 1776260 1758786 1707337 944927 -35531 -125594
40879 -125594 733564 1434824 1094771 -169387 -1554735 -2001679 -789433 1481706 2966491
40870B966491m71045j573436j248345r25647j231151p34069J227866K584900J450448
40861B046012o43029r18986L85771P79168p5387J04711K003513L160149J808497
40852H650419l51612r06358k07248j27264q37383r93911l15495Q4892l17969q20883
40842C857188q33965n89125m70125n76573q63704j004285m96034L96164N38659
40833d1800k76961m09758J309929L235907K832242M07206j300997j111549n40365
40824D103854o76216n42860M68028J011375J98301m74667M83324J873280J621756
40815H066175L9998r53718r64508j100274j307360k43277J989858L232331K128766
40806A0887991n2501j286280j229816r77663j284519j826624j809826r11610J72818
$$ plain form
40870 2966491 2495446 922010 -326335 -1251982 -2483133 -3217202 -1989336 595564 2046012
40861 2046012 1402983 483997 869768 1648936 1573549 1678260 3681773 6841922 8650419
40852 8650419 8298807 7392449 7185201 7057937 6220554 5226643 4911148 4996040 4678071 3857188
40842 3857188 3023223 2434098 1963973 1387400 523696 -480589 -976623 -580459 -41800
40833 -41800 -318761 -728519 581410 3817317 6649559 7056765 5755768 4644219 4103854
40824 4103854 3427638 2884778 3352806 4364181 4562482 4087815 4571139 6444419 8066175
40815 8066175 8106173 7152455 6187947 5087673 3780313 3537036 5526894 8759225 10887991
40806 10887991 10835490 9549210 8319394 7341731 6057212 4230588 2420762 1509152 1681970
40797A681970K82122o86900j302865m49612R47665J211122L32926m23244q18946
40788G74238j501497j751590P3752L214604M211661J448514k070927k447960Q8493
40779B039288K024140J429629l10458j282080j338465j270550j369973j481549
40771a560018j434617q88035N13237K422721L778538L806261K690734J171884
40763A0500705j47086j024289j454869j488974j170921p21813n76726q06846p14770
40754B394411K32692J226326J009621j7678j25063R14977J195677j00684q61547
40745E868732P23658K785655K187766o77394k360351j361709J87868K24330n56425
40736G022130o40146o2240L84597M75031r8572j935157m141212m071137o36058
$$ plain form
40797 1681970 1964092 1277192 -25673 -475285 472380 1683502 2016428 1593184 774238
40788 774238 -727259 -2478849 -2405097 809507 5021168 6469682 4398755 1950795 2039288
40779 2039288 4063428 5493057 5182599 3900519 2562054 1291504 -78469 -1560018
40771 -1560018 -2994635 -3882670 -3369433 -946712 2831826 6638087 9328821 10500705
40763 10500705 10353619 9329330 7874461 6385487 5214566 4492753 3916027 3109181 2394411
40754 2394411 2627103 3853429 4863050 4845372 4720309 5635286 6830963 6730279 5868732
40745 5868732 6592390 9378045 11565811 10888417 8528066 7166357 7354225 7578555 7022130
40736 7022130 6381984 6319744 6704341 7179372 7080800 5145643 1004431 -3066706 -3702764
40727c702764L413949M440919K312995J8124m50314J48723L93819N9653m09672
40718F225432p07751m76832M59391J263700O44866j248437k554005j938011j99281
40709A469072J022266J235792R41703L21758o64837j271630m37925J570398L135458
40700G322055L269639K598532J864065O09633j588515l489518l348595j428131
40692E809165K41457P17997J109337K148689K531811R15894j662897k905981k097018
40683F808454m53689P72008J107994K91928j426261k554960j611604P21507K179902
40674E835279J882278J216030J411933J831903J407583L97569k94377n74820r49053
40665A2164325j475245j698471j260257k22925Q14166J003810L77445L12926J623292
$$ plain form
40727 -3702764 -288815 4152104 6465099 6483223 6032909 6181632 6575451 6635104 6225432
40718 6225432 5517681 5040849 5500240 6763940 7408806 6160369 3606364 1668353 1469072
40709 1469072 2491338 3727130 4668833 4990591 4325754 3054124 2616199 4186597 7322055
40700 7322055 10591694 13190226 15054291 15663924 14075409 10585891 7237296 5809165
40692 5809165 6050622 6768619 7877956 10026645 12558456 13474350 11811453 8905472 6808454
40683 6808454 6354765 7126773 8234767 8526695 7100434 4545474 2933870 3655377 5835279
40674 5835279 7717557 8933587 10345520 12177423 13585006 13982575 13688198 13113378 12164325
40665 12164325 10689080 8990609 7730352 7507427 8321593 9325403 9702848 10015774 11639066
40656A1639066K608744R84027k283078l545319j514006R41514J261312O45340
40648A0737600J011657J267118l00503j980866q40026K004049K315853r37199
40640A3277683l891332l284818m63809J411513J420602N20232n60842j197532
40632G231697m49303J332083J920055J13992k018468j775922L17225J469913P96896
40623H938168J17401O00322J059107M02432k74233M39066J624945J170820q73490
40614A3204538j972466n97555J507326J685100o31j060528j83412J226382J504677
40605A5313431J006261Q70369R11616L11082m89111l66442M46626P03458L61818
40596A9069108N95437J442744J401085l3104j252039r41017j4703P1528l90782
$$ plain form
40656 11639066 14247810 15231837 12948759 9403440 7889434 8830948 10092260 10737600
40648 10737600 11749257 13016375 12715872 10735006 9894980 11899029 14214882 13277683
40640 13277683 9386351 6101533 5637724 7049237 8469839 8990071 8429229 7231697
40632 7231697 6782394 8114477 10034532 10148524 8130056 6354134 6671359 8141272 8938168
40623 8938168 9055569 9655891 10714998 11117430 10843197 11282263 12907208 14078028 13204538
40614 13204538 11232072 10634517 12141843 13826943 13826312 12765784 12582372 13808754 15313431
40605 15313431 16319692 17190061 18101677 18412759 17923648 17557206 18003832 18707290 19069108
40596 19069108 19664545 21107289 22508374 22475270 21223231 20282214 20267511 20339039 19948257
40587A9948257k28718M32898M52399l71085j069644j060621p52119o42153p43186
40578A5966028q75818q20797l08933N36637J037901Q76731P76056J516338K668588
40569B1372731L150362K677308J760622O65210n25833j126837m90686N62271L86491
40560B8431639j052042j742815l85185J526182J442217r98106l483199l601195
40552B0137496j169012J885128L340385K422398K89593j049608n39759J136977
40544B6453598K551074K923863K306520R44058p47708j767631j116067P95290
40536C2342997K053585J249726p88068j933613j221040L75220J548232K103825
40528C5730864K423810K357965J551196N32810M80289J671348K831496K462004
$$ plain form
40587 19948257 19719539 20152437 20604836 20233751 19164107 18103486 17351367 16709214 15966028
40578 15966028 15090210 14269413 13960480 14497117 15535018 16411749 17187805 18704143 21372731
40569 21372731 24523093 27200401 28961023 29626233 29100400 27973563 27482877 28045148 28431639
40560 28431639 27379597 25636782 25251597 26777779 28219996 27221890 23738691 20137496
40552 20137496 18968484 20853612 24193997 26616395 26905988 25856380 25316621 26453598
40544 26453598 29004672 31928535 34235055 35179113 34431405 32663774 31547707 32342997
40536 32342997 34396582 35646308 34858240 32924627 31703587 32078807 33627039 35730864
40528 35730864 38154674 40512639 42063835 42596645 43076934 44748282 47579778 50041782
40520E0041782N51648j373321j824518p56879O06846J193244J120427J231304
40512E0790533J835735K378872K372958K048908J765769J373141P53081N05490
40504F3824487J230651K325446K459818J428040O98602J670109L896917N556302
40496H3090372N458907M176216L167473L090082L292342L067379K938178L954928
40488A12235877N806035O732144N808343M245537L548659L399540K699820J955248
40480A46431203K877445N767535Q922788J0813877J1458881J1455769J1077783
40473B08805281J0712238J0938052J1737982J2642324J3720596J5151974J5875141
40466B99583588J4471942J1724067J0296110J1078205J1741488J0030760O728786
$$ plain form
40520 50041782 50593430 49220109 47395591 46638712 47245558 48438802 49559229 50790533
40512 50790533 52626268 55005140 57378098 59427006 61192775 62565916 63318997 63824487
40504 63824487 65055138 67380584 69840402 71268442 71967044 73637153 77534070 83090372
40496 83090372 88549279 92725495 95892968 98983050 102275392 105342771 108280949 112235877
40488 112235877 118041912 124774056 130582399 134827936 138376595 141776135 144475955 146431203
40480 146431203 149308648 155076183 163998971 174812848 186271729 197727498 208805281
40473 208805281 219517519 230455571 242193553 254835877 268556473 283708447 299583588
40466 299583588 314055530 325779597 336075707 347153912 358895400 368926160 375654946
40459C75654946M003717K402593J029507o34550k682479n373413q197361r460338
40451C56742622q441693o945936p017391q054527p955451o271403m356625l045863
40443C04653733k004201q75601N40257K632730M990020O016127N261357M899549
40435C26113971O620042Q263967O473491J923830j401474j976971k310997m362688
40427C39343171o913048q624547j0422149j3011397j4729407j4074604j2452071
40420B59115948j2273429j3669770j4911279j5029069j4443138j3785241j3306155
40413A61697867j2806418j1545970r195645p110880p043551q241720p967911n642691
40405I2143081m035968n065384o874567o840473n170640l447205j833788j95635
$$ plain form
40459 375654946 379658663 382061256 383090763 382456213 379773734 374400321 366202960 356742622
40451 356742622 348300929 341354993 334337602 326283075 318327624 312056221 307699596 304653733
40443 304653733 302649532 301773931 302314188 304946918 309936938 315953065 321214422 326113971
40435 326113971 332734013 340997980 347471471 349395301 347993827 346016856 343705859 339343171
40427 339343171 332430123 323805576 313383427 300372030 285642623 271568019 259115948
40420 259115948 246842519 233172749 218261470 203232401 188789263 175004022 161697867
40413 161697867 148891449 137345479 128149834 121038954 113995403 105753683 97785772 92143081
40405 92143081 88107113 83041729 76167162 69326689 64156049 60708844 58875056 58679421
40397E8679421N5543j864202l726969l159422j585903k070149m247108m932323
40389C7148888l261196j567581j103203n27554O84595P81925j019752k683998
40381B8452124k296542o66093L57884K12700q80603k742126m296089l733757j034583
40372A3372915J323984J474582L59347l60263o81960j009389m71732J396760K806082
40363A8210326J890202k47428r54501J76735J171453Q92457J33017m11294j030008
40354A9830959j545311j013880M35227J153540K46632j033901j119621k86461
40346A6667184O3025m53559r02004o27061j45367k17789o33038m48965N80851
40337A3883277J351868P13140p96459j387924l65620R91551J404941J267504J328390
$$ plain form
40397 58679421 58734964 56870762 53143793 49984371 48398468 46328319 42081211 37148888
40389 37148888 33887692 32320111 31216908 30689354 31373949 32155874 31136122 28452124
40381 28452124 26155582 25489489 25847373 26060073 25179470 22437344 18141255 14407498 13372915
40372 13372915 14696899 16171481 16530828 16170565 15488605 14479216 14007484 15404244 18210326
40363 18210326 20100528 19853100 18898599 19075334 20246787 21139244 21272261 20860967 19830959
40354 19830959 18285648 17271768 17706995 18860535 19107167 18073266 16953645 16667184
40346 16667184 16730209 16276650 15374646 14747585 14602218 14384429 13751391 13302426 13883277
40337 13883277 15235145 15948285 15151826 13763902 13398282 14389833 15794774 17062278 18390668
40328A8390668R23997p50086k398210j912408J76119R25436p31641k258062j328463
40319A1037350P20087J163359J1094n54655O9450M10573K6985L83461J909436
40310A5177140K588781R16211j520808k208269j299549j090357k431180l608518
40302F523451k933769q49736J032739J792195J490413N79409k29123j30536R71342
40293H246385K090157K090826Q48245p49616j659891j409862m48727J4639q73524
40284H148632k332059k490303p51476J149578J297876J28072m11678J65317L12596
40275E216555r01598k115021j582205K60479J396407R77131K21157M58602J332149
40266E263656J525056O82043j84455j64596L25113J65733r09442j901545j757408
$$ plain form
40328 18390668 19314665 18564579 16166369 14253961 14430080 15355516 14623875 12365813 11037350
40319 11037350 11757437 12920796 12931890 12377235 12446685 12857258 12884243 13267704 15177140
40310 15177140 17765921 18682132 17161324 14953055 13653506 12563149 10131969 6523451
40302 6523451 3589682 2739946 3772685 5564880 7055293 7634702 7405579 7275043 8246385
40293 8246385 10336542 12427368 13275613 12525997 10866106 9456244 9007517 9022156 8148632
40284 8148632 5816573 3326270 2574794 3724372 5022248 5150320 4738642 4903959 5216555
40275 5216555 4314957 2199936 617731 878210 2274617 3251748 3472905 3931507 5263656
40266 5263656 6788712 7470755 7286300 7121704 7446817 7612550 6703108 4801563 3044155
40257C044155n82662N93514R70467O02972J28937K10192J005349J796734J411433
40248I181091m07156k231942k300736o49784Q79299R15957j3935o83855q26159
40239C862780q39445o23081J71102J055482J046529J59406m53457j54596K73035
40230D497755j17251r73522j140808k31170J008565J756525J896250J687985J237534
40221I621863N80974l8425l32217k96806j05238K75203J004419J773990J689247
40212A4173010K86398j389917j443421O76201L107445L429731J410485q79912
40204A9370020j685443j317138r39516o94197j7813Q62337J079484O45509N16698
40195A7819941Q81944O32831p62614j875120r11858J752779L723077L237887Q95589
$$ plain form
40257 3044155 2461493 3055007 4025474 4628446 4757383 4967575 5972924 7769658 9181091
40248 9181091 8773935 6541993 4241257 3591473 4470772 5386729 5372794 4688939 3862780
40239 3862780 3023335 2400254 2571356 3626838 4673367 4832773 4379316 4224720 4497755
40230 4497755 4380504 3406982 2266174 2035004 3043569 4800094 6696344 8384329 9621863
40221 9621863 10202837 10164412 9832195 9535389 9430151 9705354 10709773 12483763 14173010
40212 14173010 14459408 13069491 11626070 12302271 15409716 18839447 20249932 19370020
40204 19370020 17684577 16367439 15427923 14733726 14715913 15578250 16657734 17303243 17819941
40195 17819941 18701885 19334716 18572102 16696982 15785124 17537903 21260980 24498867 25394456
40186B5394456j307752j951200j067436K62851Q04748M9382j370561k199918j692484
40177A6922086k79180Q46257Q03592j51137q49228n23633J19629k66497j595197
40168A5026692k034651n00987J436185J434984l72835j665878j368222q79340
40160A1075948j322105j536003k10325J477010J326915m82462j548039p92652
40152G988287R6873n75676j951439k014070n54619P07099O62772J08581K02449
40143D670257P04898N33633m73167j267215j027009j23360N42850N23683j46569
40134C938001j233747k115166j940881p04986L42220J75046n69114n89003J20334
40125b577296N82739P88884J684038L089714L376842J807246l29706j667395k381287
$$ plain form
40186 25394456 24086704 22135504 21068068 21330919 22135667 22185049 20814488 18614570 16922086
40177 16922086 16642906 17489163 18292755 18141618 17292390 16768757 16888386 16621889 15026692
40168 15026692 12992041 12491054 13927239 15362223 14989388 13323510 11955288 11075948
40160 11075948 9753843 8217840 8007515 9484525 10811440 10328978 8780939 7988287
40152 7988287 8085160 7509484 5558045 3543975 2989356 3696455 4359227 4467808 4670257
40143 4670257 5375155 5908788 5435621 4168406 3141397 3018037 3560887 4084570 3938001
40134 3938001 2704254 589088 -1351793 -2056779 -1714559 -1539513 -2108627 -2697630 -2577296
40125 -2577296 -1994557 -1205673 478365 3568079 6944921 8752167 8422461 6755066 4373779
40116D373779k969763k923724j836226n53987R9181N84844J315615J367924J72151
40107c70206p84031P310J350227J011023n80918r30239M32947J234646K45251
40098A616010q45285l24786R77635J326403N91549j85804m58988k56514L42834
40089B783054Q63230N49346l89658o92270J22084J009578J178979J234265J629168
40080H287776J435665m9099j666565j837438p90896J1653j4401l15509m30367
40071D630819k84825J83463O25075J65000j223846j999845r39257J012028K100167
40062D268779K132606J874333R47400j424634l853108l511605r7931L046250K971175
40053F353265P17874n32804J97901R03880j71330k111667k643807r94050J302553
$$ plain form
40116 4373779 1404016 -1519708 -3355934 -3909921 -3810740 -3225896 -1910281 -542357 -370206
40107 -370206 -1154237 -1146927 203300 1214323 633405 -296834 136113 1370759 1616010
40098 1616010 770725 445939 1423574 2749977 3341526 3155722 2696734 2440220 2783054
40089 2783054 3646284 4195630 3805972 3113702 3235786 4245364 5424343 6658608 8287776
40080 8287776 9723441 9674342 8007777 6170339 5379443 5391096 5376695 5061186 4630819
40071 4630819 4345994 4529457 5154532 5319532 4095686 2095841 1156584 2168612 4268779
40062 4268779 6401385 8275718 9223118 7798484 3945376 433771 335840 3382090 6353265
40053 6353265 7071139 6538335 6736236 7640116 7468786 5357119 2713312 1719262 3021815
40044C021815K221321J283061l64653j441813j633083j331180q82895l45121L02404
40035H29856R02608J003466K03329j038019j343000Q91J661202J644735Q8215
40026C953283p56601K64341J536484J086053p26128k115611k330204j818916q80417
40017a787716L19131R87154M58640o40578j213627j203726j066938m08605J256234
40008c300031K819176K467803K96864j545973j540339l08126P17648R02442M75049
39999I84513N3280K74207J041758J268064K78891r05779q77281Q819K34016m72560
39989A887928r68825p47471l82857J5319R21558J837950J535606J73440o76888
39980C595760m77228k81669m56760K6144J319394J873383R30013q1487K07797
$$ plain form
40044 3021815 5243136 6526197 6161544 4719731 3086648 1755468 872573 527452 829856
40035 829856 1732464 2735930 2939259 1901240 558240 559131 2220333 3865068 3953283
40026 3953283 3196682 3461023 4997507 6083560 5357432 3241821 911617 -907299 -1787716
40017 -1787716 -1468585 -481431 -22791 -663369 -1876996 -3080722 -4147660 -4556265 -3300031
40008 -3300031 -480855 1986948 2283812 737839 -802500 -1110626 -392978 509464 984513
39999 984513 1037793 1312000 2353758 3621822 3900713 2994934 2117653 2126472 2360488 1887928
39989 1887928 919103 171632 -211225 -195906 725652 2563602 4099208 4272648 3595760
39980 3595760 3118532 2836863 2380103 2406247 3725641 5599024 6529037 6447550 6655347
39971F655347J183816J631843J319906K55883j668311l242501k433031K64747
39963C967699J404236n96991k695153j702327Q69157J551224M53130K43753R51968
39954D446696J12377k158975k554625J30545K808613K624747O49383n67603n73402
39945D917756l58345j98292J2731j84626q44851r93781k63929J75637m92633j338642
39935D31025j378642j136916j189313p97513L77462Q45009m26716j761968j151295
39926f188867L65699L92248o45175j38820K106617L238097J898971K78644L66776
39917A674190R52710J68708j298737j725246j260624r52594k98891J591717L371778
39908B223011K859732O98893k65332O44299J139097J39738l64972Q77253J616371
$$ plain form
39971 6655347 7839163 9471006 10790912 11046795 9378484 6135983 3702952 3967699
39963 3967699 5371935 4774944 2079791 377464 1246621 2797845 3250975 3494728 4446696
39954 4446696 4559073 2400098 -154527 -23982 2784631 5409378 6058761 5491158 4917756
39945 4917756 4559411 4361119 4373850 4189224 3344373 2350592 2086663 2262300 1769667 431025
39935 431025 -947617 -2084533 -3273846 -4071359 -3693897 -2848888 -3275604 -5037572 -6188867
39926 -6188867 -5823168 -5430920 -6076095 -6214915 -4108298 -870201 1028770 1307414 1674190
39917 1674190 2626900 2795608 1496871 -228375 -1488999 -2441593 -2740484 -1148767 2223011
39908 2223011 5082743 5781636 5516304 6160603 7299700 7439438 7074466 7951719 9568090
39899I568090m08540l373021l814815j914023r94770k105500k529358m13733K201071
39890c784599K596656J254663M20659M57622N5577q38849q94476j24424k76387
39881a133558j757846k260313O7762L446629M358971K108888m29547q32826o1138
39872C507022l59921j667622j895871k91248J387218J399656J96307o84034o88456
39863I03051l20969j09109m59871j670779l063986l037820j229677L29744j39450
39854h798866j196174N887L276413N195875L706419N97454j367486j652232j140701
39845a373411j63758J015334J307079K48086p30413k57363O81415K98381q68734
39836A56616n98288J359055K473432R14706j881241l180977k388490j278606j236271
$$ plain form
39899 9568090 9159550 5786529 1971714 57691 -937079 -3042579 -5571937 -5985670 -3784599
39890 -3784599 -1187943 66720 487379 945001 1000578 161729 -732747 -857171 -1133558
39881 -1133558 -2891404 -5151717 -5083955 -1637326 2721645 4830533 4400986 3568160 3507022
39872 3507022 3147101 1479479 -416392 -707640 679578 2079234 2275541 1591507 903051
39863 903051 582082 472973 13102 -1657677 -4721663 -7759483 -8989160 -8659416 -8798866
39854 -8798866 -9995040 -9989153 -6712740 -1516865 2189554 2787008 1419522 -232710 -1373411
39845 -1373411 -1537169 -521835 785244 1033330 302917 45554 726969 1025350 156616
39836 156616 -441672 917383 3390815 4305521 2424280 -756697 -3145187 -4423793 -5660064
39827e660064j513232o54847J096801J895930R48998q2369O09137K109424K015786
39818G65564L16764k45231J602695L352480K223343q10141k615334k318568j716220
39809E55352j828641j571839j72426J198565J123932P81n22330L90467J821423
39800I95284K099485O96212r51950j062417Q5824N30707l01896o44681N29955
39791A976523J456054L94625j272881j201832O3581K73913m76952j85202R93661
39782B021490P06551j200178j809203K07399K234440J670379m00994j347347o35441
39773A447096N05651J235544J146108k01078k070225k404652n39059J391663J323603
39764A834651j998p90501r27634r86768k72063J624586K713563R81886j904449
$$ plain form
39827 -5660064 -7173296 -7828143 -6731342 -4835412 -3886414 -3968783 -3359646 -1250222 765564
39818 765564 1082328 837097 2439792 5792272 8015615 7205474 4590140 2271572 555352
39809 555352 -1273289 -2845128 -3017554 -1818989 -695057 -694276 -1216606 -826139 995284
39800 995284 3094769 3790981 2839031 1776614 1862438 2393145 2091249 1446568 1976523
39791 1976523 3432577 3827202 2554321 1352489 1416070 1689983 1213031 1027829 2021490
39782 2021490 2728041 1527863 -281340 -73941 2160499 3830878 3429884 2082537 1447096
39773 1447096 1952747 3188291 4334399 4133321 2063096 -341556 -880615 511048 1834651
39764 1834651 1832653 1042152 114518 -872250 -1144313 480273 3193836 4175722 2271273
39755B271273k293586K28654K239076J499986j64028r6529J292347J536656j57013
39746F356836j866815j535457L98995J440282O1819k217855k609520p67232P38551
39737c96K03887p55871j292J483609J051280j309666k700563j398794J008595
39728b419211K101157J474625M26135R7587N85225J069597N85428o69983j118023
39719B132537J18153J535459J189812k73330o08313K61699J465k176305l888343
39710a707166l060125q26506N40522P61084Q80999R90461N80852J92392P54435
39701h93052J788918J948271J029912J353o77815j296294j621692r05283O42358
39692A6676J645208J247689J16992n84531m98843k5373M05290O26327O48352N25840
$$ plain form
39755 2271273 -22313 206341 2445417 3945403 3781375 3684846 4977193 6513849 6356836
39746 6356836 4490021 2954564 3353559 4793841 4855660 2637805 28285 -738947 -396
39737 -396 203491 -552380 -553672 929937 1981217 671551 -2029012 -3427806 -2419211
39728 -2419211 -318054 1156571 1582706 1680293 2265518 3335115 3920543 3250560 2132537
39719 2132537 2250690 3786149 4975961 4702631 4094318 4356017 4357482 2181177 -1707166
39710 -1707166 -4767291 -5593797 -5053275 -4292191 -3411192 -2420731 -1839879 -1647487 -893052
39701 -893052 895866 2844137 3874049 3875402 3197587 1901293 279601 -625682 16676
39692 16676 1661884 2909573 3026565 2442034 1943191 1917818 2323108 2949435 3597787 4123627
39682D123627J78898n47189j374173j437607k60035J212901J308516l71379k221488
39673F12071k376730q90239L72533N2321r75165o38596J638038L852832L465540
39664E112605K88345l167417m230106k554219q7697R94379K49505p66510j62568
39655d323683K061660L694138K805211K71179j202317n45407M94158P5742j196847
39646B133834j502401n39410L74026M45671K04342J66602M742n80066j106900
39637c99560r80313l32159K76441O16949Q23168Q75617N07539k80214q80631o14708
39627c87871K93416O80833j39941j236607j134108O4986P50984K35907k46214
39618a118615K78461P59949n7401j201822q11716P04326J103789p4738o88900
$$ plain form
39682 4123627 4302525 3755336 2381163 943556 683521 1896422 3204938 2833559 612071
39673 612071 -1764659 -2654898 -2282365 -2230044 -3205209 -3843805 -2205767 1647065 5112605
39664 5112605 5400950 2233533 -1996573 -4550792 -4638489 -3644110 -3394605 -4161115 -4323683
39655 -4323683 -2262023 1432115 4237326 4508505 3306188 2760781 3254939 3330681 2133834
39646 2133834 631433 92023 466049 911720 1116062 1282664 1287406 707340 -399560
39637 -399560 -1379873 -1712032 -1435591 -818642 4526 880143 1387682 1107468 226837 -387871
39627 -387871 -94455 586378 446437 -790170 -1924278 -1859292 -1108308 -872401 -1118615
39618 -1118615 -840154 -80205 -137606 -1339428 -2151144 -1446818 -343029 -417767 -1106667
39609a106667N07573J740290R68462r39695j555193l37982J049731J260135M20052
39600B006706q55846j979078k026480m67163J512051J782789j50526k352946k640805
39591e171298p84707J659795K895006K120981J33509j147535n91677O95130Q21830
39582F31034j94613o87199k57591l73750j448041j612042J54302J743456R21482
39573a122962r22965o41611J871311L470299K258752k11947j629517j632468j173607
39564B65285r63528j262323j791363j412465O28727K881608K906610P34872q70959
39555A116464k79218J005598J169024O81579O07603M08606o64654j673142j480782
39546H91078p27482l88434J51099J462651K070714O52988j093647p48154O88204
$$ plain form
39609 -1106667 -599094 1141196 2109658 1169963 -385230 -723212 326519 1586654 2006706
39600 2006706 1150860 -828218 -2854698 -3321861 -1809810 -27021 -177547 -2530493 -5171298
39591 -5171298 -5956005 -4296210 -1401204 719777 853286 -294249 -885926 -190796 631034
39582 631034 436421 -250778 -508369 -882119 -2330160 -3942202 -3787900 -2044444 -1122962
39573 -1122962 -2045927 -2687538 -816227 2654072 4912824 4700877 3071360 1438892 265285
39564 265285 -698243 -1960566 -3751929 -5164394 -4535667 -1654059 1252551 1987423 1116464
39555 1116464 837246 1842844 3011868 3693447 4301050 4709656 4045002 2371860 891078
39546 891078 163596 -224838 -73739 1388912 3459626 4112614 3018967 2270813 2959017
39537B959017K79066j760497k160504J0320J767245J018744m55018m04660M61085
39528A714798L99927m38529j072864j641843k237879j635343O14275K406198J724931
39519a66329k30551r09133k44502o8924n52033q6672J475826K260872J431863
39510B910417L97672K70770K67550l80786p95238l2582J085303J131457J51126
39501E005689p14853j021586j153675j088758m05266M38447J30950j602556l028042
39492c439650k239289L74127K430989K368111J015519K927l90362q42615j215518
39483a935761o80845M78976P75374k88517j236891o07722J121292K430392K656903
39474B713201K070699R06138n59014j543969j493113r06616n74892m75080l04783
$$ plain form
39537 2959017 3238083 1477586 -682918 -672598 1094647 2113391 1658373 1253713 1714798
39528 1714798 2114725 1676196 603332 -1038511 -3276390 -4911733 -4297458 -1891260 -166329
39519 -166329 -396880 -1306013 -1550515 -1619439 -2171472 -2258144 -782318 1478554 2910417
39510 2910417 3308089 3578859 3846409 3465623 2670385 2637803 3723106 4854563 5005689
39501 5005689 4290836 3269250 2115575 1026817 621551 1059998 1190948 -411608 -3439650
39492 -3439650 -5678939 -5304812 -2873823 -505712 509807 512734 122372 -720243 -1935761
39483 -1935761 -2616606 -2137630 -1362256 -1650773 -2887664 -3495386 -2374094 56298 2713201
39474 2713201 4783900 5690038 5131024 3587055 2093942 1187326 612434 137354 -167429
39465a67429m34030j140861j478918l77560J366487J716501J48359j542004j507363
39456c416818J18970J759542K077061R09607o62851j069703J41698J497646J321975
39447B677127O4860m16093J45423p4704j907475l417980k541593j87509R94578
39438d663366K73669n17985O5687J160251J200356K55766k33135M49861J434947
39429e73949J554394P87470K4194k32571l48402p56732j246141j321466q68251
39420b981454j07500P55545J413509J345263M24103n54977n91053L21516J241001
39411A265953J447072J004215K79428l97277n99259j08429N00193L43515m54692
39402C280719p25301N9447Q50445M46258p70159j402915r91019l56652l2756N12075
$$ plain form
39465 -167429 -601459 -1742320 -3221238 -3598798 -2232311 -515810 -367451 -1909455 -3416818
39456 -3416818 -3297848 -1538306 538755 1448362 785511 -284192 -142494 1355152 2677127
39447 2677127 2741987 2325894 2471317 2396613 489138 -2928842 -5470435 -5657944 -4663366
39438 -4663366 -4389697 -4907682 -4841995 -3681744 -2481388 -2225622 -2458757 -2008896 -573949
39429 -573949 980445 1767915 1792109 1559538 1211136 454404 -791737 -2113203 -2981454
39420 -2981454 -3088954 -2333409 -919900 425363 849466 294489 -296564 24952 1265953
39411 1265953 2713025 3717240 3996668 3599391 3000132 2891703 3391896 3735411 3280719
39402 3280719 2555418 2614865 3465310 3911568 3141409 1738494 747475 390823 358067 870142
39392H70142J566704K108521J164703k47002m3333J810121K670400P27237k169207
39383H458286k914997j576488j086033k510148l260965j156258K027057L023161
39375A003615J555284O8166j16904J7230m04423q34193p45883n88883p56350r41509
39365a743850r13854p75796k67156R34882K073539J838601L03881r86364j128086
39356f64203o85340j83486O07914J390756J018271o59367k021042j700479k48971
39347c145947J008687J572766J423459L90375j096161j759367j058607o2763J65579
39338b561979o885R9687J52620k40585l69729M79614J655865K069300J648219
39329B926127Q48889k15735j086704p48166N32220O43060j330406l012567j938283
$$ plain form
39392 870142 2436846 4545367 5710070 5463068 5419735 7229856 9900256 10627493 8458286
39383 8458286 5543289 3966801 2880768 370620 -2890345 -4046603 -2019546 1003615
39375 1003615 2558899 2627065 2510161 2527391 2122968 1288775 542892 -45991 -802341 -1743850
39365 -1743850 -2657704 -3433500 -3700656 -2765774 -692235 1146366 1450247 463883 -664203
39356 -664203 -1349543 -1533029 -925115 465641 1483912 824545 -1196497 -2896976 -3145947
39347 -3145947 -2137260 -564494 858965 1249340 153179 -1606188 -2664795 -2727558 -2561979
39338 -2561979 -2568864 -2469177 -2316557 -2557142 -2926871 -2447257 -791392 1277908 2926127
39329 2926127 3775016 3559281 2472577 1724411 2256631 2899691 1569285 -1443282 -3381565
39320c381565M88505J028148l15230n18868J321633K526622J257045p11113j069780
39311F25397k97069r8401m73499l07092M01565P30904M71132J08040j89829l82942
39301E88206l7939Q67269J263087K81574j268480j827386j106267j67286J93336
39292a213886J35933J6603j50770m35499q02383j183296j379385j099599m22223
39283f534505R8879J00849j84680m06197m32736o5798P57648J213780K22581j522355
39273f752534j515792J306225M398724M406485J473004j120983j361453n35748
39265B97928o03377j465610j705059o19811J431554L621767M710761L551490N81138
39256I800781j986690k462299j489049o57360k36435M08292R62044N38828l77390
$$ plain form
39320 -3381565 -2893060 -1864912 -2180142 -2699010 -1377377 1149245 2406290 1695177 625397
39311 625397 328328 229927 -243572 -550664 -149099 581805 1052937 1160977 971148 588206
39301 588206 550267 1417536 2680623 2962197 1693717 -133669 -1239936 -1407222 -1213886
39292 -1213886 -1077953 -1061350 -1212120 -1647619 -2450002 -3633298 -5012683 -6112282 -6534505
39283 -6534505 -6435626 -6334777 -6519457 -6925654 -7358390 -7424188 -6666540 -5452760 -5230179 -6752534
39273 -6752534 -8268326 -6962101 -2563377 1843108 3316112 2195129 833676 297928
39265 297928 -305449 -1771059 -3476118 -4095929 -2664375 957392 5668153 9219643 9800781
39256 9800781 7814091 5351792 3862743 3205383 2968948 3377240 4339284 4878112 4500722
39247D500722l34484N09258J89576j893992l480108k527663l35789K93551q79762
39238c958691j465842k30541J261392J314172M75388J48937L19085J23451k45546
39229b258195J54228J167045J526753P71066j31320l85514m50960r38982j383220
39220a929099r71370N9765O71301M36950r8425m04423n11673m76472j26275L17800
39210c031921J74989n03852m24586J238418L097182K903084O41971j235280j119012
39201A740993k04194k22040p85253n66732J39856J13531l42866k1746N19360l48272
39191B2637j795872q16782K842417N042951K625721j989441m145735k999089j279072
39182b492265m45308L96152J268844P51994p73540o24943K033830M174830K864149
$$ plain form
39247 4500722 4166238 4675496 4865072 2971080 -509028 -3036691 -3372480 -3078929 -3958691
39238 -3958691 -5424533 -5655074 -4393682 -3079510 -2604122 -2455185 -2136100 -2012649 -2258195
39229 -2258195 -2103967 -936922 589831 1360897 1229577 844063 393103 -545879 -1929099
39220 -1929099 -2900469 -2840704 -2169403 -1732453 -1830878 -2235301 -2746974 -3223446 -3349721 -3031921
39210 -3031921 -2856932 -3360784 -3785370 -2546952 550230 3453314 4095285 2860005 1740993
39201 1740993 1536799 1314759 529506 -37226 102630 216161 -126705 -148451 370909 22637
39191 22637 -1773235 -2590017 252400 5295351 7921072 5931631 1785896 -1213193 -2492265
39182 -2492265 -2937573 -2541421 -1272577 -520583 -1294123 -1919066 114764 4289594 7153743
39173G153743o75888k899025k495996j170511o37589p47509n34227K63120J074940
39164f68942J272877Q60306M66128M46636J88454r52417k147680j780174P0359
39155b244453J246226M02983j039631j012018K44959Q74288L73244R1756Q03770
39146b58876J449426Q96352k36427m77672L35544Q29108R2032r53047q07932M36406
39136A304914J218676Q47736M58123R25776J112005l73550k547225l090894j670881
39127a815320k03312J81656K57832M50392j19600j390390j511845K11717J548178
39118b390692M38690j730545k089301l25367J403006J730871J139738L87377n6128
39109a492351N04772K066217K918093J585444o05932j037688M00555J291481L77893
$$ plain form
39173 7153743 6477855 3578830 1082834 -87677 -725266 -1472775 -2007002 -1743882 -668942
39164 -668942 603935 1464241 1930369 2377005 2565459 1613042 -534638 -2314812 -2244453
39155 -2244453 -998227 -595244 -1634875 -2646893 -2401934 -1527646 -1154402 -1062646 -258876
39146 -258876 1190550 2086902 1850475 1372803 1708347 2537455 2629487 1676440 868508 1304914
39136 1304914 2523590 3371326 3829449 4755225 5867230 5493680 2946455 -144439 -1815320
39127 -1815320 -2018632 -1836976 -1579144 -1128752 -1248352 -2638742 -4150587 -3938870 -2390692
39118 -2390692 -1952002 -3682547 -5771848 -6097215 -4694209 -2963338 -1823600 -1436223 -1492351
39109 -1492351 -987579 1078638 3996731 5582175 4976243 3938555 4339110 5630591 6008484
39100F008484j139457k134565k821354k968927j490227J134388K425854J313019
39092C27215r8971K75547J446396J304967k6801r12264j004340j073169q70810
39083f32230M53933K092793K015163m9233j956136k036431j103141q38398j413848
39074c467528j666926q89544M77371J586252J896614J271834m1646j376662j902640
39065d112875j227291J94888J393537J740589J361668N89701o20464k235562l380393
39056f296202k899440q69698J169342J829634J174933K17753j84631L17520J447615
39047d093174K064485R56508j402439k745370j630231N20931J138848k27082j625289
39038g042813j415451J19681J911250L392561M138176L465594J338967j003356
$$ plain form
39100 6008484 4869027 2734462 -86892 -3055819 -4546046 -3411658 -985804 327215
39092 327215 228244 503791 1950187 3255154 3228353 2316089 1311749 238580 -632230
39083 -632230 -178297 1914496 3929659 3880426 1924290 -112141 -1215282 -2053680 -3467528
39074 -3467528 -5134454 -6023998 -5546627 -3960375 -2063761 -791927 -833573 -2210235 -4112875
39065 -4112875 -5340166 -5145278 -3751741 -2011152 -649484 -59783 -680247 -2915809 -6296202
39056 -6296202 -9195642 -10065340 -8895998 -7066364 -5891431 -5673678 -5858309 -5540789 -4093174
39047 -4093174 -2028689 -1072181 -2474620 -5219990 -6850221 -6329290 -5190442 -5417524 -7042813
39038 -7042813 -8458264 -8338583 -6427333 -3034772 1103404 4568998 5907965 4904609
39030D904609k159154j913569r11423M30235J818400K356099J181159j015527
39022D690829k261399j665900n91566o43234j322859r80090L83425R93299J65235
39013a232260n58700M203O98631J41112o60530P6982J626035J654919J42201m33564
39003A459029P33677J310025j94793j655288o39048J596761K037159M99802n17036
38994D630288N8851P11598K96463l88361m83026l50148k83067J63531P53063K90121
38984E399313j205596j732977q5634J970041J912887o3324j510133j159833j57376
38975C367368J63227J12571O22057J490765J633600P12111l25294m91910n3935
38966G230560j26852j077541j876720j385209R5245J145169R64482J25203m64954
$$ plain form
39030 4904609 2745455 831886 -79537 350698 2169098 4525197 5706356 4690829
39022 4690829 2429430 763530 171964 -471270 -1794129 -2774219 -2390794 -1397495 -1232260
39013 -1232260 -1790960 -1786757 -1088126 -947014 -1607544 -1530562 95473 1750392 1892593 1459029
39003 1459029 2192706 3502731 3307938 1652650 1013602 2610363 4647522 5147324 4630288
38994 4630288 4689139 5400737 5697200 5308839 4825813 4475665 4192598 4356129 5109192 5399313
38984 5399313 4193717 2460740 2375106 4345147 6258034 6194710 4684577 3524744 3367368
38975 3367368 3530595 3643166 4265223 5755988 7389588 8101699 7776405 7284495 7230560
38966 7230560 7103708 6026167 4149447 2764238 2859483 4004652 4969134 5094337 4629383
38957D629383o39724o96926o40716k51737L48488P01119N70095K21465R1357K81539
38947D614343M53392K82459m0301l1370L01022L44398j67652o26045n05219l31309
38937D293718q61943j640477j412255J7146J325513J309480K00904q94950j217221
38928A119915p82349j40202J68390K85499R15699J967545J931829j96986k844205
38919B425135l378209j677420k87426o23971j052986K45852K346405L023568J831973
38910B852921J75018p68050p43236J30081J162258R98232q65312k930402l270638
38901c259128j750217L76368K285408L701205M001190K807314R92132l50806j406881
38892G396585k668458l210210j805661O86874K030446J536866M66413k73713q75979
$$ plain form
38957 4629383 3989659 3292733 2652017 2400280 2748768 3449887 4019982 4241447 4332804 4614343
38947 4614343 5067735 5350194 5309893 5278523 5579545 5923943 5756291 5130246 4625027 4293718
38937 4293718 3431775 1791298 379043 396189 1721702 3031182 3232086 2337136 1119915
38928 1119915 337566 197364 365754 651253 1566952 3534497 5466326 5269340 2425135
38919 2425135 -953074 -2630494 -2917920 -3541891 -4594877 -4349025 -2002620 1020948 2852921
38910 2852921 3027939 2259889 1516653 1646734 2808992 3807224 2941912 11510 -3259128
38901 -3259128 -5009345 -4632977 -2347569 1353636 5354826 8162140 9154272 8803466 7396585
38892 7396585 4728127 1517917 -287744 399130 2429576 3966442 4432855 4159142 3283163
38883C283163j230248q86756m71698j040470j931964j475440N8228O87898J58494
38874b848793L23553J468903J387945o05257j895010p14421Q61072N09018m43331
38865a956321K70894J513002O77522j516303j939706o4625J529997J460235R29257
38856I03952O68448j36356j219127p42861J392159K538584J078608j136009j692445
38847A654953q77351k91136n4922N35425R01808m9486j687098k147272r42367
38838b957446M34981N88460k41210q84945o91401k3116L24485J00885l7567N33687
38828b853187J252190R57998k60583q65265J3888J279873J435461N72198j35347
38819A397226k41973k68018m87838n25339j39443L62133O13179O10458N46528
$$ plain form
38883 3283163 2052915 1166159 694461 -346009 -2277973 -3753413 -3695185 -3007287 -2848793
38874 -2848793 -2525240 -1056337 331608 -273649 -2168659 -2883080 -2022008 -1512990 -1956321
38865 -1956321 -1685427 -172425 505097 -1011206 -2950912 -3015537 -1485540 -25305 903952
38856 903952 1572400 1436044 216917 -525944 866215 3404799 4483407 3347398 1654953
38847 1654953 777602 486466 431544 966969 1868777 1819291 132193 -2015079 -2957446
38838 -2957446 -2522465 -1934005 -2175215 -3060160 -3751561 -3774677 -3450192 -3349307 -3386874 -2853187
38828 -2853187 -1600997 -642999 -903582 -1768847 -1754959 -475086 960375 1532573 1397226
38819 1397226 1155253 887235 399397 -125942 -265385 96748 709927 1320385 1866913
38810A866913N00263L70877P8772j43999J15127P21267P27897m93638k068838
38801A674641k446807j403186k90262j89963p70286j140604q63248P4411J274211
38792d081093J746937Q47516m56688n53124M18044P08711j97822p82385j42307
38783b492211O47477Q25587J333171K388556J983068r46744l755377l235727k25868
38774c478068J734106J377086M16945j6302m38843o43869M73117K208449K136300
38765C768921j65091k017271j333210Q21810K364965K702418K011135K37661j777497
38756F613841k171739o36762O02042o5714j220055q83796K37974J19361j215691
38747A379461j975902j535311q82111m69478L10094J424795J758569Q09281l90616
$$ plain form
38810 1866913 2367176 2738053 2816825 2672826 2787953 3509220 4237117 3743479 1674641
38801 1674641 -772166 -2175352 -2465614 -2655577 -3425863 -4566467 -5429715 -5355304 -4081093
38792 -4081093 -2334156 -1486640 -1943328 -2496452 -2078408 -1369697 -1567519 -2349904 -2492211
38783 -2492211 -1844734 -1019147 314024 2702580 4685648 3738904 -16473 -3252200 -3478068
38774 -3478068 -1743962 -366876 50069 33767 -405076 -1048945 -575828 1632621 3768921
38765 3768921 3603830 1586559 253349 1075159 3440124 6142542 8153677 8391338 6613841
38756 6613841 4442102 3805340 4407382 4341668 3121613 2237817 2475791 2595152 1379461
38747 1379461 -596441 -2131752 -3013863 -3483341 -3173247 -1748452 10117 819398 428782
38738D28782n20223N40542J641273J408737m02407k299387k412911q87600L8522
38729b464672r72107k456070k326578p55348O17776J300868J891902K131189J166478
38720a866562m42022j058189m43758K76k93515k65855N95548J186469P45692K18261
38710a623655N55615J016269M17378r15152j669214j308904k65755R70083J909253
38701i14082J815429N37137p99400j027041n89294q10156j651856j545553J84512
38692d800304J962730J920727M50811l61771L52625J140912M12563j318727k251479
38683b491913j659440k96522J131817K419263K814215J377171r12010j266221
38675A116360J191647L308329J604570k746246n047959l056807N42634K067369
$$ plain form
38738 428782 -91441 449101 2090374 3499111 3096704 797317 -1615594 -2503194 -2464672
38729 -2464672 -3436779 -5892849 -8219427 -8974775 -8356999 -7056131 -5164229 -3033040 -1866562
38720 -1866562 -2308584 -3366773 -3810531 -3810255 -4103770 -4369625 -3774077 -2587608 -1841916 -1623655
38710 -1623655 -1068040 -51771 365607 -549545 -2218759 -3527663 -3793418 -2823335 -914082
38701 -914082 901347 1438484 639084 -387957 -977251 -1787407 -3439263 -4984816 -4800304
38692 -4800304 -2837574 -916847 -466036 -827807 -475182 665730 1078293 -240434 -2491913
38683 -2491913 -4151353 -4447875 -3316058 -896795 1917420 3294591 2382581 1116360
38675 1116360 2308007 5616336 7220906 4474660 -573299 -3630106 -3087472 -1020103
38667a020103J020579n95643j233226o91856N68998J586730J278842j56738j074582
38658c16999o49838k72349j369622k842021k406724K0379K076149K021942M96701
38649c242382r21821j438047r74972K72093J588017K012765J488754J021461J211811
38640A017679J348189N46024p88922j329040m16933J212040K227639J975876J009146
38631F801698L91511M13540K73489o39074j629551j694365j287238j787997l060896
38622b218883l061985p24936K037636K569958R30675m25440q1361Q72605R52101
38613H50370K53117l71026p85607j151760r37998L28283J724997J692913K12926
38604A816215r30210m78188O26601N70537r33422k388899k408614j082826N55933
$$ plain form
38667 -1020103 476 -595167 -1828393 -2520249 -1951251 -364521 914321 757583 -316999
38658 -316999 -966837 -1239186 -2608808 -5450829 -7857553 -7837174 -5761025 -3739083 -3242382
38649 -3242382 -4164203 -5602250 -6577222 -6305129 -4717112 -2704347 -1215593 -194132 1017679
38640 1017679 2365868 2911892 2122970 793930 376997 1589037 3816676 5792552 6801698
38631 6801698 7193209 7606749 7880238 7241164 5611613 3917248 2630010 842013 -2218883
38622 -2218883 -5280868 -6005804 -3968168 -1398210 -467535 -892975 -974336 -101731 850370
38613 850370 1103487 732461 -53146 -1204906 -2142904 -1814621 -89624 1603289 1816215
38604 1816215 886005 407817 1034418 1604955 671533 -1717366 -4125980 -5208806 -4652873
38595d652873J687395J997203J406752J66184r23896j016834j59037O63942O80440
38586a50724K00753j7690P1138r6957n66054o38859l210P03032R31716J094759
38576A527904J633597J829863O49842j436899k642649k017430m56848O40876P65229
38567D93485R4964r88639j673640j068547M60561J224181L42357r04797q23413
38558b843488M24172J416815J526847J011728j68968j848072k442344m26964K819548
38549e30726L816472J353408j846940k827219j920967j190476j055140n17851
38541d719439L25843L50481l00651j39913J166333K059410J445294K65021q9807
38532C62572L20608O10310N86264N43252K38466p57862k015632k588834k286265
$$ plain form
38595 -4652873 -2965478 -968275 438477 604661 -319235 -1336069 -1495106 -831164 -150724
38586 -150724 50029 32339 103477 6520 -559534 -1198393 -1201603 -498571 433145 1527904
38576 1527904 3161501 4991364 5641206 4204307 1561658 -455772 -912620 -271744 493485
38567 493485 588449 -400190 -2073830 -3142377 -2681816 -1457635 -1115278 -2020075 -2843488
38558 -2843488 -2419316 -1002501 524346 1536074 1367106 -480966 -2923310 -3350274 -530726
38549 -530726 3285746 4639154 2792214 -35005 -1955972 -3146448 -4201588 -4719439
38541 -4719439 -4393596 -4043115 -4343766 -4483679 -3317346 -1257936 187358 452379 362572
38532 362572 683180 1293490 1879754 2423006 2661472 1903610 -112022 -2700856 -4987121
38523d987121j735392j298914q13218l33611j27918J78794J328984K908464L263426
38514a616506J733262m9837k09878Q28426J241119O62389L44105N69078o515j781061
38504A714582k943679k085372n18063k93165j038193p46885R15340K190710J975075
38495h29650R89202L1205r90151j786129j357915J73174J065002M03798l96174
38486b697638J56385J189458R02040n19076j254837o51942J64261M16340O59113
38477a635896J247173J344960L17086q79645o97597R57074K408820J953419l75448
38468D639946k766183l288700j707726L21102R09474l19457k165831l146115k549838
38459a0073328o05641J763113L346900L336403J887846l6057j384303j631897
$$ plain form
38523 -4987121 -6722513 -8021427 -8834645 -9168256 -9296174 -9117380 -7788396 -4879932 -1616506
38514 -1616506 116756 66919 -142959 685467 1926586 2588975 2933080 3502158 3495643 1714582
38504 1714582 -1229097 -3314469 -3832532 -4125697 -5163890 -5910775 -4995435 -2804725 -829650
38495 -829650 159552 190757 -799394 -2585523 -3943438 -3770264 -2705262 -2301464 -2697638
38486 -2697638 -2541253 -1351795 -449755 -968831 -2223668 -2875610 -2711349 -2295009 -1635896
38477 -1635896 -388723 956237 1273323 393678 -303919 653155 3061975 5015394 4639946
38468 4639946 1873763 -1414937 -3122663 -2801561 -1892087 -2211544 -4377375 -7523490 -10073328
38459 -10073328 -10678969 -8915856 -5568956 -2232553 -344707 -380764 -1765067 -3396964
38451c396964r88057j63432K85004M60104P19499Q79085M56553k52760k72011
38442b272979M81805O96738m95367k031681k299191j350409n37541l83891k07706
38433h400222K52775L12097k36035m44535L79776J529186J911582J540883J173575
38424a980918Q82416J7578j288455j536125L53802K952631L248699L26823k858393
38415A18058k774870J03617J897475O58627j169436p21292J092821J449006N5051
38406G09057r18045m90805L34733J124199K420080L343890J811389j814812l988990
38397B530696k517859L26145J061739m05932j489917q79404L96759J119274J112071
38388A253572O40684Q0607r9852p8369o85216j630830r97993J830411M064194
$$ plain form
38451 -3396964 -4385021 -4548453 -4263449 -3803345 -3083846 -2204761 -1748208 -2000968 -2272979
38442 -2272979 -1791174 -1094436 -1589803 -3621484 -5920675 -7271084 -7808625 -8192516 -8400222
38433 -8400222 -8147447 -7835350 -8071385 -8515920 -8136144 -6606958 -4695376 -3154493 -1980918
38424 -1980918 -1098502 -1080924 -2369379 -3905504 -3551702 -599071 2649628 2976451 118058
38415 118058 -2656812 -2553195 -655720 2907 -1166529 -1887821 -795000 654006 709057
38406 709057 -208988 -699793 -365060 759139 3179219 6523109 8334498 6519686 2530696
38397 2530696 12837 338982 1400721 994789 -495128 -1374532 -977773 141501 1253572
38388 1253572 1894256 1974863 1875011 1796642 1111426 -519404 -1517397 313014 4377208
38379D377208K747050p34737k233932o83564P82624L8442j002578j12862J365161
38370D542812Q40603j227096k162893j266286m58602r59542j763164j769154j345482
38361e568804j033081l85071R10475K022429K169417J869625J895693J757615
38353C638298N43620j133356j508439j84232R98525L06866j514436k195321r32476
38344a980951O28049O42884n65430j149856l29928O96425O41968o0771j48293
38335a625903M11569M65931k89561o52039K07182J334444J361704M59938j41649
38326A531616p970K91905M08637L76918j52129j394069k257180j363775N38642
38317b027405J014382n97707k041067j497192j72077P6946p3390J070674K691993
$$ plain form
38379 4377208 7124258 6389521 4155589 3472025 4254649 4293091 3290513 3177651 4542812
38370 4542812 5383415 4156319 1993426 727140 268538 -691004 -2454168 -4223322 -5568804
38361 -5568804 -6601885 -6986956 -6076481 -4054052 -1884635 -15010 1880683 3638298
38353 3638298 4181918 3048562 1540123 1355891 2354416 2661282 1146846 -1048475 -1980951
38344 -1980951 -1352902 -710018 -1275448 -2425304 -2755232 -2058807 -1416839 -1477610 -1625903
38335 -1625903 -1214334 -748403 -1037964 -1690003 -1482821 -148377 1213327 1673265 1531616
38326 1531616 1523646 1815551 2224188 2601106 2448977 1054908 -1202272 -2566047 -2027405
38317 -2027405 -1013023 -1610730 -3651797 -5148989 -5321066 -5244120 -5317510 -4246836 -1554843
38308a554843K263109l55831k312396j748640j11960L96984k18320n28400j8798
38299d189095N98456N79038k48991j403578j736293l72875J829344K770542J638839
38290e34613j03567q89801r63566j184879j155963K0663J804789K498616J322193
38281H13872p75566k247435k201248q54308N63915P06130m38223j345155q00899
38272f578917N35033J086577M15890m32162l38927P43844J812926J652591J26397
38263i76748j215373p26656Q58368R02535j408108l340538k055745J437051L590436
38254b934778K825724Q05429l94974l90335K75405J125779J529704R24716k15890
38245C550780p19399l44642n6496m43081r42493r70377p86314p83216p44153k91535
$$ plain form
38308 -1554843 708266 352435 -1959961 -3708601 -3820561 -3423577 -3641897 -4170297 -4189095
38299 -4189095 -3590639 -3011601 -3260592 -4664170 -6400463 -6773338 -4943994 -2173452 -534613
38290 -534613 -638180 -1527981 -2491547 -3676426 -4832389 -4811726 -3006937 -508321 813872
38281 813872 38306 -2209129 -4410377 -5264685 -4700770 -3994640 -4432863 -5778018 -6578917
38272 -6578917 -6043884 -4957307 -4541417 -4973579 -5312506 -4568662 -2755736 -1103145 -976748
38263 -976748 -2192121 -2918777 -2060409 -1157874 -2565982 -5906520 -7962265 -6525214 -2934778
38254 -2934778 -109054 696375 301401 -88934 186471 1312250 2841954 3766670 3550780
38245 3550780 2831381 2486739 2430243 1987162 1044669 74292 -712022 -1495238 -2239391 -2530926
38235b530926M63889J039581J032569M63319p8128O445L23766j28418j011594
38226d19497l89898K274939M216943K560234j427570l746456k944146j298592
38218a174043o95506l09655Q09491J673052J327744O35139N32838M65778L3890
38209C298728K19118J284153J436463l54589k020911j300289N30084O01165r14327
38200B779595j191959N51302J814256P12494j463472k446373j706078p0399J579829
38191E59195K223820Q94251j764057l258905j900761R68525K535472J881027P09527
38182B848094Q26717J902746K171426Q26994r79710j674185j204674q03630j082135
38173B831643j373465j114931p08892m63827J02670R88061R48243o36062k165926
$$ plain form
38235 -2530926 -2067037 -1027456 5113 468432 390304 396749 720515 592097 -419497
38226 -419497 -809395 1465544 5682487 8242721 6815151 3068695 124549 -1174043
38218 -1174043 -1869549 -2179204 -1369713 303339 1631083 2266222 2799060 3264838 3298728
38209 3298728 3517846 4801999 6238462 5883873 3862962 2562673 3092757 3693922 2779595
38200 2779595 1587636 2138938 3953194 4665688 3202216 755843 -950235 -1020634 559195
38191 559195 2783015 3677266 1913209 -1345696 -3246457 -2277932 257540 2138567 2848094
38182 2848094 3674811 5577557 7748983 8575977 7596267 5922082 4717408 3913778 2831643
38173 2831643 1458178 343247 -365645 -829472 -726802 261259 1209502 573440 -1592486
38164a592486j783262j67874N17651o5580l47399J71887L19408j03382L27392
38155b723645J760720K026794J2718k073198j802485j91467M9099j273469j934217
38146f149150j018584O5904L61028O76951J507813J767937P12206n22063n98487
38137c196445r064m6771o11632n07861N16735J453768J671524J573103J434646
38128B278003P98073m38419j304081r73798j07100l343o48932o45345O74238J962202
38118A591498J419513p72519k443142j931040J08457J725325J899363J098843
38110B696298J5210j222839k364494k577795j482483q3379K91044k67702n83644
38101e579784l57731m88549j146633j025996N43436K046499J809755O42952O35404
$$ plain form
38164 -1592486 -3375748 -3543622 -3025971 -3091551 -3438950 -3267063 -2947655 -3051037 -2723645
38155 -2723645 -962925 1063869 1076587 -996611 -2799096 -2990563 -2941464 -4214933 -6149150
38146 -6149150 -7167734 -7101830 -6740802 -6063851 -4556038 -2788101 -2075895 -2597958 -3196445
38137 -3196445 -3205509 -3252280 -3863912 -4371773 -3855038 -2401270 -729746 843357 2278003
38128 2278003 3076076 2637657 1333576 359778 252678 249335 -399597 -1044942 -370704 1591498
38118 1591498 3011011 2238492 -204650 -2135690 -2027233 -301908 1597455 2696298
38110 2696298 2711508 1488669 -875825 -3453620 -4936103 -5019482 -4728438 -4996140 -5579784
38101 -5579784 -5937515 -6426064 -7572697 -8598693 -8055257 -6008758 -4199003 -3556051 -2920647
38092b920647J830862K223530J098079R1786K61072L35979p66040j668899p34141
38083b48419R22909R58815m66537r81881J61754J058536M06480n16401j95298
38074A099958O84097O12060k55499o20928k73698j52924m56795k00210J109085
38065A545146K476126K609213J472679J64542m61211o48302j206657k321924l131808
38056D97804k685047j178649J89815O49982O23495Q43541J281998J440904J262744
38047B926587J046232O44776m43264j996980k771105j827475R2678J127416L52193
38038h48942j145554j572849n28193P17677R33223K07689o91094j432041j939640
38029f299724j749757n70904P82048J113463N05144J64480N06872O48209K02522
$$ plain form
38092 -2920647 -1089785 1133745 2231824 2323610 2584682 2920661 2154621 485722 -248419
38083 -248419 674490 1633305 1166768 184887 346641 1405177 1811657 1295256 1099958
38074 1099958 1784055 2396115 2140616 1519688 1245990 1093066 636271 436061 1545146
38065 1545146 4021272 6630485 8103164 8267706 7806495 7158193 5951536 3629612 497804
38056 497804 -2187243 -3365892 -3176077 -2526095 -1902600 -1059059 222939 1663843 2926587
38047 2926587 3972819 4617595 4174331 2177351 -593754 -2421229 -2328551 -1201135 -848942
38038 -848942 -1994496 -3567345 -4095538 -3377861 -2444638 -2236949 -2928043 -4360084 -6299724
38029 -6299724 -8049481 -8620385 -7838337 -6724874 -6219730 -6055250 -5548378 -4900169 -4697647
38020d697647J55521J015264J410938M1928j848383j814090K39045J775845J200146
38011b521433j79597n72176l19741o07370r20097R0652J750906J754357j97414
38002a721913j356736K40328K649221K592077J01457j671399j061237N1132n47102
37993g24172k142169k429883q10435J197300K113619J679441L79978q85933j020995
37984b643249R3742R49985K72272q52408l83967J332195J778417K18564r06711
37975a41160K20762J714357P45760k040115l368538k014101q9436N21236N87051
37966c864184J420834K339751J897732N21892R2404J208550K452163K531517J818021
37957A0418680J220557O47432m42024j600848j727271q10005k44407r78255k156742
$$ plain form
38020 -4697647 -4542126 -3526862 -2115924 -2073996 -3922379 -5736469 -5497424 -3721579 -2521433
38011 -2521433 -2701030 -3273206 -3592947 -4200317 -5120414 -5029762 -3278856 -1524499 -1721913
38002 -1721913 -3078649 -2838321 -189100 2402977 2504434 833035 -228202 -177070 -724172
37993 -724172 -2866341 -5296224 -6106659 -4909359 -2795740 -1116299 -736321 -1622254 -2643249
37984 -2643249 -2549507 -1599522 -1327250 -2179658 -2563625 -1231430 546987 765551 -141160
37975 -141160 79602 1793959 2539719 499604 -2868934 -4883035 -4972471 -4451235 -3864184
37966 -3864184 -2443350 -103599 1794133 2316025 2408429 3616979 6069142 8600659 10418680
37957 10418680 11639237 12286669 11844645 10243797 8516526 7706521 7462114 6483859 4327117
37948D327117k267576j077485L22745J006827Q67325J536j485179k857408k897533
37939d059631j255781Q86996K013066J780687R98670M89391M25827N77688P96302
37930B653215J188287J815105K184510J401732o86500k812905l522601k873089
37922f52246j933129q12304J297719L858921M581575K366114p86626k242528k012363
37913C665133j928069k422005k160592o52218P87852J046717O13217M28545N77252
37904d4168O74047N48713Q0521p48765j293480p10282O38535J269020N27834n64525
37894C77450r54053r21865j054526r61544j44776O74626M13121o14483j051247
37885d237297m71403J54118L0110m55110n47456j03545O00957J334874J752122
$$ plain form
37948 4327117 2059541 982056 1304801 2311628 3178953 3180489 1695310 -1162098 -4059631
37939 -4059631 -5315412 -4428416 -2415350 -634663 364007 853398 1279225 1856913 2653215
37930 2653215 3841502 5656607 7841117 9242849 8556349 5743444 2220843 -652246
37922 -652246 -2585375 -3397679 -2099960 1758961 6340536 8706650 7920024 5677496 3665133
37913 3665133 1737064 -684941 -2845533 -3497751 -2709899 -1663182 -1049965 -621420 -44168
37904 -44168 629879 1178592 1259113 510348 -783132 -1493414 -854879 414141 941975 377450
37894 377450 -576603 -1498468 -2552994 -3514538 -3659314 -2984688 -2571567 -3186050 -4237297
37885 -4237297 -4708700 -4554582 -4524472 -4979582 -5527038 -5630583 -5029626 -3694752 -1942630
37876a942630J361399K40645n69960m0861J516811K602810K114005L97959j375142
37867D305036k380628k334441j118383Q69899K152877J208602j352179k688700
37859a337917r16492K197928L067511P00203k088658k242116k6294J761592J344001
37850B459758k92871j009898p5304J161796R83600n36091j461639l46323J840697
37841B723725K865862J970385M21397n59978j108029j647673j884873j646544
37833A134272j658655k481767l355387l018823j244420J050254K652834K604991
37825d316701Q76969q52041k93312K491137M384678K892543n12516k438473k036049
37816A96235j227396j050671m70767Q81236J451505L67781q26529n27922M61751
$$ plain form
37876 -1942630 -581231 -340586 -910546 -951407 565404 3168214 5282219 5680178 4305036
37867 4305036 1924408 -410033 -1528416 -658517 1494360 2702962 1350783 -1337917
37859 -1337917 -2254409 -56481 3011030 3711233 1622575 -619541 -645835 1115757 2459758
37850 2459758 2166887 1156989 1081685 2243481 3227081 2690990 1229351 883028 2723725
37841 2723725 5589587 7559972 7981369 7421391 6313362 4665689 2780816 1134272
37833 1134272 -524383 -3006150 -6361537 -9380360 -10624780 -9574526 -6921692 -4316701
37825 -4316701 -3439732 -4291773 -4585085 -2093948 2290730 5183273 4670757 2232284 196235
37816 196235 -1031161 -2081832 -2552599 -1671363 -219858 147923 -678606 -1206528 -744777
37807g44777M43208m78639r67398q39509r95685j402530j030610J10127N93374
37798e312439j91849p98885L00325K294615K777941Q60585j429581j401946J056600
$$ plain form
37807 -744777 -301569 -780208 -1747606 -2587115 -3582800 -4985330 -6015940 -5905813 -5312439
37798 -5312439 -5504288 -6303173 -6002848 -3708233 -930292 -69707 -1499288 -2901234 -1844634
$$ [...]
##END NTUPLES=NMR SPECTRUM
##END=
