##TITLE=31Pdec_DE-75k_TFA2
 CDCl3, 64 sc
 27.11.2024
##JCAMPDX= 6.0         $$ Bruker NMR JCAMP-DX V2.0
##DATA TYPE= NMR SPECTRUM
##DATA CLASS= NTUPLES
##ORIGIN= UXNMR, Bruker Analytische Messtechnik GmbH
##OWNER= root
$$ XWIN-NMR		Version 3.5
$$ Wed Nov 27 14:16:36 2024 Russian Standard Time (UT+4h)  she@DPX200
##.OBSERVE FREQUENCY= 81.013821
##.OBSERVE NUCLEUS= ^31P
##.ACQUISITION MODE= SIMULTANEOUS
##.ACQUISITION SCHEME= undefined
##.AVERAGES= 64
##.DIGITISER RES= 17
##SPECTROMETER/DATA SYSTEM= spect
##.PULSE SEQUENCE= zgpg30
##.SOLVENT NAME= DMSO
##.SHIFT REFERENCE= (INTERNAL, DMSO, 0, 198.062)
##AUDIT TRAIL= $$ (NUMBER, WHEN, WHO, WHERE, WHAT)
$$ ##TITLE= Audit trail, XWIN-NMR		Version 3.5
$$ ##JCAMPDX= 5.01
$$ ##ORIGIN= Bruker BioSpin GmbH
$$ ##OWNER= she
$$ F:/spectra/data/she/nmr/P31/2/pdata/1/auditp.txt
$$ ##AUDIT TRAIL=  $$ (NUMBER, WHEN, WHO, WHERE, WHAT)
(   1,<2024-11-27 14:15:30.03 +0400>,<she>,<DPX200>,
      <created by zg, POWCHK disabled, PULCHK disabled
       configuration hash MD5:
       00 E9 B6 7A A2 85 ED C7 34 08 36 98 17 FE 4E 26
       data hash MD5: 32K
       C3 04 8A 0D 93 1B FB A2 0A 7E 9E 9E 83 39 17 3C>)
(   2,<2024-11-27 14:15:32.95 +0400>,<she>,<DPX200>,
      <Start of raw data processing
       efp BC_mod = 2 LB = 1.5 FT_mod = 6 PKNL = 1 PHC0 = 2235.211 PHC1 = 210.2883 SI = 64K 
       data hash MD5: 64K
       89 6E C0 96 DA 89 3D C3 55 55 7C 7B 68 95 38 49>)
(   3,<2024-11-27 14:15:57.12 +0400>,<she>,<DPX200>,
      <pk PHC0 = 20.96045 PHC1 = -40.2 
       data hash MD5: 64K
       51 1D AC 90 AB E4 81 BA ED 87 7C D4 E1 28 6B DC>)
(   4,<2024-11-27 14:16:01.42 +0400>,<she>,<DPX200>,
      <abs ABSG = 5 
       data hash MD5: 64K
       23 C7 71 C5 FD B3 98 48 A8 39 AE 97 05 AC D6 32>)
$$ ##END=
$$ 
$$ hash MD5
$$ 45 DF FB 9D 73 9B 8C 99 5C 2D 87 AC DF B3 D3 ED
##$RELAX= 
##$RELAX= 
##$RELAX= 
##$RELAX= 
##$RELAX= 
##$RELAX= 
##$RELAX= 
##$RELAX= 
$$ Bruker specific parameters
$$ --------------------------
##$DU= <F:/spectra>
##$EXPNO= 2
##$NAME= <P31>
##$PROCNO= 1
##$TYPE= <nmr>
##$USER= <she>
##$AMP= (0..31)
100 100 100 100 100 100 100 100 100 100 100 100 100 100 100 100 100 100 
100 100 100 100 100 100 100 100 100 100 100 100 100 100 
##$AQSEQ= 0
##$AQ_mod= 1
##$AUNM= <au_zg>
##$AUTOPOS= <>
##$BF1= 81.014009
##$BF2= 200.13
##$BF3= 200.13
##$BF4= 200.13
##$BF5= 200.13
##$BF6= 200.13
##$BF7= 200.13
##$BF8= 200.13
##$BYTORDA= 1
##$CFDGTYP= 0
##$CFRGTYP= 5
##$CHEMSTR= <none>
##$CNST= (0..31)
1 1 145 1 1 1 1 1 1 1 1 1 1 1 1 1 1 1 1 1 1 1 1 1 1 1 1 1 1 1 1 1 
##$CPDPRG= <waltz16>
##$CPDPRG1= <>
##$CPDPRG2= <waltz16>
##$CPDPRG3= <>
##$CPDPRG4= <mlev>
##$CPDPRG5= <mlev>
##$CPDPRG6= <mlev>
##$CPDPRG7= <mlev>
##$CPDPRG8= <mlev>
##$CPDPRGB= <>
##$CPDPRGT= <>
##$D= (0..31)
0 1 0 0 0 0 0 0 0 0.06 0 0.03 2e-05 3e-06 0 0 0.0002 0 0 0 0 0 0 0 0 0 
0 0 0 0 0 0 
##$DATE= 1732702529
##$DBL= (0..7)
120 120 120 11 120 120 24 19 
##$DBP= (0..7)
150 150 150 150 150 150 150 150 
##$DBP07= 0
##$DBPNAM0= <>
##$DBPNAM1= <>
$$ [...]
##$SUBNAM3= <"">
##$SUBNAM4= <"">
##$SUBNAM5= <"">
##$SUBNAM6= <"">
##$SUBNAM7= <"">
##$SUBNAM8= <"">
##$SUBNAM9= <"">
##$SW= 400.765351723535
##$SWIBOX= (0..15)
0 1 3 0 0 0 0 0 0 0 0 0 0 0 0 0 
##$SW_h= 32467.5324675325
##$TD= 32768
##$TD0= 1
##$TE= 0
##$TE2= 300
##$TE3= 300
##$TEG= 300
##$TL= (0..7)
0 120 53 12 22 120 120 120 
##$TP= (0..7)
150 150 150 150 150 150 150 150 
##$TP07= 0
##$TPNAME0= <>
##$TPNAME1= <>
##$TPNAME2= <>
##$TPNAME3= <>
##$TPNAME4= <>
##$TPNAME5= <>
##$TPNAME6= <>
##$TPNAME7= <>
##$TPOAL= (0..7)
0.5 0.5 0.5 0.5 0.5 0.5 0.5 0.5 
##$TPOFFS= (0..7)
0 0 0 0 0 0 0 0 
##$TUNHIN= 0
##$TUNHOUT= 0
##$TUNXOUT= 0
##$USERA1= <user>
##$USERA2= <user>
##$USERA3= <user>
##$USERA4= <user>
##$USERA5= <user>
##$V9= 5
##$VALIST= <valist>
##$VCLIST= <CCCCCCCCCCCCCCC>
##$VD= 0
##$VDLIST= <DDDDDDDDDDDDDDD>
##$VPLIST= <PPPPPPPPPPPPPPP>
##$VTLIST= <TTTTTTTTTTTTTTT>
##$WBST= 1024
##$WBSW= 4
##$XGAIN= (0..3)
0 0 0 0 
##$XL= 0
##$YL= 0
##$YMAX_a= 20964
##$YMIN_a= -21099
##$ZGOPTNS= <>
##$ZL1= 120
##$ZL2= 120
##$ZL3= 120
##$ZL4= 120
##$ABSF1= 198.0616
##$ABSF2= -202.7028
##$ABSG= 5
##$ABSL= 3
##$ALPHA= 0
##$AQORDER= 0
##$ASSFAC= 0
##$ASSFACI= 0
##$ASSFACX= 0
##$ASSWID= 0
##$AUNMP= <proc_1d>
##$AZFE= 0.1
##$AZFW= 0.5
##$BCFW= 0
##$BC_mod= 2
##$BYTORDP= 0
##$COROFFS= 0
##$CY= -3
##$DATMOD= 1
##$DC= 0
##$DFILT= <>
##$DTYPP= 0
##$F1P= 0
##$F2P= 0
##$FCOR= 1
##$FTSIZE= 65536
##$FT_mod= 6
##$GAMMA= 0
##$GB= 0
##$INTBC= 1
##$INTSCL= 9.790993e-09
##$ISEN= 30
##$LB= 1.5
##$LEV0= 0
##$LPBIN= 0
##$MAXI= 10000
##$MC2= 0
##$MEAN= 0
##$ME_mod= 0
##$MI= 50
##$NCOEF= 0
##$NC_proc= -8
##$NLEV= 6
##$NOISF1= 182.463
##$NOISF2= 159.3651
##$NSP= 0
##$NTH_PI= 0
##$NZP= 0
##$OFFSET= 198.0616
##$PC= 4
##$PHC0= 2256.171
##$PHC1= 170.0883
##$PH_mod= 1
##$PKNL= yes
##$PPARMOD= 0
##$PSCAL= 0
##$PSIGN= 0
##$REVERSE= no
##$SF= 81.0140089999434
##$SI= 65536
##$SIGF1= 159.3651
##$SIGF2= -187.1042
##$SINO= 113.3802
##$SIOLD= 16384
##$SREGLST= <1H.CDCl3>
##$SSB= 0
##$STSI= 65536
##$STSR= 0
##$SW_p= 32467.5324675325
##$SYMM= 0
##$S_DEV= 0
##$TDeff= 32768
##$TDoff= 0
##$TI= <>
##$TILT= no
##$TM1= 0
##$TM2= 0
##$TOPLEV= 0
##$USERP1= <user>
##$USERP2= <user>
##$USERP3= <user>
##$USERP4= <user>
##$USERP5= <user>
##$WDW= 1
##$XDIM= 65536
##$YMAX_p= 250187393
##$YMIN_p= -101824877
$$ End of Bruker specific parameters
$$ ---------------------------------
##NTUPLES= NMR SPECTRUM
##VAR_NAME=  FREQUENCY,     SPECTRUM/REAL,   SPECTRUM/IMAG
##SYMBOL=    X,             R,               I
##VAR_TYPE=  INDEPENDENT,   DEPENDENT,       DEPENDENT
##VAR_FORM=  AFFN,          ASDF,            ASDF
##VAR_DIM=   65536,         65536,           65536
##UNITS=     HZ,            ARBITRARY UNITS, ARBITRARY UNITS
##FACTOR=    0.49542278885378, 1,            1
##FIRST=     16045.7642231865, 0,            0
##LAST=      -16421.768244346, 0,            0
##MIN=       -16421.768244346, -101824877,   0
##MAX=       16045.7642231865, 250187393,    0
$$ Real data points
##PAGE= N=1
##DATA TABLE= (X++(R..R)), XYDATA
$$ [...]
##PAGE= N=2
##DATA TABLE= (X++(I..I)), XYDATA
$$ plain form
7462 -7998273 -6927687 -3369619 389544 1732515 274701 -1772055 -2018574 -614218
7454 -614218 153765 -926904 -2482051 -2974624 -3003319 -3522141 -3250184 -515375 2988713
7445 2988713 3436843 252332 -2681563 -2249919 8043 646097 -1306657 -4360590 -7009045
7436 -7009045 -8382884 -8162995 -7573604 -8758471 -11382997 -11825304 -8053160 -3352921 -2213767
7427 -2213767 -4065374 -4689821 -2905533 -1709437 -2661347 -3324305 -1581599 1077805 2550629
7418 2550629 3516964 5486359 7571582 7692915 5616726 2622222 -640634 -3724628 -4830938
7409 -4830938 -2315046 2333110 5224930 4233740 910954 -2006160 -3482131 -4075166 -4343845
7400 -4343845 -4358713 -4060424 -3123706 -704285 3810958 9451286 13390167 12640440 6536172
$$ packed form
7462g998273J070586L558068L759163J342971j457814k046756k46519J404356
7454f14218P67983j080669j555147m92573k8695n18822K71957K734809L504088
7445B988713M48130l184511k933895M31644K257962O38054j952754l053933k648455
7436g009045j373839K19889N89391j184867k624526m42307L772144M700239J139154
7427b213767j851607o24447J784288J196096r51910o62958J742706K659404J472824
7418B550629R66335J969395K085223J21333k076189k994504l262856l083994j106310
7409d830938K515892M648156K891820r91190l322786k917114j475971n93035k68679
7400d343845j4868K98289R36718K419421M515243N640328L938881p49727o104268
$$ plain form
7391 6536172 -2396550 -10298194 -14771141 -15788442 -14422191 -11682994 -8626889 -6333040
7383 -6333040 -4958003 -3493323 -1211168 1154335 2303448 1898304 548265 -1073976
7375 -1073976 -2283920 -2255803 -965842 238713 245088 -91385 708721 2016234 1692085
7366 1692085 -322190 -1228162 705734 3400127 3906334 2523401 1589494 1163528 -996361
7357 -996361 -4998063 -7619659 -7023990 -5930346 -7586775 -10469033 -10197525 -5975395 -1723478
7348 -1723478 -526288 -1217402 -1613530 -2012551 -3295431 -4016034 -2342778 479281 1573234
7339 1573234 585911 -541348 -1590658 -4598060 -9842239 -14391378 -16028949 -16165213 -17059350
7330 -17059350 -18007011 -16317429 -11007663 -3827099 2654647 6665216 7754298 7049688
$$ packed form
7391F536172q932722p901644m472947j017301J366251K739197L056105K293849
7383f333040J375037J464680K282155K365503J149113m05144j350039j622241
7375a073976j209944K8117J289961J204555O375l36473Q00106J307513l24149
7366A692085k014275r05972J933896K694393N06207j382933r33907m25966k159889
7357i96361m001702k621596N95669J093644j656429k882258K71508M222130M251917
7348a723478J197190o91114l96128l99021j282880p20603J673256K822059J093953
7339A573234r87323j127259j049310l007402n244179m549139j637571j36264q94137
7330a7059350r47661J689582N309766P180564O481746M010569J089082p04610
$$ plain form
7322 7049688 6462846 6722798 6916308 6550783 6584384 7281362 6806693 3911693 669218
7313 669218 159066 2228374 3957390 3814900 2802914 1671279 -255276 -3064992 -5607994
7304 -5607994 -7597998 -10048350 -12670207 -13105603 -10136087 -5798073 -2852867 -1776811
7296 -1776811 -1655255 -2232131 -3133052 -2649196 164553 3025629 2716636 -274055 -1911561
7287 -1911561 75946 3257235 3955559 1939080 128818 646129 2904885 5419046 7735716
7278 7735716 9720505 10027090 6965262 1270883 -3223456 -2985005 1279215 5124654 5056023
7269 5056023 1912928 -702785 -496724 1623312 3051432 2094397 -677882 -3180534 -4056478
7260 -4056478 -4281541 -5967252 -9344763 -11822861 -10755852 -6525203 -2068659 216706
$$ packed form
7322G049688n86842K59952J93510l65525L3601O96978m74669k895000l242475
7313F69218n10152K069308J729016j42490j011986j131635j926555k809716k543002
7304e607994j990004k450352k621857m35396K969516M338014K945206J076056
7296a776811J21556n76876r00921M83856K813749K861076l08993k990691j637506
7287a911561J987507L181289O98324k016479j810262N17311K258756K514161K316670
7278G735716J984789L06585l061828n694379m494339K38451M264220L845439o8631
7269E056023l143095k615713K06061K120036J428120r57035k772279k502652q75944
7260d056478k25063j685711l377511k478098J067009M230649M456544K285365
$$ plain form
7252 216706 317848 -289843 -515583 -588942 -1490023 -3344667 -4509177 -3139827 116494
7243 116494 2299105 1715596 -99047 -1191219 -2274288 -4807831 -7171568 -5826076 -419010
7234 -419010 5080179 7203118 6563475 5498093 4502237 2906809 1313541 916751 1166009
7225 1166009 305094 -1911018 -3775865 -3907408 -2481835 -169547 2639237 5162036 6032858
7216 6032858 4454183 953861 -3158132 -6415525 -7467263 -6004008 -3738744 -3196977
7208 -3196977 -4781768 -6011789 -4547436 -1157344 1383964 1760049 1223710 1461259 2645234
7199 2645234 3876039 4506256 4483141 4071547 3747252 3804535 3639475 2141708 -509260
7190 -509260 -2197224 -1217468 1111424 1713424 -214523 -2152945 -2089052 -1644813 -3436745
$$ packed form
7252B16706J01142o07691k25740p3359r01081j854644j164510J369350L256321
7243A16494K182611n83509j814643j092172j083069k533543k363737J345492N407066
7234d19010N499189K122939o39643j065382r95856j595428j593268l96790K49258
7225A166009q60915k216112j864847j31543J425573K312288K808784K522799Q70822
7216F032858j578675l500322m111993l257393j051738J463255K265264N41767
7208c196977j584791j230021J464353L390092K541308L76085n36339K37549J183975
7199B645234J230805O30217k3115m11594l24295N7283j65060j497767k650968
7190e09260j687964R79756K328892O02000j927947j938422O3893M44239j791932
$$ plain form
7181 -3436745 -6309422 -5973505 -955461 4474976 4968230 276479 -5111200 -7674886 -7936958
7172 -7936958 -7761804 -6937273 -3886697 1359300 6491963 9069750 8389635 5422512 1930328
7163 1930328 -208361 156350 2430949 4338363 3668911 245614 -3987274 -6904999 -8065612
7154 -8065612 -8503815 -8935836 -8798537 -7393682 -5436277 -4610980 -5587231 -7270324 -8248248
7145 -8248248 -8209362 -7582505 -6690864 -5913651 -5693866 -5321940 -2728993 2754245 8033199
7136 8033199 9005930 5958007 3736447 5437647 8269798 7666467 3602523 46335 -793168
7127 -793168 -432693 -389900 149448 1733501 2445359 405350 -3075702 -4895003 -3931430
7118 -3931430 -1764551 -172541 536709 889419 1194324 1167561 -64560 -3203931 -7326394
$$ packed form
7181c436745k872677L35917N018044N430437M93254m691751n387679k563686k62072
7172g936958J75154Q24531L050576N245997N132663K577787o80115k967123l492184
7163A930328k138689L64711K274599J907414o69452l423297m232888k917725j160613
7154h065612m38203m32021J37299J404855J957405Q25297r76251j683093r77924
7145h248248L8886O26857Q91641P77213K19785L71926K592947N483238N278954
7136H033199R72731l047923k221560J701200K832151o03331m063944l556188q39503
7127g93168L60475M2793N39348J584053P11858k040009l481052j819301R63573
7118c931430K166879J592010P09250L52710L04905k6763j232121l139371m122463
$$ plain form
7109 -7326394 -9866565 -9109551 -6209226 -3674052 -2377885 -1322394 67392 943887 409587
7100 409587 -1319583 -3315991 -4687196 -5045077 -5030432 -5941355 -7856743 -8874817 -7718062
7091 -7718062 -6298898 -7478864 -10646594 -12255637 -11037212 -9594259 -9646594 -8894926 -5051908
7082 -5051908 -473758 606283 -1811046 -3674974 -2930894 -1933531 -3001142 -4542470 -3464065
7073 -3464065 357427 3981722 4944250 3305191 660708 -1356824 -1553704 531126 4102944
7064 4102944 7331256 8637875 7811140 5769526 3381662 768390 -2191802 -4969370
7056 -4969370 -6416090 -5824232 -3782386 -1909954 -1813689 -4025391 -7419780 -9745577 -9509745
7047 -9509745 -7621748 -6510199 -7329190 -8870520 -9661744 -9976919 -10712725 -11265504 -10165003
$$ packed form
7109g326394k540171P57014K900325K535174J296167J055491J389786Q76495n34300
7100D09587j729170j996408j371205l57881J4645r10923j915388j018074J156755
7091g718062J419164j179966l167730j609043J218425J442953n2335P51668L843018
7082e051908M578150J080041k417329j863928P44080R97363j067611j541328J078405
7073c464065L821492L624295R62528j639059k644483k017532j96880K084830L571818
7064D102944L228312J306619q26735k041614k387864k613272k960192k777568
7056d969370j446720N91858K041846J872432R6265k211702l394389k325797K35832
7047i509745J887997J111549q18991j541330p91224l15175p35806n52779J100501
$$ plain form
7038 -10165003 -7460329 -4806650 -3125090 -1795061 -499643 -132686 -933326 -1199421 628311
7029 628311 3376284 4206837 2137283 -790467 -2033093 -1252933 -163640 -367666 -1758102
7020 -1758102 -2764369 -2081637 -425828 -282373 -3141158 -7131039 -8616893 -6492801 -3476469
7011 -3476469 -2161589 -1292024 1945968 6688912 8415063 5028660 337324 -499380 2718693
7002 2718693 5822545 6044636 4387911 2568034 739995 -877961 -938885 595231 848354
6993 848354 -2848167 -9054080 -13385772 -13288639 -10162860 -6991107 -5340824 -4869579 -4601066
6984 -4601066 -4099128 -3679747 -3633566 -3458391 -2532654 -1527540 -1905276 -3528087 -4217797
6975 -4217797 -2702392 -602445 -91128 -888770 -1401409 -1772650 -3528295 -6594264 -8819709
$$ packed form
7038a0165003K704674K653679J681560J330029J295418L66957q00640k66095J827732
7029F28311K747973Q30553k069554k927750j242626P80160J089293k04026j390436
7020a758102j006267O82732J655809J43455k858785l989881j485854K124092L016332
7011c476469J314880Q69565L237992M742944J726151l386403m691336q36704L218073
7002B718693L103852K22091j656725j819877j828039j617956o0924J534116K53123
6993H48354l696521o205913m331692R7133L125779L171753J650283M71245K68513
6984d601066N01938M19381M6181J75175R25737J005114l77736j622811o89710
6975d217797J515405K099947N11317p97642n12639l71241j755645l065969k225445
$$ plain form
6966 -8819709 -8501285 -5736457 -1548965 2513980 4241237 2366326 -1613071 -5108203
6958 -5108203 -7715147 -10572782 -12741236 -11388858 -6435681 -2094370 -2194393 -6087985
6950 -6087985 -10544573 -13542480 -14659202 -13917134 -12305396 -11796275 -12849868 -13289930 -11460720
6941 -11460720 -8963197 -8194908 -8600639 -7718262 -4882527 -1535012 1276001 3332001 3969804
6932 3969804 2948093 2109638 3488407 5822482 5604148 1972753 -1856258 -2715910 -965687
6923 -965687 918286 1397273 620332 -425089 -686882 30259 692502 750765 1902479
6914 1902479 6050414 11369036 13035521 8993653 2721214 -1225846 -2303090 -2661566
6906 -2661566 -2745214 -1213921 1423590 2196985 -531095 -4660319 -6858629 -6320022 -4961017
$$ packed form
6966h819709L18424K764828M187492M062945J727257j874911l979397l495132
6958e108203k606944k857635k168454J352378M953177M341311j00023l893592
6950f087985m456588k997907j116722P42068J611738N09121j053593m40062J829210
6941a1460720K497523P68289m05731Q82377K835735L347515K811013K056000O37803
6932C969804j021711q38455J378769K334075k18334l631395l829011q59652J750223
6923i65687J883973M78987p76941j045421k61793P17141O62243N8263J151714
6914A902479M147935N318622J666485m041868o272439l947060j077244l58476
6906b661566q3648J531293K637511P73395k728080m129224k198310N38607J359005
$$ plain form
6897 -4961017 -4520293 -4624592 -3940192 -2555682 -2352878 -4558197 -7388750 -7252770 -2800333
6888 -2800333 2949706 5338583 2659647 -2599134 -6776838 -8386825 -8386376 -8130499 -7876495
6879 -7876495 -7012194 -4891349 -1189773 3872897 8996289 11896184 11008292 7345062 3817968
6870 3817968 2300803 2101693 1689148 783249 -155332 -1327141 -2901750 -3643957 -2187290
6861 -2187290 407377 1358571 -87789 -1447547 -527649 1323619 969523 -2256324 -5514146
6852 -5514146 -5713168 -2909570 -129189 -36904 -2030458 -3006834 -1175869 1624023 2190347
6843 2190347 -220223 -3658636 -6398126 -8034436 -7876922 -5034940 -1145764 -358779 -4406661
6834 -4406661 -9436708 -10320956 -7143811 -4676423 -5673625 -7594406 -6855390 -3966906 -2543920
$$ packed form
6897d961017M40724j04299O84400J384510K02804k205319k830553J35980M452437
6888b800333N750039K388877k678936n258781m177704j609987M49K55877K54004
6879g876495Q64301K120845L701576N062670N123392K899895q87892l663230l527094
6870C817968j517165j99110m12545r05899r38581j171809j574609p42207J456667
6861b187290K594667R51194j446360j359758R19898J851268l54096l225847l257822
6852e514146j99022K803598K780381R2285j993554r76376J830965K799892N66324
6843B190347k410570l438413k739490j636310J57514K841982L889176P86985m047882
6834d406661n030047q84248L177145K467388r97202j920781P39016K888484J422986
$$ plain form
6825 -2543920 -4241561 -6650885 -6533898 -3938219 -2037849 -2968556 -4939256 -4499201 -1160939
6816 -1160939 1896379 2089053 574855 -95147 122481 -732680 -3128707 -5522964 -7225250
6807 -7225250 -9216371 -11457147 -11849640 -9390987 -6408051 -5531240 -5708798 -3757278 575446
6798 575446 3871449 3991493 3213981 4686926 7467350 7583423 3607947 -1197326 -2824835
6789 -2824835 -802482 2294916 4005002 3334813 219264 -4454011 -8481623 -9554712
6781 -9554712 -7250436 -3232932 373738 2303483 2529135 2330089 3375513 5612672 6816787
6772 6816787 5649073 4125366 4777951 6080470 3849468 -2442940 -8033780 -8932499 -6799401
6763 -6799401 -5810089 -7028272 -8322005 -8077020 -6306469 -3183110 929117 4486274 5893931
$$ packed form
6825b543920j697641k409324J16987K595679J900370r30707j970700M40055L338262
6816a160939L057318J92674j514198o70002K17628q55161k396027k394257j702286
6807g225250j991121k240776l92493K458653K982936Q76811j77558J951520M332724
6798E75446L296003J20044p77512J472945K780424J16073l975476m805273j627509
6789b824835K022353L097398J710086o70189l115549m673275m027612j073089
6781i554712K304276M017504L606670J929745K25652j99046J045424K237159J204115
6772F816787j167714j523707O52585J302519k231002o292408n590840q98719K133098
6763f799401R89312j218183j293733K44985J770551L123359M112227L557157J407657
$$ plain form
6754 5893931 5216926 3239560 -118360 -4545710 -7785084 -7917418 -6377906 -5960157 -6402675
6745 -6402675 -4949792 -1043626 2818880 5155895 6957140 8169641 6380751 1191968
6737 1191968 -2952591 -1400070 4525953 8687869 7140857 1911820 -2289987 -3420696
6729 -3420696 -3368349 -4647409 -6977717 -7832332 -5954437 -2827392 -132361 2335538 4670369
6720 4670369 4912980 2078802 -405727 1582804 6098577 6784546 2181933 -1548764 448707
6711 448707 4665021 4793845 718602 -2724499 -3580591 -4225625 -5885554 -6669964 -5555466
6702 -5555466 -4322871 -4488984 -5380791 -6212731 -7410882 -8971097 -9965185 -10604447 -12430848
6693 -12430848 -15366064 -16765360 -14721555 -10481439 -6322212 -2787752 508401 2912610
$$ packed form
6754E893931o77005j977366l357920m427350l239374j32334J539512M17749m42518
6745f402675J452883L906166L862506K337015J801245J212501j788890n188783
6737A191968m144559J552521N926023M161916j547012n229037m201807j130709
6729c420696N2347j279060k330308q54615J877895L127045K695031K467899K334831
6720D670369K42611k834178k484529J988531M515773O85969m602613l730697J997471
6711D48707M216314J28824m075243l443101q56092o45034j659929p84410J114498
6702e555466J232595j66113q91807q31940j198151j560215r94088o39262j826401
6693a2430848k935216j399296K043805M240116M159227L534460L296153K404209
$$ plain form
6685 2912610 3439584 2666688 2306576 3077802 3933333 3195259 -44464 -5177392 -10266325
6676 -10266325 -13487561 -14790440 -15695831 -17310364 -19142712 -19957849 -19099638 -16926494 -14631641
6667 -14631641 -13490005 -13514048 -13279949 -12089156 -11468233 -12781076 -14180131 -12625416 -8796601
6658 -8796601 -6748123 -7863908 -8555580 -5848595 -2152522 -1607311 -4004823 -5772160 -5549705
6649 -5549705 -5051898 -4865541 -3226078 247650 2744634 1775595 -1493995 -3932540 -4150198
6640 -4150198 -3249420 -2833202 -3440437 -4488975 -5033417 -4929316 -5532797 -8534624 -13625151
6631 -13625151 -17969775 -18638149 -15275252 -10083630 -5634105 -3103198 -2234746 -2294424 -2775523
6622 -2775523 -3358707 -3601916 -3055956 -1626277 537736 3343744 6332874 8193052 7812874
$$ packed form
6685B912610N26974p72896l60112P71226Q55531p38074l239723n132928n088933
6676a0266325l221236j302879r05391j614533j832348q15137Q58211K173144K294853
6667a4631641J141636k4043K34099J190793O20923j312843j399055J554715L828815
6658h796601K048478j115785o91672K706985L696073N45211k397512j767337K22455
6649e549705M97807J86357J639463L473728K496984r69039l269590k438545k17658
6640d150198R00778M16218o07235j048538n44442J04101o03481l001827n090527
6631a3625151m344624o68374L362897N191622M449525K530907Q68452n9678m81099
6622b775523n83184k43209N45960J429679K164013K806008K989130J860178l80178
$$ plain form
6613 7812874 5910394 4276320 3114770 866101 -2603537 -4724277 -3666546 -1170482
6605 -1170482 121125 480483 1757155 3728746 4839771 5465595 6885281 7603729 4766132
6596 4766132 -464411 -3041849 -654376 3491656 5793069 6329652 6080177 4125027 394008
6587 394008 -2322716 -2374159 -2247236 -4166307 -5679856 -3674272 -168762 586177 -1116470
6578 -1116470 -1542545 -53536 717274 474103 1455092 2998981 1719401 -1918097 -2909131
6569 -2909131 544346 4017673 4119306 3516038 5295569 7175693 5798672 2882752 2017676
6560 2017676 2185937 -180823 -4505871 -6771536 -6113195 -5741274 -7370282 -9223087 -9888969
6551 -9888969 -9967761 -9194480 -5907953 -603932 3368896 3992148 2563365 502427 -2569915
$$ packed form
6613G812874j902480j634074j161550k248669l469638k120740J057731K496064
6605a170482J291607L59358J276672J971591J111025O25824J419686P18448k837597
6596D766132n230543k577438K387473M146032K301413N36583k49475j955150l731019
6587C94008k716724n1443J26923j919071j513549K005584L505510P54939j702647
6578a116470m26075J489009P70810k43171R80989J543889j279580l637498r91034
6569b909131L453477L473327J01633o03268J779531J880124j377021k915920q65076
6560B017676J68261k366760m325048k265665O58341L71921j629008j852805o65882
6551i888969p8792P73281L286527N304021L972828O23252j428783k060938l072342
$$ plain form
6542 -2569915 -6044239 -6884637 -3453300 1469607 3904136 3286852 1816302 865878 443443
6533 443443 956114 2806374 4655170 4525022 2782714 1968257 3094616 3824935 1429400
6524 1429400 -3418753 -7075928 -6949065 -3933944 -464249 2713308 6393162 9971590
6516 9971590 10864266 7924763 3721047 1607969 1629985 1328392 -203602 -1417226 -1128945
6507 -1128945 94912 1318140 1729102 -81851 -4561808 -8658603 -7975496 -2456206 2995897
6498 2995897 4789928 4456354 4580722 4484639 2894091 1890100 4112953 7662331 7995880
6489 7995880 4426128 891340 72003 277481 -984153 -3458812 -5588123 -7026717 -7912312
6480 -7912312 -7315350 -4446199 -795699 546133 -2002111 -6603181 -9415640 -8099297
$$ packed form
6542b569915l474324q40398L431337M922907K434529o17284j470550r50424m22435
6533D43443N12671J850260J848796j30148j742308q14457J126359P30319k395535
6524A429400m848153l657175J26863L015121L469695L177557L679854L578428
6516I971590Q92676k939503m203716k113078K2016l01593j531994j213624K88281
6507a128945J223857J223228M10962j810953m479957m096795O83107N519290N452103
6498B995897J794031l33574J24368r6083j590548j003991K222853L549378L33549
6489G995880l569752l534788q19337K05478j261634k474659k129311j438594q85595
6480g912312N96962K869151L650500J341832k548244m601070k812459J316343
$$ plain form
6472 -8099297 -4088221 -1040197 -861429 -2101417 -2739467 -3123150 -4693888 -7017305 -8368409
6463 -8368409 -8873603 -10541306 -13620778 -15136479 -12409723 -6835628 -2810990 -3241323 -6816039
6454 -6816039 -9585588 -8937077 -6026645 -4151656 -4842883 -6488551 -7125229 -7011765 -7148378
6445 -7148378 -6813342 -4873229 -2671113 -2821293 -5067206 -5968226 -3408529 749892 3379533
6436 3379533 3605506 2789108 2779727 5054994 9735249 14209191 14380042 8895368 1221244
6427 1221244 -3699342 -4105949 -1986079 -133212 242430 -288414 -644867 -1029627 -3308229
6418 -3308229 -8313362 -13018280 -12844952 -7537359 -2096012 -354719 -354522 1450773 3966500
6409 3966500 3238205 -805026 -3668162 -2677417 -326005 8148 -1372287 -2074044 -1476966
$$ packed form
6472h099297M011076L048024J78768j239988o38050l83683j570738k323417j351104
6463h368409n05194j667703l079472j515701K726756N574095M024638m30333l574716
6454f816039k769549O48511K910432J874989o91227j645668o36678J13464j36613
6445g148378L35036J940113K202116j50180k245913r01020K559697M158421K629641
6436C379533K25973q16398r381K275267M680255M473942J70851n484674p674124
6427A221244m920586m06607K119870J852867L75642n30844l56453l84760k278602
6418c308229n005133m704918J73328N307593N441347J741293J97J805295K515727
6409C966500p28295m043231k863136R90745K351412L34153j380435p01757N97078
$$ plain form
6400 -1476966 -763858 -510749 -463763 -935776 -2325734 -3541935 -2907968 -806391 522991
6391 522991 574304 2164385 7791728 15386099 19741704 18230804 13295145 8759080 5542271
6382 5542271 2342163 -1045136 -3392485 -4548229 -5925899 -8008226 -9196343 -8091226
6374 -8091226 -5751980 -4773803 -6718912 -10761514 -14082971 -13602408 -8613230 -2018265 2276943
6365 2276943 3331500 3039591 2222823 -437764 -4661853 -6860802 -4644895 -917219 -439038
6356 -439038 -3462331 -5792657 -4640714 -1421184 1305926 2790379 3263275 2556719 793981
6347 793981 -986016 -1812602 -1473098 -45545 1970035 3003884 1600648 -1332692 -3092691
6338 -3092691 -2542828 -1310347 -972363 -770153 742848 3109391 4313896 2965767 -672991
$$ packed form
6400a476966P13108K53109M6986m72013j389958j216201O33967K101577J329382
6391E22991N1313J590081N627343P594371M355605j510900m935659m536065l216809
6382E542271l200108l387299k347349j155744j377670k082327j188117J105117
6374h091226K339246R78177j945109m042602l321457M80563M989178O594965M295208
6365B276943J054557k91909q16768k660587m224089k198949K215907L727676M78181
6356d39038l023293k330326J151943L219530K727110J484453M72896p06556j762738
6347G93981j779997q26586L39504J427553K015580J033849j403236k933340j759999
6338c092691N49863J232481L37984K02210J513001K366543J204505j348129l638758
$$ plain form
6329 -672991 -5013902 -7902595 -8149346 -7029046 -7126651 -8944094 -10003199 -8343354 -5424089
6320 -5424089 -3972625 -4162843 -3990711 -2847749 -2475658 -4095154 -6396888 -7254340 -6476135
6311 -6476135 -6004188 -7509947 -10031597 -10262399 -5975089 557012 3838311 1042831 -4368903
6302 -4368903 -6572493 -4185106 -1051532 -590823 -2079959 -3265284 -3975503 -5268427 -6787165
6293 -6787165 -7205365 -6329214 -4675082 -1710046 3093181 7641708 8329349 4638809 563716
6284 563716 67280 2581028 4508918 4019487 2427560 1358231 746820 229208 781272
6275 781272 3444940 6881512 7707668 4048120 -1798759 -5326987 -4727942 -2816851 -3152429
6266 -3152429 -5157213 -4949187 -935942 3687763 5015832 3040731 534317 -1085248
$$ packed form
6329f72991m340911k888693k46751J120300r7605j817443j059105J659845K919265
6320e424089J451464j90218J72132J142962L72091j619496k301734q57452P78205
6311f476135M71947j505759k521650k30802M287310O532101L281299k795480n411734
6302d368903k203590K387387L133574M60709j489136j185325p10219j292924j518738
6293f787165m18200Q76151J654132K965036M803227M548527O87641l690540m075093
6284E63716m96436K513748J927890m89431j591927j069329o11411n17612N52064
6275G81272K663668L436572Q26156l659548n846879l528228N99045J911091l35578
6266c152429k004784K08026M013245M623705J328069j975101k506414j619565
$$ plain form
6258 -1085248 -2460735 -3723188 -3810891 -2522799 -1217266 -978528 -1495856 -1913891 -1450295
6249 -1450295 621475 3858722 5726347 4011740 335352 -1200618 544396 2220616
6241 2220616 910050 -2069826 -3850070 -3938807 -3271682 -1549250 1660534 4580336 4916470
6232 4916470 3261862 2279420 2855918 3326590 2257197 -128530 -3062240 -5618678 -6080166
6223 -6080166 -3174813 1633849 4958410 5174542 3919232 3583791 4701177 6249672 7294569
6214 7294569 7633503 7422742 6595524 4681622 1670751 -930736 -1202352 482386 1574576
6205 1574576 1283117 2327191 6836706 12467062 15189233 14295745 11662711 7657687 1625900
6196 1625900 -4444468 -7038481 -6025153 -4574801 -3877462 -1953778 1575879 3724517
$$ packed form
6258a085248j375487j262453q7703J288092J305533K38738n17328m18035M63596
6249a450295K071770L237247J867625j714607l676388j535970J745014J676220
6241B220616j310566k979876j780244q8737O67125J722432L209784K919802L36134
6232D916470j654608r82442N76498M70672j069393k385727k933710k556438m61488
6223f080166K905353M808662L324561K16132j255310l35441J117386J548495J044897
6214G294569L38934k10761q27218j913902l010871k601487k71616J684738J092190
6205A574576k91459J044074M509515N630356K722171q93488k633034m005024o031787
6196A625900o070368k594013J013328J450352O97339J923684L529657K148638
$$ plain form
6188 3724517 2601094 -36823 -2220063 -4166834 -5627145 -4643670 -1175734 1553723
6180 1553723 1722594 1496136 2461890 2257029 -958215 -4248305 -4182241 -2370673 -2295981
6171 -2295981 -3194071 -2053363 253803 339399 -1151799 23136 4553774 8051467 7574941
6162 7574941 5019779 2751919 396157 -2036637 -1937918 2065005 6904087 8580828 7021426
6153 7021426 5090898 4409685 4463202 4670486 5085053 5554040 5823987 6131356 6545622 6223858
6143 6223858 4376962 1631238 -364013 -417494 1526488 4675389 7891801 10269787 11491095
6134 11491095 11535690 10512208 9267765 9201344 10183669 9589009 5406435 -219736 -3064238
6125 -3064238 -2464588 -2098628 -4439912 -7401286 -8111369 -7321500 -7455863 -8093134 -6551521
$$ packed form
6188C724517j123423k637917k183240j946771j460311R83475L467936K729457
6180A553723J68871k26458R65754k04861l215244l290090O6064J811568P4692
6171b295981q98090J140708K307166Q5596j491198J174935M530638L497693m76526
6162G574941k555162k267860k355762k432794R8719M002923M839082J676741j559402
6153G021426j930528o81213N3517K07284M14567M68987K69947L07369M14266l21764
6143F223858j846896k745724j995251n3481J943982L148901L216412K377986J221308
6134A1491095M4595j023482j244443o6421R82325n94660m182574n626171k844502
6125c064238N99650L65960k341284k961374p10083P89869j34363o37271J541613
$$ plain form
6116 -6551521 -2502157 820182 546605 -2569051 -5490248 -6128090 -4511416 -1838411 498515
6107 498515 1223798 -418275 -3907832 -7266961 -8379940 -7015144 -5148058 -4626710 -4870120
6098 -4870120 -3862256 -1279117 751150 535489 -726950 -462010 1843280 3848478 3092243
6089 3092243 -241435 -3691391 -5309101 -5500718 -5928255 -7162859 -8185251 -8000533 -6704386
6080 -6704386 -4803119 -2678774 -1192411 -1482359 -3308195 -4869937 -5307652 -5994617 -8017788
6071 -8017788 -9899146 -9658091 -7729991 -5613129 -2961037 1178369 5215431 6395996
6063 6395996 4985110 3743528 3184566 839026 -4182460 -9322846 -12254603 -13206176 -12581249
6054 -12581249 -9733147 -5674832 -3576462 -4475819 -5568174 -4858155 -4219240 -5315841 -6027165
$$ packed form
6116f551521M049364L322339k73577l115656k921197o37842J616674K673005K336926
6107D98515P25283j642073l489557l359129j112979J364796J867086N21348k43410
6098d870120J007864K583139K030267k15661j262439K64940K305290K005198p56235
6089C092243l333678l449956j617710j91617m27537j234604j022392J84718J296147
6080f704386J901267K124345J486363k89948j825836j561742m37715o86965k023171
6071h017788j881358K41055J928100K116862K652092M139406M037062J180565
6063F395996j410886j241582n58962k345540n021486n140386k931757r51573O24927
6054a2581249K848102M058315K098370q99357j092355P10019O38915j096601p11324
$$ plain form
6045 -6027165 -4346136 -2524598 -2989281 -2860015 2138351 9766795 12978412 9605563 5170517
6036 5170517 4995417 8043751 10311898 10445316 9671664 9087620 9414933 11338377 13932400
6027 13932400 14406179 11359181 6995505 4433532 3986537 3665765 2256991 208218 -1769413
6018 -1769413 -3325873 -4038674 -3698961 -2888049 -2226825 -1185780 1326240 4974161 7320562
6009 7320562 5715623 -14981 -6864151 -10933970 -10720944 -8017390 -5537006 -4283778
6001 -4283778 -3618940 -2928683 -2098676 -917295 671259 1939465 2189411 1981354 2332165
5992 2332165 2914327 2415429 529254 -1917041 -4694491 -8156081 -11190080 -11243383 -7516237
5983 -7516237 -2793906 -930859 -3252419 -8026330 -12384614 -13944218 -11640576 -6317170
$$ packed form
6045f027165J681029J821538m64683J29266M998366P628444L211617l372849m435046
6036E170517j75100L048334K268147J33418p73652n84044L27313J923444K594023
6027A3932400M73779l046998m363676k561973m46995l20772j408774k048773j977631
6018a769413j556460p12801L39713Q10912O61224J041045K512020L647921K346401
6009G320562j604939n730604o849170m069819K13026K703554K480384J253228
6001d283778O64838O90257Q30007J181381J588554J268206K49946k08057L50811
5992B332165N82162m98898j886175k446295k777450l461590l033999n3303L727146
5983g516237M722331J863047k321560m773911m358284j559604K303642N323406
$$ plain form
5975 -6317170 -342869 3952250 5361962 3584741 -892194 -6219758 -9595259 -9217519
5967 -9217519 -5591442 -726518 3357021 5440591 5676487 5694824 6950374 8552477 8095865
5958 8095865 5263472 3031202 4097000 7373757 9504360 8957967 6994175 5069101
5950 5069101 3045364 200495 -3238367 -6082888 -7129002 -5913779 -3023479 105771
5942 105771 1908149 1444026 -1250060 -5176648 -8862475 -11364080 -12745862 -13055028 -11254140
5933 -11254140 -6415420 -31705 4325238 4397478 1457059 -1303630 -1766940 -142861 1512754
5924 1512754 729261 -2974052 -6701918 -6933449 -4226248 -2943596 -5163690 -7540079 -6468934
5915 -6468934 -3838811 -4083419 -7061463 -8283135 -6219428 -4921712 -7784169 -12397864
$$ packed form
5975f317170N974301M295119J409712j777221m476935n327564l375501L77740
5967i217519L626077M864924M083539K083570K35896J8337J255550J602103m56612
5958H095865k832393k232270J065798L276757K130603n46393j963792j925074
5950E069101k023737k844869l438862k844521j046114J215223K890300L129250
5942A05771J802378m64123k694086l926588l685827k501605j381782l09166J800888
5933a1254140M838720O383715M356943P2240k940419k760689m63310J624079J655615
5924A512754p83493l703313l727866k31531K707201J282652k220094k376389J071145
5915f468934K630123k44608k978044j221672K063707J297716k862457m613695
$$ plain form
5907 -12397864 -14286816 -13193197 -12396233 -13148410 -13292633 -11468932 -9585565 -9767704 -10888263
5898 -10888263 -10072510 -6777592 -3387950 -1668888 -462230 2020693 4862729 5252300
5890 5252300 2482553 -763284 -1929977 -1881265 -3202161 -6098791 -7902199 -6774535 -4272780
5881 -4272780 -3355650 -4740019 -6323889 -6085113 -4603382 -4109941 -5418763 -6869596 -6806620
5872 -6806620 -6009649 -6209114 -6764683 -5003087 -270743 4554887 6712321 6672769 6081227
5863 6081227 4769086 2283493 593289 1867077 4288742 3691008 -432674 -3950685
5855 -3950685 -3917574 -2116280 -1399652 -1592044 -1201673 -704160 -1389905 -2538645 -2478050 -1580916
5845 -1580916 -1730765 -3234291 -4498318 -4745410 -5155538 -6947940 -9505199 -10634982 -8228994
$$ packed form
5907a2397864j888952J093619P96964p52177j44223J823701J883367j82139j120559
5898a0888263Q15753L294918L389642J719062J206658K482923K842036L89571
5890E252300k769747l245837j166693M8712j320896k896630j803408J127664K501755
5881d272780R17130j384369j583870K38776J481731M93441j308822j450833O2976
5872f806620P96971j99465n55569J761596M732344M825630K157434l9552n91542
5863F081227j312141k485593j690204J273788K421665n97734m123682l518011
5855c950685L3111J801294P16628j92392L90371M97513o85745j148740O0595Q97134
5845a580916j49849j503526j264027k47092m10128j792402k557259j129783K405988
$$ plain form
5836 -8228994 -2319059 3785842 5572503 1955620 -3037433 -4701768 -2844335 -871611
5828 -871611 -884537 -2160362 -3805291 -5852791 -7458204 -6951044 -4741374 -3736076 -5402404
5819 -5402404 -7290029 -6054415 -1600191 3211692 5877229 5926636 4236532 2126439 847404
5810 847404 1099975 3054809 6529163 10135173 10871063 6937001 1231109 -868344 1595386
5801 1595386 3584737 1498475 -1186146 595336 5016129 5588400 985970 -3049455
5793 -3049455 -2570528 -742399 -1628802 -3288861 -1383528 3150950 4960158 1995702 -1969660
5784 -1969660 -2951930 -1220507 1083106 3774538 7851899 12488795 15116490 14333899 11339465
5775 11339465 8278599 5956856 3521559 112045 -3577026 -5737456 -5521556 -4157667
$$ packed form
5836h228994N909935O104901J786661l616883m993053j664335J857433J972724
5828h71611j2926j275825j644929k047500j605413N07160K209670J005298j666328
5819e402404j887625J235614M454224M811883K665537M9407j690104k110093j279035
5810H47404K52571J954834L474354L606010P35890l934062n705892k099453K463730
5801A595386J989351k086262k684621J781482M420793N72271m602430m035425
5793c049455M78927J828129q86403j660059J905333M534478J809208k964456l965362
5784a969660r82270J731423K303613K691432M077361M636896K627695p82591k994434
5775A1339465l060866k321743k435297l409514l689071k160430K15900J363889
$$ plain form
5767 -4157667 -3513576 -3966093 -4398707 -3983558 -3022046 -2105643 -1498838 -1581180 -2922543 -5438660
5757 -5438660 -8199150 -10511811 -12453811 -13777239 -13105502 -9270482 -3238296 2211333
5749 2211333 4901278 4855322 3472914 1805279 129566 -1162168 -1203393 207475 1557560
5740 1557560 931502 -1085888 -951566 3848957 10611319 13075364 8120203 -467836 -6003025
5731 -6003025 -5651842 -1867597 1813424 3992760 4333306 2017741 -2727158 -6824100 -6491445
5722 -6491445 -1562375 3808944 5421792 3145782 250076 -493724 845840 2389823
5714 2389823 2699553 1813454 693958 18131 -532597 -1660599 -3082674 -3404852 -1964648
5705 -1964648 -132404 382909 73808 705831 1692359 -282269 -6514533 -12975181 -14242856
$$ packed form
5767d157667O44091m52517m32614M15149R61512R16403O06805q2342j341363k516117
5757e438660k760490k312661j942000j323428O71737L835020O032186N449629
5749B211333K689945m5956j382408j667635j675713j291734m1225J410868J350085
5740A557560o26058k017390J34322M800523O762362K464045m955161q588039n535189
5731f003025L51183L784245L681021K179336L40546k315565m744899m096942L32655
5722f491445M929070N371319J612848k276010k895706p43800J339564J543983
5714B389823L09730q86099j119496o75827n50728j128002j422075l22178J440204
5705a964648J832244N15313l09101O32023R86528j974628o232264o460648j267675
$$ plain form
5696 -14242856 -10093702 -5640897 -4836923 -6360891 -6713544 -4885301 -2229146 386437
5688 386437 2885859 4407261 3931606 2387404 1879008 2432009 1597155 -1791581 -5289537
5679 -5289537 -5742684 -3285467 -770733 21665 -251630 -639282 -1282822 -2038622 -1544456
5670 -1544456 886418 3448778 3615339 1497868 -102829 697139 2542419 2870021 1262911
5661 1262911 -348909 -375391 766845 1774117 2213612 2636176 3537703 4823256 6016710
5652 6016710 6417266 5175436 1951537 -2123940 -4615889 -3665838 87291 3876667 5371424
5643 5371424 4609248 3269776 2736203 3506549 5683684 8486965 9430065 6063509 -482968
5634 -482968 -5468606 -5771648 -3881185 -4464399 -7786067 -9435874 -6768267 -2481697 -405910
$$ packed form
5696a4242856M149154M452805Q03974j523968l52653J828243K656155K615583
5688C86437K499422J521402m75655j544202n08396N53001q34854l388736l497956
5679e289537m53147K457217K514734P92398k73295l87652o43540p55800M94166
5670a544456K430874K562360J66561k117471j600697P99968J845280L27602j607110
5661A262911j611820k6482J142236J007272M39495M22564R01527J285553J193454
5652F016710M00556j241830l223899m075477k491949R50051L753129L789376J494757
5643E371424p62176j339472n33573P70346K177135K803281R43100l366556o546477
5634d82968m985638l03042J890463n83214l321668j649807K667607M286570K075787
$$ plain form
5625 -405910 -487318 -380316 -19156 -1333800 -4098199 -5423733 -3993707 -2074513 -2056701
5616 -2056701 -3121798 -3028356 -1718660 -1254128 -2984492 -6519842 -10945854 -15172410 -17198083
5607 -17198083 -15115096 -9725126 -4816011 -3649952 -5668392 -7443198 -6521769 -3682452
5599 -3682452 -1640736 -2147532 -4404158 -6081182 -5883234 -4974192 -5435792 -7395055 -8521516
5590 -8521516 -6748903 -2724500 1032746 2712139 2248644 565459 -1109541 -1642821 -957155
5581 -957155 -439945 -1249574 -2372713 -1714893 806462 2775961 2406968 804218 280768
5572 280768 1498667 3280159 4491393 5024150 5195501 4975581 3872716 1517525 -1315389
5563 -1315389 -2593805 -1012758 1930003 3259120 2220004 1042291 1433039 2202304 1542847
$$ packed form
5625d05910q1408J07002L61160j314644k764399j325534J430026J919194J7812
5616b056701j065097R3442J309696M64532j730364l535350m426012m226556k025673
5607a7198083K082987N389970M909115J166059k018440j774806R21429K839317
5599c682452K041716n06796k256626j677024J97948R09042m61600j959263j126461
5590h521516J772613M024403L757246J679393m63495j683185j675000n33280O85666
5581i57155N17210q09629j123139O57820K521355J969499l68993j602750n23450
5572B80768J217899J781492J211234N32757J71351k19920j102865k355191k832914
5563a315389j278416J581047K942761J329117j039116j177713L90748P69265o59457
$$ plain form
5554 1542847 -159414 -1451711 -2173349 -2729500 -2366823 -480151 1307065 812037 -1463908
5545 -1463908 -3022524 -2847843 -1910037 -677850 1203400 2839679 2516946 646100 -298577
5536 -298577 592267 1555242 1367910 1064560 1339878 786952 -1595265 -4117601 -4460238
5527 -4460238 -2732961 -1083556 -1319756 -3775848 -7159392 -8796746 -6777089 -2771648
5519 -2771648 -875773 -2646467 -5294962 -5888725 -4947066 -4264344 -3689624 -2425452 -1460284
5510 -1460284 -1991427 -2906968 -2464611 -1232071 -768852 -590176 695929 2146086 1527586
5501 1527586 -663736 -1273172 1032162 3823925 4075065 1400606 -2287867 -4749802 -4726250
5492 -4726250 -2735217 -890507 -926564 -2476451 -4107540 -5325138 -6333703 -6751746 -6222691
$$ packed form
5554A542847j702261j292297p21638n56151L62677J886672J787216m95028k275945
5545a463908j558616J74681R37806J232187J881250J636279l22733j870846r44677
5536b98577Q90844R62975j87332l03350K75318n52926k382217k522336l42637
5527d460238J727277J649405k36200k456092l383544j637354K019657M005441
5519b771648J895875j770694k648495n93763R41659O82722N74720J264172R65168
5510a460284n31143r15541M42357J232540M63219J78676J286105J450157o18500
5501A527586k191322o09436K305334K791763K51140k674459l688473k461935K3552
5492d726250J991033J844710l6057j549887j631089j217598j008565m18043N29055
$$ plain form
5483 -6222691 -5541928 -5459404 -5120166 -3445949 -1163697 456371 1789456 3502427 4214552
5474 4214552 2452960 144086 781149 4246849 6832324 6750751 6296019 7616295 9395130
5465 9395130 9180246 6715148 3577316 1186841 70143 -384560 -1775131 -4589151 -6329876
5456 -6329876 -4001058 1470750 5821660 6636278 5234255 3235166 591456 -2119801
5448 -2119801 -2858028 -1139020 898014 1902696 3134429 5524293 7718774 8537874 8534095
5439 8534095 7565081 3970370 -1819208 -5957382 -5869487 -3439538 -1195587 1439310 5082648
5430 5082648 6915154 4473364 659956 465583 3872764 6184238 4819860 1993637
5422 1993637 846499 2310356 5753893 9626251 11419276 9907819 7575404 8099967
$$ packed form
5483f222691O80763Q2524L39238J674217K282252J620068J333085J712971P12125
5474D214552j761592k308874O37063L465700K585475q1573m54732J320276J778835
5465I395130k14884k465098l137832k390475j116698m54703j390571k814020j740725
5456f329876K328818N471808M350910Q14618j402023j999089k643710k711257
5448b119801p38227J719008K037034J004682J231733K389864K194481Q19100l779
5439H534095r69014l594711n789578m138174Q7895K429949K243951K634897L643338
5430E082648J832506k441790l813408j94373L407181K311474j364378k826223
5422A993637j147138J463857L443537L872358J793025j511457k332415N24563
$$ plain form
5414 8099967 11219222 12658860 9488472 3235257 -2589833 -5771640 -5780036 -3084846 961183
5405 961183 4703030 7005931 6928047 3530782 -2441464 -7572991 -8504888 -5357455 -960172
5396 -960172 2518236 4522717 4913791 4152147 3934191 5420793 7459982 8416008 8534547
5387 8534547 8407714 6978905 4069760 2896744 5968017 9866910 8900642 3310440 -1265324
5378 -1265324 -2428134 -3388967 -5750070 -6115632 -2710350 43325 -2246245 -6966833 -8182631
5369 -8182631 -4708416 -315643 2314839 3702581 4445200 3736613 1380285 -1044229 -1524544
5360 -1524544 757932 4657249 7442959 7308172 5997789 6850800 9510318 9534252 4880055
5351 4880055 -474578 -2020948 -829180 -740780 -2024437 -2069975 -722209 -274405 -798327
$$ packed form
5414H099967L119255J439638l170388o253215n825090l181807q396K695190M046029
5405I61183L741847K302901p7884l397265n972246n131527r31897L147433M397283
5396i60172L478408K004481L91074p61644k17956J486602K039189R56026J18539
5387H534547j26833j428809k909145j173016L071273L898893r66268n590202m575764
5378a265324j162810r60833k361103l65562L405282K753675k289570m720588j215798
5369h182631L474215M392773K630482J387742P42619p08587k356328k424514m80315
5360a524544K282476L899317K785710j34787j310383Q53011K659518K3934m654197
5351D880055n354633j546370J191768Q8400j283657m5538J347766M47804n23922
$$ plain form
5342 -798327 -90964 1486264 509831 -3995686 -8247956 -8639291 -6206185 -4506562 -5309321
5333 -5309321 -7987697 -11201303 -13407033 -13096801 -10174610 -6368528 -3374539 -1440517
5325 -1440517 -298550 -219386 -1341714 -3024072 -4564696 -5639375 -5697889 -4239580 -2144458
5316 -2144458 -1239298 -1887801 -2550173 -2468732 -2930539 -4563265 -5190171 -2418039 2706670
5307 2706670 6719744 7879809 7351537 6542247 5300025 3106588 412164 -1901920 -3355438
5298 -3355438 -3771811 -3385103 -3404914 -5287721 -8746343 -11515122 -12050339 -11635273 -12527517
5289 -12527517 -14462036 -14626537 -11540227 -7598635 -6618817 -9477580 -13432043 -15545381
5281 -15545381 -15306506 -13587255 -10923008 -8335628 -8304379 -12103691 -16336120 -15302282 -8195083
$$ packed form
5342g98327P07363J577228r76433m505517m252270l91335K433106J699623q02759
5333e309321k678376l213606k205730L10232K922191L806082K993989J934022
5325a440517J141967P9164j122328j682358j540624j074679n8514J458309K095122
5316b144458R05160o48503o62372Q1441m61807j632726o26906K772132N124709
5307B706670M013074J160065n28272q09290j242222k193437k694424k314084j453518
5298c355438m16373L86708j9811j882807l458622k768779n35217M15066q92244
5289a2527517j934519j64501L086310L941592R79818k858763l954463k113338
5281a5545381K38875J719251K664247K587380L1249l799312m232429J033838P107199
$$ plain form
5272 -8195083 -1244010 -341860 -3651396 -4768310 -1822797 822147 -15136 -1881313 -1511211
5263 -1511211 -81979 -443874 -2016229 -2348970 -1945806 -3274094 -5780452 -6306606 -4687207
5254 -4687207 -4580584 -7417733 -9411614 -6825950 -1240545 2982891 4239407 4067101 3691991
5245 3691991 2917809 1615208 150669 -1097286 -1205752 1137327 5297070 7923397 6668775
5236 6668775 3574194 2483959 4000345 5397809 4829843 3045238 1255683 -159552
5228 -159552 -773198 -199161 732503 771408 176121 -25239 -421647 -2623839 -6317087 -9228994
5218 -9228994 -10272203 -10552097 -11013696 -11281143 -11115596 -10765870 -9508772 -6200230 -1814391
5209 -1814391 939830 1227817 1010883 1719881 2578558 3142990 4632834 7076516 7723057
$$ packed form
5272h195083O951073R02150l309536j116914K945513K644944q37283j866177L70102
5263a511211J429232l61895j572355l32741M03164j328288k506358n26154J619399
5254d687207J06623k837149j993881K585664N585405M223436J256516j72306l75110
5245C691991p74182j302601j464539j247955j08466K343079M159743K626327j254622
5236F668775l094581j090235J516386J397464n67966j784605j789555j415235
5228a59552o13646N74037R31664L8905n95287k01360l96408k202192l693248k911907
5218i228994j043209k79894m61599k67447J65547L49726J257098L308542M385839
5209a814391K754221K87987k16934P08998Q58677N64432J489844K443682O46541
$$ plain form
5200 7723057 4604548 -86664 -2466276 -1697079 -377432 -1072582 -4078760 -7941990 -10797055
5191 -10797055 -11589892 -10808258 -9574456 -7909460 -5052844 -1558835 690216 943414 148421
5182 148421 -1306703 -4020552 -7056494 -7870604 -6232298 -5428926 -7514998 -9941391 -9482804
5173 -9482804 -7283280 -6872752 -8626361 -9417904 -7193440 -3196030 124691 1325773 400531
5164 400531 -1314815 -2161764 -2368929 -4084834 -7736669 -10137732 -8578382 -5204112 -4263781
5155 -4263781 -5977400 -6529037 -3971964 -814376 -130649 -1919771 -4353638 -6357444 -7603272
5146 -7603272 -7510832 -5683451 -2714293 235799 2379058 3604360 4117683 3787809 1979727
5137 1979727 -1241215 -3893307 -3688684 -1340880 -277339 -1967427 -3692271 -2652949
$$ packed form
5200G723057l118509m691212k379612P69197J319647o95150l006178l863230k855065
5191a0797055p92837P81634J233802J664996K856616L494009K249051K53198p94993
5182A48421j455124k713849l035942q14110J638306Q03372k086072k426393M58587
5173i482804K199524M10528j753609p91543K224464L997410L320721J201082r25242
5164D00531j715346q46949k07165j715905l651835k401063J559350L374270R40331
5155d263781j713619n51637K557073L157588O83727j789122k433867k003806j245828
5146g603272R2440J827381K969158K950092K143259J225302N13323l29874j808082
5137A979727l220942k652092K04623K347804J063541j690088j724844J039322
$$ plain form
5129 -2652949 -112779 903294 124633 -530023 -387395 267331 2506671 7057272 11052461
5120 11052461 10580094 6593947 4281328 5699923 6908037 4152806 -420110 -1846232
5112 -1846232 951400 4191822 4058688 430969 -3861753 -5968725 -5121757 -2783089 -1105547
5103 -1105547 -1101353 -2143297 -2955457 -2927258 -2677400 -3196089 -3919975 -2327567 2899936 8675474
5093 8675474 10114777 6864635 3716854 3599296 3559560 297419 -3857239 -4446326 -1727016
5084 -1727016 540403 1354281 2672300 4428488 4441644 3131916 3459206 5706738 6798489
5075 6798489 5494832 4007879 3657862 3221037 2676370 4263467 8211955 11363156 11790267
5066 11790267 11169728 10984708 10197357 8510866 7980830 9072018 8908470 6124904 3823047
$$ packed form
5129b652949K540170J016073p78661o54656J42628O54726K239340M550601L995189
5120A1052461m72367l986147k312619J418595J208114k755231m572916j426122
5112a846232K797632L240422j33134l627719m292722k106972Q46968K338668J677542
5103a105547M194j041944q12160K8199K49858n18689p23886J592408N227503N775538
5093H675474J439303l250142l147781j17558l9736l262141m154658n89087K719310
5084a727016K267419Q13878J318019J756188J3156j309728L27290K247532J091751
5075F798489j303657j486953l50017m36825n44667J587097L948488L151201M27111
5066A1790267o20539j85020p87351j686491n30036J091188j63548k783566k301857
$$ plain form
5057 3823047 4547848 5632669 3266983 -1318252 -3554689 -1725846 1981191 5237352
5049 5237352 7123273 6971119 4869376 2956205 3614341 6470487 9041712 9986484 10055735
5040 10055735 10205892 10203773 8899088 5161222 -776812 -6487171 -9106937 -8498452 -7299626
5031 -7299626 -7473527 -8603685 -9937183 -11642026 -13068850 -12229054 -8437180 -3541087 477922
5022 477922 3012546 3308921 381389 -4335973 -7286177 -7285842 -6741755 -6930212 -5723116
5013 -5723116 -2184470 514409 -5370 -1036805 687975 3103593 1919365 -2381507
5005 -2381507 -5212795 -4453729 -2146186 -201451 1694224 3857284 5519118 6312421 6625840
4996 6625840 6595638 6458098 7092500 8461389 8811667 7425127 6539859 8112374 10297828
$$ packed form
5057C823047P24801J084821k365686m585235k236437J828843L707037L256161
5049E237352J885921j52154k101743j913171O58136K856146K571225R44772O9251
5040A0055735J50157k119j304685l737866n938034n710359k619766O08485J198826
5031g299626j73901j130158j333498j704843j426824Q39796L791874M896093M019009
5022D77922K534624K96375k927532m717362k950204L35N44087j88457J207096
5013e723116L538646K698879n19779j031435J724780K415618j184228m300872
5005b381507k831288P59066K307543J944735J895675K163060J661834P93303L13419
4996F625840l0202j37540O34402J368889L50278j386540q85268J572515K185454
$$ plain form
4987 10297828 9893830 6807826 3279954 258573 -2252097 -2755723 5602 3616843
4979 3616843 3993359 741035 -2530457 -3060957 -1306883 1141150 3075401 3356623 1954424
4970 1954424 1211902 3416931 7209635 8882936 7032851 3517429 282496 -2032694
4962 -2032694 -2657582 -875063 2015410 3395519 2459324 825962 62621 413282 1703170
4953 1703170 3529085 4754146 4663278 4370243 5383343 7184819 7876259 6716152 4475762
4944 4475762 1952071 -346924 -1749337 -1993961 -1471350 -52776 2835874 6093953 7019332
4935 7019332 4813834 1836379 141404 -582541 -389802 2114046 6389463 9098797 9101200
4926 9101200 9548131 12299792 14404477 13328503 11256096 10475609 9239315 6582489 6190291
$$ packed form
4987A0297828m03998l086004l527872l021381k510670n03626K761325L611241
4979C616843L76516l252324l271492n30500J754074K448033J934251K81222j402199
4970A954424p42522K205029L792704J673301j850085l515422l234933k315190
4962b032694o24888J782519K890473J380109r36195j633362p63341L50661J289888
4953A703170J825915J225061r0868k93035J013100J801476O91440j160107k240390
4944D475762k523691k298995j402413k44624N22611J418574K888650L258079R25379
4935G019332k205498k977455j694975p23945J92739K503848M275417K709334K403
4926I101200M46931K751661K104685j075974k072407p80487j236294k656826l92198
$$ plain form
4917 6190291 10100134 13477650 11799230 8519966 8818106 10382840 8189427 4251346
4909 4251346 4018768 6428881 6452157 4779871 5889538 8815490 9073960 7689157 8957130
4900 8957130 11345868 10406513 8623425 11877567 17902012 19227643 16007815 14505665
4892 14505665 14676069 11752623 8388188 11290200 17018817 16284486 11608196 14079503
4884 14079503 22796648 26127409 24047868 28200948 37740464 39222938 34870470 43340903
4876 43340903 64913061 78961561 90389768 138712982 229376261 290757277 247738707
4869 247738707 122199608 12209462 -23878570 -16105330 -14496145 -23196802 -22352225
4862 -22352225 -13865512 -13192990 -18817411 -18941343 -15199256 -16434376 -18999249 -13766657
$$ packed form
4917F190291L909843L377516j678420l279264K98140J564734k193413l938081
4909D251346k32578K410113K3276j672286J109667K925952K58470j384803J267973
4900H957130K388738r39355j783088L254142O024445J325631l219828j502150
4892A4505665J70404k923446l364435K902012N728617p34331m676290K471307
4884A4079503Q717145L330761k079541M153080R539516J482474m352468Q470433
4876D3340903K1572158J4048500J1428207M8323214R0663279O1381016m3018570
4869B47738707j25539099j09990146l6088032P773240J609185q700657Q44577
4862b2352225Q486713O72522n624421j23932L742087j235120k564873N232592
$$ plain form
4854 -13766657 -5175136 -4800385 -11335148 -13481909 -8936813 -5556031 -6123719 -5523189 -2067290
4845 -2067290 -26754 -1044843 -2494834 -3968763 -7291121 -10909491 -11584303 -10567429
4837 -10567429 -11526952 -13944897 -14855062 -14966778 -16448072 -16778334 -11834329 -3610536 1882533
4828 1882533 3263071 3882172 4399572 1952553 -3461848 -7897209 -9161466 -8593854 -7120410
4819 -7120410 -4319598 -1465926 -949783 -2304017 -2589722 -856779 961446 1192592 -376683
4810 -376683 -3319576 -5699712 -4257149 1008571 4496273 1429928 -5136388 -8174532
4802 -8174532 -5941139 -2692606 -1627082 -2303473 -4189985 -7336494 -9562104 -8041183
4794 -8041183 -4103302 -1979553 -2522107 -2609738 -1015577 -126543 -1096942 -1943393 -1698905
$$ packed form
4854a3766657Q591521L74751o534763k146761M545096L380782n67688O00530L455899
4845b067290K040536j018089j449991j473929l322358l618370o74812J016874
4837a0567429r59523k417945r10165j11716j481294l30262M944005Q223793N493069
4828A882533J380538O19101N17400k447019n414401m435361j264257N67612J473444
4819g120410K800812K853672N16143j354234k85705J732943J818225K31146j569275
4810c76683k942893k380136J442563N265720L487702l066345o566316l038144
4802h174532K233393L248533J065524o76391j886512l146509k225610J520921
4794h041183L937881K123749n42554q7631J594161Q89034r70399q46451K44488
$$ plain form
4785 -1698905 -2147641 -3878123 -4642582 -3589084 -3544713 -6722701 -10883895 -12080018 -9319461
4776 -9319461 -4711469 -507747 2560757 5102404 8053856 11040503 11985557 9838505
4768 9838505 7110801 7425823 10720362 13207387 12054176 7841365 2652541 -1675587
4760 -1675587 -3557443 -2734700 -1450636 -1897029 -2645504 -607537 3702371 6508269 6551450
4751 6551450 6421578 7248353 6433128 2552410 -1519876 -3017933 -3332749 -4590490 -5235287
4742 -5235287 -2784236 1079779 2162429 -410154 -3547805 -5051653 -5843505 -6984181
4734 -6984181 -7284557 -5076579 -788146 3227726 4670773 2827658 -999580 -4325812
4726 -4325812 -5423792 -4686289 -3764741 -3578920 -3651586 -3081730 -1514559 672594 2550900
$$ packed form
4785a698905m48736j730482p64459J053498M4371l177988m161194j196123K760557
4776i319461M607992M203722L068504K541647K951452K986647R45054k147052
4768I838505k727704L15022L294539K487025j153211m212811n188824m328128
4760a675587j881856Q22743J284064m46393p48475K037967M309908K805898M3181
4751F551450j29872Q26775q15225l880718m072286j498057l14816j257741o44797
4742e235287K451051L864015J082650k572583l137651j503848p91852j140676
4734f984181l00376K207978M288433M015872J443047j843115l827238l326232
4726d325812j097980P37503R21548J85821p2666N69856J567171K187153J878306
$$ plain form
4717 2550900 3152068 2341674 1063772 282784 -60589 -467499 -522764 957804 4151949
4708 4151949 7370592 8679860 8058989 7119894 6733854 6077056 4599751 3678929 4787737
4699 4787737 6719607 6716262 4395125 2246891 1506532 13183 -4139538 -8959593 -10981275
4690 -10981275 -9865637 -7902339 -6009414 -3390018 -759322 -337472 -1867791 -1842579 1732134
4681 1732134 6311363 8375194 7884631 7012755 6218210 4353621 1757679 232978 -177839
4672 -177839 -1692682 -5198344 -8422134 -9133225 -8322190 -8100740 -7675581 -4281637 1781287
4663 1781287 5930416 4627632 1922 -2830742 -1901496 247249 622268 -1091841 -3411899
4654 -3411899 -4974317 -5251294 -5037549 -6357811 -10143335 -14064012 -14884017 -13057211 -12231752
$$ packed form
4717B550900O01168q10394j277902p80988l43373m06910n5265J480568L194145
4708D151949L218643J309268o20871r39095l86040o56798j477305r20822J108808
4699D787737J931870l345k321137k148234p40359j493349m152721m820055k021682
4690a0981275J115638J963298J892925K619396K630696M21850j530319K5212L574713
4681A732134M579229K063831m90563q71876p94545j864589k595942j524701m10817
4672a77839j514843l505662l223790p11091Q11035K21450M25159L393944O062924
4663A781287M149129j302784m625710k832664R29246K148745L75019j714109k320058
4654c411899j562418k76977K13745j320262l785524l920677q20005J826806Q25459
$$ plain form
4645 -12231752 -13633708 -14181145 -11630436 -8306182 -7254278 -7496107 -6293886 -4039887
4637 -4039887 -3235132 -3772946 -2973255 -145535 2131108 1773038 -181807 -1276154 -278307
4628 -278307 2071787 3662521 2693016 38094 -911845 1610143 4846157 4789864 1311977
4619 1311977 -2348760 -4237954 -5097174 -5789430 -6187247 -6325395 -6021745 -3855606 581601
4610 581601 3997367 2453568 -2902024 -6713966 -6400195 -4723870 -4781090 -6110923 -6940825
4601 -6940825 -6775480 -5218830 -1475979 3224819 5684643 4948338 3604110 3258564 1964340
4592 1964340 -1747891 -5631025 -7274503 -7834074 -9031193 -9310144 -6870238 -4210337 -5099680
4583 -5099680 -8256304 -8675340 -5051335 -1578925 -1813728 -4584744 -7091274 -8600149 -9379361
$$ packed form
4645a2231752j401956n47437K550709L324254J051904k41829J202221K253999
4637d039887Q04755n37814P99691K827720K276643l58070j954845j094347R97847
4628b78307K350094J590734r69505k654922r49939K521988L236014n6293l477887
4619A311977l660737j889194q59220o92256l97817j38148L03650K166139M437207
4610E81601L415766j543799n355592l811942L13771J676325n7220j329833q29902
4601f940825J65345J556650L742851M700798K459824p36305j344228l45546j294224
4592A964340l712231l883134j643478n59571j197119k78951K439906K659901q89343
4583e099680l156624m19036L624005L472410k34803k771016k506530j508875p79212
$$ plain form
4574 -9379361 -8828131 -6901482 -5522198 -6415878 -8658587 -10106391 -10290868 -10198612 -10008395
4565 -10008395 -9050775 -7773445 -7688623 -8876134 -9308759 -7748872 -6013294 -6843786 -10256580
4556 -10256580 -13700524 -15542342 -16462669 -17134063 -16613196 -14108998 -10641762 -7559191 -4847358
4547 -4847358 -2421421 -1556076 -2993298 -4886009 -4998086 -3979035 -3851296 -4121724 -2622071
4538 -2622071 56525 604255 -1818025 -3779504 -2364145 991392 2955897 2184222 -746301
4529 -746301 -4866176 -8499395 -9579423 -8247384 -7378063 -8758830 -10551133 -10343410 -8772890
4520 -8772890 -7948363 -8051217 -7938106 -7602998 -7402013 -6071438 -2418595 1729383 3170849
4511 3170849 1727069 313672 502147 605846 -1172461 -3949813 -5676641 -5902225 -5751589
$$ packed form
4574i379361N51230J926649J379284q93680k242709j447804j84477R2256J90217
4565a0008395R57620J277330Q4822j187511m32625J559887J735578q30492l412794
4556a0256580l443944j841818r20327o71394N20867K504198L467236L082571K711833
4547d847358K425937Q65345j437222j892711j12077J019051J27739k70428J499653
4538b622071K678596N47730k422280j961479J415359L355537J964505p71675k930523
4529g46301m119875l633219j080028J332039Q69321j380767j792303K07723J570520
4520h772890Q24527j02854J13111L35108K00985J330575L652843M147978J441466
4511C170849j443780j413397J88475J03699j778307k777352j726828k25584J50636
$$ plain form
4502 -5751589 -5947422 -5982567 -5169269 -3875244 -3304189 -3854858 -4019120 -1710343 3175778
4493 3175778 8323811 11293096 11373652 9165351 5737151 2581589 844592 -57632 -1562915
4484 -1562915 -3222030 -2880565 -441886 1147144 442370 448571 4207560 9380816 10799028
4475 10799028 7629751 4438039 4919317 7768034 9685313 9772440 9235125 8397615 6048916
4466 6048916 1600210 -3308246 -5974660 -5415444 -3504763 -2701692 -3051030 -2761773 -1534028
4457 -1534028 -1077569 -1697975 -1013687 2215403 5393790 5724628 4609225 5369388 7901033
4448 7901033 9044102 7817100 6879845 8399374 11271261 13150328 13026904 11162365 8345376
4439 8345376 5742549 3995629 2378402 291140 -931323 223838 2378437 2551050
$$ packed form
4502e751589j95833l5145Q13298J294025N71055n50669j64262K308777M886121
4493C175778N148033K969285Q0556k208301l428200l155562j736997r02224j505283
4484a562915j659115L41465K438679J589030p04774O201L758989N173256J418212
4475A0799028l169277l191712M81278K848717J917279Q7127n37315q37510k348699
4466F048916m448706m908456k666414N59216J910681Q03071l49338K89257J227745
4457a534028M56459o20406O84288L229090L178387L30838j115403P60163K531645
4448G901033J143069j227002r37255J519529K871887J879067j23424j864539k816989
4439H345376k602827j746920j617227k087262j222463J155161K154599J72613
$$ plain form
4431 2551050 401392 -1596785 -2342289 -3304803 -4834350 -4633049 -1632462 1303033 723153
4422 723153 -3123970 -7113753 -8772782 -7496760 -4029299 -496316 624613 -563231
4414 -563231 -892785 1565689 4313469 3913099 1295799 494723 2576829 4193043 2803167
4405 2803167 248182 -604147 -417893 -1956763 -5134408 -6445061 -3902706 -234966 528226
4396 528226 -1583213 -2708395 -664386 1996517 1573065 -1717561 -4155988 -3429906 -1103156
4387 -1103156 158495 60030 188651 1005934 890432 -1568150 -5230742 -7096206 -5241715
4378 -5241715 -608832 4181491 7132763 7542201 5212887 436265 -5139887 -8981645
4370 -8981645 -9708376 -7959329 -5021532 -1743790 799665 1146899 -835864 -3083945 -3409807
$$ packed form
4431B551050k149658j998177p45504r62514j529547K01301L000587K935495n79880
4422G23153l847123l989783j659029J276022L467461L532983J120929j187844
4414e63231l29554K458474K747780m00370k617300q01076K082106J616214j389876
4405B803167k554985q52329J86254j538870l177645j310653K542355L667740P63192
4396E28226k111439j125182K044009K660903m23452l290626k438427P26082K326750
4387a103156J261651r8465J28621Q17283j15502k458582l662592j865464J854491
4378e241715M632883M790323K951272M09438k329314m776622n576152l841758
4370h981645p26731J749047K937797L277742K543455L47234j982763k248081l25862
$$ plain form
4361 -3409807 -1824416 18204 761118 -98001 -2311438 -4337042 -4015170 -1370498 479119
4352 479119 -906799 -3707961 -4300235 -2519692 -1810739 -4207808 -7815449 -9884587 -10100546
4343 -10100546 -9680030 -8904610 -7059530 -4143068 -1516546 -815431 -2456735 -5195018 -7310443
4334 -7310443 -8205187 -8210885 -6972697 -3611630 928956 3714285 3554757 3182002 5582496
4325 5582496 9529193 11248034 9599789 6935319 5270489 4294014 3201373 2121996
4317 2121996 1364994 957176 928780 701298 -1026596 -4052373 -5620035 -4070613 -2181192
4308 -2181192 -3560084 -6731322 -6844669 -2994648 559268 992843 240808 372681 25954
4299 25954 -2199598 -4430408 -4441994 -3167900 -2621215 -2651735 -2371904 -2674264 -4516266 -6277933
$$ packed form
4361c409807J585391J842620P42914q59119k213437k025604L21872K644672J849617
4352D79119j385918k801162n92274J780543P08953k397069l607641k069138k15959
4343a0100546M20516P75420J845080K916462K626522P01115j641304k738283k115425
4334g310443q94744n698J238188L361067M540586K785329j59528l72755K400494
4325E582496L946697J718841j648245k664470j664830r76475j092641j079377
4317B121996p57002m07818k8396k27482j727894l025777j567662J549422J889421
4308b181192j378892l171238j13347L850021L553916M33575p52035J31873l46727
4299B5954k225552k230810j1586J274094N46685l0520K79831l02360j842002j761667
$$ plain form
4289 -6277933 -5515914 -2289645 1421054 4461853 6609623 7138609 5512454 2714118 9157
4280 9157 -2763017 -5926756 -8110715 -7795424 -5969564 -5010506 -5235727 -4680695 -2354219
4271 -2354219 266737 1603347 2411538 4835811 9419137 13708603 14181153 9778111 3318665
4262 3318665 -1124352 -2059567 -1030931 417987 2702766 6556760 10619208 11805388
4254 11805388 8112405 897079 -5680900 -8092857 -6782765 -5309314 -5654483 -5915121
4246 -5915121 -3953971 -1449183 -1755814 -4925606 -7820760 -8574601 -7900841 -6326183 -3458936
4237 -3458936 -203340 1558526 2046083 3320695 5408278 5827359 3793660 1768039 1676210
4228 1676210 2397044 2134860 666318 -1740782 -5013532 -7987716 -9000679 -8378214 -7665122
$$ packed form
4289f277933P62019L226269L710699L040799K147770N28986j626155k798336k704961
4280I157k772174l163739k183959L15291J825860R59058k25221N55032K326476
4271b354219K620956J336610Q08191K424273M583326M289466M72550m403042o459446
4262C318665m443017r35215J028636J448918K284779L853994M062448J186180
4254A1805388l692983p215326o577979k411957J310092J473451l45169k60638
4246e915121J961150K504788l06631l169792k895154p53841O73760J574658K867247
4237c458936L255596J761866M87557J274612K087583M19081k033699k025621r1829
4228A676210P20834k62184j468542k407100l272750k974184j012963O22465P13092
$$ plain form
4219 -7665122 -6307205 -2621477 1708648 2517557 -357441 -2015024 246337 2999808
4211 2999808 2460638 91534 -555919 794973 2027190 2211975 1664249 693038 220498
4202 220498 1247733 2491041 1652208 -2606 1632898 6884658 11006666 11301738 10523881
4193 10523881 10866434 10017712 6479418 3531598 3905841 5229181 4840617 4590576 6698585
4184 6698585 9365770 10752058 12657533 15774089 16152596 11445589 6031164 4655944
4176 4655944 5501781 4963385 4608174 7395416 11310626 12937564 13420497 14971895 15541944
4167 15541944 12857263 9591585 8850478 9065846 8659745 10042099 13369919 13439816 9446225
4158 9446225 9627935 18034481 25534158 23761883 18736133 19383370 22618592 23082277 26662459
$$ packed form
4219g665122J357917L685728M330125Q08909k874998j657583K261361K753471
4211B999808n39170k369104o47453J350892J232217J84785n47726r71211m72540
4202B20498J027235J243308q38833j654814J635504N251760M122008K95072p77857
4193A0523881L42553q48722l538294k947820L74243J323340l88564k50041K108009
4184F698585K667185J386288J905475L116556L78507m707007n414425j375220
4176D655944Q45837n38396l55211K787242L915210J626938M82933J551398N70049
4167A5541944k684681l265678p41107K15368m06101J382354L327820O9897l993591
4158I446225J81710Q406546P499677j772275n025750O47237L235222M63685L580182
$$ plain form
4149 26662459 38092592 46568933 43448677 42525703 58510129 77647992 81810788 91406945
4141 91406945 139318183 199322173 192394572 88594696 -39343363 -98847800 -83020679
4134 -83020679 -55116442 -53061553 -57909773 -48159104 -35348919 -35166067 -39936301 -37003402
4126 -37003402 -30574329 -29727906 -31558385 -29357069 -25024634 -22890652 -21280206 -18285917
4118 -18285917 -16934234 -18324664 -18200162 -15294464 -14348512 -16595132 -16542947 -12631668 -11534516
4109 -11534516 -16719434 -21796489 -20859822 -17091241 -15318868 -13892094 -10086087 -6520373
4101 -6520373 -5929027 -5647880 -3233908 -2010252 -5303392 -10147861 -12071522 -11607653 -11294106
4092 -11294106 -10815501 -9711611 -10256587 -13054957 -14310951 -11884732 -9301769 -9212308 -8053978
$$ packed form
4149B6662459J1430133Q476341l120256r22974J5984426J9137863M162796R596157
4141I1406945M7911238O0003990o927601j03799876j27938059n9504437J5827121
4134h3020679K7904237K054889m848220R750669J2810185J82852m770234K932899
4126c7003402O429073Q46423j830479K201316M332435K133982J610446K994289
4118a8285917J351683j390430J24502K905698R45952k246620N2185L911279J097152
4109a1534516n184918n077055R36667L768581J772373J426774L806007L565714
4101f520373N91346K81147K413972J223656l293140m844469j923661M63869L13547
4092a1294106M78605J103890n44976k798370j255994K426219K582963Q9461J158330
$$ plain form
4083 -8053978 -2651240 2740661 2285197 -2398608 -5522796 -6400796 -8748746 -12723936 -14359117
4074 -14359117 -12469856 -10450405 -10759736 -11862838 -11147811 -7894497 -3412135 -476322
4066 -476322 -1737151 -6509348 -10518653 -10995512 -10104115 -10847682 -11965791 -10339147 -6630080
4057 -6630080 -4641028 -5878971 -8146204 -9152821 -8735826 -7772143 -7128011 -7291284 -7369348
4048 -7369348 -5391043 -1180521 2508998 3478353 2865558 2298801 414078 -4659419 -10829691
4039 -10829691 -13666931 -12155143 -9765705 -9670078 -11402539 -12623364 -12123599 -10495128 -9161809
4030 -9161809 -9120302 -9843123 -9533994 -7150174 -3784844 -1399677 -721650 -1005153 -1298281
4021 -1298281 -1380373 -1790511 -2933604 -3730462 -2043789 2171761 5259465 3843319 -277281
$$ packed form
4083h053978N402738N391901m55464m683805l124188q78000k347950l975190j635181
4074a4359117J889261K019451l09331j103102P15027L253314M482362K935813
4066d76322j260829m772197m009305m76859Q91397p43567j118109J626644L709067
4057f630080J989052j237943k267233j006617M16995R63683O44132j63273p8064
4048g369348J978305M210522L689519R69355o12795n66757j884723n073497o170272
4039a0829691k837240J511788K389438R5627j732461j220825M99765J628471J333319
4030i161809M1507p22821L09129K383820L365330K385167O78027k83503k93128
4021a298281q2092m10138j143093p96858J686673M215550L087704j416146m120600
$$ plain form
4012 -277281 -2280059 -1096941 -419682 -2549370 -5136248 -5174562 -2518694 1948044 7729095
4003 7729095 12449308 12222776 6927621 1627803 89827 397969 -179913 17306 3408159
3994 3408159 7737992 9011457 7549857 6545528 6361827 4839668 2026743 146587
3986 146587 -410207 -987469 -1199640 400019 2562767 2250446 -635413 -3086694 -3777578
3977 -3777578 -4538673 -6561025 -8362607 -8335986 -6604557 -3626602 535891 4765379 6969576
3968 6969576 6589476 5361600 4869787 4713476 3614213 1210608 -1592849 -3329275 -3136869
3959 -3136869 -1809605 -1134757 -1713785 -2555751 -3350549 -5255905 -8246663 -9819726 -8233444
3950 -8233444 -5220398 -3457207 -3091117 -2851859 -2673493 -2811715 -2259376 -631581 279705
$$ packed form
4012b77281k002778J183118O77259k129688k586878l8314K655868M466738N781051
4003G729095M720213k26532n295155n299818j537976L08142n77882J97219L390853
3994C408159M329833J273465j461600j004329j83701j522159k812925j880156
3986A46587n56794n77262k12171J599659K162748l12321k885859k451281o90884
3977c777578p61095k022352j801582K6621J731429K977955M162493M229488K204197
3968F969576l80100j227876m91813j56311j099263k403605k803457j736426J92406
3959c136869J327264O74848n79028q41966p94798j905356k990758j573063J586282
3950h233444L013046J763191L66090K39258J78366j38222N52339J627795R11286
$$ plain form
3941 279705 -499505 -822132 722658 1103545 -2905911 -8756909 -11092891 -9375810 -7607998
3932 -7607998 -7248251 -5800640 -2663536 -1024062 -2585749 -4922743 -5768977 -6078575 -7020307
3923 -7020307 -7309246 -5492352 -2276766 947941 3602939 4933392 4041191 1878654 739226
3914 739226 901935 257496 -2064561 -4437664 -5817527 -7089642 -8331364 -7765110 -4857504
3905 -4857504 -1775338 -366081 -238558 -1076371 -3958247 -8589308 -11845681 -11293435 -8333703
3896 -8333703 -6064611 -5683763 -6463928 -7434383 -7492216 -5585100 -2465662 -840129 -2289888
3887 -2289888 -5311269 -7588647 -8761517 -9668384 -10267729 -9839233 -8422402 -6882901 -5935958
3878 -5935958 -5471681 -4366437 -1418677 2385922 3424797 -629711 -6961762 -10259363
$$ packed form
3941B79705p79210l22627J544790L80887m009456n850998k335982J717081J767812
3932g607998L59747J447611L137104J639474j561687k336994q46234l09598r41732
3923g020307k88939J816894L215586L224707K654998J330453q92201k162537j139428
3914G39226J62709o44439k322057k373103j379863j272115j241722N66254K907606
3905d857504L082166J409257J27523q37813k881876m631061l256373N52246K959732
3896h333703K269092L80848p80165r70455n7833J907116L119438J625533j449759
3887b289888l021381k277378j172870r06867n99345M28496J416831J539501R46943
3878e935958M64277J105244K947760L804599J038875m054508o332051l297601
$$ plain form
3870 -10259363 -9061680 -6790578 -6525734 -7808702 -8952936 -9293389 -8331059 -5644983 -2587225
3861 -2587225 -1289587 -1303924 -217232 1847058 1866202 -1050263 -4032087 -5134936 -5788441
3852 -5788441 -6967441 -6981722 -5217656 -4070088 -4550649 -3870737 -453929 2325616 905355
3843 905355 -3204282 -6486680 -8628683 -10788365 -11553321 -8995607 -4648831 -1351955 940571
3834 940571 3270898 3762496 112034 -5562807 -8921508 -9389418 -9666219 -10296688 -9257031
3825 -9257031 -6392333 -3838586 -2178927 -248977 1438493 1199135 12226 611197 2551199
3816 2551199 2483029 -95179 -1681730 -425089 1202723 956886 277883 1138938 2524082
3807 2524082 2318873 476496 -1663998 -3537598 -5348558 -7250996 -9370672 -11301005
$$ packed form
3870a0259363J197683K271102K64844j282968j144234l40453R62330K686076L057758
3861b587225J297638j4337J086692K064290J9144k916465k981824j102849o53505
3852e788441j179000j4281J764066J147568m80561O79912L416808K779545j420261
3843I05355m109637l282398k142003k159682p64956K557714M346776L296876K292526
3834I40571K330327M91598l650462n674841l358701m67910k76801o30469J039657
3825i257031K864698K553747J659659J929950J687470k39358j186909N98971J940002
3816B551199o8170k578208j586551J256641J627812k45837o79003Q61055J385144
3807B524082k05209j842377k140494j873600j810960j902438k119676j930333
$$ plain form
3799 -11301005 -11474933 -9030560 -6290677 -6743591 -10150255 -12447702 -11176734 -8076965
3791 -8076965 -5362409 -2600423 1058680 4337377 5535348 4693396 2510505 -622064
3783 -622064 -2981016 -1630852 3528242 8166272 8568212 6276799 4962033 4692288 2950469
3774 2950469 135388 -247336 2722935 5273533 4034957 469098 -1723537 -1527444 -562360
3765 -562360 541932 2756058 5613435 6416508 3888962 647007 -61584 1090436 725912
3756 725912 -1950837 -4078279 -3890460 -3408417 -4647322 -5840192 -4107503 -2473 3630062
3747 3630062 6036231 8450849 10289675 9179304 5279275 2244215 2536540 4224101
3739 4224101 3914654 1048795 -2170512 -3812033 -3853045 -3513740 -3848657 -4744560 -5271601
$$ packed form
3799a1301005j73928K444373K739883m52914l406664k297447J270968L099769
3791h076965K714556K761986L659103L278697J197971q41952k182891l132569
3783f22064k358952J350164N159094M638030M01940k291413j314766k69745j741819
3774B950469k815081l82724K970271K550598j238576l565859k192635J96093R65084
3765e62360J104292K214126K857377Q03073k527546l241955p08591J152020l64524
3756G25912k676749k127442J87819M82043j238905j192870J732689M105030L632535
3747C630062K406169K414618J838826j110371l900029l035060K92325J687561
3739D224101l09447k865859l219307j641521m1012L39305l34917q95903n27041
$$ plain form
3730 -5271601 -5344299 -6190874 -8145046 -9163978 -7402593 -4239526 -2374098 -1774010 -413219
3721 -413219 1508362 1526730 -775449 -2938807 -3756593 -4761711 -6562473 -7191599 -5679285
3712 -5679285 -4069041 -4030763 -4355639 -3656120 -2688188 -2086245 -794940 1097053 1122596
3703 1122596 -1405167 -3252235 -2429116 -2259877 -6262502 -11712243 -13151492 -10540472 -8746342
3694 -8746342 -9739225 -10575587 -9327745 -7842057 -7277165 -5483254 -1102810 3206578 4218584
3685 4218584 2365626 247172 -1056684 -1935730 -2209797 -1632793 -1510288 -3444091 -6595915
3676 -6595915 -8031481 -6085201 -2146703 1291056 3428603 5326543 7711233 9552799
3668 9552799 9293466 6973611 4234247 2266213 832194 -420694 -1002673 -758764 -836467
$$ packed form
3730e271601p2698q46575j954172j018932J761385L163067J865428O00088J360791
3721d13219J921581J8368k302179k163358q17786j005118j800762o29126J512314
3712e679285J610244L8278l24876O99519R67932O01943J291305J891993K5543
3703A122596k527763j847068Q23119J69239m002625n449741j439249K611020J794130
3694h746342r92883q36362J247842J485688N64892J793911M380444M309388J012006
3685D218584j852958k118454j303856q79046k74067N77004J22505j933803l151824
3676f595915j435566J946280L938498L437759K137547J897940K384690J841566
3668I552799k59333k319855k739364j968034j434019j252888n81979K43909p7703
$$ plain form
3659 -836467 -2296172 -4590767 -6573424 -8156745 -9642060 -10211836 -8727798 -5646556 -2693467
3650 -2693467 -911804 -237304 -427485 -957009 -571583 1313170 3088196 2599301 207799
3641 207799 -1497331 -1048816 449021 1245851 731576 -788115 -2583847 -3666141 -3812455
3632 -3812455 -4264282 -5885957 -7028701 -5277717 -1217422 1868132 2350795 1945214 2398564
3623 2398564 2907569 2062056 368910 -655356 -510301 385254 1554069 2210494 1475711
3614 1475711 -128397 -707232 438894 1552207 784089 -1426714 -3412369 -4450628 -4753088
3605 -4753088 -4534178 -4329449 -5103636 -6793461 -7780576 -6986293 -5467992 -4886846 -5568621
3596 -5568621 -7113461 -9484093 -12238724 -14218286 -15358636 -17011477 -18804140 -17418122
$$ packed form
3659h36467j459705k294595j982657j583321j485315n69776J484038L081242K953089
3650b693467J781663O74500j90181n29524L85426J884753J775026m88895k391502
3641B07799j705130M48515J497837P96830n14275j519691j795732j082294j46314
3632c812455m51827j621675j142744J750984M060295L085554M82663m05581M53350
3623B398564N09005q45513j693146j024266J45055Q95555J168815O56425p34783
3614A475711j604108n78835J146126J113313p68118k210803j985655j038259l02460
3605d753088K18910K04729p74187j689825r87115P94283J518301N81146o81775
3596e568621j544840k370632k754631j979562j140350j652841j792663J386018
$$ plain form
3588 -17418122 -11143501 -3792630 -746940 -2237731 -3980667 -3595113 -2478171 -1658049
3580 -1658049 -261047 1175548 327371 -2262673 -2273158 2077281 6338057 5644881 1343507
3571 1343507 -1782580 -2495337 -3111224 -4100057 -3378012 -773233 1145577 1321177 1480905
3562 1480905 2217015 1489443 -1450294 -4114450 -4825278 -5484716 -7611263 -8573353 -5489594
3553 -5489594 -906968 -227180 -3998344 -6920998 -5077549 -502871 2670418 3363889 2895149
3544 2895149 1834645 235313 -518027 1051262 3749787 4497992 2197142 -823819 -1778776
3535 -1778776 -709779 -78862 -1599605 -4134604 -4916078 -2802847 21010 187864 -3005847
3526 -3005847 -6668792 -7528552 -5310064 -2494830 -1575927 -3211401 -6249721 -8568847 -8382422
$$ packed form
3588a7418122O274621P350871L045690j490791j742936L85554J116942Q20122
3580a658049J397002J436595q48177k590044j0485M350439M260776o93176m301374
3571A343507l126087p12757o15887r88833P22045K604779J918810J75600J59728
3562A480905P36110p27572k939737k664156p10828o59438k126547r62090L083759
3553e489594M582626O79788l771164k922654J843449M574678L173289O93471m68740
3544B895149j060504j599332p53340J569289K698525P48205k300850l020961r54957
3535a778776J068997O30917j520743k534999p81474K113231K823857J66854l193711
3526c005847l662945q59760K218488K815234R18903j635474l038320k319126J86425
$$ plain form
3517 -8382422 -5789494 -3002623 -2417824 -4504236 -7771540 -10240322 -10624884 -8954393 -6737025
3508 -6737025 -5790278 -6264157 -6652642 -6297617 -6466706 -7808992 -8312391 -5801624 -1508719
3499 -1508719 1127251 880059 -176895 43882 1287988 2129983 1812919 690783 172744
3490 172744 1919283 5446638 7186177 4357047 -579529 -2320077 240476 2694195
3482 2694195 1663497 -944924 -1975395 -1816321 -2372402 -2996188 -1776447 927953 3428339
3473 3428339 5649021 7801459 7465507 2041168 -6066476 -10589891 -8598963 -3642122
3465 -3642122 -830053 -1422192 -3345003 -4596089 -4501044 -3211591 -1492764 -236750 495009
3456 495009 1166085 1506802 895147 -97265 -283070 62993 -161620 -108099 2427214 6895752
$$ packed form
3517h382422K592928K786871N84799k086412l267304k468782l84562J670491K217368
3508f737025R46747m73879l88485L55025j69089j342286n03399K510767M292905
3499a508719K635970k47192j056954K20777J244106Q41995l17064j122136n18039
3490A72744J746539L527355J739539k829130m936576j740548K560553K453719
3482B694195j030698k608421j030471J59074n56081o23786J219741K704400K500386
3473C428339K220682K152438l35952n424339q107644m523415J990928M956841
3465c642122K812069n92139j922811j251086R5045J289453J718827J256014P31759
3456D95009O71076L40717o11655r92412j85805L46063k24613N3521K535313M468538
$$ plain form
3446 6895752 9383067 7520787 3346041 -405261 -3962659 -8087868 -10884675 -10578175
3438 -10578175 -9400533 -10547140 -12423697 -10474554 -4604536 -60894 107114 -1099657
3430 -1099657 -519735 -379015 -4182824 -9800715 -11295978 -7019108 -1764722 -163759 -1231166
3421 -1231166 -1140712 874926 1813336 -518746 -4206341 -5210152 -2006351 2484877 3859263
3412 3859263 834940 -3656927 -5943539 -5215433 -3193419 -1387117 -77828 548229 10680
3403 10680 -1480204 -3028581 -4459694 -6482375 -8915659 -10056553 -8792909 -6392720 -5068252
3394 -5068252 -5395873 -6261432 -6834698 -7282619 -7660652 -7409112 -6281468 -4839436 -3645615
3385 -3645615 -2729447 -2241637 -2789840 -4310085 -5130013 -3368930 415979 2947210 1616033
$$ packed form
3446F895752K487315j862280m174746l751302l557398m125209k796807L06500
3438a0578175J177642j146607j876557J949143N870018M543642J68008j206771
3430a099657N79922J40720l803809n617891j495263M276870N254386J600963j067407
3421a231166R0454K015638R38410k332082l687595j003811L203801M491228J374386
3412C859263l024323m491867k286612P28106K022014J806302J309289O26057n37549
3403A0680j490884j548377j431113k022681k433284j140894J263644K400189J324468
3394e068252l27621q65559n73266m47921l78033K51540J127644J442032J193821
3385c645615R16168M87810n48203j520245q19928J761083L784909K531231j331177
$$ plain form
3376 1616033 -2042107 -3427952 45847 5904267 9585719 9662144 8530969 8260181 7953150
3367 7953150 6051075 3321742 1902849 2477743 4042388 5647836 6608181 5644405 2071042
3358 2071042 -2025711 -2912306 588897 5334644 7086430 4550362 -267748 -4532108
3350 -4532108 -6566609 -6344071 -5145052 -4538304 -5053962 -5807041 -5431967 -3190682 463153
3341 463153 3778661 4660603 2879974 1081320 2194699 5831870 8695672 8650183 6715008
3332 6715008 4737455 3065867 1413580 220668 -180236 -464857 -1141378 -1522892 -907226
3323 -907226 288659 1489706 2837996 4170441 4500301 3592545 2628543 2214856 1416731
3314 1416731 47709 -132527 1624945 2938736 1547058 -1115347 -2326053 -2335676 -2923471
$$ packed form
3376A616033l658140j385845L473799N858420L681452P6425j131175k70788l07031
3367G953150j902075k729333j418893N74894J564645J605448R60345r63776l573363
3358B071042m096753q86595L501203M745747J751786k536068m818110m264360
3350d532108k034501K22538J199019O06748n15658p53079L75074K241285L653835
3341D63153L315508Q81942j780629j798654J113379L637171K863802m5489j935175
3332F715008j977553j671588j652287j192912m00904k84621o76521l81514O15666
3323i07226J195885J201047J348290J332445L29860r07756r64002m13687p98125
3314A416731j369022j80236J757472J313791j391678k662405j210706r623n87795
$$ plain form
3305 -2923471 -3177478 -805630 2957802 4164786 2228104 912754 2173861 3146260 1271101
3296 1271101 -1182498 -506479 3009056 5728032 5050682 928614 -5320677 -11397176 -14544545
3287 -14544545 -13974709 -11919842 -10538690 -8973663 -5478384 -1326216 -81746 -3190156
3279 -3190156 -8253406 -11721390 -11848251 -9146978 -5449875 -2823348 -2481017 -4365456 -7720187
3270 -7720187 -11447563 -13914536 -13803017 -11813940 -10230580 -10058264 -9997893 -8897259 -7196134
3261 -7196134 -4772408 139069 7526926 13092172 12293765 6078082 -181553 -2898797
3253 -2898797 -2808880 -1880354 -832244 -68834 -347134 -1609091 -3016823 -4628043 -7186232
3244 -7186232 -9874958 -10302411 -7447497 -2990552 867369 3387702 4715915 5030799 4825973
$$ packed form
3305b923471k54007K371848L763432J206984j936682j315350J261107R72399j875159
3296A271101k453599O76019L515535K718976o77350m122068o249291o076499l147369
3287a4544545N69836K054867J381152J565027L495279M152168J244470l108410
3279c190156n063250l467984j26861K701273L697103K626527L42331j884439l354731
3270g720187l727376k466973J11519J989077J583360J72316O0371J100634J701125
3261g196134K423726M911477P387857N565246p98407o215683o259635k717244
3253b898797Q9917R28526J048110P63410k78300j261957j407732j611220k558189
3244g186232k688726m27453K854914M456945L857921K520333J328213L14884k04826
$$ plain form
3235 4825973 4465395 3032149 -623021 -5193952 -7374120 -6101008 -4515866 -6142488
3227 -6142488 -10296041 -12769343 -10462744 -4399971 1191486 2171903 -2171436 -8219374
3219 -8219374 -11142389 -9506798 -6098036 -4079076 -3766934 -3744688 -3402197 -2996526 -2416554
3210 -2416554 -1558960 -1408347 -3278016 -6938695 -10329748 -11222969 -9020363 -5375578 -3172731
3201 -3172731 -4028906 -6374090 -6830701 -4005085 -134994 1505438 44638 -2567623 -3697632
3192 -3697632 -2136229 965032 2715934 976059 -3179239 -6255040 -5933219 -2929347
3184 -2929347 828469 4274349 6844175 7740072 6759196 4700177 1980979 -1901323 -6590538
3175 -6590538 -10101323 -11245930 -11469596 -12567168 -13674055 -12499612 -8982239 -5816321
$$ packed form
3235D825973l60578j433246l655170m570931k180168J273112J585142j626622
3227f142488m153553k473302K306599O062773N591457R80417m343339o047938
3219h219374k923015J635591L408762K018960L12142K2246L42491M05671N79972
3210b416554Q57594J50613j869669l660679l391053q93221K202606L644785K202847
3201c172731q56175k345184m56611K825616L870091J640432j460800k612261j130009
3192c697632J561403L101261J750902j739875m155298l075801L21821L003872
3184b929347L757816L445880K569826Q95897r80876k059019k719198l882302m689215
3175f590538l510785j144607k23666j097572j106887J174443L517373L165918
$$ plain form
3167 -5816321 -5334263 -7142754 -8822341 -8114413 -4724012 -674262 1609371 2030487 2656179
3158 2656179 4286721 4808889 2261333 -1974713 -4856753 -5466932 -5246321 -5291253 -5325825
3149 -5325825 -4829054 -3518758 -1245532 1188386 2012623 876300 111002 1653128 3851867
3140 3851867 3653631 922969 -2027350 -4234066 -6275373 -7259887 -5251679 -1021457 1986197
3131 1986197 2205223 1461577 1143416 32525 -2713263 -5365070 -6206852 -5962207 -5993499
3122 -5993499 -6317751 -7011641 -9143587 -12233534 -13051929 -9530746 -4216633 -1236874 -1139311
3113 -1139311 -1375192 -770060 -432351 -595766 202841 1975592 1832526 -2654237 -9748269
3104 -9748269 -14666016 -14349741 -10555452 -8079006 -9956978 -14468709 -17070313 -15185627
$$ packed form
3167e816321M82058j808491j679587P07928L390401M049750K283633M21116O25692
3158B656179J630542N22168k547556m236046k882040o10179K20611m4932l4572
3149e325825M96771J310296K273226K433918Q24237j136323p65298J542126K198739
3140C851867j98236k730662k950319k206716k041307r84514K008208M230222L007654
3131A986197K19026p43646l18161j110891k745788k651807q41782K44645l1292
3122e993499l24252o93890k131946l089947q18395L521183N314113K979759R7563
3113a139311k35881O05132L37709j63415P98607J772751j43066m486763p094032
3104i748269m917747L16275L794289K476446j877972m511731k601604J884686
$$ plain form
3096 -15185627 -10586578 -7068187 -6573457 -7948324 -8830907 -8199059 -7237036 -7813642 -10011203
3087 -10011203 -11650213 -10786055 -7919327 -4757990 -1757720 1439808 3906816 4036414
3079 4036414 2069315 -161011 -1859857 -3348715 -3877412 -2393153 -500856 -1019975 -2923181
3070 -2923181 -1749706 3409302 7457667 6222114 1973225 -966575 -2379158 -4113695
3062 -4113695 -5291997 -4271350 -2928858 -3899216 -5179952 -2779136 2074050 3714281
3054 3714281 180195 -4338941 -5917539 -5302427 -4772104 -4525434 -3674067 -1823725 1236989
3045 1236989 4707464 5676704 2399479 -1492449 -599178 3980724 5207767 300104 -5247585
3036 -5247585 -6458514 -6047415 -8606603 -12400350 -12435412 -8619107 -5254348 -4197507 -3753438
$$ packed form
3096a5185627M599049L518391M94730j374867q82583O31848R62023n76606k197561
3087a0011203j639010Q64158K866728L161337L000270L197528K467008J29598
3079D036414j967099k230326j698846j488858n28697J484259J892297n19119j903206
3070b923181J173475N159008M048365j235553m248889k939800j412583j734537
3062d113695j178302J020647J342492r70358j280736K400816M853186J640231
3054C714281l534086m519136j578598O15112N30323K46670Q51367J850342L060714
3045A236989L470475R69240l277225l891928Q93271M579902J227043m907663n547689
3036e247585j210929M11099k559188l793747l5062L816305L364759J056841M44069
$$ plain form
3027 -3753438 -3325618 -4125033 -5495989 -5069359 -2837566 -1223843 -961016 -688099 -762000
3018 -762000 -3294261 -7636890 -10002312 -9057029 -8051356 -9395299 -10740102 -9213612 -6518761
3009 -6518761 -6315644 -8431296 -9281250 -7185073 -3976466 -1565126 28774 796105 -335526
3000 -335526 -3500423 -6703186 -7936928 -7298116 -6007740 -4547077 -3000789 -2268447 -3366582
2991 -3366582 -5881508 -8489789 -10873657 -13717824 -16628812 -17514724 -14864316 -9825046
2983 -9825046 -5249525 -3144378 -3479648 -4813925 -5492870 -4864385 -3979407 -4583812 -6909342
2974 -6909342 -9143330 -9575391 -8277873 -5970817 -2613131 1477067 4333394 4212272 2234219
2965 2234219 1236607 2207542 3542395 3520754 1773839 -1262531 -4336722 -5283945 -3328021
$$ packed form
3027c753438M27820p99415j370956M26630K231793J613723K62827K72917p3901
3018g62000k532261m342629k365422R45283J005673j343943j344803J526490K694851
3009f518761K03117k115652q49954K096177L208607K411340J593900P67331j131631
3000c35526l164897l202763j233742O38812J290376J460663J546288P32342j098135
2991c366582k514926k608281k383868k844167k910988q85912K650408N039270
2983i825046M575521K105147l35270j334277o78945O28485Q84978o04405k325530
2974f909342k233988m32061J297518K307056L357686M090198K856327j21122j978053
2965B234219r97612R70935J334853k1641j746915l036370l074191r47223J955924
$$ plain form
2956 -3328021 -1177985 -2127701 -5224168 -6467031 -4897586 -3649063 -4097054 -3340067 349404
2947 349404 3723824 3547087 2053367 3415525 7112005 9017622 7581380 4785146 1907835
2938 1907835 -1530124 -4834061 -5900113 -4193044 -1072349 2591701 6172064 7382153
2930 7382153 4426385 -140736 -1839453 -896769 -2109404 -7181100 -11906861 -12970470
2922 -12970470 -12907005 -14998774 -17071941 -14757180 -8621983 -3582908 -2221630 -2693674 -2998232
2913 -2998232 -3545725 -4787043 -5335177 -3901339 -1443578 -313349 -2107499 -6534874 -11310475
2904 -11310475 -13274628 -11193143 -7748007 -7202979 -10461196 -13793639 -13314814 -9466036
2896 -9466036 -5770793 -4025461 -2581372 422756 3833677 4737583 2190341 -1806792
$$ packed form
2956c328021K150036r49716l096467j242863J569445J248523m47991P56987L689471
2947C49404L374420j76737j493720J362158L696480J905617j436242k796234k877311
2938A907835l437959l303937j066052J707069L120695L664050L580363J210089
2930G382153k955768m567121j698717R42684j212635n071696m725761j063609
2922a2970470O3465k091769k073167K314761O135197N039075J361278m72044l04558
2913b998232n47493j241318n48134J433838K457761J130229j794150m427375m775601
2904a1310475j964153K081485L445136N45028l258217l332443M78825L848778
2896i466036L695243J745332J444089L004128L410921R03906k547242l997133
$$ plain form
2888 -1806792 -5081744 -7539112 -9942285 -11816152 -12003302 -10577612 -8577468 -6197491
2880 -6197491 -3123196 -726981 -1640709 -5972843 -9736633 -8929518 -4363901 -659845 -781298
2871 -781298 -3340544 -5384809 -5870820 -5351696 -3863149 -1262259 702681 -832297 -5747770
2862 -5747770 -9391384 -7400486 -1457134 2281900 715294 -2897079 -4148223 -3116884
2854 -3116884 -2478249 -2355902 -632664 2474854 3852269 1957617 -1072236 -2603286 -2350120
2845 -2350120 -1191295 433497 1659965 838379 -2281527 -5370911 -5977981 -4230367 -2131455
2836 -2131455 -1200599 -1642344 -2805950 -3704988 -3957943 -4496466 -6177147 -7815046 -7515439
2827 -7515439 -5980566 -5864814 -7256724 -6887133 -3266769 490408 1202530 138873 65213
$$ packed form
2888a806792l274952k457368k403173j873867j87150J425690K000144K379977
2880f197491L074295K396215r13728m332134l763790Q07115M565617L704056j21453
2871g81298k559246k044265m86011N19124J488547K600890J964940j534978m915473
2862e747770l643614J990898N943352L739034j566606l612373j251144J031339
2854c116884O38635J22347J723238L107518J377415j894652l029853j531050K53166
2845b350120J158825J624792J226468q21586l119906l089384o07070J747614K098912
2836b131455R30856m41745j163606q99038k52955n38523j680681j637899K99607
2827g515439J534873J15752j391910L69591L620364L757177P12122j063657p3660
$$ plain form
2818 65213 123819 -2675797 -8102220 -12398343 -12949408 -10417912 -6718983 -3711447 -3464382
2809 -3464382 -6616706 -10137587 -9579077 -4425850 891502 2008283 -1104503 -5294826
2801 -5294826 -7769574 -7736763 -6036976 -4192210 -3367554 -3989534 -6268771 -9919461 -12748076
2792 -12748076 -11482497 -5850301 -155713 1554821 347385 -267398 -5888 -985796 -2567342
2783 -2567342 -1857463 780139 1813639 997634 2547131 7878644 12108402 10886253 6532984
2774 6532984 3641548 2156113 -692561 -4199596 -4983971 -2841923 -1234834 -2155259 -4284042
2765 -4284042 -6101889 -7165422 -6212637 -1862122 3886708 6305172 3638158 -552769
2757 -552769 -2390845 -2597146 -4274453 -7584039 -9289503 -7179801 -2817178 577594 1768353
$$ packed form
2818F5213N8606k799616n426423m296123n51065K531496L698929L007536K47065
2809c464382l152324l520881N58510N153227N317352J116781l112786m190323
2801e294826k474748L2811J699787J844766Q24656o21980k279237l650690k828615
2792a2748076J265579N632196N694588J710534j207436o14783K61510r79908j581546
2783b567342P09879K637602J033500q16005J549497N331513M229758j222149m353269
2774F532984k891436j485435k848674l507035p84375K142048J607089r20425k128783
2765d284042j817847j063533R52785M350515N748830K418464k667014m190927
2757e52769j838076k06301j677307l309586j705464K109702M362623L394772J190759
$$ plain form
2748 1768353 2314008 4136005 6991417 8816022 8350953 6517963 4802123 3336756 1640469
2739 1640469 350065 528260 1482443 1046773 -1573273 -4632775 -6057808 -5689194 -4798826
2730 -4798826 -4432524 -4822057 -5450160 -5029336 -2360917 1952961 5426198 6198545 4966291
2721 4966291 3470877 1808563 -1207290 -5063555 -6678804 -3621665 2600295 7779103
2713 7779103 9535751 9527088 10704364 13379510 15132740 14218141 11613399 9250921 7360401
2704 7360401 4536285 -56041 -5427271 -9609792 -11277013 -10754061 -9794669 -9994475 -11089119
2695 -11089119 -11370410 -10133904 -8775931 -8681107 -9080873 -8417403 -7110141 -7156973 -9154342
2686 -9154342 -11558408 -13138512 -14301478 -15290868 -14862041 -12094451 -8389516 -6213622 -6345937
$$ packed form
2748A768353N45655J821997K855412J824605m65069j832990j715840j465367j696287
2739A640469j290404J78195R54183m35670k620046l059502j425033L68614Q90368
2730d798826L66302l89533o28103M20824K668419M313878L473237P72347j232254
2721D966291j495414j662314l015853l856265j615249L057139O221960N178808
2713G779103J756648q663J177276K675146J753230r14599k604742k362478j890520
2704G360401k824116m592326n371230m182521j667221N22952R59392j99806j094644
2695a1089119k81291J236506J357973R4824l99766O63470J307262m6832j997369
2686i154342k404066j580104j162966r89390M28827K767590L704935K175894j32315
$$ plain form
2677 -6345937 -7408359 -7666086 -6399198 -4008974 -1768173 -1120756 -2280256 -3742946 -3969759
2668 -3969759 -3195054 -2699863 -2713086 -2173689 -393479 2227730 5110545 7850775 9488413
2659 9488413 8791257 5901194 2656099 592731 -459319 -1166123 -1244413 -374258 388870
2650 388870 -288848 -1867367 -2472181 -1621612 -871963 -1380338 -2343835 -2641942 -2662155 -3270513
2640 -3270513 -3984093 -3733118 -2954195 -3243531 -4831838 -5934897 -5176228 -3433036 -2400932
2631 -2400932 -2150861 -1136880 1715084 5753565 9220544 10381255 8247649 3216183
2623 3216183 -2594106 -6303030 -6320610 -3517485 -132356 2389728 4159706 5503290 5529912
2614 5529912 2852484 -2165789 -6733392 -8058983 -6286783 -4219591 -4110498 -5650726
$$ packed form
2677f345937j062422k57727J266888K390224K240801O47417j159500j462690k26813
2668c969759P74705M95191j3223N39397J780210K621209K882815K740230J637638
2659I488413o97156k890063l245095k063368j052050p06804p8290Q70155P63128
2650C88870o77718j578519o04814Q50569P49649n08375r63497k98107k0213o08358
2640c270513p13580K50975P78923k89336j588307j103059P58669J743192J032104
2631b400932K50071J013981K851964M038481L466979J160711k133606n031466
2623C216183n810289l708924j7580K803125L385129K522084J769978J343584K6622
2614E529912k677428n018273m567603j325591J772200K067192J09093j540228
$$ plain form
2606 -5650726 -7387372 -8866788 -10222197 -10468537 -8079368 -3554927 233218 1316497
2598 1316497 1110176 2129764 3888010 3124536 -1460980 -6635723 -8204533 -5996247 -3559173
2589 -3559173 -3497708 -5119221 -6708626 -7878299 -8713325 -8501833 -6930045 -5245626 -4450988
2580 -4450988 -3334359 -403347 2793221 2730696 -1470512 -6692515 -9705899 -10384924 -10198632
2571 -10198632 -9614551 -8498203 -7363973 -6378698 -4433726 -1200487 1023425 -35136
2563 -35136 -2687836 -2684590 1196603 5389618 6123696 3654633 875859 -340900 51467
2554 51467 1470748 2775393 2197718 -741164 -3764074 -4242584 -2848714 -2805113 -5393723
2545 -5393723 -8378932 -9573184 -9768494 -10641722 -11602042 -11032968 -9667172 -9918972 -11621802
$$ packed form
2606e650726j736646j479416j355409k46340K389169M524441L788145J083279
2598A316497k06321J019588J758246p63474m585516n174743j568810K208286K437074
2589c559173O1465j621513j589405j169673q35026K11492J571788J684419P94638
2580d450988J116629K931012L196568o2525m201208n222003l013384o79025J86292
2571a0198632N84081J116348J134230R85275J944972L233239K223912j058561
2563c5136k652700L246L881193M193015P34078k469063k778774j216759L92367
2554E1467J419281J304645n77675k938882l022910m78510J393870M3601k588610
2545e393723k985209j194252j95310q73228r60320N69074J365796k51800j702830
$$ plain form
2536 -11621802 -11049312 -5610357 2119293 6848661 6316886 2942428 67690 -1572334
2528 -1572334 -3035893 -4390853 -4439528 -3129208 -2695992 -5215058 -9423875 -11439580 -9244420
2519 -9244420 -5319646 -3630838 -4820375 -6129516 -5726402 -4808895 -4872846 -5272377 -4971046
2510 -4971046 -4744560 -5540203 -6050938 -4377693 -1311967 577359 801617 1320589 2953516
2501 2953516 4036973 3382065 2279729 2418245 3499456 3976115 2837870 34958 -3372509
2492 -3372509 -5058847 -3419688 -429265 -199969 -3485473 -6122618 -4893122 -2524110
2484 -2524110 -3881733 -8690464 -11531693 -8952890 -3562241 -309701 -872906 -2841987
2476 -2841987 -3188875 -1425354 413584 482712 -516174 -427342 916892 951118 -1978254
$$ packed form
2536a1621802N72490N438955P729650M729368n31775l374458k874738j640024
2528a572334j463559j354960m8675J310320M33216k519066m208817k015705K195160
2519i244420L924774J688808j189537j309141M03114R17507o3951l99531L01331
2510d971046K26486p95643n10735J673245L065726J889326K24258N18972J632927
2501B953516J083457o54908j102336J38516J081211M76659j138245k802912l407467
2492c372509j686338J639159K990423K29296l285504k637145J229496K369012
2484b524110j357623m808731k841229K578803N390649L252540n63205j969081
2476b841987l46888J763521J838938O9128r98886Q8832J344234L4226k929372
$$ plain form
2467 -1978254 -5844176 -7482028 -6642187 -5499444 -5056855 -4338132 -2746880 -962895 551020
2458 551020 2005553 3101804 3011287 1568424 -907935 -4555553 -8984693 -11909414 -11102616
2449 -11102616 -7689356 -5187034 -5093257 -5745322 -5779676 -5966124 -6687679 -6300875 -3784373
2440 -3784373 -1147179 -1229201 -4074133 -6994668 -7652933 -6032478 -3782270 -2260196 -1047668
2431 -1047668 1399955 5064477 7264715 5895342 2992779 2601336 5245700 7274121
2423 7274121 5979806 2405819 -1646535 -6130664 -10793139 -13756509 -14129740 -13528066 -13002619
2414 -13002619 -11070309 -7105936 -3942627 -4007619 -5157768 -3940341 -1274611 -895702 -3060785
2405 -3060785 -3966271 -1590647 1531293 2196946 342797 -1996411 -3286887 -3115377 -1873460
$$ packed form
2467a978254l865922j637852Q39841J142743M42589P18723J591252J783985J513915
2458E51020J454533J096251r0517j442863k476359l647618m429140k924721Q06798
2449a1102616L413260K502322R3777o52065l4354j86448p21555L86804K516502
2440c784373K637194q2022k844932k920535o58265J620455K250208J522074J212528
2431a047668K447623L664522K200238j369373k902563l91443K644364K028421
2423G274121j294315l573987m052354m484129m662475k963370l73231O01674N25447
2414a3002619J932310L964373L163309o4992j150149J217427K665730L78909k165083
2405c060785r05486K375624L121940O65653j854149k339208j290476J71510J241917
$$ plain form
2396 -1873460 -513224 437570 1436706 2310659 1114325 -3172219 -7708592 -8556255 -6085435
2387 -6085435 -4358385 -4991784 -5337349 -3679472 -2247756 -2860990 -3065875 70870 4639132
2378 4639132 6108773 3862801 1931625 3142566 5629203 6117915 4380587 2851646
2370 2851646 3021064 3810520 3359641 1289313 -1284550 -3504470 -5773388 -8767251 -12029823
2361 -12029823 -14176872 -14195741 -11898459 -7528015 -2033535 2406480 3610040 1786013
2353 1786013 -201315 363020 3407309 6408888 6720187 3551710 -1375052 -4915488 -5227781
2344 -5227781 -3726397 -3413278 -5199005 -7198966 -7852773 -7857302 -8092871 -7543356 -5059937
2335 -5059937 -1948550 -697176 -1623132 -2770973 -3131888 -4066182 -6880087 -10386629 -11981538
$$ packed form
2396a873460J360236R50794R99136Q73953j196334m286544m536373q47663K470820
2387f085435J727050o33399l45565J657877J431716o13234k04885L136745M568262
2378D639132J469641k245972j931176J210941K486637M88712j737328j528941
2370B851646J69418P89456m50879k070328k573863k219920k268918k993863l262572
2361a2029823k147049j8869K297282M370444N494480M440015J203560j824027
2353A786013j987328N64335L044289L001579L11299l168477m926762l540436l12293
2344e227781J501384L13119j785727j999961o53807m529k35569N49515K483419
2335e059937L111387J251374r25956j147841l60915r34294k813905l506542j594909
$$ plain form
2326 -11981538 -10644049 -7989376 -6289135 -5975535 -5580771 -4131025 -2810368 -3362636 -5273846
2317 -5273846 -6093538 -4930980 -3973932 -5336604 -7677078 -7715710 -4579254 -869833 611041
2308 611041 -275139 -1652527 -1852334 -556583 1224872 1772375 -3038 -3375792 -6491739
2299 -6491739 -8406142 -9728524 -11086368 -11912258 -11261782 -9019679 -5665296 -1582183 2564861
2290 2564861 5306425 5275136 2653030 -923859 -3901920 -5830231 -7137127 -8620378 -11048277
2281 -11048277 -14379229 -17153164 -17476143 -15118546 -12023197 -10069904 -8782385 -6137925
$$ packed form
2326a1981538J337489K654673J700241L13600L94764J449746J320657n52268j911210
2317e273846q19692J162558R57048j362672k340474l8632L136456L709421J480874
2308F11041q86180j377388j99807J295751J781455N47503j775413l372754l115947
2299f491739j914403j322382j357844q25890O50476K242103L354383M083113M147044
2290B564861K741564l1289k622106l576889k978061j928311j306896j483251k427899
2281a1048277l330952k773935l22979K357597L095349J953293J287519K644460
$$ [...]
##END NTUPLES=NMR SPECTRUM
##END=
