##TITLE=31Pdec_DE-75k3_F
 CDCl3, 64 sc
 14.1.2025
##JCAMPDX= 6.0         $$ Bruker NMR JCAMP-DX V2.0
##DATA TYPE= NMR SPECTRUM
##DATA CLASS= NTUPLES
##ORIGIN= UXNMR, Bruker Analytische Messtechnik GmbH
##OWNER= root
$$ XWIN-NMR		Version 3.5
$$ Wed Jan 15 14:33:00 2025 Russian Standard Time (UT+4h)  she@DPX200
##.OBSERVE FREQUENCY= 81.013821
##.OBSERVE NUCLEUS= ^31P
##.ACQUISITION MODE= SIMULTANEOUS
##.ACQUISITION SCHEME= undefined
##.AVERAGES= 64
##.DIGITISER RES= 17
##SPECTROMETER/DATA SYSTEM= spect
##.PULSE SEQUENCE= zgpg30
##.SOLVENT NAME= CDCl3
##.SHIFT REFERENCE= (INTERNAL, CDCl3, 0, 198.062)
##AUDIT TRAIL= $$ (NUMBER, WHEN, WHO, WHERE, WHAT)
$$ ##TITLE= Audit trail, XWIN-NMR		Version 3.5
$$ ##JCAMPDX= 5.01
$$ ##ORIGIN= Bruker BioSpin GmbH
$$ ##OWNER= she
$$ F:/spectra/data/she/nmr/P31/2/pdata/1/auditp.txt
$$ ##AUDIT TRAIL=  $$ (NUMBER, WHEN, WHO, WHERE, WHAT)
(   1,<2025-01-15 14:31:02.09 +0400>,<she>,<DPX200>,
      <created by zg, POWCHK disabled, PULCHK disabled
       configuration hash MD5:
       00 E9 B6 7A A2 85 ED C7 34 08 36 98 17 FE 4E 26
       data hash MD5: 32K
       C5 6E F8 A0 1A 1A 9F 18 3B 55 58 D2 E8 22 39 22>)
(   2,<2025-01-15 14:31:04.34 +0400>,<she>,<DPX200>,
      <Start of raw data processing
       efp BC_mod = 2 LB = 1.5 FT_mod = 6 PKNL = 1 PHC0 = 2153.326 PHC1 = 80.68559 SI = 64K 
       data hash MD5: 64K
       C0 66 CC EA 8D F9 38 B9 65 60 EC 79 18 D1 98 1A>)
(   3,<2025-01-15 14:31:48.15 +0400>,<she>,<DPX200>,
      <pk PHC0 = -521.9175 PHC1 = 367.4 
       data hash MD5: 64K
       9A DA 2D 57 FC 30 07 C1 77 2A 57 49 1C DD D4 56>)
(   4,<2025-01-15 14:31:52.01 +0400>,<she>,<DPX200>,
      <abs ABSG = 5 
       data hash MD5: 64K
       3E 20 B1 7E 4C C9 70 16 DD D3 82 31 B3 D0 D4 FB>)
$$ ##END=
$$ 
$$ hash MD5
$$ B3 83 EC F0 8F 21 B2 64 73 33 21 FD 82 9E 70 F0
##$RELAX= 
##$RELAX= 
##$RELAX= 
##$RELAX= 
##$RELAX= 
##$RELAX= 
##$RELAX= 
##$RELAX= 
$$ Bruker specific parameters
$$ --------------------------
##$DU= <F:/spectra>
##$EXPNO= 2
##$NAME= <P31>
##$PROCNO= 1
##$TYPE= <nmr>
##$USER= <she>
##$AMP= (0..31)
100 100 100 100 100 100 100 100 100 100 100 100 100 100 100 100 100 100 
100 100 100 100 100 100 100 100 100 100 100 100 100 100 
##$AQSEQ= 0
##$AQ_mod= 1
##$AUNM= <au_zg>
##$AUTOPOS= <>
##$BF1= 81.014009
##$BF2= 200.13
##$BF3= 200.13
##$BF4= 200.13
##$BF5= 200.13
##$BF6= 200.13
##$BF7= 200.13
##$BF8= 200.13
##$BYTORDA= 1
##$CFDGTYP= 0
##$CFRGTYP= 5
##$CHEMSTR= <none>
##$CNST= (0..31)
1 1 145 1 1 1 1 1 1 1 1 1 1 1 1 1 1 1 1 1 1 1 1 1 1 1 1 1 1 1 1 1 
##$CPDPRG= <waltz16>
##$CPDPRG1= <>
##$CPDPRG2= <waltz16>
##$CPDPRG3= <>
##$CPDPRG4= <mlev>
##$CPDPRG5= <mlev>
##$CPDPRG6= <mlev>
##$CPDPRG7= <mlev>
##$CPDPRG8= <mlev>
##$CPDPRGB= <>
##$CPDPRGT= <>
##$D= (0..31)
0 1 0 0 0 0 0 0 0 0.06 0 0.03 2e-05 3e-06 0 0 0.0002 0 0 0 0 0 0 0 0 0 
0 0 0 0 0 0 
##$DATE= 1736937061
##$DBL= (0..7)
120 120 120 11 120 120 24 19 
##$DBP= (0..7)
150 150 150 150 150 150 150 150 
##$DBP07= 0
##$DBPNAM0= <>
##$DBPNAM1= <>
$$ [...]
##$SUBNAM3= <"">
##$SUBNAM4= <"">
##$SUBNAM5= <"">
##$SUBNAM6= <"">
##$SUBNAM7= <"">
##$SUBNAM8= <"">
##$SUBNAM9= <"">
##$SW= 400.765351723535
##$SWIBOX= (0..15)
0 1 3 0 0 0 0 0 0 0 0 0 0 0 0 0 
##$SW_h= 32467.5324675325
##$TD= 32768
##$TD0= 1
##$TE= 0
##$TE2= 300
##$TE3= 300
##$TEG= 300
##$TL= (0..7)
0 120 53 12 22 120 120 120 
##$TP= (0..7)
150 150 150 150 150 150 150 150 
##$TP07= 0
##$TPNAME0= <>
##$TPNAME1= <>
##$TPNAME2= <>
##$TPNAME3= <>
##$TPNAME4= <>
##$TPNAME5= <>
##$TPNAME6= <>
##$TPNAME7= <>
##$TPOAL= (0..7)
0.5 0.5 0.5 0.5 0.5 0.5 0.5 0.5 
##$TPOFFS= (0..7)
0 0 0 0 0 0 0 0 
##$TUNHIN= 0
##$TUNHOUT= 0
##$TUNXOUT= 0
##$USERA1= <user>
##$USERA2= <user>
##$USERA3= <user>
##$USERA4= <user>
##$USERA5= <user>
##$V9= 5
##$VALIST= <valist>
##$VCLIST= <CCCCCCCCCCCCCCC>
##$VD= 0
##$VDLIST= <DDDDDDDDDDDDDDD>
##$VPLIST= <PPPPPPPPPPPPPPP>
##$VTLIST= <TTTTTTTTTTTTTTT>
##$WBST= 1024
##$WBSW= 4
##$XGAIN= (0..3)
0 0 0 0 
##$XL= 0
##$YL= 0
##$YMAX_a= 7498
##$YMIN_a= -4879
##$ZGOPTNS= <>
##$ZL1= 120
##$ZL2= 120
##$ZL3= 120
##$ZL4= 120
##$ABSF1= 198.0616
##$ABSF2= -202.7028
##$ABSG= 5
##$ABSL= 3
##$ALPHA= 0
##$AQORDER= 0
##$ASSFAC= 0
##$ASSFACI= 0
##$ASSFACX= 0
##$ASSWID= 0
##$AUNMP= <proc_1d>
##$AZFE= 0.1
##$AZFW= 0.5
##$BCFW= 0
##$BC_mod= 2
##$BYTORDP= 0
##$COROFFS= 0
##$CY= -3
##$DATMOD= 1
##$DC= 0
##$DFILT= <>
##$DTYPP= 0
##$F1P= 0
##$F2P= 0
##$FCOR= 1
##$FTSIZE= 65536
##$FT_mod= 6
##$GAMMA= 0
##$GB= 0
##$INTBC= 1
##$INTSCL= 9.790993e-09
##$ISEN= 30
##$LB= 1.5
##$LEV0= 0
##$LPBIN= 0
##$MAXI= 10000
##$MC2= 0
##$MEAN= 0
##$ME_mod= 0
##$MI= 50
##$NCOEF= 0
##$NC_proc= -9
##$NLEV= 6
##$NOISF1= 182.463
##$NOISF2= 159.3651
##$NSP= 0
##$NTH_PI= 0
##$NZP= 0
##$OFFSET= 198.0616
##$PC= 4
##$PHC0= 1631.408
##$PHC1= 448.0856
##$PH_mod= 1
##$PKNL= yes
##$PPARMOD= 0
##$PSCAL= 0
##$PSIGN= 0
##$REVERSE= no
##$SF= 81.0140089999434
##$SI= 65536
##$SIGF1= 159.3651
##$SIGF2= -187.1042
##$SINO= 113.3802
##$SIOLD= 16384
##$SREGLST= <1H.CDCl3>
##$SSB= 0
##$STSI= 65536
##$STSR= 0
##$SW_p= 32467.5324675325
##$SYMM= 0
##$S_DEV= 0
##$TDeff= 32768
##$TDoff= 0
##$TI= <>
##$TILT= no
##$TM1= 0
##$TM2= 0
##$TOPLEV= 0
##$USERP1= <user>
##$USERP2= <user>
##$USERP3= <user>
##$USERP4= <user>
##$USERP5= <user>
##$WDW= 1
##$XDIM= 65536
##$YMAX_p= 396577834
##$YMIN_p= -255695859
$$ End of Bruker specific parameters
$$ ---------------------------------
##NTUPLES= NMR SPECTRUM
##VAR_NAME=  FREQUENCY,     SPECTRUM/REAL,   SPECTRUM/IMAG
##SYMBOL=    X,             R,               I
##VAR_TYPE=  INDEPENDENT,   DEPENDENT,       DEPENDENT
##VAR_FORM=  AFFN,          ASDF,            ASDF
##VAR_DIM=   65536,         65536,           65536
##UNITS=     HZ,            ARBITRARY UNITS, ARBITRARY UNITS
##FACTOR=    0.49542278885378, 1,            1
##FIRST=     16045.7642231865, 0,            0
##LAST=      -16421.768244346, 0,            0
##MIN=       -16421.768244346, -255695859,   0
##MAX=       16045.7642231865, 396577834,    0
$$ Real data points
##PAGE= N=1
##DATA TABLE= (X++(R..R)), XYDATA
$$ [...]
7379E765912J951699j964712k049156q86209k706411m230978p06804L911127K143762
$$ 5765912 7717611 5752899 3703743 2817534 111123 -4119855 -4826659 -915532 1228230
7370A228230m215918n685600O81441O819093N182769j699988o107066m914995
$$ 1228230 -2987688 -8673288 -7991847 -1172754 4010015 2310027 -3797039 -8712034
7362h712034j121075J647791K731565L171866L104576J387069k103925m587355
$$ -8712034 -9833109 -8185318 -5453753 -2281887 822689 2209758 105833 -4481522
7354d481522k753729K242388M562377O37331n459672o548419j391990L880336
$$ -4481522 -7235251 -4992863 -430486 206845 -5252827 -11801246 -13193236 -9312900
7346i312900L534666j208504m276648j822070L819231O881761M592993M04218
$$ -9312900 -5778234 -6986738 -11263386 -13085456 -9266225 -2384464 2208529 2612747
7338B612747j92762L375610O302044N175753J945591m67772k867425o755009r442600
$$ 2612747 2419985 5795595 12097639 17273392 19218983 18751211 15883786 9128777 -313823
7329c13823o827623j36944M349120K634426k918895o975326o198394j124417M362795
$$ -313823 -7141446 -7278390 -2929270 -294844 -3213739 -10189065 -16387459 -17511876 -13149081
7320a3149081N714004K297137j235580n59946K514950L053393N34190r95510R8731
$$ -13149081 -7435077 -5137940 -6373520 -6933466 -4418516 -1365123 -830933 -1826443 -1727712
7311a727712R69841J04599J02440K314398L157388o21752n959840o694095j423005
$$ -1727712 -757871 -653272 -550832 1763566 4920954 4299202 -1660638 -8354733 -9777738
7302i777738N110563P964806O724140M286026K953277K441325J056975j690865
$$ -9777738 -4667175 3297631 10021771 14307797 17261074 19702399 20759374 19068509
7294A9068509m140673m576516l526446k792236k909548l190268l479497l712097
$$ 19068509 14927836 10351320 6824874 4032638 1123090 -2067178 -5546675 -9258772
7286i258772k581885M70232K628902P67334k991723l154346J029332M199640L291708
$$ -9258772 -11840657 -11370425 -8741523 -7974189 -10965912 -14120258 -13090926 -8891286 -5599578
7277e599578K005680L740022N210649K040184l144662m040638J65578M628157
$$ -5599578 -3593898 146124 5356773 7396957 4252295 211657 377235 5005392
7269E005392O317898N951360L534335j605667o173889m935235R52031L787960
$$ 5005392 11323290 17274650 20808985 19203318 13029429 8094194 9046225 12834185
7261A2834185J79549l818171k249314J560501R79857k927437l522619P4946J386805
$$ 12834185 13013734 9195563 6946249 8506750 9486607 6559170 3036551 3111497 4498302
7252D498302k805144p057238n576862q11812O49777k397754n176890m538193k500461
$$ 4498302 1693158 -5364080 -10940942 -11752754 -11102977 -13500731 -18677621 -23215814 -25716275
7243b5716275j775192j636216k1579K654193L928387K577566n105j306644J99214
$$ -25716275 -27491467 -29127683 -29149262 -26495069 -22566682 -19989116 -19994221 -21300865 -21101651
7234b1101651L834816O985872P311871N265747L549193L576524L878485K962488
$$ -21101651 -17266835 -10280963 -2969092 2296655 5845848 9422372 13300857 16263345
7226A6263345J867949J751361N36500m503192j0927818j1898539m687563M514508
$$ 16263345 18131294 19882655 20419155 15915963 4988145 -6910394 -11597957 -7083449
7218g083449P221549K433591l310062m753569l117645j961747j631300m18273
$$ -7083449 138100 2571691 -738371 -5491940 -8609585 -10571332 -12202632 -12620905
7210a2620905J004147k3704l384868n062540k333973K016825L055642L82632j308904
$$ -12620905 -11616758 -11640462 -15025330 -20087870 -22421843 -20405018 -17349376 -16966744 -18275648
7201a8275648J147352M848539M874012J200360j427357l68384J489337P99254
$$ -18275648 -17128296 -12279757 -7405745 -6205385 -7632742 -8001126 -6511789 -5712535
7193e712535n61600J599806O186134O630924Q4199o966070o262854P74209M315191
$$ -5712535 -6274135 -4674329 1511805 8142729 8226928 1260858 -5001996 -4227787 87404
7184H7404m79755o623797n273303J570084M092201j031933n958369k973511N064751
$$ 87404 -392351 -7016148 -12289451 -10719367 -6627166 -7659099 -13617468 -16590979 -11526228
7175a1526228R405259O933766K297958O4942m89473k221144n187955o509144l856451
$$ -11526228 -2120969 4812797 7110755 7175697 6686224 4465080 -722875 -7232019 -11088470
7166a1088470J628712N514584L947623j646380n055235k273300L306708N064878
$$ -11088470 -9459758 -3945174 2449 -1643931 -6699166 -8972466 -5665758 -600880
7158f00880J307599l749326o196729n790930l207386J610649O911824Q843253
$$ -600880 706719 -3042607 -9239336 -15030266 -18237652 -16627003 -9715179 -871926
7150h71926O180784K612787J872088K871585K109308j194264m998695p549264
$$ -871926 5308858 7921645 9793733 12665318 14774626 13580362 8581667 1032403
7142A032403p619146l486805M409137J0629135R104785J296622m008219j259925
$$ 1032403 -6586743 -10073548 -5664411 4964724 14069509 15366131 11357912 10097987
7134A0097987M644888N033610o72607m340169p50098M787863L695303l749455
$$ 10097987 14742875 19776485 19103878 14763709 14013611 18801474 22496777 18747322
7126A8747322q493380m990278J528964K644045k138654o172633n695093l872918
$$ 18747322 10253942 5263664 6792628 9436673 7298019 1125386 -4569707 -8442625
7118h442625m319696n241124k650993L229686P752541P253775K763203j510993
$$ -8442625 -12762321 -18003445 -20654438 -17424752 -9672211 -2418436 344767 -1166226
7110a166226k292505J61701K987998L818420K396708o10817m387388o591530m008876
$$ -1166226 -3458731 -3297030 -309032 3509388 5906096 5295279 907891 -5683639 -9692515
7101i692515K706228P454535N833613J719289J478909L396069K40536p499145
$$ -9692515 -6986287 468248 6301861 8021150 9500059 12896128 13136664 5637519
7093E637519r912544k638535M950407K907772m612846o089805K82429N425148
$$ 5637519 -4275025 -6913560 -1963153 944619 -3668227 -9758032 -9475603 -4050455
7085d050455L663709o59605j534272J151037M152168N152291K771808k705967
$$ -4050455 -386746 -1046351 -2580623 -1429586 2722582 7874873 10646681 7940714
7077G940714p203089o251488j762215l38758l475872n119356j263102L965760
$$ 7940714 737625 -5513863 -7276078 -7614836 -11090708 -16210064 -17473166 -13507406
7069a3507406N404145M434405M506988L856710q41812o464239o270810k56826
$$ -13507406 -8103261 -3668856 838132 4694842 3853030 -2611209 -8882019 -9138845
7061i138845L832852J080837m326541n688146k489057O57586J084282M65618J022319
$$ -9138845 -5305993 -4225156 -8551697 -14239843 -16728900 -16071314 -14987032 -14521414 -13499095
7052a3499095K486371L429885L627604L954613M798781N550213N340748L594695
$$ -13499095 -11012724 -7582839 -3955235 -622 4798159 10348372 15689120 19283815
7044A9283815K37040l628124n447143l217031J559840M384129K575435j416678
$$ 19283815 19520855 15892731 10445588 7228557 8788397 13172526 15747961 14331283
7036A4331283l043711j139047J533067K596230K446684K041954P84731k006992
$$ 14331283 11287572 10148525 11681592 14277822 16724506 18766460 19551191 17544199
7028A7544199m964957n561899k841635J410041M048370L111315m78307l710882
$$ 17544199 12579242 7017343 4175708 5585749 9634119 12745434 12267127 8556245
7020H556245m342589k705939o21605L56852q02160m144444p193314o203616j357630
$$ 8556245 4213656 1507717 886112 1242964 440804 -3703640 -10896954 -17100570 -18458200
7011a8458200J569696j779052p529263q179446k799808K571107M243177M467299
$$ -18458200 -16888504 -18667556 -26196819 -34376265 -37176073 -34604966 -30361789 -25894490
7003b5894490M908041L307018n40845j793307K073712O105158N199759K179615
$$ -25894490 -20986449 -17679431 -18220276 -20013583 -17939871 -11834713 -6634954 -4455339
6995d455339K616009N174420M021437j125955m468899l264443r53806n04162m97758
$$ -4455339 -1839330 3335090 7356527 6230572 1761673 -1502770 -2456576 -2960738 -3458496
6986c458496P32403K097979K547169K562071J467483k463974p655335r250368
$$ -3458496 -2726093 -628114 1919055 4481126 5948609 3484635 -4170700 -13421068
6978a3421068n462947p9564L077623M034323L217224q43504p101897r866238n460217
$$ -13421068 -18884015 -18963579 -15885956 -11851633 -8634409 -9477913 -16579810 -26446048 -31906265
6969c1906265K292599P352647R012419R788072R168313N122787l99492l432632
$$ -31906265 -29613666 -22261019 -13248600 -3460528 5707785 10830572 10431080 6998448
6961F998448m130419n173381n346289j413519L978884L889720j962654n255961
$$ 6998448 2868029 -2305352 -7651641 -9065160 -5086276 -1196556 -3159210 -8415171
6953h415171j113668M691672M891166J083627n79183O66400R77352l56130l39195
$$ -8415171 -9528839 -4837167 53999 1137626 558443 1224843 2202195 1846065 1506870
6944A506870J872729L819038L632428J063803l710490q253611p484542m06744
$$ 1506870 3379599 7198637 10831065 11894868 8184378 -69233 -7553775 -7960519
6936g960519N390866K511902m966194o671647j322297K021681j201484m585206
$$ -7960519 -2569653 -57751 -5023945 -11695592 -13017889 -10996208 -12197692 -16782898
6928a6782898k246837K209878L237959K181504K570393L030348J403457N18554
$$ -16782898 -19029735 -16819857 -13581898 -11400394 -8830001 -5799653 -4396196 -3877642
6920c877642L111994N694384M313202J997497L145436M660715R47612n521980
$$ -3877642 -765648 4928736 9241938 11239435 14384871 19045586 19993198 14471218
6912A4471218p493506m537078k282448j633507J442146N694775M566582j999126
$$ 14471218 6977712 2440634 158186 -1475321 -33175 5661600 10228182 8229056
6904H229056n571002k077046K329794K091764M81168J994647L853057J080411
$$ 8229056 2658054 581008 2910802 5002566 5483734 7478381 11331438 12411849
6896A2411849n291597j0475606j2100541r961789m223238K231960M641726L496235
$$ 12411849 7120252 -3355354 -15455895 -25417684 -29640922 -27408962 -22767236 -19271001
6888a9271001N326264J1971339J5275937Q503683k563649p145379l770621M21979
$$ -19271001 -13944737 -1973398 13302539 21806222 19242573 12097194 8326573 8748552
6880H748552J275338O16663j57153j656100k437365k76236K725055K301101r83034
$$ 8748552 10023890 10640553 10483400 8827300 6389935 6113699 8838754 11139855 10156821
6871A0156821k487988q84521O84323N67811L84523Q09516N00236o98373j738076
$$ 10156821 7668833 6784312 7468635 8036446 8420969 9230485 9730721 9032348 7294272
6862G294272k962960m561850l951392L45258M074394K463274j658025j829622
$$ 7294272 4331312 -230538 -4181930 -3836672 237722 2700996 1042971 -786651
6854g86651J319110J351015k441465l828391j040677J49243k404259k484559L151506
$$ -786651 532459 1883474 -557991 -4386382 -5427059 -5277816 -7682075 -10166634 -7015128
6845g015128P376341L421848l921065n591333j571993J296519J214683K402235
$$ -7015128 361213 3783061 -138004 -5729337 -7301330 -6004811 -4790128 -2387893
6837b387893N549990N688581O94903m577888m859452p60817L339213M337062J779386
$$ -2387893 3162097 8850678 9545581 4967693 108241 -652576 2686637 7023699 8803085
6828H803085k910433o806885p057855l687059K32041J984733J735883J196478
$$ 8803085 5892652 -914233 -7972088 -11659147 -11427106 -9442373 -7706490 -6510012
6820f510012J171639J407898J833631K475659K333044m0784l916179n621419k413494
$$ -6510012 -5338373 -3930475 -2096844 378815 2711859 2671075 -1245104 -6866523 -9280017
6811i280017L205671N576490K830712j101548k647164l141299m506883m178410
$$ -9280017 -6074346 -497856 2332856 1231308 -1415856 -4557155 -9064038 -13242448
6803a3242448Q56932P420797R316180O141199L154765K668807J773634p71649
$$ -13242448 -12385516 -4964719 4351461 10492660 13647425 16316232 18089866 17318217
6795A7318217j999561j022861j478460m575650n544401j146746M234199M752943
$$ 17318217 15318656 14295795 12817335 8241685 2697284 1550538 5784737 10537680
6787A0537680J331074j221520j906751k913080l758986j992756J098753J016957
$$ 10537680 11868754 10647234 8740483 5827403 2068417 75661 1174414 2191371
6779B191371l018910n985021l471179K623624O573933N490703J745653j061652
$$ 2191371 -827539 -6812560 -10283739 -7660115 -1086182 4404521 6150174 5088522
6771E088522k812582n672985q707188p458603j099099L967216K288334k029355
$$ 5088522 2275940 -3397045 -12104233 -19562836 -20661935 -16694719 -14406385 -16435740
6763a6435740j299976L502030M742045J436704N41980L553375K879727m079554
$$ -16435740 -17735716 -14233686 -9491641 -8054937 -7512957 -3959582 -1079855 -5159409
6755e159409q095876k444588N417188N406482J15779j472678J002393J631676
$$ -5159409 -13255285 -15699873 -10282685 -4876203 -4760424 -6233102 -5230709 -3599033
6747c599033N99692K394839M861734K013119l757793l953507J772155M770986
$$ -3599033 -2999341 -604502 4257232 6270351 2512558 -1440949 331206 5102192
6739E102192J436071k592183l410978l518708l744468j013505L336229L343493
$$ 5102192 6538263 3946080 535102 -2983606 -6728074 -7741579 -4405350 -1061857
6731a061857m93713m62311M431304N058043k000994o725980j518858N633610L756202
$$ -1061857 -1555570 -2017881 2413423 7471466 5470472 -1255508 -2774366 2859244 6615446
6722F615446l741708n527279k92563L386634J751344p23393j309879k319747m115594
$$ 6615446 2873738 -2653541 -2946104 440530 2191874 1468481 158602 -2161145 -6276739
6713f276739l502698l83508J042401p88890k447768j339113J034163K552314K857815
$$ -6276739 -9779437 -10162945 -9120544 -9909434 -12357202 -13696315 -12662152 -10109838 -7252023
6704g252023J743577o86772k004757K73175M194350N161209K381911l74241n32930
$$ -7252023 -5508446 -6195218 -8199975 -7926800 -3732450 1428759 3810670 3436429 2903499
6695B903499P44716J906602K875872L181692J944937R7320p31187j310126l140882
$$ 2903499 3648215 5554817 8430689 11612381 13557318 13654638 12923451 11613325 8472443
6686H472443m422906k355740Q95159R3776m548773o584143k823362J964198K447843
$$ 8472443 4049537 1693797 2588956 2682732 -1866041 -8450184 -11273546 -9309348 -6861505
6677f861505m09122l143100n359973p202670n724796O97172P298990Q034426M054374
$$ -6861505 -7270627 -10413727 -15773700 -22976370 -28701166 -28003994 -20705004 -12670578 -8616204
6668h616204J537304K121477J564377j725285l127922O19987N284693M674515
$$ -8616204 -7078900 -4957423 -3393046 -5118331 -8246253 -7626266 -2341573 2332942
6660B332942n77420m136579k684655O10936J556023K15030p88983n63711o6386
$$ 2332942 1755522 -2381057 -5065712 -4454776 -2898753 -2683723 -3472706 -4036417 -4102803
6651d102803O33107K302624L835477K430605k206911n915741m528195O42735M110048
$$ -4102803 -3469696 -1167072 2668405 5099010 2892099 -3023642 -7551837 -6909102 -2799054
6642b799054L009433L54471O42367M016705O429356M776171K01261l691219m622897
$$ -2799054 210379 564850 1207217 5223922 11653278 16429449 16630710 12939491 8316594
6633H316594l185830j404721n14803k06588K53275O49544J27197j159798j634125
$$ 8316594 5130764 3726043 3211240 3004652 3257927 3907471 4034668 2874870 1240745
6624A240745k01033K149543L691927M323196M950901M696504J085620n815170
$$ 1240745 1039712 3189255 6881182 11204378 16155279 20851783 21937403 16122233
6616A6122233j1571510j1944874q077028m576026l170598j384819K350776N760174
$$ 16122233 4550723 -7394151 -15471179 -20047205 -23217803 -24602622 -22251846 -16491672
6608a6491672O337227N005907M042717L534098K263369M96986m81577m76181p9286
$$ -16491672 -10154445 -5148538 -1105821 2428277 4691646 5188632 4707055 4230874 4151588
6599D151588M75141N35244j009241l137571k671024N50453J675911j994964n197544
$$ 4151588 4626729 5161973 4152732 1015161 -1655863 -1105410 570501 -1424463 -6622007
6590f622007j866549M435881M831481r91668l945694M8642M029403K288759j59654
$$ -6622007 -8488556 -4052675 778806 -212862 -4158556 -4109914 -80511 2208248 2048594
6581B048594K879079P010043L994671m184937p795522m195527o94532k105827
$$ 2048594 4927673 11937716 15932387 11747450 3951928 -243599 -938131 -3043958
6573c043958m436095l551046k064505k927673k515788L484385J1020438J1525119
$$ -3043958 -7480053 -11031099 -13095604 -16023277 -18539065 -15054680 -4034242 7490877
6565G490877L975860l188411l473670l51414p06293m190915m286256J225675O579239
$$ 7490877 11466737 8278326 4804656 4453242 3746949 -443966 -4730222 -3504547 3074692
6556C074692O361699K545497j88259j899725m979893p371911n093504m68105j88551
$$ 3074692 9436391 11981888 11793629 9893904 4914011 -2457900 -7551404 -8019509 -8208060
6547h208060m239063m583836K280927R008045Q110408K219218j943505l586830
$$ -8208060 -12447123 -17030959 -14750032 -5741987 2368421 4587639 2644134 -942696
6539i42696n002530m232560J105032O565748O197527K481498K226330M668242
$$ -942696 -5945226 -10177786 -9072754 -2507006 3690521 6172019 8398349 13066591
6531A3066591L187189k140810l933833r0906L087717K259474J592313K892630
$$ 13066591 16253780 14112970 10179137 10088231 13175948 15435422 17027735 19920365
6523A9920365J091729n586624r939037o376492K85224K838917J567904k80451
$$ 19920365 21012094 15425470 5486433 -890059 -604835 2234082 3801986 3521535
6515C521535l761018r117754r818425j204387R311233J0589180L605163q26613
$$ 3521535 -239483 -9357237 -19175662 -20380049 -11068816 -479636 3125527 2298914
6507B298914J411684L684204J377263j351398l16349J705949R13860j004253p82600
$$ 2298914 3710598 7394802 8772065 7420667 7104318 8810267 9724127 8719874 7937274
6498G937274O73149O70208n17447r31139m82361l27596p36635j730558l711240
$$ 7937274 8610423 9280631 8763184 7832045 7349684 7022088 6285453 4554895 843655
6489H43655n672896n210451k226593j54825j270547l100162k122985Q38763J995830
$$ 843655 -4829241 -10039692 -12266285 -12421110 -13691657 -16791819 -18914804 -18076041 -16080211
6480a6080211L95593p41079J259470M797624O051979L588999k86473k616514l058912
$$ -16080211 -15684618 -16425697 -15166227 -10368603 -4316624 -727625 -1014098 -3630612 -6689524
6471f689524l193989l407535k554357r46080q51069k362490j694278L229857P881517
$$ -6689524 -9883513 -13291048 -15845405 -16791485 -17642554 -20005044 -21699322 -18469465 -10587948
6462a0587948O374075M43119k155139J429975N316948L805990j081203m150837
$$ -10587948 -4213873 -3770754 -5925893 -4495918 821030 4627020 3545817 -605020
6454f05020m595074m546682l450123N96433N335897N784642J589088j721272k57938
$$ -605020 -5200094 -9746776 -13196899 -12600466 -7264569 -1479927 109161 -1612111 -1870049
6445a870049L265549M179203K254616L96171r28948l868162p860468q195833k186947
$$ -1870049 1395500 5574703 7829319 8225490 7296542 3428380 -4432088 -12627921 -14814868
6436a4814868N671747Q079116L729769j751547l923433m402860n646602n303615
$$ -14814868 -9143121 -1064005 2665764 914217 -3009216 -7412076 -13058678 -18362293
6428a8362293m32692N470665N902726J232321j348095J125714L026536k45516
$$ -18362293 -18794985 -13324320 -7421594 -6189273 -7537368 -6411654 -3385118 -3630634
6420c630634m700308m759363k395257k625698l792221l61920O307803Q497614
$$ -3630634 -8330942 -13090305 -15485562 -18111260 -21903481 -22265401 -15957598 -7459984
6412g459984L944529p60185n30997J816678K573912L358627N602562N131446j351513
$$ -7459984 -3515455 -4275640 -4806637 -2989959 -416047 2942580 8545142 13676588 12325075
6403A2325075q797594r685970m554071j22540Q80989J143403J421510p70369m878375
$$ 12325075 3527481 -6158489 -10712560 -10835100 -9954111 -8810708 -7389198 -8159567 -13037942
6394a3037942o499837l912544L75030M934571R727522J0885490L659633p274309
$$ -13037942 -19537779 -23450323 -23075293 -18140722 -8413200 2472290 6131923 -1142386
6386a142386r696919n30755Q217232O405093j57122j127296J158653k196183q974943
$$ -1142386 -10839305 -11370060 -3152828 3252265 3095143 1967847 3126500 930317 -8044626
6377h044626q472472j03595M841022J532938j648804J587173N909652N808407
$$ -8044626 -16517098 -16620693 -11779671 -10246733 -11895537 -10308364 -4398712 1409695
6369A409695N045296P125700O648699m89856o897976m348018K141930K323861
$$ 1409695 6454991 13580691 20229390 19739534 12841558 8493540 10635470 12959331
6361A2959331k408429k589031K160348K840468k662449o165990l888837k187464
$$ 12959331 10550902 7961871 10122219 12962687 10300238 4134248 245411 -1942053
6353a942053m709298n253207N06542N940650L803204j845854k440632J733291
$$ -1942053 -6651351 -11904558 -11398016 -5457366 -1654162 -3500016 -5940648 -4207357
6345d207357L529862R31123j251946l42852P74000n86641l156971m280881k449242
$$ -4207357 -677495 253628 -998318 -1341170 -567170 -1153811 -4310782 -8591663 -11040905
6336a1040905K467184Q185572J0172292O434480J087047n93108O51213J90051
$$ -11040905 -8573721 -388149 9784143 16218623 17305670 16712562 17363775 17553826
6328A7553826k389375k815600O3138J739097q01523m150021l562596M61836L668482
$$ 17553826 15164451 12348851 12411989 14151086 13349563 9199542 5636946 6098782 9767264
6319I767264L590477P37130l722911q255244r944327o380843R39597O930202P379746
$$ 9767264 13357741 14094871 10371960 2116716 -7827611 -14208454 -13268857 -6338655 1041091
6310A041091K639994k914539m553701r23197M861962P930762O073741J386433
$$ 1041091 3681085 766546 -3787155 -4710352 151610 8082372 14156113 15542546
6302A5542546k562480m305177m560485l864192j834410J274873L970466N166990
$$ 15542546 12980066 8674889 4114404 250212 -1584198 -309325 3661141 8828131
6294H828131N246250M618059K439448j714762n700402o424130l668770k73705
$$ 8828131 14074381 18692440 21131888 19417126 13716724 7292594 3623824 3350119
6286C350119J815398L216810L965836J940588k959916n860135k322143M596545
$$ 3350119 5165517 8382327 12348163 14288751 11328835 5468700 3146557 7743102
6278G743102P329853L673436j180363l242044m947642r107671j2497371j0112356
$$ 7743102 15072955 18746391 17566028 14323984 9376342 268671 -12228700 -22341056
6270b2341056l052103K684803M174705M076898N304707O867689N938564J835208
$$ -22341056 -25393159 -22708356 -18533651 -14456753 -9152046 -2284357 3654207 5489415
6262E489415k943947m841992k693796M17385J63981l279962m752663j022872M519483
$$ 5489415 2545468 -2296524 -4990320 -4572935 -4408954 -7688916 -12441579 -13464451 -8944968
6253h944968O726514N470673L884694K304315j170967n349898o321862l070023
$$ -8944968 -2218454 3252219 7136913 9441228 8270261 2920363 -3401499 -6471522
6245f471522J670255N893711R115937R141168L664380m243327p984843o259737
$$ -6471522 -4801267 1092444 10208381 19349549 23013929 18770602 10785759 4526022
6237D526022m413297n114121m062767J510797O316737M485232j047369k979822
$$ 4526022 112725 -5001396 -9064163 -7553366 -1236629 3248603 2201234 -778588
6229g78588m83132R96024p11096j745934N70331L362690K820908n20516k968150
$$ -778588 -1261720 -265696 -976792 -2722726 -2152395 1210295 4031203 3510687 542537
6220E42537j968675J816649N214413N024692J112436l215616m946800m354640
$$ 542537 -1426138 390511 5604924 10629616 11742052 8526436 3579636 -775004
6212g75004l009192r02179K026689L569789J882598q86409j187053O24617J245161
$$ -775004 -3784196 -4686375 -2659686 910103 2792701 1906292 719239 1343856 2589017
6203B589017k052n25907P43968J861660J498148N02169n45077j958440k943125
$$ 2589017 2586965 2061058 2805026 4666686 6164834 6667003 6121926 4163486 1220361
6194A220361k440483j936137l463623m894871k092834L656055N896379K399102
$$ 1220361 -1220122 -3156259 -6619882 -11514753 -13607587 -9951532 -4055153 -1656051
6186a656051j335444p49781J173120O3460k105774q56591K867606M533251L473415
$$ -1656051 -2991495 -3741276 -2568156 -2504696 -4610470 -5467061 -2599455 1933796 5407211
6177E407211K636057K279107m7631l438874l486356N51271L451795J146303l611907
$$ 5407211 8043268 10322375 10274744 6835870 3349514 3900785 7352580 8498883 4886976
6168D886976n275827k610282Q18376J712713K56030j202969r41171Q52223K689428
$$ 4886976 -388851 -2999133 -2180757 -468044 -212014 -1414983 -2356154 -1503931 1185497
6159A185497L133233J593349j443805m005817l107778K167105P767064P661940
$$ 1185497 4318730 5912079 4468274 462457 -2645321 -478216 7288848 14950788
6151A4950788J265190m715168m093827J379744N054997L659033o47651m555532
$$ 14950788 16215978 11500810 7406983 8786727 13841724 17500757 16853106 12297574
6143A2297574o081712m040976P95023M507555L832989P52196m23787L19403l67772
$$ 12297574 6215862 2174886 2969909 7477464 11310453 12062649 11638862 11958265 11590493
6134A1590493k237380j360330K067950K205125l275731q180907o414157j296896
$$ 11590493 9353113 7992783 10060733 12265858 8990127 809220 -5604937 -6901833
6126f901833p71376n679505q554267l954239M532230Q760278M786543l884042
$$ -6901833 -7673209 -13352714 -21906981 -25861220 -21328990 -12568712 -7782169 -11666211
6118a1666211j0060348q950618j517129P107415J1977183J1146784N703862r60354
$$ -11666211 -21726559 -30677177 -32194306 -25086891 -13109708 -1962924 3740938 2780584
6110B780584m526429l124388L63161J831682J691210L581763P016269O220044
$$ 2780584 -1745845 -4870233 -4507072 -2675390 -984180 2597583 9613852 15833896
6102A5833896j190671q858174r168333l084644K019187K342839O31079L2211o06
$$ 15833896 14643225 5785051 -3383282 -6467926 -4448739 -2105900 -1474821 -1442610 -1443216
6093a443216p36150r56758J164586M722875O316702L540995j979039n382378l486938
$$ -1443216 -2179366 -3136124 -1971538 2751337 9068039 12609034 10629995 5247617 1760679
6084A760679J225086L523024K326755J415839K387399J413772m055525r578949
$$ 1760679 2985765 6508789 8835544 10251383 12638782 14052554 9997029 418080
6076D18080r263795m001052Q32290L398251N377871N780531J726167m521811o220073
$$ 418080 -8845715 -12846767 -12014477 -8616226 -3238355 2542176 4268343 -253468 -6473541
6067f473541j692718K717882J962999p19937J31357L432701L730220j08026l296940
$$ -6473541 -8166259 -5448377 -3485378 -4205315 -4073958 -641257 3088963 2980937 -316003
6058c16003k119050J212416J888035j324073m868007m969574k004152P24217J824389
$$ -316003 -2435053 -1222637 665398 -658675 -5526682 -10496256 -12500408 -11776191 -9951802
6049i951802L164032N740156O954041M332052L7462j321286J497519N236833N985285
$$ -9951802 -6787770 -1047614 5906427 10238479 10275941 8954655 10452174 15689007 21674292
6040B1674292K146505m842159j0397770r546853k859603K679822K226022m50102
$$ 21674292 23820797 18978638 8580868 -965985 -3825588 -1145766 1080256 630154
6032F30154M51627L335538L050080J075130K955928O752337M331198m493180r593693
$$ 630154 1081781 4417319 7467399 8542529 11498457 18250794 22581992 18088812 8495119
6023H495119n883194r60330j843495l573511R40713P463258O742542n48417n270003
$$ 8495119 2611925 1651595 -191900 -3765411 -2824698 4638560 11381102 10832685 5562682
6014E562682l819747j262415j144448q74206J642674L928408L622643K027718
$$ 5562682 1742935 480520 -663928 -1538134 104540 4032948 7655591 9683309
6006I683309R44141j58252k091538l783713l348992N2117N030887P559062L909706
$$ 9683309 10627450 10469198 8377660 4593947 1244955 1297072 6327959 13887021 17796727
5997A7796727l880634q367358n583394l81816R65204k02983J242340M653875M907457
$$ 17796727 13916093 5548735 -34659 -416475 548729 345746 1588086 6241961 11149418
5988A1149418J562321p12905n77758j650248m936514o418565l833176M0489K480374
$$ 11149418 12711739 11998834 11421076 9770828 4834314 -1584251 -5417427 -5376938 -2896564
5979b896564L593324K553485k701439r557312j0585166l041642O258021R320173
$$ -2896564 696760 3250245 548806 -9008506 -19593672 -22635314 -16377293 -7057120
5971g057120O230453K488639R22961L54591m78112j658187l098038l911436k362331
$$ -7057120 -826667 1661972 2584933 2939524 2461412 803225 -2294813 -6206249 -8568580
5962h568580J411115M510017M873564L516758J721250r57259l956734m479356
$$ -8568580 -7157465 -2647448 2226116 5742874 7464124 6506865 2550131 -1929225
5954a929225j790148M55667n71362k312609j224595R91017J94430k901503l373137
$$ -1929225 -3719373 -3263706 -3835068 -6147677 -7372272 -6381255 -6186825 -9088328 -12461465
5945a2461465K92139M073467M822751M494926N868984P377602N535698J065652
$$ -12461465 -12169326 -8095859 -3273108 1221818 7090802 14468404 20004102 21069754
5937B1069754j053743J678159N325926M366944j241644o764376r467083j0503965
$$ 21069754 20016011 21694170 27020096 31387040 30145396 23381020 13913937 3409972
5929C409972r685167m013805N357105J0188046N195667k750428l061256L077475
$$ 3409972 -6275195 -10289000 -4931895 5256151 10451818 7701390 4640134 7717609
5921G717609M603384k078137p761545n577188j576053l560165p112610k154017
$$ 7717609 12320993 10242856 2481311 -3095877 -4671930 -8232095 -15344705 -17498722
5913a7498722J0298424J7451690J1000579k990650j2170062j1114565m393075
$$ -17498722 -7200298 10251392 21251971 18261321 6091259 -5023306 -9416381
5906i416381O32964J584402J702903L602436M591607J119298l513074j679208
$$ -9416381 -8783417 -7199015 -5496112 -1893676 2697931 3817229 304155 -1375053
5898a375053O969380J2833426R053903Q97972l064824l724300p583031j3637187
$$ -1375053 5594327 18427753 27481656 28379628 25314804 21590504 14007473 370286
5890C70286j3443109m257896O108961R564621O524892K067642j263489l577958
$$ 370286 -13072823 -17330719 -11221758 -1657137 4867755 6935397 5671908 2093950
5882B093950m452881l200346o49367J448009J929692O89422j043739j182254O58420
$$ 2093950 -2358931 -5559277 -6208644 -4760635 -2830943 -2141521 -3185260 -4367514 -3709094
5873c709094J817267J65601j940337l73891M692039Q722857Q498960M632533j011777
$$ -3709094 -1891827 -1726226 -3666563 -4040454 651585 9374442 17873402 22505935 21494158
5864B1494158o578982r103548o428357j050412J623484j90265k985417l229298
$$ 21494158 14915176 5811628 -616729 -1667141 -43657 -233922 -3219339 -6448637
5856f448637q23965K994695P109099Q965838N910392r5384k928705J85071M691192
$$ -6448637 -7272602 -4277907 2831192 11797030 17707422 17612038 14683333 14868404 19559596
5847A9559596M521466o53776o039983p351529m067978Q78417L217190J094376
$$ 19559596 24081062 23427286 17387303 10035774 5967796 6846213 10063403 11157779
5839A1157779k357296k418624Q78595K987258J921348P53246J325514K68186n119218
$$ 11157779 8800483 6381859 7260454 10247712 12169060 12922306 14247820 14516006 9396788
5830I396788j0758992j0254693l570735L002059M711188K610437L54775j09247
$$ 9396788 -1362204 -11616897 -15187632 -12185573 -7474385 -4863948 -4509173 -4618420
5822d618420O90364J168292M09986o04147Q3923K648992M797527M632493K693731
$$ -4618420 -3928056 -2759764 -2349778 -2953925 -2870002 -221010 4576517 9209010 11902741
5813A1902741L14379j993110l287985j863174J754280L757217J695104j671971
$$ 11902741 12217120 10224010 6936025 5072851 6827131 10584348 12279452 10607481
5805A0607481k146653k71228k44328l218484n301602l067223J581295L598298
$$ 10607481 8460828 8189600 7945272 4726788 -574814 -3642037 -2060742 1537556
5797A537556P74796l567657l903564J472818Q037549R608308N218597k49750k466847
$$ 1537556 2312352 -1255305 -5158869 -3686051 4351498 13959806 19178403 18928653 16461806
5788A6461806k117718j841387j688131k77567J552536J460149r10797l812413
$$ 16461806 14344088 12502701 10814570 10537003 12089539 13549688 12638891 8826478
5780H826478o052103p309096o613056l351440M98883J948998J004030O40151K436225
$$ 8826478 2774375 -4534721 -11147777 -14499217 -14000334 -12051336 -11047306 -10407155 -7970930
5771g970930M533085M554323K518001m286k009339l453648m669177o045933p448136
$$ -7970930 -3437845 1116478 3634479 3630193 1620854 -1832794 -6501971 -12547904 -19996040
5762a9996040p660488n310015n63841M752684Q535318R205535O015495K27662
$$ -19996040 -27656528 -32966543 -33530384 -28777700 -20242382 -11036847 -5021352 -4793690
5754d793690m415613m502098o70710L035443L861150K742284J639970N90806j237154
$$ -4793690 -9209303 -13711401 -14382111 -11346668 -7485518 -4743234 -3103264 -2512458 -3749612
5745c749612l187855l786371l028271k133340j334896J25901J717467J671266
$$ -3749612 -6937467 -10723838 -13752109 -15885449 -17220345 -17094444 -15376977 -13705711
5737a3705711L17960Q88785M650966P332783M292227j640369k718787K213992
$$ -13705711 -13387751 -12498966 -7848000 -515217 3777010 2136641 -582146 1631846
5729A631846M738366q42788p829270o423497J182635M052211j99947j731941N173231
$$ 1631846 6370212 5527424 -2301846 -8725343 -7542708 -3490497 -3690444 -5422385 -249154
5720b49154J2010493Q691224j248793o451114m015524r97749j899663l528759
$$ -249154 11761339 20452563 19203770 12752656 8737132 7739383 5839720 2310961
5712B310961k386768M96962L353721N918407O528425K895963k704190m835224
$$ 2310961 -75807 421155 3774876 9693283 16221708 19117671 16413481 11578257
5704A1578257l193406l258291o238913n514166K120755Q207161L089870r180637
$$ 11578257 8384851 5126560 -1112353 -6626519 -4505764 3701397 6791267 -2389370
5696b389370j4759450p943693K576785O679364N010122M528651O851623O646511
$$ -2389370 -17148820 -25092513 -22515728 -15836364 -10826242 -6297591 554032 7200543
5688G200543M36725p654200j0393452n591367J895209N866032N161969L630358
$$ 7200543 7637268 -16932 -10410384 -16001751 -14106542 -8240510 -3078541 551817
5680E51817M370339N736383M047535r49712n304243n596896k734501k43760K4085
$$ 551817 4922156 10658539 14706074 13756362 8452119 2855223 120722 -123038 -98953
5671i8953o62827k41238J521163K901472K180495m89840l067934l596406k347227
$$ -98953 -761780 -1003018 518145 3419617 5600112 5110272 2042338 -1554068 -3901295
5662c901295j661707l225234n786692o311402l457884Q16320L443428L454221
$$ -3901295 -5563002 -8788236 -14574928 -20886330 -24344214 -23527894 -20084466 -16630245
5654a6630245K531984K783854M490317N907179N045281J888186j165549j682911
$$ -16630245 -14098261 -11314407 -6824090 -916911 4128370 6016556 4851007 3168096
5646C168096K0527J491117J438094O20496q01933l835615o939903n296947K397716
$$ 3168096 3188623 4679740 6117834 6738330 5936397 2100782 -4839121 -10136068 -7738352
5637g738352R139330P102052j210869n628617k486317R50717j401907n346210
$$ -7738352 1400978 8503030 7292161 1663544 -822773 127944 -1273963 -6620173
5629f620173m556036j543576k912263p423099p361490q54883N212572N581294
$$ -6620173 -11176209 -12719785 -15632048 -23055147 -30416637 -31271520 -26058948 -20477654
5621b0477654K939861J770039J913310J304162K42115m86336j923022m022428
$$ -20477654 -17537793 -15767754 -13854444 -12550282 -12308167 -12794503 -14717525 -18739953
5613a8739953l715587N80990N192156N596600K702825J178431K848265N180194
$$ -18739953 -22455540 -21874550 -16682394 -11085794 -8382969 -7204538 -4356273 823921
5605H23921N650052M464703K953540J700752N66777r61654l305373n594901n823895
$$ 823921 6473973 10938676 13892216 15592968 16159745 15198091 11892718 6297817 473922
5596D73922l604736j551548j897607k806068o99066M113036O994509M754847n25260
$$ 473922 -3130814 -4682362 -6579969 -9386037 -10085103 -5972067 1022442 5777289 5252029
5587E252029m521885n622726n318263m880305l628249n97171L413304O306042
$$ 5252029 730144 -4892582 -10210845 -15091150 -18719399 -19316570 -15903266 -9597224
5579i597224O912412O031347M995224L809230J528511j709099m130609m194346
$$ -9597224 -2684812 3346535 8341759 12150989 13679500 11970401 7839792 3645446
5571C645446k154203O58217L068101L778212J073830n269440j1734109j2607253
$$ 3645446 1491243 2149460 5217561 8995773 10069603 4800163 -6933946 -19541199
5563a9541199n317921N957299J3124303J1298370L118177m099616n175676q84909
$$ -19541199 -24859120 -18901821 -5777518 5520852 8639029 4539413 -636263 -1521172
5555a521172M130181N888800L621507l74394k465888p20155K444514J982134l606495
$$ -1521172 2609009 8497809 12119316 11744922 9279034 8558879 11003393 12985527 9379032
5546I379032r111788q240655j682737L707185L948060K372349L390422N406769
$$ 9379032 267244 -7973411 -9656148 -5948963 -2000903 371446 3761868 9168637
5538I168637L494562k605631p176043n590799J22229L929375K400396k340707
$$ 9168637 12663199 10057568 2881525 -2709274 -2587045 1342330 3742726 1402019
5530A402019n302484l483458J386658M595947L502648P46438J120625M972670
$$ 1402019 -3900465 -7383923 -5997265 -1401318 2101330 2847768 3968393 8941063
5522H941063O802750K188996n591110r041024o159017k623548k880100l530656
$$ 8941063 15743813 17932809 12341699 3300675 -2858342 -5481890 -8361990 -11892646
5514a1892646L79532N945582N695809n74946m583882k082953M65316l730107j0488176
$$ -11892646 -11513114 -5567532 128277 -446669 -5030551 -7113504 -6648188 -10378295 -20866471
5505b0866471j0367226k340293N345500O674079L574891L80640j013768K49647
$$ -20866471 -31233697 -33573990 -28228490 -21554411 -17979520 -17598880 -18612648 -18363001
5497a8363001M155209P132646M870540m57162j607332K735107M757773o00634
$$ -18363001 -14207792 -7075146 -2204606 -2661768 -4269100 -1533993 3223780 2623146
5489B623146o620069l961974N132259R206584K984105o303006q908795l805200
$$ 2623146 -3996923 -7958897 -2826638 6379946 9364051 3061045 -5847750 -9652950
5481i652950K139335L007524n49345l533514k944691j109817j867215m327509
$$ -9652950 -7513615 -4506091 -5055436 -8588950 -11533641 -12643458 -14510673 -18838182
5473a8838182l598223J562158N964929N481103L245407M137282O565737N566262
$$ -18838182 -22436405 -20874247 -14909318 -9428215 -6182808 -2045526 4520211 10086473
5465A0086473J830595O19028K068674K11046o387480j0184439n161742L628575
$$ 10086473 11917068 12536096 14604770 14815816 8428336 -1756103 -6917845 -3289270
5457c289270O513065J778649l885507n517188m498062l381266j854043N99338
$$ -3289270 3223795 5002444 1116937 -4400251 -8898313 -12279579 -14133622 -13534284
5449a3534284K406847K544537K329373K529235J600682r18786k228809n12568
$$ -13534284 -11127437 -8582900 -6253527 -3724292 -2123610 -3042396 -5271205 -5783773
5441e783773J343596K23357j252352J645476P231051Q526964L540307j665781
$$ -5783773 -4440177 -4216820 -5469172 -3823696 3407355 11934319 15474626 13808845
5433A3808845k191591o22266q83608j707017j042898j562706n388283p828312
$$ 13808845 11617254 10994988 10111380 8404363 7361465 5798759 410476 -7417836
5425g417836m039144J433973N97635m572050m671750J385602M165302l29237l491195
$$ -7417836 -11456980 -10023007 -9425372 -13997422 -18669172 -17283570 -13118268 -13447505 -16938700
5416a6938700J747877R201079R309593L309649p93854p86870q6949Q19825L709102
$$ -16938700 -15190823 -5989744 3319849 6629498 5835644 5048774 4961825 5781650 9490752
5407I490752N788210K432043l967695n926211j962612J325403q08260n538469
$$ 9490752 15278962 17711005 13743310 7817099 5854487 7179890 6371630 833161
5399H33161p958327o764048l013268J914795N573752N775799L846636K912139
$$ 833161 -7125166 -13889214 -16902482 -14987687 -9413935 -3638136 208500 3120639
5391C120639K548121n57793n960100q250812m294207K192034N322053L500007
$$ 3120639 5668760 5110967 -849133 -9099945 -13394152 -11202118 -5880065 -2380058
5383b380058k49304j992578Q482L813389N214661K631463l20941R5792J818616
$$ -2380058 -2629362 -4621940 -4613458 -800069 4414592 7046055 6725114 6820906 8639522
5374H639522L66987l381238m434172k177639j180910k733856k286032K378312
$$ 8639522 9006509 5625271 1191099 -986540 -2167450 -4901306 -7187338 -4809026
5366d809026O580649N759441J979664j44737K99867J743700L373969L675939N1505
$$ -4809026 1771623 7531064 9510728 9365991 9665858 11409558 14783527 18459466 18510971
5357A8510971o123832q312520l397308K434069J860181k895443m046034n49810
$$ 18510971 12387139 4074619 677311 3111380 4971561 2076118 -1969916 -2519726
5349b519726J165053j556065l550679j205917J242710p16513l330138P440P338031
$$ -2519726 -1354673 -2910738 -6461417 -7667334 -6424624 -7141137 -10471275 -10463835 -3125804
5340c125804R257757K160252n951274o216020p85597J274257k685479o200034
$$ -3125804 6131953 8292205 2340931 -3875089 -4660686 -3386429 -6071908 -12271942
5332a2271942m316508j80564J508255J645976K884519L392807L39952l437773
$$ -12271942 -16588450 -16769014 -15260759 -13614783 -10730264 -7337457 -6997505 -10435278
5324a0435278k726434J534031L345314R44327j118684K15863K402130K439507
$$ -10435278 -13161712 -11627681 -8282367 -7338040 -8456724 -8240861 -5838731 -3399224
5316c399224J142067L86419J58921J5012J12429j72234j439098k018137k58556
$$ -3399224 -2257157 -1870738 -1711817 -1696805 -1584376 -1756610 -3195708 -5213845 -5472401
5307e472401J559797L35284j755955l56789K533614P66262m763914n958319o95425
$$ -5472401 -3912604 -3577320 -5333275 -5690064 -3156450 -2390188 -7154102 -13112421 -13807846
5298a3807846L101128M05926l190192k109970M7834q37022l06945N858480J1083302
$$ -13807846 -10706718 -10300792 -13490984 -15600954 -15553120 -16390142 -16697087 -10838607 244695
5289B44695P188228j194547l161492R80658J198522m634571p357416k199611L944857
$$ 244695 7432923 6238376 3076884 4057542 5256064 621493 -6735923 -8935534 -4990677
5280d990677M457023K033594J130902L11606k064964k060235L033860P707551
$$ -4990677 -533654 1499940 2630842 2942448 877484 -1182751 1851109 9558660
5272I558660N364048j272328m146939k203545k361786p942606j2727821r404124
$$ 9558660 14922708 13650380 9503441 7299896 4938110 -3004496 -15732317 -25136441
5264b5136441K02761P242543O749601K749679J763343M242396N291879K570488
$$ -25136441 -24933680 -17691137 -10941536 -8191857 -6428514 -2186118 3105761 5676249
5256E676249o10241r99682k65171j468750l850340m809071m696402n197091m601389
$$ 5676249 5066008 4066326 3801155 2332405 -1517935 -6327006 -11023408 -16220499 -20821888
5247b0821888m2555N877870O483421N06575m984864l912985P60571K068639q53180
$$ -20821888 -20864443 -14986573 -8503152 -7996577 -12981441 -16894426 -16133855 -14065216 -14918396
5238a4918396k331880J088409N860404O534605K746715r62700j099340J085694
$$ -14918396 -17250276 -16161867 -10301463 -3766858 -1020143 -1982843 -3082183 -1996489
5230a996489J950003n6698l194667m883335m183015k108829m70086k81863o35272
$$ -1996489 -46486 -103184 -3297851 -8181186 -12364201 -14473030 -14943116 -15224979 -15860251
5221a5860251L63541K842489M536263M172824L759385N177669O268859L761582
$$ -15860251 -15496710 -12654221 -8117958 -3945134 -185749 4991920 11260779 15022361
5213A5022361j131285m154299m297232m075783m053369k449156k72010p95107
$$ 15022361 13891076 9736777 5439545 1363762 -2689607 -5138763 -5410773 -6205880
5205f205880l063998k332079J679042L905468L106582L902354O799521N267175
$$ -6205880 -9269878 -11601957 -9922915 -6017447 -2910865 991489 7791010 13058185
5197A3058185k444412p909313n626878k315646m606873o512518k72430Q026010
$$ 13058185 10613773 2704460 -2922418 -5238064 -9844937 -16357455 -16629885 -8603875
5189h603875P096710n93464l131383N16429m3949o926633r289884j691563O731254
$$ -8603875 -1507165 -2100629 -5232012 -4715583 -4759532 -11686165 -20976049 -22667612 -15936358
5180a5936358O913849K135838o17190j642637l808555m789962j399145L738876
$$ -15936358 -9022509 -6886671 -7503861 -9146498 -12955053 -17745015 -19144160 -15405284
5172a5405284N921680M739904K458510J54111j228154k79383J713955J379963
$$ -15405284 -9483604 -4743700 -2285190 -2131079 -3359233 -3638616 -1924661 -544698
5164e44698j173597k336700j574794j930124l013007r02372L375703L639824n89334
$$ -544698 -1718295 -4054995 -5629789 -7559913 -10572920 -11475292 -8099589 -4459765 -5049099
5155e049099j928869K466005N559673K563796o88830J894378O118374M997172
$$ -5049099 -6977968 -4511963 1047710 3611506 2922676 4817054 10935428 15932600
5147A5932600j1841l176677m137432n532250n925078k860104J014654J856560
$$ 15932600 15920759 12744082 8606650 3074400 -2850678 -5710782 -4696128 -2839568
5139b839568Q78260N49754q85318m656620o187263j779086M028484N253642M044584
$$ -2839568 -1961308 -1411554 -2296872 -6953492 -13140755 -14919841 -10891357 -5637715 -1593131
5130a593131N436579P091384L562658k498525l235963J864218N344960K990120
$$ -1593131 3843448 10934832 14497490 11998965 8763002 10627220 15972180 18962300
5122A8962300k311631p065566r825377q234022j233747O133341P485190M297841
$$ 18962300 16650669 9585103 -240274 -8474296 -9708043 -3574702 3910488 8208329
5114H208329L322701N645272N987610K520240o91262j482558k054786k801973
$$ 8208329 11531030 17176302 23163912 25684152 24992890 23510332 21455546 18653573
5106A8653573j335588J007362p31616o443921r433155o202153j408643k04520
$$ 18653573 17317985 18325347 17593731 11149810 1716655 -4485498 -5894141 -6098661
5098f098661j427500j553031l16188R35006K293678L555418K801836n30848l769474
$$ -6098661 -7526161 -9079192 -9395380 -8460374 -6166696 -2611278 190558 -340290 -4109764
5089d109764m210709k087981P65787L036837M088187M015745L629075K835801
$$ -4109764 -8320473 -10408454 -9642667 -6605830 -2517643 1498102 5127177 7962978
5081G962978L50737l081766l901515j267827J92638k229052l245836K469076R767421
$$ 7962978 8313715 5231949 1330434 62607 255245 -1973807 -5219643 -2750567 7016854
5072G016854R061193R68386m580431l546914k039530l964745m701142p98239L151837
$$ 7016854 16078047 17046433 12466002 8919088 6879558 2914813 -1786329 -2584568 567269
5063E67269K475916k64451j345662k575081n842552o677632k69226R554231J3790896
$$ 567269 3043185 2778734 1433072 -1142009 -6984561 -13662193 -13931419 -4377188 9413708
5054I413708Q987477j94245p399932r542355o984140k548644M90140J810406M066812
$$ 9413708 18401185 18206940 10807008 1264653 -5719487 -8268131 -7777991 -5967585 -1900773
5045a900773P905932R588150O123539L54194k286961o68829J362724O09824j695757
$$ -1900773 6005159 15593309 21716848 22071042 19784081 19115252 20477976 21087800 19392043
5036A9392043k201532k70363O38956k699334p993023r052473l937501J694549
$$ 19392043 17190511 16920148 17559104 14859770 6866747 -2185726 -6123227 -4428678
5028d428678K177014m96363q27833J324867J762557l7168l89772J561182K503722
$$ -4428678 -2251664 -2748027 -3575860 -2250993 -488436 -525604 -915376 645806 3149528
5019C149528J016558o29995j177704j682071j946834q00173K80459q72752k263181
$$ 3149528 4166086 3536091 2358387 676316 -1270518 -2070691 -1790232 -2662984 -4926165
5010d926165o54233J923577J420536n6884K300084N593659K493271m755901m965665
$$ -4926165 -5580398 -3656821 -2236285 -2293169 6915 5600574 8093845 3337944 -1627721
5001a627721M755162J3434647J2009932M365901k032664o150912q309518n444346
$$ -1627721 3127441 16562088 28572020 32937921 30905257 24754345 16444827 11000481
4993A1000481J263487L272567k856309q297900n422070k6274q92217n071091m355744
$$ 11000481 12263968 15536535 12680226 4382326 -1039744 -1066018 -1958235 -7029326 -11385070
4984a1385070M944P12202k019932k026955N51985l353l370927l144656J453026
$$ -11385070 -11380126 -10667924 -12687856 -14714811 -14162826 -14166179 -17537106 -20681762 -19228736
4975a9228736L686153N21405k727597j203058K768611M229841K036874j189350
$$ -19228736 -15542583 -15021178 -17748775 -18951833 -16183222 -11953381 -9916507 -11105857
4967a1105857k306286n0020L559207M808119L035134J596033K159984J778092
$$ -11105857 -13412143 -13462163 -9902956 -5094837 -2059703 -463670 1696314 3474406
4959C474406j360056l743063k376559l58840j445567l084333o47149M651358P684161
$$ 3474406 2114350 -1628713 -4005272 -4364112 -5809679 -8894012 -9541161 -4889803 2794358
4950B794358O512317K736512k061576n754458n410759k058099j150489l878492
$$ 2794358 9306675 12043187 9981611 4227153 -1183606 -3241705 -4392194 -8270686
4942h270686l926388J793830O288858L541003q25030J019977N597800M664245
$$ -8270686 -12197074 -10403244 -4114386 -573383 -1398413 -378436 5219364 9883609
4934I883609j11252p17438K664036K727940j421553l414293j423514r0807r86067
$$ 9883609 9772357 9054919 11718955 14446895 13025342 9611049 8187535 8096728 7110661
4925G110661j087314n14089k320679m883015l616409J16584O67016j964330k545073
$$ 7110661 6023347 5509258 3188579 -1694436 -5310845 -5194261 -4527245 -6491575 -9036648
4916i036648m9042J959504L054309N227752O091921J987334l818334n247730l522626
$$ -9036648 -9085690 -7126186 -4071877 1155875 7247796 9235130 5416796 169066 -3353560
4907c353560l663566l955620K91490N407806L719690k807223n207078j990789
$$ -3353560 -7017126 -10972746 -10681256 -5273450 -1553760 -4360983 -9568061 -11558850
4899a1558850P25875J300068K825193M104949K503963K008175N842801O741425
$$ -11558850 -10832975 -9532907 -6707714 -2602765 -98802 1909373 7752174 14493599
4891A4493599j069974p720381k877124L658477k144724j1039352m971978Q708526
$$ 14493599 13423625 5703244 2826120 6484597 4339873 -6699479 -11671457 -2962931
4883b962931Q262884k767548j964677R045350Q036342j784606M479363J9986598
$$ -2962931 5299953 2532405 567728 9613078 17649420 15864814 20344177 40330775
4875D0330775J2481869l118647L3424624J18493674J47132008M7833531r7601959
$$ 40330775 52812644 49693997 83118621 201612295 348744303 396577834 298975875
4868B98975875j47667743q3302438j2345032o382936k4638009j2285652J2647826
$$ 298975875 151308132 68005694 55660662 49277726 24639717 12354065 25001891
4861B5001891J0055734r388524j2103518r45175j05653q188791p335972J9890
$$ 25001891 35057625 25669101 13565583 12620408 12514755 4325964 -3010008 -2990118
4853b990118q15899o200146k560039N881083N231265j632294j512519M327690
$$ -2990118 -3806017 -10006163 -12566202 -6685119 -1453854 -3086148 -4598667 -270977
4845b70977M522071l82656j314332K97636l285294q544159o165909Q03880K025899
$$ -270977 4251094 3868438 2554106 2851742 -433552 -8977711 -15143620 -14339740 -12313841
4836a2313841j374856j18871N232951O116574K379807J135348K363103P53928
$$ -12313841 -13688697 -13807568 -8574617 -2458043 -78236 1057112 3420215 4174143
4828D174143j323258K195710P147986M426511l348365n621857k078383j400107
$$ 4174143 2850885 5046595 12194581 16621092 13272727 7650870 5572487 4172380
4820D172380l642111n04249O822831P054569j613252p237831l424965J628967
$$ 4172380 530269 26020 6848851 13903420 12290168 5052337 1627372 3256339
4812C256339N38273j980990L37357M378094M163445J76476l470048m796329l264849
$$ 3256339 3794612 1813622 2150979 6529073 10692518 10868994 7398946 2602617 -662232
4803f62232N64548K696051l94668m657339k839402L715573O409060K945316l38353
$$ -662232 -97684 2598367 2203699 -2453640 -5293042 -1577469 4831591 7776907 7438554
4794G438554o23516k121247n466269n356649k182254l878119j1123567j2810627
$$ 7438554 6815038 4693791 -772478 -6129127 -8311381 -12189500 -23313067 -36123694
4786c6123694l265751P337179Q376298M417361N413963R912590R500975M018365
$$ -36123694 -39389445 -32052266 -23675968 -19258607 -13844644 -3932054 5568921 9587286
4778I587286Q00281K163961L793830L393928K163903l71371m868767p331880l624110
$$ 9587286 10387567 12551528 16345358 19739286 21903189 21531818 16663051 9331171 5707061
4769E707061K636225M147507N26837k527981l276013n042128p684905o392433
$$ 5707061 8343286 12490793 13017630 10489649 7213636 2171508 -5513397 -11905830
4761a1905830m06001M453127M339733K337657K276111K960083J649417r32326
$$ -11905830 -12311831 -7858704 -3518971 -1181314 1094797 4054880 5704297 4771971
4753D771971k313944k167420j836070j880531j878327j242696N64524L143440
$$ 4771971 2458027 290607 -1545463 -3425994 -5304321 -6547017 -5982493 -2839053
4745b839053M461301L028458M86909l95914Q3332o98412l014393m224725l128247
$$ -2839053 1622248 4650706 5137615 4741701 4825033 4126621 1112228 -3112497 -6240744
4736f240744j430092k47476J365078L370484L715898J990052R88941K498693M078312
$$ -6240744 -7670836 -7918312 -6553234 -3182750 533148 2523200 3512141 6010834 10089146
4727A0089146K515029j282083l296835j440018K284190M213741K509598j364248
$$ 10089146 12604175 11322092 8025257 6585239 8869429 13083170 15592768 14228520
4719A4228520m049409l670077j723958o76779m28173O54951J681456k98210m786570
$$ 14228520 10179111 6509034 4785076 4108297 3680124 4335075 6016531 5718321 931751
4710I31751o481933k099591M120412N306637J018890k465479r92388K146212J550874
$$ 931751 -5550182 -7649773 -3529361 1777276 2796166 330687 -661701 1484511 3035385
4701C035385k360504m104569j323594J347355j303365o946135p791069j013581
$$ 3035385 674881 -3429688 -4753282 -3405927 -4709292 -11655427 -19446496 -20460077
4693b0460077O752089P539518J636560m233922n900775m467656j510674K798769
$$ -20460077 -13707988 -6168470 -4531910 -8765832 -14666607 -19134263 -20644937 -17846168
4685a7846168O299681N224816J89298k869603n36877L361132L886478J763251
$$ -17846168 -11546487 -6321671 -6132373 -9001976 -9538853 -6177721 -2291243 -527992
4677e27992L79391J6615m34026L10638K701004K787598j769225n139111o07485
$$ -527992 -148601 -131986 -566012 -255374 2445630 5233228 3464003 -1675108 -2282593
4668b282593P464529Q215561P44962m283483j711028M62024m100192q214853l254023
$$ -2282593 5181936 13397497 14142459 9858976 8147948 8609972 4509780 -3705073 -6959096
4659f959096N215422N618386p21802j830079N173614R636594M704284k915143
$$ -6959096 -1743674 3874712 3152910 1322831 6496445 16133039 20837323 17922180
4651A7922180n259015m701505o208623o585102p15873O834413O460736k128300
$$ 17922180 12663165 7961660 1753037 -4832065 -5547938 1286475 7747211 5618911
4643E618911q934145p130713k99465M621250N193696K639302j182524l403829
$$ 5618911 -3315234 -10445947 -10745412 -6124162 -930466 1708836 526312 -2877517
4635b877517j221712L858867O300059L605708j0758K58050K956682L043268n68254
$$ -2877517 -4099229 -240362 6059697 9665405 9654647 9912697 12869379 15912647 15344393
4626A5344393l921654l849967j551698J35818O02616J388429L259793M500341
$$ 15344393 11422739 7572772 6021074 6156892 6759508 8147937 11407730 15908071
4618A5908071K579583k363155o540406o401727l132961j207686k286545l228037
$$ 15908071 18487654 16124499 9584093 3182366 49405 -1158281 -3444826 -6672863
4610f672863j202262K113063L477128K643773J318809j21645j596187j094779
$$ -6672863 -7875125 -5762062 -2284934 358839 1677648 1556003 -40184 -1134963
4602a134963K307504M612125J139298n579993p619970k545807K936848K678289
$$ -1134963 1172541 5784666 6923964 1343971 -6275999 -8821806 -5884958 -3206669
4594c206669q05696j945310j327343l471079p849847q604189l257856L705274
$$ -3206669 -4012365 -5957675 -7285018 -10756097 -18605944 -27210133 -30467989 -26762715
4586b6762715P202559P164716O117955M873342K998634J002255l72193j482290
$$ -26762715 -19560156 -12395440 -6277485 -1404143 1594491 2596746 2224553 742263
4578G42263k640694k968599j846392k43830O70974R93001R86967o3884k458711
$$ 742263 -1898431 -4867030 -6713422 -6957252 -6286278 -5293277 -4306310 -4370194 -6828905
4569f828905m602022m404063j585403K325251N540553O810343N559335K114014
$$ -6828905 -11430927 -15834990 -17420393 -15095142 -9554589 -2744246 2815089 4929103
4561D929103k512062o948101q947582n883705J731058Q081173P238761Q94522
$$ 4929103 2417041 -4531060 -13478642 -19362347 -17631289 -9550116 -2311355 -1416833
4553a416833l215572j584020J196970Q04901k96035J203851K428482n15550m249306
$$ -1416833 -4632405 -6216425 -5019455 -4214554 -4510589 -3306738 -878256 -1393806 -5643112
4544e643112k538270K982881M384439m74336n004493m126784m53479J733275K185950
$$ -5643112 -8181382 -5198501 -814062 -1288398 -6292891 -10419675 -10873154 -9139879 -6953929
4535f953929J673867p87155m370957n327387k860911j232490k555965k717826
$$ -6953929 -5280062 -6067217 -10438174 -15765561 -18626472 -19858962 -22414927 -25132753
4527b5132753J254873M963387L319280q40454j183884K150585L688951J815374
$$ -25132753 -23877880 -18914493 -15595213 -16435667 -17619551 -15468966 -11780015 -9964641
4519i964641J52116M78901N62838o87856j421065q84877m96059k22525J549638
$$ -9964641 -9812525 -9333624 -8770786 -9458642 -10879707 -11764584 -12260643 -12483168 -10933530
4510a0933530L790063K981713j291747m962406m975722k502076M14236L504593
$$ -10933530 -7143467 -4161754 -5453501 -10415907 -15391629 -17893705 -17479469 -13974876
4502a3974876O140135O466404M718641L964063N253341N169477R39134m558458
$$ -13974876 -7834741 -1368337 3350304 7314367 12567708 17737185 18676319 14117861
4494A4117861o057688k810488O43354K89052k837565m347139j852769K073174
$$ 14117861 8060173 5249685 5893039 6182091 3344526 -1002613 -2855382 -782208
4486g82208K993803N31328q94963J424021L933133J909960l077814n266045l032692
$$ -782208 2211595 2742923 1847960 3271981 7205114 9115074 6037260 771215 -2261477
4477b261477l8874J572434L373456N317145M277859J09321k395836p24152R94806
$$ -2261477 -2300351 -727917 2645539 7962684 12240543 12349864 9954028 9229876 10224682
4468A0224682j559601o184426p659857m563598Q13354N949721Q215963N250455
$$ 10224682 8665081 2480655 -5179202 -9742800 -8929446 -2979725 5236238 10486693
4460A0486693j077192m671317k903976m15689j349170k632053l23811K301849
$$ 10486693 9409501 4738184 1834208 1418519 69349 -2562704 -2886515 -584666
4452e84666J91112l854867l299513Q51409J785996j229443j936397J599820L893616
$$ -584666 -393554 -4248421 -7547934 -6696525 -4910529 -6139972 -8076369 -6476549 -2582933
4443b582933J963402k66328p8032k55121j941453j243808K746224M201766O5658
$$ -2582933 -619531 -885859 -963891 -1219012 -3160465 -4404273 -1658049 2543717 2609375
4434B609375l844275k284793O49452o26113k873774l38957L616282J456346m685675
$$ 2609375 -1234900 -3519693 -2870241 -3496354 -6370128 -6709085 -3092803 -1636457 -6322132
4425f322132n060225J850231O074685J242337o136655o725013o55014N115575
$$ -6322132 -11382357 -9532126 -3457441 -2215104 -8351759 -15076772 -15731786 -10616211
4417a0616211O425240L889994p41965n178076o088176k506251J835419L028978
$$ -10616211 -4190971 -300977 -1042942 -6221018 -12309194 -14815445 -12980026 -9951048
4409i951048K129086K407332L370730J801943j976291l407188k06978L997272
$$ -9951048 -7821962 -5414630 -2043900 -241957 -2218248 -5625436 -5832414 -1835142
4401a835142M455676J427159p60456L37261K647611L037018J383145q6966l60565
$$ -1835142 2620534 4047693 3287237 3624498 6272109 9309127 10692272 10605306 10244741
4392A0244741n59448j421763k054932j999438k384142l450757l006656J58570
$$ 10244741 9685293 8263530 6208598 4209160 1825018 -1625739 -4632395 -4473825
4384d473825K980242J621512k500983l975192q36079L094574M259057L874169
$$ -4473825 -1493583 127929 -2373054 -6348246 -7184325 -4089751 169306 4043475
4376D043475M434203N205121M156026J842154P769k043649o111482j0678809j1197398
$$ 4043475 8477678 13682799 17838825 19680979 19688748 17645099 11533617 854808 -10342590
4367a0342590n535524K878823Q098038O803800N40517n733180p183137k773563
$$ -10342590 -15878114 -12999291 -4901253 1902547 2443064 -3290116 -10473253 -13246816
4359a3246816L612906O353194L326063j905179l753105q78207J979208j16135
$$ -13246816 -9633910 -3280716 45347 -1859832 -5612937 -6491144 -4511936 -4628071
4351d628071n121215n807683J48238N769510L996433k066987l737167M10303L467794
$$ -4628071 -9749286 -15556969 -15408731 -9639221 -5642788 -7709775 -11446942 -11036639 -7568845
4342g568845J953081N46679K574168L633764l61072n223963m776092k83734K740530
$$ -7568845 -5615764 -5069085 -2494917 1138847 777775 -4446188 -9222280 -9506014 -6765484
4333f765484L223116L519050L211864Q03810j371851j002134j559811o313904
$$ -6765484 -3542368 -23318 3188546 3992356 2620505 1618371 58560 -6255344
4325f255344r567976l647034O936141R454407J801034m132966p49087N020038
$$ -6255344 -15823320 -19470354 -12534213 -3079806 -1278772 -5411738 -6160825 -1140787
4317a140787M891952J867252K117107L337307N89596k920855j017016L842296
$$ -1140787 3751165 5618417 7735524 11072831 11662427 8741572 7724556 11566852
4309A1566852M039860o67265l501085k263365j503306l022049k801314R41891
$$ 11566852 15606712 14939447 11438362 9174997 7671691 4649642 1848328 2790219
4301B790219L933613K649920p26093k694790l159321l361880k926562j238176
$$ 2790219 6723832 9373752 8647659 5952869 2793548 -568332 -3494894 -4733070
4293d733070J008034L036961M372476L753120Q09265j275301J100808N730390
$$ -4733070 -3725036 -688075 3684401 7437521 8246786 6971485 8072293 13802683
4285A3802683O181767R12638l979823l374735O9739J004806o79841j380365n86402
$$ 13802683 19984450 20897088 16917265 13542530 13612269 14617075 13937234 12556869 11970467
4276A1970467j180627l674508m652987j868478K242728L663634J634004j101548
$$ 11970467 10789840 7115332 2462345 593867 2836595 6500229 8134233 7032685
4268G032685k015494j363463r34541j186404n81304K039268N253845O260301M252559
$$ 7032685 5017191 3653728 2719187 1532783 951479 2990747 8244592 14504893 18757452
4259A8757452J589085R26438J674901M55866m281262r033151q639395l354328
$$ 18757452 20346537 21272975 22947876 23403742 19122480 10089329 1449934 -1904394
4251a904394R9684l082235q502326p788417l71938N174865K863226k859693m150227
$$ -1904394 -1804710 -4886945 -13389271 -21177688 -21549626 -16374761 -13511535 -16371228 -20521455
4242b0521455l18368L194643L473240K570581K450911K290205J112048l21567
$$ -20521455 -20839823 -17645180 -14171940 -11601359 -9150448 -6860243 -5748195 -6069762
4234f069762q00799K54035K726216N075778M770209J434077j846745k438444j476636
$$ -6069762 -6870561 -6616526 -3890310 1185468 5955677 7389754 5543009 3104565 1627929
4225A627929r84442l42247J093341P11628l459309p716904o731755j425279K335584
$$ 1627929 643487 301240 1394581 2106209 -1353100 -9070004 -15801759 -17227038 -14891454
4216a4891454K073465M32582q42591k730500m234089j815032M561980R566168
$$ -14891454 -12817989 -12385407 -13227998 -15958498 -20192587 -22007619 -17445639 -7879471
4208g879471Q846704L589436k717687q145667j1137239r327023k504382N251404
$$ -7879471 967233 4556669 1838982 -6306685 -17443924 -26770947 -29275329 -24023925
4200b4023925Q679177N968872q1055m503230m223731j029562N47178n33381k99187
$$ -24023925 -15344748 -9375876 -9456931 -13960161 -18183892 -19213454 -18666276 -19199657 -19498844
4191a9498844L275710N542353J783680m642632o404453k252668K902599O073303
$$ -19498844 -16223134 -10680781 -8897101 -13539733 -19944186 -22196854 -19294255 -13220952
4183a3220952P874035P494346L095788k895614n403008l903773k482269l165324
$$ -13220952 -5346917 2147429 5243217 2347603 -3055405 -6959178 -9441447 -12606771
4175a2606771m644566o210614o982887l573896M339165R098156M585990k265409
$$ -12606771 -17251337 -23461951 -30444838 -34018734 -29679569 -20581413 -15995423 -18260832
4167a8260832k41430Q096119R751125K011440m195708l073521j463884l956036
$$ -18260832 -18502262 -10406143 -655018 1356422 -2839286 -5912807 -7376691 -11332727
4159a1332727m911657j098653J027281k316018m453069j39100N384146O022946
$$ -11332727 -16244384 -17343037 -16315756 -18631774 -23084843 -23223943 -17839797 -11816851
4151a1816851L500310N89028l857475p954040o219220p54251n50247n328584m444933
$$ -11816851 -8316541 -7727513 -11584988 -19539028 -25758248 -26512499 -27062746 -32391330 -36836263
4142c6836263L661066P632309L907106K104609L814819j435624j1475029r572848
$$ -36836263 -33175197 -25542888 -21635782 -19531173 -15716354 -17151978 -28627007 -38199855
4134c8199855K234563k73883j8612296k2125457p218794j8744960o9153445q3601732
$$ -38199855 -35965292 -36239175 -54851471 -76976928 -84195722 -102940682 -172094127 -255695859
4126b55695859M776531J33160292J66913790P7191800k3082588l8124919k068655
$$ -255695859 -250919328 -117759036 49154754 126346554 103263966 65139047 63070392
4119F3070392N693820j6847715j9590619K334769R540350o182035j3345304j468066
$$ 63070392 68764212 51916497 32325878 34660647 44200997 38018962 24673658 23205592
4111B3205592N023388m263854r291888P17643R632227N892660j9182O98601P24604
$$ 23205592 28228980 23965126 14673238 15390881 25023108 30915768 30896586 31595187 32319791
4102C2319791m747179p743449m262739j556333k324145l41116L352650p27405
$$ 32319791 27572612 19829163 15566424 14010091 11685946 11344830 14697480 13970075
4094A3970075j0457074j0696816J672222J0646251O601964J08237J300166L693851
$$ 13970075 3513001 -7183815 -5511593 5134658 11736622 11844859 13145025 16838876
4086A6838876k37071l799670N10346N882203L133278k913094k270276L411500
$$ 16838876 16601805 12802135 13312481 19194684 22327962 19414868 17144592 20556092
4078B0556092N437365K888249J181367Q13837j748067n369413n684348k949605
$$ 20556092 25993457 28881706 30063073 30876910 29128843 23759430 18075082 15125477
4070A5125477j196335j664893k641570l184449k625297J13102K986622J297549
$$ 15125477 13929142 12264249 9622679 6438230 3812933 3926035 6912657 8210206
4062H210206m530147p295042l502401Q09058K2703k000108L67040M030323K742472
$$ 8210206 3680059 -3614983 -7117384 -6308326 -6285623 -8285731 -7918691 -3888368 -1145896
4053a145896j717202k944589j031305j022327k555077p56183L204021K398164
$$ -1145896 -2863098 -5807687 -6838992 -7861319 -10416396 -11172579 -7968558 -5570394
4045e570394l600901o155201p65350N375676M382720l39592j38400N092222P280098
$$ -5570394 -9171295 -15326496 -16091846 -10716170 -6333450 -6673042 -6811442 -1719220 5560878
4036E560878L084315j605262j560391N19941K17869j172842q44631j292409n664610
$$ 5560878 8645193 7039931 5479540 5999481 6217350 5044508 4199877 2907468 -2757142
4027b757142r353623n074774M326448P780778K492560j292792L743643J0735167
$$ -2757142 -12110765 -17185539 -12859091 -5078313 -2585753 -3878545 -134902 10600265
4019A0600265J0084400L947101N63728N50042j234118m535424m714032k325896
$$ 10600265 20684665 24631766 25195494 25745536 24511418 19975994 15261962 12936066
4011A2936066j852318k414089O80247N859993O118063J21298n954429p923668
$$ 12936066 11083748 8669659 9349906 15209899 21327962 21449260 15494831 7571163
4003G571163o961242l751428K194772P209922O095203P65850j777182k25685O73058
$$ 7571163 609921 -3141507 -946735 6263187 12358390 13124240 11347058 11121373 11794431
3994A1794431Q3294J768043M708103L448471j293851l025802j551297l144669
$$ 11794431 11877725 13645768 18353871 21802342 20508491 17482689 15931392 12786723
3986A2786723p121633n118215L114265O775479J816845j944414J909308N588388
$$ 12786723 5665090 546875 3661140 10436619 12253464 10309050 12218358 17806746
3978A7806746K035638k371702n41106J727135k987351q828295o218999J529632
$$ 17806746 19842384 17470682 16929576 18656711 15669360 6841065 622066 2151698
3970B151698M349940J851425O88156Q12370k526543o926989n780945o04642J282703
$$ 2151698 6501638 8353063 9041219 9853589 7327046 400057 -5380888 -5985530 -4702827
3961d702827o50843q52559J107651Q52049j186497j128778o86586l918456o922657
$$ -4702827 -5353670 -6206229 -5098578 -4246529 -5433026 -6561804 -7248390 -11166846 -18089503
3952a8089503k638262N171891N411686k372870o219314k22043P237980P578953
$$ -18089503 -20727765 -15555874 -10144188 -12517058 -18736372 -18958415 -11720435 -4141482
3944d141482L632715K206669L846996N216256M862383K444528j946222m910934
$$ -4141482 -508767 1697902 5544898 10761154 15623537 18068065 16121843 11210909
3936A1210909k302109L246409M090379j050410m808606k771033L75813k91102
$$ 11210909 8908800 12155209 16245588 15195178 10386572 7615539 7991352 7700250
3928G700250k588358l162514l698676n945093o601417k871333J746859K776822
$$ 7700250 5111892 1949378 -1749298 -7694391 -14295808 -17167141 -15420282 -12643460
3920a2643460J846845L061072N578190N229435J502653j841003k143928l70223
$$ -12643460 -10796615 -7735543 -2157353 3072082 4574735 2733732 589804 219581
3912B19581J120410J074528K35149N75047K354401K352610j973111o955342n980068
$$ 219581 1339991 2414519 2649668 3224715 5579116 7931726 5958615 -996727 -6976795
3903f976795Q41875N432952K454453l575303n191260j886520J112644J116347
$$ -6976795 -6134920 -701968 1752485 -1822818 -7014078 -8900598 -7787954 -6671607
3895f671607L32179R44003J852621J010120j313751k909128k721155k288463k982261
$$ -6671607 -6339428 -5395425 -3542804 -2532684 -3846435 -6755563 -9476718 -11765181 -14747442
3886a4747442k712120J624245P981563R807830N235020R03109K447776N919531
$$ -14747442 -17459562 -15835317 -7853754 1954076 7189096 8092205 10539981 16459512
3878A6459512M634699J88006j224506j37105j974143n502552l675572L356267
$$ 16459512 21094211 21282217 20057711 19920606 17946463 12443911 8768339 12124606
3870A2124606O606200K199018k805478k350431j36081j556280m839180n791713
$$ 12124606 18730806 20929824 18124346 15773915 15637834 14081554 9242374 3450661
3862C450661m754994l512983j259388J422637N80896m088483o257878k212020
$$ 3450661 -1304333 -4817316 -6076704 -4654067 -4073171 -8161654 -14419532 -16631552
3854a6631552L018364M318994M820417Q775116J2108217Q272808o83184o991962
$$ -16631552 -13613188 -9294194 -4473777 4301339 16409556 24682364 23999180 17007218
3846A7007218q013602o608106l478008K685904Q681699Q194880L22648q721344
$$ 17007218 8993616 2385510 -1092498 1593406 10275105 18469985 18792633 10071289
3838A0071289j2642998r965410l186719K934011L997541P96257p66508J754433
$$ 10071289 -2571709 -12537119 -15723838 -12789827 -8792286 -7996029 -8762537 -7008104
3830g008104K753058k288013p530083m249963N261421R918239N294413j363277
$$ -7008104 -4255046 -6543059 -14073142 -18323105 -13061684 -3143445 2150968 787691
3822G87691k451544R56559L384630K382895p22787l304633k884796P54261M298670
$$ 787691 -1663853 -707294 2677336 5060231 4337444 1032811 -1851985 -1097724 3200946
3813C200946M597273L004290K591349K432723n87377n214109o532058l288499
$$ 3200946 7798219 10802509 13393858 15826581 15239204 10025095 3493037 204538
3805B04538O18516K303112K601983K192145M5716l228083m962652m349205k904681
$$ 204538 823054 3126166 5728149 7920294 7966010 4737927 -224725 -4573930 -7478611
3796g478611q37681K687237N659971M721741J077710m52171P53764J754m214818
$$ -7478611 -8316292 -5629055 30916 4752657 5830367 5378196 6131960 6133714 1918896
3787A918896o497604k633974L395197M603366O9318m919792n819966k863715P62637
$$ 1918896 -4578708 -7212682 -3817485 785881 855199 -4064593 -9884559 -12748274 -11985637
3778a1985637K630168L159909M262710N447923L222128l063534p248502l229016
$$ -11985637 -9355469 -6195560 -1932850 3515073 6737201 3673667 -3574835 -6803851
3770f803851N487751R183717M833365j007710l092657l785270n806036o246012
$$ -6803851 -1316100 7867617 12700982 11693272 8600615 4815345 -990691 -7236703
3762g236703k692025R16446N65789n20901K559029P054743N922029j170687o907123
$$ -7236703 -9928728 -9012282 -8446493 -8967394 -6408365 646378 6568407 5397720 -1509403
3753a509403o177044j198428L525670O162996O331297L515860r82576l407269
$$ -1509403 -7686447 -8884875 -5359205 803791 7135088 10650948 9668372 6261103
3745F261103j295459L209125N173281J748842m919193r352141p824784k191771
$$ 6261103 4965644 8174769 13348050 15096892 10177699 825558 -6999226 -9190997
3737i190997K315804L289531L117566M027662M202141J292876k724861l842657
$$ -9190997 -6875193 -3585662 -468096 3559566 7761707 9054583 6329722 2487065
3729B487065j946770q20047k535088n151807o215375n508621l585452k32998M193093
$$ 2487065 540295 -279752 -2814840 -7966647 -14182022 -19690643 -23276095 -23509093 -19316000
3720a9316000P537287P394745L561890j279175l086879L46659O444072R061924
$$ -19316000 -11778713 -4383968 -822078 -2101253 -5188132 -4841473 1602599 10664523
3712A0664523M686606l021192o961723m598533Q5026K507786K427789K061500
$$ 10664523 15351129 12329937 5368214 769681 854707 3362493 5790282 7851782
3704G851782K057215J314314q14388l931023p076797q485365o361455j647498
$$ 7851782 9908997 11223311 10408923 6477900 -598897 -9084262 -15445717 -17093215
3696a7093215J513013M67427j921936q42725L557747O397630N332372L341541
$$ -17093215 -15580202 -15112775 -17034711 -17877436 -14319689 -7922059 -2589687 751854
3688G51854K737937J090065l222359n494313p32528O811139P409099j68361n714714
$$ 751854 3489791 4579856 1357497 -4136816 -4869344 1941795 9350894 9182533 3467819
3679C467819j759481N802696O610356M54950m061600k861765m78888p61134j109530
$$ 3467819 1708338 7511034 14121390 14576340 10514740 7652975 7174087 6412953 5303423
3670E303423J345141L836913K448818j430897l645031l810431m643716n772082
$$ 5303423 6648564 10485477 12934295 11503398 7858367 4047936 -595780 -6367862
3662f367862l124470M256663J0506901R015378Q54162n889262n574979j157010
$$ -6367862 -9492332 -5235669 5271232 14286610 15140772 9251510 3676531 2519521
3654B519521Q52418p59192j700463j2215Q40495j636059m189651l050618k31211
$$ 2519521 3371939 2612747 912284 900069 1740564 104505 -4085146 -7135764 -7366975
3645g366975J22039j145236m07033J247146n56877m818451n103740K73096M768738
$$ -7366975 -7244936 -8390172 -8797205 -7550059 -8106936 -12925387 -18029127 -17756031 -12987293
3636a2987293L286117o97371j577364K29515J406461K240197M121440M243517
$$ -12987293 -9701176 -10398547 -11975911 -11746396 -10339935 -8099738 -3978298 265219
3628B65219l23448n285162l155889N308899J0390685N808323l547956q707521
$$ 265219 -58229 -5343391 -8499280 -3190381 7200304 13008627 9460671 753150
3620G53150p083476k850931k09639J13737p00051j397049j226016o33756j125731
$$ 753150 -6330326 -9181257 -9390896 -9277159 -9977210 -11374259 -12600275 -13234031 -14359762
3611a4359762l103679m335321j974330L996774J0289385J3163350J1199723N806323
$$ -14359762 -17463441 -21798762 -23773092 -19776318 -9486933 3676417 14876140 20682463
3603B0682463l9455l822735n256571n953513o646500n423715m03585O082319Q611020
$$ 20682463 20643008 16820273 11563702 5610189 -1036311 -6460026 -6863611 -781292 7829728
3594G829728N179759J08436j858912k022368m541179q361049p809879j864622
$$ 7829728 13009487 13117923 11259011 9236643 4695464 -3665585 -11475464 -13340086
3586a3340086L032339K182080n93233L52143L560602L955287J817853J397627
$$ -13340086 -10307747 -8125667 -8718900 -8366757 -4806155 -850868 966985 2364612
3578B364612K494595J047197k127590j074404N114508R009174M810269m188871
$$ 2364612 4859207 5906404 3778814 2704410 7818918 16828092 21638361 17449490
3570A7449490j1166430j3292499j0505192k768451O758014J0913175O490396n65282
$$ 17449490 6283060 -7009439 -17514631 -20283082 -13525068 -2611893 3878503 3313221
3562C313221k842968p52933Q56739J243401K484421K955050l15366m453533l719070
$$ 3313221 470253 -282680 574059 1817460 4301881 7256931 6941565 2488032 -1231038
3553a231038N94096R71626m441897q134538m115012L730300P884756O881630M452656
$$ -1231038 -636942 334684 -4107213 -12241751 -16356763 -12626463 -4741707 2139923 6592579
3544F592579K600010L12106k371515l161906o45099L517982N857318M004537j055502
$$ 6592579 9192589 9504695 7133180 3971274 3326175 6844157 12701475 16706012 15650510
3535A5650510n346874n493985k106045J382308K675761J807801n48023l013717
$$ 15650510 10303636 4809651 2703606 4085914 6761675 8569476 8021453 5007736
3527E007736k344302L611124J0976339J2020018M427660m920509q034391m799558
$$ 5007736 2663434 6274558 17250897 29270915 33698575 28778066 20743675 15944117
3519A5944117r20350L15293L1839q16794k962305n296955m363676M79047M542771
$$ 15944117 15023767 15339060 15370899 14554105 11591800 6294845 1931169 2410216 6952987
3510F952987L383476r28880k323432J114497M764073L795385j150632o160871
$$ 6952987 10336463 9407583 7084151 8198648 12962721 16758106 15607474 9446603
3502I446603r170806j0138515q187396k637920L530420N550504L301247K074903
$$ 9446603 275797 -9862718 -18050114 -20688034 -17157614 -11607110 -8305863 -6230960
3494f230960M996680Q224306O664506J576916j420954k56749J834931J950823
$$ -6230960 -1234280 6990026 13654532 15231448 13810494 13553745 15388676 17339499
3486A7339499R45413N44816K49366j325813l821616n322788m661117k939823k631708
$$ 17339499 18284912 18829728 19079094 17753281 13931665 8608877 3947760 1007937 -1623771
3477a623771m646563o525846n178353j521815K63487j007441j517973J210266
$$ -1623771 -6270334 -12796180 -17974533 -19496348 -19232861 -20240302 -21758275 -20548009
3469b0548009L911774L129162J403882K751019M952568K927450j814778k493889
$$ -20548009 -16636235 -13507073 -12103191 -9352172 -4399604 -1472154 -3286932 -5780821
3461e780821K062361N377700L790467J603300K657358L696767R54329k397394
$$ -5780821 -3718460 1659240 5449707 7053007 9710365 13407132 14361461 11964067
3453A1964067j475196J666176J244960k646449m252684j411143J448027N23389
$$ 11964067 10488871 12155047 13400007 10753558 6500874 5089731 6537758 7061147
3445G061147k045688k104915O05859K722103J658253j868234m767474m263062
$$ 7061147 5015459 2910544 3516403 6238506 7896759 6028525 1261051 -3002011
3437c002011n18954L009761K662283j728698o718725q549340n937377l70060M938590
$$ -3002011 -3520965 -511204 2151079 422381 -6296344 -14845684 -20783061 -21153121 -16214531
3428a6214531O686214L832064j009685l474090j532531K538478M620775L057197
$$ -16214531 -9528317 -5696253 -6705938 -10180028 -11712559 -9174081 -4553306 -1496109
3420a496109J42919q65084K28005O25216j079770k322423j47530L833431M952480
$$ -1496109 -1353190 -2218274 -1990269 -1365053 -2444823 -4767246 -4914776 -1081345 3871135
3411C871135K010865q05418K06566L232037M024763K070284P04405J746076K941949
$$ 3871135 5882000 5076582 5283148 8515185 12539948 14610232 15314637 17060713 20002662
3402B0002662J367239k776666o985489r617932j0430766q521611k349870O627206
$$ 20002662 21369901 18593235 11607746 1989814 -8440952 -16962563 -19312433 -12685227
3394a2685227J2208969Q809042r60558p407337m504135L128786O698302M085559
$$ -12685227 -476258 8332784 7372226 -35111 -4539246 -1410460 5287842 9373401
3386I373401J64748j715696k827476l689374k003818J588310J346063n455390
$$ 9373401 9538149 7822453 4994977 1305603 -698215 890095 2236158 -3219232
3378c219232j2087698r631968R34127R337709Q811670L447693J187058L477223
$$ -3219232 -15306930 -24938898 -24004771 -14667062 -5855392 -2407699 -1220641 2256582
3370B256582N109042K335366k571576n113909m076695j696497m5263N84252M58225
$$ 2256582 7365624 9700990 7129414 2015505 -2061190 -3757687 -3802950 -3218698 -2760473
3361b760473M1173P61696L377976N180503K264632m030153o937112l301278J284917
$$ -2760473 -2719300 -1957604 1420372 6600875 8865507 4835354 -2101758 -5403036 -4118119
3352d118119P37498j983498M3634N622358O436035k800o504548p124017m389606
$$ -4118119 -3380621 -5364119 -5320485 301873 6737908 6735108 230560 -6893457 -11283063
3343a1283063k528048o13574K929585N093979L192488L41400L43775J025089j351695
$$ -11283063 -13811111 -14424685 -11495100 -6401121 -3208633 -2867233 -2523458 -1498369 -2850064
3334b850064m369505k832451K166114M296835J518445j552788j100390J420161
$$ -2850064 -7219569 -10052020 -7885906 -3589071 -2070626 -3623414 -4723804 -3303643
3326c303643L181548L772791L652757K358789j20369k392160l051906j745237
$$ -3303643 -122095 3650696 7303453 9662242 9541873 7149713 4097807 2352570
3318B352570Q97421L119966L063558J559838J923307M731085N489877R43768m935074
$$ 2352570 3249991 6369957 9433515 10993353 12916660 17647745 23137622 24081390 19146316
3309A9146316n892101k393821l28039j734410k654205m46484K342773K666115
$$ 19146316 13254215 10860394 10532355 8797945 6143740 5697256 8040029 10706144
3301A0706144P70433k105089n438862p277235m690587J440967N702829M460779
$$ 10706144 11476577 9371488 3932626 -3344609 -8035196 -6594229 -891400 3569379
3293C569379o2820l798090n646773o138731m554825n46395L394168M155448J884487
$$ 3569379 3506559 -291531 -5938304 -12077035 -16631860 -17178255 -13784087 -9628639 -7744152
3284g744152m00262l86479J781932M487474N928154M861914J299082l130461n590718
$$ -7744152 -8144414 -8530893 -6748961 -2261487 3666667 8528581 9827663 6697202 1106484
3275A106484l546887K475352P386315N572972j764286o382607l327390J579940
$$ 1106484 -2440403 34949 7421264 12994236 11229950 4847343 1519953 3099893
3267C099893m33297q036285j1233453n569007K269559M782963K840331J156386
$$ 3099893 2666596 -5369689 -16603142 -22172149 -19902590 -15119627 -12279296 -11122910
3259a1122910N11573o07591q60125J825440N187222M812809N97462l061748l279347
$$ -11122910 -10611337 -11218928 -12079053 -10253613 -5066391 -253582 343880 -2717868 -5997215
3250e997215j487343l3405J106695L108174N369805N285994J341201l965269n790872
$$ -5997215 -7484558 -7517963 -6411268 -3303094 2066711 7352705 8693906 4728637 -1062235
3241a062235k659128J156010J105401j626368k943677k715132l663614m471550
$$ -1062235 -3721363 -2565353 -1459952 -3086320 -6029997 -8745129 -12408743 -16880293
3233a6880293q06153N969219Q502529M525042R13992K562382M444514P03606n073066
$$ -16880293 -17686446 -11717227 -3214698 1310344 2224336 4786718 9231232 9934838 4861772
3224D861772o412504n143684o628379p994987k308381P174141R049118J520619
$$ 4861772 -1550732 -6694416 -13322795 -21317782 -23626163 -16452022 -7402904 -5882285
3216e882285l693645O15733O275139L900230j626913p193O483114O003448l644040
$$ -5882285 -9575930 -8960197 -2685058 1215172 -411741 -418934 6064180 12067628 8423588
3207H423588j0667833o486422K471251N218056J343980j102341J176502L135230
$$ 8423588 -2244245 -8730667 -6259416 -1041360 302620 -799721 376781 3512011
3199C512011M70273m038068n251951k682030L9242N75749j1013m6188P7978j219623
$$ 3512011 3982284 -55784 -5307735 -7989765 -7950523 -7374774 -7385787 -7431975 -7353997 -8573620
3189h573620l885961n229712k540352L073057O632587M554311n80508k497422
$$ -8573620 -12459581 -17689293 -20229645 -17156588 -10524001 -5969690 -6550198 -9047620
3181i047620J398979P161363R274311O281601O35770m497022o672467m881896
$$ -9047620 -7648641 -487278 8787033 15068634 15704404 11207382 4534915 -346981
3173c46981j176929L38104j432877k407015J026910O088467O805081J810059m662845
$$ -346981 -1523910 -1185806 -2618683 -5025698 -3998788 2089679 8894760 10704819 6041974
3164F041974q491966q568394n092868M45795M016097K672634l35686R09803N814448
$$ 6041974 -2449992 -11018386 -16111254 -15665459 -11649362 -8976728 -9312414 -8402611 -2588163
3155b588163P245525K276146k935221k094831K547794M493205J895585k087505
$$ -2588163 4657362 6933508 3998287 1903456 4451250 8944455 10840040 8752535
3147H752535m624786m682759j836504K210390L018318j650094p705998q803783
$$ 8752535 4127749 -555010 -2391514 -181124 2837194 1187100 -6518898 -15322681
3139a5322681l174835N821518J3375998J4981612Q299024k685588q756962n517556
$$ -15322681 -18497516 -12675998 700000 15681612 23980636 21295048 12538086 7020530
3131G020530N83337J231013k212282k673485J91141K07860l420833l890040J446662
$$ 7020530 7603867 8834880 6622598 3949113 4140254 4348114 927281 -2962759 -1516097
3122a516097N675243K892170k784867m202818j852068j259238l088196k599772
$$ -1516097 4159146 7051316 4266449 63631 -1788437 -3047675 -6135871 -8735643
3114h735643J827358N402442L279075l404626r133788r459110m009916M012747
$$ -8735643 -6908285 -1505843 1773232 -1631394 -10765182 -20224292 -24234208 -20221461
3106b0221461J0067143J0922754O529801p8894m830672n383902k812900m27910
$$ -20221461 -10154318 768436 7298237 7219343 2388671 -2995231 -5808131 -6236041
3098f236041k30474r03145j46319J803606K652397J625015N10793R05597K239957
$$ -6236041 -6466515 -7369660 -7515979 -5712373 -3059976 -1434961 -924168 -18571 2221386
3089B221386L017954K482952P27124j328685j944172l91742J116595k41114l075896
$$ 2221386 5239340 7722292 8449416 7120731 5176559 4784817 5901412 5660298 2584402
3080B584402k336985L478611Q525245O392934q39927m581393j097051L436718
$$ 2584402 247417 3726028 12251273 18644207 17804280 13222887 12125836 15562554
3072A5562554J791551l873098n231385k77608L485895L66386m719902l787575
$$ 15562554 17354105 13481007 8249622 7972014 11457909 11824295 7104393 3316818
3064C316818J809407L590398q36289m699873l307435m34770j41437M16366M534326
$$ 3316818 5126225 8716623 7880334 3180461 -126974 -561744 -703181 -286815 4247511
3055D247511Q361111O587306J375078j589550k521181n207333p824732m927514
$$ 4247511 12608622 19195928 20571006 18981456 16460275 11252942 3428210 -1499304
3047a499304K049152N100917J536494k425409j788739R44798K115911K422932
$$ -1499304 549848 5650765 7187259 4761850 2973111 3917909 6033820 8456752
3039H456752K856465J617424j188099j729450P45729J149132k864428n312914
$$ 8456752 11313217 12930641 11742542 10013092 10758821 11907953 9043525 3730611
3031C730611p25366O089709N908552j900341q592135p295233j43828N352853L676800
$$ 3730611 3005245 9094954 15003506 13103165 4511030 -2784203 -2928031 2424822 6101622
3022F101622l958139r802274o630709L132439Q773916M751057j714405j166169
$$ 6101622 2143483 -7658791 -14289500 -11157061 -2383145 2367912 653507 -512662
3014e12662M591627O324159J435721l897773n504795n867173p153030p110496
$$ -512662 4078965 10403124 11838845 7941072 2436277 -3430896 -10583926 -17694422
3006a7694422m270400j158512M49695K370563N323204O175198L197196o1802L9571
$$ -17694422 -21964822 -23123334 -22673639 -20303076 -14979872 -8804674 -5607478 -5669280 -5629709
2997e629709J477985J60568l070522l522940J34307L809756L582105L93419j924332
$$ -5629709 -4151724 -3991156 -7061678 -10584618 -10450311 -6640555 -3058450 -2665031 -4589363
2988d589363j503597m0102j55493k089199l364024j761807J835912M318139L940017
$$ -4589363 -6092960 -6133062 -6288555 -8377754 -11741778 -13503585 -11667673 -7349534 -3409517
2979c409517K038015Q69815Q27845P17528K20001O86868K858382M671356K994385
$$ -3409517 -1371502 -501687 326158 1043686 1263687 1950555 4808937 9480293 12474678
2970A2474678j968146n713304m565820n08189J652562J141116J647984M624525
$$ 12474678 10506532 4793228 227408 -280781 1371781 2512897 4160881 8785406
2962H785406O387074L824392p89225l473189l765432l105034j282594J449863
$$ 8785406 15172480 18996872 18207647 14734458 10969026 7863992 6581398 8031261
2954H031261J730834k341450o144721l848340K315888M320007o8186m285997k887197
$$ 8031261 9762095 7420645 1275924 -2572416 -256528 4063479 3995293 -290704 -3177901
2945c177901J517999L654491K688722Q10035r48794k031655j059163J346085J501604
$$ -3177901 -1659902 1994589 4683311 5493346 4544552 2512897 1453734 2799819 4301423
2936D301423k087214n128742k906366K810990N872021L391577j864628n570031
$$ 4301423 2214209 -2914533 -5820899 -3009909 2862112 6253689 4389061 -1180970
2928a180970n464737j965093K215350L855972K567890J120282J031375K56776
$$ -1180970 -6645707 -8610800 -6395450 -2539478 28412 1148694 2180069 2436845
2920B436845k651058n125513m446750k041067j56996K527932O972870Q502608
$$ 2436845 -214213 -5339726 -9786476 -11827543 -11984539 -9456607 -2483737 6018871
2912F018871K270599p489052j1159422o699276j264556J002858M056063R644210
$$ 6018871 8289470 800418 -10359004 -17058280 -18322836 -17319978 -13263915 -3619705
2904c619705J0993881L364918n982641o778088m99003K555587j246403n093991
$$ -3619705 7374176 10739094 4756453 -2021635 -2520638 34949 -1211454 -6305445
2896f305445l307384J538598M723027N635383N320894L507253J015334L80085
$$ -6305445 -9612829 -8074231 -3351204 2284179 7605073 11112326 12127660 12507745
2888A2507745J302840k8813m291426o360678k823606K176687K839587k54477k648266
$$ 12507745 13810585 13781772 9490346 3129668 306062 2482749 5322336 5067859 2419593
2879B419593l329516m290666n113630l587047n17473J283358K076642M269900
$$ 2419593 -909923 -5200589 -10314219 -13901266 -14418739 -13135381 -11058739 -6788839
2871f788839O919440O304803K125460j720809k879973k397226p70072K424669
$$ -6788839 130601 6435404 8560864 6840055 3960082 1562856 792784 3217453
2863C217453M361299O69005o658213r232001l570953L105101K819231k268778
$$ 3217453 7578752 8247757 1589544 -7642457 -11213410 -8108309 -5289078 -7557856
2855g557856m471257k352884j158606k969276l263366J505067P933059R840083
$$ -7557856 -12029113 -14381997 -15540603 -18509879 -21773245 -20268178 -12335119 -2495036
2847b495036N876347P23103n28338K119966M083391K123380j438195k161584j18729
$$ -2495036 3381311 4104414 3576076 5696042 9779433 11902813 10464618 8303034 8184305
2838H184305M36023j774662k790856k68270K061761M39381k300162j030759L252845
$$ 8184305 8620328 6845666 4054810 3786540 5848301 6287682 3987520 2956761 6209606
2829F209606M609338P00496m540850o541754m533655n63872K612872K933171J040783
$$ 6209606 10818944 11519440 6978590 436836 -4096819 -4660691 -2047819 885352 1926135
2820A926135N0359R77280O61670k482259l878448P33270O905592O609642O24083
$$ 1926135 1976494 2953774 3615444 1133185 -2745263 -2011993 4893599 11503241 12127324
2811A2127324k111695J775427N129203J741156m578233o726259m191598j212362
$$ 12127324 10015629 11791056 16920259 18661415 14083182 7356923 3165325 1952963
2803A952963L64176J192832Q72159o63775q27892J827648L834254J613462j970537
$$ 1952963 2317139 3509971 4382130 3718355 2890463 4718111 8552365 10165827 8195290
2794H195290j230813L145401M126449j723267r015528j0193644m510596J562028
$$ 8195290 6964477 10109878 14236327 12513060 3497532 -6696112 -11206708 -9644680
2786i644680J541176m380096r187977o023606L629779J0164997O637408k018175
$$ -9644680 -8103504 -12483600 -21671577 -27695183 -24065404 -13900407 -7262999 -9281174
2778i281174m389218K896861J0720173R538403J655854k805160J92407M314110
$$ -9281174 -13670392 -10773531 -53358 9485045 11140899 8335739 8528146 12842256
2770A2842256K896523k108608m366668k578375q47946j181070r84425J308799
$$ 12842256 15738779 13630171 9263503 6685128 5837182 4656112 3671687 4980486
2762D980486L034605J898937k08178q66461j167235k708964l691602k179548o24115
$$ 4980486 8015091 9914028 9705850 8839389 7672154 4963190 1271588 -907960 -1532075
2753a532075k211870m667649l304586Q30136K029993p60370k086006J085780M529073
$$ -1532075 -3743945 -8411594 -11716180 -10886044 -8856051 -9616421 -11702427 -10616647 -6087574
2744f087574L528944m21944k788408j955142Q02219L812212M910626K273137k202648
$$ -6087574 -2558630 -2980574 -5768982 -7724124 -6921905 -3109693 1800933 4074070 1871422
2735A871422l743734j102070J732741K296621L139533N385015M559781j745427
$$ 1871422 -1872312 -2974382 -1241641 1054980 4194513 9579528 14139309 12393882
2727A2393882o939406l389426N468562Q672134K606430n010999o829955m702995
$$ 12393882 5454476 2065050 7533612 16205746 18812176 13801177 6971222 2268227
2719B268227m157551n503145m778648q60868K607319K262047o21022j906571J63470
$$ 2268227 -1889324 -7392469 -12171117 -13031985 -10424666 -8162619 -8783641 -10690212 -10526742
2710a0526742L071684M018563M094730N944533Q226996O502425L89678m601682
$$ -10526742 -7455058 -3436495 658235 6602768 14829764 21332189 21721867 17120185
2702A7120185m536366k115439j229166p03610K082903M849677L308091j422727
$$ 17120185 12583819 10468380 9239214 8535604 10618507 15468184 18776275 17353548
2694A7353548l821941j855961Q59863P61996j772391m359020n158584l500220
$$ 17353548 13531607 11675646 12535509 13297505 11525114 7166094 2007510 -1492710
2686a492710n27851J258932J040617P08013J065968O3467k475135k501932J579398
$$ -1492710 -2020561 -761629 278988 987001 2052969 2116436 -358699 -2860631 -1281233
2677a281233M360566J487065k079419L81790N130943K978268n268894r104447
$$ -1281233 3079333 4566398 2486979 2868769 7999712 10977980 5709086 -3395361
2669c395361m447761J393605L005025M157792P663060Q431649L100962k219854
$$ -3395361 -7843122 -6449517 -3444492 713300 8376360 16808009 19908971 17689117
2661A7689117j416762J543068j5407m001834m039750p58718L94104n24018J052224
$$ 17689117 16272355 17815423 17800016 13798182 9758432 8999714 9393818 8869800 9922024
2652I922024M381077L412827l078687q802234q523683l461847K550356O695921
$$ 9922024 14303101 17715928 14637241 5835007 -2688676 -6150523 -3600167 3095754
2644C095754O391871P70987n601238n885329R3444M743245K794874j921158k722781
$$ 3095754 9487625 10258612 4657374 -1227955 -1134511 3608734 6403608 4482450 1759669
2635A759669O93489L142700J813501q08290j434630j80905N79378k84325j720963
$$ 1759669 2453158 5595858 7409359 6601069 5166439 4985534 5564912 5280587 3559624
2626C559624k580585l180791m047832m199559k411864K96826J801729K523277
$$ 3559624 979039 -2201752 -6249584 -10449143 -12861007 -12564181 -10762452 -8239175
2618h239175M902617Q387058Q539365L302248l131670n621430m379008k741260
$$ -8239175 -3336558 5050500 13589865 16892113 13760443 8139013 3760005 1018745
2610A018745j602202j77902K27149j855865m021910k894274J12065R76606j44106
$$ 1018745 -583457 -761359 -534210 -2390075 -6411985 -9306259 -9194194 -8217588 -8361694
2601h361694N443Q03985j439862n510413n454178l75320L308975K284258J560120
$$ -8361694 -8356251 -7552266 -8992128 -14502541 -19956719 -20332039 -17023064 -14738806 -13178686
2592a3178686M880927P289317L870217l01807K314463Q108955O149766n040191
$$ -13178686 -8297759 -1008442 2861775 2559968 4874431 12983386 19133152 14092961
2584A4092961j3972104j1485754j867457M593497L919545p07057n261342p006077
$$ 14092961 120857 -11364897 -13232354 -8638857 -4719312 -5426369 -10687711 -17693788
2576a7693788l695615L955764J0311477R809212L759325j181685j313914L22367
$$ -17693788 -21389403 -17433639 -7122162 2687050 6446375 5264690 3950776 4273143
2568D273143j001989n328205p983660m972877K394683Q279464Q060853L268954
$$ 4273143 3271154 -2057051 -10040711 -15013588 -12618905 -4339441 3721412 6990366
2560F990366m23636k51782Q79387k52137k084223j420265O57506K58598k708051
$$ 6990366 6566730 6314948 7194335 6942198 4857975 3437710 4095216 4353814 1645763
2551A645763l797821n51311L851586M603541K71653o708543j1663084r764007
$$ 1645763 -2152058 -2703369 1148217 5751758 6023411 -685132 -12348216 -22112223
2543b2112223m58575R386434J1115038M554106j766125k268247o04326j318958
$$ -22112223 -22570798 -13184364 -2069326 2484780 718655 -1549592 -2153918 -3472876
2535c472876j806650J595508M964459K251196l723077m307467J927864P289048
$$ -3472876 -5279526 -3684018 1280441 3531637 -191440 -4498907 -2571043 4718005
2527D718005O291784J253717m132490q845383j0337120m454511O733804J3880353
$$ 4718005 11009789 12263506 8131016 -714367 -11051487 -15505998 -8772194 5108159
2519E108159J1426435M090369j315966m167245n686857l405901L194354P097040
$$ 5108159 16534594 20624963 19308997 15141752 9454895 6048994 9243348 16340388
2511A6340388J973128p451674j1193607p776008m147246l269718n02117O723406
$$ 16340388 18313516 10861842 -331765 -8107773 -12255019 -15524737 -16026854 -9303448
2503i303448J3347277J3536238P688882J45678n783901q401513p072554l479764
$$ -9303448 4043829 17580067 25268949 25414627 19630726 11229213 4156659 676895
2495F76895q97374o52941j168145q23882N34518K755763N202598N643867K480339
$$ 676895 -220479 -873420 -2041565 -2865447 -2330929 424834 5627432 11271299 13751638
2486A3751638j994014l685993j958468J79561N77166o14158l041210n819453o076320
$$ 13751638 11757624 8071631 6113163 6292724 6869890 6255732 3214522 -2604931 -8681251
2477h681251k203046K334783L113187J435636J460877K329258L16204k365011
$$ -8681251 -10884297 -8549514 -5436327 -4000691 -2539814 -210556 105648 -2259363
2469b259363p9745M472680J735645q373161j2786008m118541P079828P643285
$$ -2259363 -2339108 2133572 3869217 -4503944 -17289952 -21408493 -14328665 -6685380
2461f685380P37061j346216L019506M713733N80358k370012J44285L396839K585123
$$ -6685380 -5948319 -7294535 -4275029 438704 1019062 -1350950 -1206665 2190174 4775297
2452D775297m31176j943731j291120R21857L549601L017115k793075q277158n423720
$$ 4775297 4344121 2400390 1109270 2031127 5580728 8597843 5804768 -2472390 -7896110
2443g896110L400155O718721P75580m224342J69269P467430O508612j659786o334886
$$ -7896110 -4495955 2222766 2998346 -1225996 -1056727 6410703 12919315 11259529 4924643
2434D924643k952107K612471M212781K009549j373528m710791o859519o322705
$$ 4924643 1972536 4585007 8797788 10807337 9433809 4723018 -2136501 -8459206
2426h459206l534807o25675J302154K232953J678135P0593J25901L121874N490557
$$ -8459206 -11994013 -12619688 -11317534 -9084581 -7406446 -7335853 -7209952 -4088078 1402479
2417A402479L419189p52712j696181O73512J757849K44461p78439o60558k370044
$$ 1402479 4821668 4068956 2372775 3046287 4804136 5048597 4270158 3609600 1239556
2408A239556n740448o257283k593242R88389K032466L180251N425979N230837
$$ 1239556 -4500892 -10758175 -13351417 -12363028 -10330562 -7150311 -1724332 3506505
2400C506505J990886P62228K685534R88033o510505r498542o8913J1446348Q821102
$$ 3506505 5497391 6259619 8945153 9933186 3422681 -6075861 -6144774 5301574 14122676
2391A4122676n482959j2704254m801263N605156N850559j3709j993479j02511
$$ 14122676 8639717 -4064537 -8865800 -3260644 2589915 2576206 582727 480216
2383D80216k00359k244388k599655k372533m091085m427086O32083O654766N961067
$$ 480216 279857 -1964531 -4564186 -6936719 -11027804 -15454890 -14822807 -8168041 -2206974
2374b206974j78817l420617j125210J500969J462633J212887J329407j053703
$$ -2206974 -2385791 -5806408 -6931618 -5430649 -3968016 -2755129 -1425722 -2479425
2366b479425m617292l186753M172974R884006Q303789K743639j485076m016980
$$ -2479425 -7096717 -10283470 -6110496 3773510 12077299 14820938 13335862 9318882
2358I318882n113171j836876N170399P600243J24777r551949r933381j942227
$$ 9318882 4205711 2368835 7539234 15139477 15264254 5712305 -4221076 -6163303
$$ [...]
##END NTUPLES=NMR SPECTRUM
##END=
