##TITLE=31Pdec_DE-75H_b
 D2O, 64 sc
 4.2.2025
##JCAMPDX= 6.0         $$ Bruker NMR JCAMP-DX V2.0
##DATA TYPE= NMR SPECTRUM
##DATA CLASS= NTUPLES
##ORIGIN= UXNMR, Bruker Analytische Messtechnik GmbH
##OWNER= root
$$ XWIN-NMR		Version 3.5
$$ Tue Feb  4 16:38:21 2025 Russian Standard Time (UT+4h)  she@DPX200
##.OBSERVE FREQUENCY= 81.013821
##.OBSERVE NUCLEUS= ^31P
##.ACQUISITION MODE= SIMULTANEOUS
##.ACQUISITION SCHEME= undefined
##.AVERAGES= 64
##.DIGITISER RES= 17
##SPECTROMETER/DATA SYSTEM= spect
##.PULSE SEQUENCE= zgpg30
##.SOLVENT NAME= D2O
##.SHIFT REFERENCE= (INTERNAL, D2O, 0, 198.062)
##AUDIT TRAIL= $$ (NUMBER, WHEN, WHO, WHERE, WHAT)
$$ ##TITLE= Audit trail, XWIN-NMR		Version 3.5
$$ ##JCAMPDX= 5.01
$$ ##ORIGIN= Bruker BioSpin GmbH
$$ ##OWNER= she
$$ F:/spectra/data/she/nmr/P31/2/pdata/1/auditp.txt
$$ ##AUDIT TRAIL=  $$ (NUMBER, WHEN, WHO, WHERE, WHAT)
(   1,<2025-02-04 16:35:59.96 +0400>,<she>,<DPX200>,
      <created by zg, POWCHK disabled, PULCHK disabled
       configuration hash MD5:
       00 E9 B6 7A A2 85 ED C7 34 08 36 98 17 FE 4E 26
       data hash MD5: 32K
       74 33 C4 2D FB 1D 48 59 FE 3C A8 D1 14 28 A4 2D>)
(   2,<2025-02-04 16:36:02.50 +0400>,<she>,<DPX200>,
      <Start of raw data processing
       efp BC_mod = 2 LB = 1.5 FT_mod = 6 PKNL = 1 PHC0 = 1346.636 PHC1 = 1029.295 SI = 64K 
       data hash MD5: 64K
       76 7B E0 D4 38 A0 86 26 D7 F7 A6 41 F7 37 9F 3F>)
(   3,<2025-02-04 16:36:30.15 +0400>,<she>,<DPX200>,
      <pk PHC0 = -134.5228 PHC1 = 340.0002 
       data hash MD5: 64K
       C6 1D 21 55 CC C6 BC A1 EF 8F 3D 1E 92 62 EF 19>)
(   4,<2025-02-04 16:36:38.40 +0400>,<she>,<DPX200>,
      <abs ABSG = 5 
       data hash MD5: 64K
       40 F9 85 D6 0B EC FF 56 26 47 2E C9 4C 68 71 4F>)
$$ ##END=
$$ 
$$ hash MD5
$$ 97 8D FB D1 81 C5 49 31 8A 2D AF 06 6E 20 5D CF
##$RELAX= 
##$RELAX= 
##$RELAX= 
##$RELAX= 
##$RELAX= 
##$RELAX= 
##$RELAX= 
##$RELAX= 
$$ Bruker specific parameters
$$ --------------------------
##$DU= <F:/spectra>
##$EXPNO= 2
##$NAME= <P31>
##$PROCNO= 1
##$TYPE= <nmr>
##$USER= <she>
##$AMP= (0..31)
100 100 100 100 100 100 100 100 100 100 100 100 100 100 100 100 100 100 
100 100 100 100 100 100 100 100 100 100 100 100 100 100 
##$AQSEQ= 0
##$AQ_mod= 1
##$AUNM= <au_zg>
##$AUTOPOS= <>
##$BF1= 81.014009
##$BF2= 200.13
##$BF3= 200.13
##$BF4= 200.13
##$BF5= 200.13
##$BF6= 200.13
##$BF7= 200.13
##$BF8= 200.13
##$BYTORDA= 1
##$CFDGTYP= 0
##$CFRGTYP= 5
##$CHEMSTR= <none>
##$CNST= (0..31)
1 1 145 1 1 1 1 1 1 1 1 1 1 1 1 1 1 1 1 1 1 1 1 1 1 1 1 1 1 1 1 1 
##$CPDPRG= <waltz16>
##$CPDPRG1= <>
##$CPDPRG2= <waltz16>
##$CPDPRG3= <>
##$CPDPRG4= <mlev>
##$CPDPRG5= <mlev>
##$CPDPRG6= <mlev>
##$CPDPRG7= <mlev>
##$CPDPRG8= <mlev>
##$CPDPRGB= <>
##$CPDPRGT= <>
##$D= (0..31)
0 1 0 0 0 0 0 0 0 0.06 0 0.03 2e-05 3e-06 0 0 0.0002 0 0 0 0 0 0 0 0 0 
0 0 0 0 0 0 
##$DATE= 1738672559
##$DBL= (0..7)
120 120 120 11 120 120 24 19 
##$DBP= (0..7)
150 150 150 150 150 150 150 150 
##$DBP07= 0
##$DBPNAM0= <>
##$DBPNAM1= <>
$$ [...]
##$SUBNAM3= <"">
##$SUBNAM4= <"">
##$SUBNAM5= <"">
##$SUBNAM6= <"">
##$SUBNAM7= <"">
##$SUBNAM8= <"">
##$SUBNAM9= <"">
##$SW= 400.765351723535
##$SWIBOX= (0..15)
0 1 3 0 0 0 0 0 0 0 0 0 0 0 0 0 
##$SW_h= 32467.5324675325
##$TD= 32768
##$TD0= 1
##$TE= 0
##$TE2= 300
##$TE3= 300
##$TEG= 300
##$TL= (0..7)
0 120 53 12 22 120 120 120 
##$TP= (0..7)
150 150 150 150 150 150 150 150 
##$TP07= 0
##$TPNAME0= <>
##$TPNAME1= <>
##$TPNAME2= <>
##$TPNAME3= <>
##$TPNAME4= <>
##$TPNAME5= <>
##$TPNAME6= <>
##$TPNAME7= <>
##$TPOAL= (0..7)
0.5 0.5 0.5 0.5 0.5 0.5 0.5 0.5 
##$TPOFFS= (0..7)
0 0 0 0 0 0 0 0 
##$TUNHIN= 0
##$TUNHOUT= 0
##$TUNXOUT= 0
##$USERA1= <user>
##$USERA2= <user>
##$USERA3= <user>
##$USERA4= <user>
##$USERA5= <user>
##$V9= 5
##$VALIST= <valist>
##$VCLIST= <CCCCCCCCCCCCCCC>
##$VD= 0
##$VDLIST= <DDDDDDDDDDDDDDD>
##$VPLIST= <PPPPPPPPPPPPPPP>
##$VTLIST= <TTTTTTTTTTTTTTT>
##$WBST= 1024
##$WBSW= 4
##$XGAIN= (0..3)
0 0 0 0 
##$XL= 0
##$YL= 0
##$YMAX_a= 9288
##$YMIN_a= -10926
##$ZGOPTNS= <>
##$ZL1= 120
##$ZL2= 120
##$ZL3= 120
##$ZL4= 120
##$ABSF1= 198.0616
##$ABSF2= -202.7028
##$ABSG= 5
##$ABSL= 3
##$ALPHA= 0
##$AQORDER= 0
##$ASSFAC= 0
##$ASSFACI= 0
##$ASSFACX= 0
##$ASSWID= 0
##$AUNMP= <proc_1d>
##$AZFE= 0.1
##$AZFW= 0.5
##$BCFW= 0
##$BC_mod= 2
##$BYTORDP= 0
##$COROFFS= 0
##$CY= -3
##$DATMOD= 1
##$DC= 0
##$DFILT= <>
##$DTYPP= 0
##$F1P= 0
##$F2P= 0
##$FCOR= 1
##$FTSIZE= 65536
##$FT_mod= 6
##$GAMMA= 0
##$GB= 0
##$INTBC= 1
##$INTSCL= 9.790993e-09
##$ISEN= 30
##$LB= 1.5
##$LEV0= 0
##$LPBIN= 0
##$MAXI= 10000
##$MC2= 0
##$MEAN= 0
##$ME_mod= 0
##$MI= 50
##$NCOEF= 0
##$NC_proc= -9
##$NLEV= 6
##$NOISF1= 182.463
##$NOISF2= 159.3651
##$NSP= 0
##$NTH_PI= 0
##$NZP= 0
##$OFFSET= 198.0616
##$PC= 4
##$PHC0= 1212.113
##$PHC1= 1369.295
##$PH_mod= 1
##$PKNL= yes
##$PPARMOD= 0
##$PSCAL= 0
##$PSIGN= 0
##$REVERSE= no
##$SF= 81.0140089999434
##$SI= 65536
##$SIGF1= 159.3651
##$SIGF2= -187.1042
##$SINO= 113.3802
##$SIOLD= 16384
##$SREGLST= <1H.CDCl3>
##$SSB= 0
##$STSI= 65536
##$STSR= 0
##$SW_p= 32467.5324675325
##$SYMM= 0
##$S_DEV= 0
##$TDeff= 32768
##$TDoff= 0
##$TI= <>
##$TILT= no
##$TM1= 0
##$TM2= 0
##$TOPLEV= 0
##$USERP1= <user>
##$USERP2= <user>
##$USERP3= <user>
##$USERP4= <user>
##$USERP5= <user>
##$WDW= 1
##$XDIM= 65536
##$YMAX_p= 315625567
##$YMIN_p= -110960204
$$ End of Bruker specific parameters
$$ ---------------------------------
##NTUPLES= NMR SPECTRUM
##VAR_NAME=  FREQUENCY,     SPECTRUM/REAL,   SPECTRUM/IMAG
##SYMBOL=    X,             R,               I
##VAR_TYPE=  INDEPENDENT,   DEPENDENT,       DEPENDENT
##VAR_FORM=  AFFN,          ASDF,            ASDF
##VAR_DIM=   65536,         65536,           65536
##UNITS=     HZ,            ARBITRARY UNITS, ARBITRARY UNITS
##FACTOR=    0.49542278885378, 1,            1
##FIRST=     16045.7642231865, 0,            0
##LAST=      -16421.768244346, 0,            0
##MIN=       -16421.768244346, -110960204,   0
##MAX=       16045.7642231865, 315625567,    0
$$ Real data points
##PAGE= N=1
##DATA TABLE= (X++(R..R)), XYDATA
$$ [...]
##PAGE= N=2
##DATA TABLE= (X++(I..I)), XYDATA
$$ plain form
7372 262166 -2811778 -2921181 -101883 384013 -3155811 -5180863 -660397 8114680 15752073
7363 15752073 20888057 24956707 26678384 22865260 14209890 6109732 2877078 3709439
7355 3709439 5204846 5837621 6700340 8820211 10957622 10263771 5047375 -3033100 -9595563
7346 -9595563 -10592324 -5230097 3388818 10316959 12424857 10941579 9971413 12107427 16377972
7337 16377972 20608240 23588368 23826177 19229673 10906209 4570387 3948753 4791094 834943
7328 834943 -5385633 -4535370 5743065 16243352 18654097 16032076 15617739 16690696
7320 16690696 12955081 4194327 -2412540 -2690489 -483432 -735369 -2983588 -4100345
7312 -4100345 -3214454 -1059977 2277730 5811064 6235186 1621525 -4417733 -5465247 482280
$$ packed form
7372B62166l073944j09403K819298M85896l539824k025052M520466Q775077P637393
7363A5752073N135984M068650J721677l813124q655370q100158l232654Q32361
7355C709439J495407O32775Q62719K119871K137411o93851n216396q080475o562463
7346i595563r96761N362227Q618915O928141K107898j483278r70166K136014M270545
7337A6377972M230268K980128K37809m596504q323464o335822o21634Q42341l956151
7328H34943o220576Q50263J0278435J0500287K410745k622021m14337J072957
7320A6690696l735615q760754o606867k77949K207057k51937k248219j116757
7312d100345Q85891K154477L337707L533334M24122m613661o039258j047514N947527
$$ plain form
7303 482280 8710034 13421039 14111956 15008115 18710386 22140252 19995728 11546013 1961052
7294 1961052 -3779469 -6200624 -8672701 -11228076 -10416598 -5133820 1029657 4502292
7286 4502292 5730145 6577152 6666690 5272933 4502043 6553310 9034601 7690464 3851892
7277 3851892 4017119 10236662 15835115 14139938 7408361 2503694 1013309 -395347
7269 -395347 -1850800 194974 5141663 7401424 5642899 5951144 11859382 17383303 15322380
7260 15322380 7490358 538740 -4122704 -8975138 -12293093 -10139165 -5346488 -5512328
7252 -5512328 -11037117 -13624309 -9187170 -4352431 -6103848 -11755228 -14296007 -12223019
7244 -12223019 -8492288 -4130986 938811 3595347 139484 -7914433 -15300313 -19255225
$$ packed form
7303D82280Q227754M711005O90917Q96159L702271L429866k144524q449715r584961
7294A961052n740521k421155k472077k555375Q11478N282778O163477L472635
7286D502292J227853Q47007Q9538j393757p70890K051267K481291j344137l838572
7277C851892J65227O219543N598453j695177o731577m904667j490385j408656
7269c95347j455453K045774M946689K259761j758525L08245N908238N523921k060923
7260A5322380p832022o951618m661444m852434l317955K153928M792677j65840
7252e512328n524789k587192M437139M834739j751417n651380k540779K072988
7244a2223019L730731M361302N069797K656536l455863q053917p385880l954912
$$ plain form
7236 -19255225 -20582305 -20017254 -17574446 -14455232 -12006942 -9767063 -7485724 -7196957
7228 -7196957 -9766103 -11586120 -9139217 -5022515 -4322664 -6170197 -4668388 1670934
7220 1670934 7135178 6897102 3068617 462232 50147 -721031 -3405147 -6574298 -7351271
7211 -7351271 -4161774 1047161 3769463 1965237 -544842 1765000 8984189 15490317
7203 15490317 16559555 12525989 6663465 1915737 -273455 -677214 -1909567 -5159729
7195 -5159729 -8219882 -9235708 -10319749 -13381437 -14536353 -8585916 1775660 7915332
7187 7915332 6988477 4949937 6182811 6985756 2665701 -4729016 -9762117 -10170075 -6666940
7178 -6666940 -754366 3817647 2175764 -4975675 -10088819 -8397716 -4519353 -4993573
$$ packed form
7236a9255225j327080N65051K442808L119214K448290K239879K281339K88767
7228g196957k569146j820017K446903M116702O99851j847533J501809O339322
7220A670934N464244k38076l828485k606385m12085p71178k684116l169151p76973
7211g351271L189497N208935K722302j804226k510079K309842P219189O506128
7203A5490317J069238m033566n862524m747728k189192m03759j232353l250162
7195e159729l060153j015826j084041l061688j154916N950437J0361576O139672
7187G915332r26855k038540J232874Q02945m320055p394717n033101m07958L503135
7178f666940N912574M572013j641883p151439n113144J691103L878363m74220
$$ plain form
7170 -4993573 -8813227 -10863413 -10595897 -10695194 -10135788 -5651136 1344198 5687166 5466272
7161 5466272 2529061 -2654644 -10444207 -17135079 -17242562 -11236514 -5342085 -3024965
7153 -3024965 -1973121 530 1670195 1975869 1412379 -1445587 -9294102 -20022770
7145 -20022770 -26432139 -24579280 -18206927 -12790470 -9570150 -7733371 -7795669 -9497204
7137 -9497204 -10103524 -8158619 -5881323 -4977263 -3353865 732473 4196990 2421186 -4908136
7128 -4908136 -14050923 -21187126 -23646604 -19950996 -12116015 -5982995 -5775937 -9413184
7120 -9413184 -11769735 -11059385 -9408696 -8763283 -9063298 -9320576 -8283980 -5467275 -3184976
7111 -3184976 -4939538 -9410697 -9464365 -1143782 9192452 11835401 6206827 944781
$$ packed form
7170d993573l819654k050186K67516r9297N59406M484652O995334M342968k20894
7161E466272k937211n183705p789563o690872j07483O006048N894429K317120
7153c024965J051844J973651J669665L05674n63490k857966p848515j0728668
7145b0022770o409369J852859O372353N416457L220320J836779o2298j701535
7137i497204o06320J944905K277296R04060J623398M086338L464517j775804p329322
7128d908136r142787p136203k459478L695608P834981O133020K07058l637247
7120i413184k356551P10350J650689O45413l00015k57278J036596K816705K282299
7111c184976j754562m471159n3668Q320583J0336234K642949n628574n262046
$$ plain form
7103 944781 2068348 6637078 9018099 8315266 7244625 7119632 6652141 4289475 361440
7094 361440 -2502772 -1609936 1816780 2507325 -2301532 -7925979 -7825820 -2811428 413457
7085 413457 -646035 -1835834 -994285 -2199165 -7988515 -13092381 -10895252 -2383210 6107514
7076 6107514 10975404 12335353 9777755 3135878 -3610031 -4976029 -870771 3758957
7068 3758957 6372593 8990346 11936650 10753246 2474964 -8521457 -14531701 -12703972
7060 -12703972 -6623792 -1339006 489149 -1298750 -4766462 -6005608 -1323618 9206320
7052 9206320 20953500 28121210 27947001 21971506 13990462 6983471 1654061 -2444713
7044 -2444713 -4951850 -4627094 -1143899 4160855 9690888 14434486 16596298 13145145
$$ packed form
7103I44781J123567M568730K381021p02833j070641j24993m67491k362666l928035
7094C61440k864212Q92836L426716O90545m808857n624447J00159N014392L224885
7085D13457j059492j189799Q41549j204880n789350n103866K197129Q512042Q490724
7076F107514M867890J359949k557598o641877o745909j365998M105258M629728
7068C758957K613636K617753K946304j183404q278282j0996421o010244J827729
7060a2703972O080180N284786J828155j787899l467712j239146M681990J0529938
7052I206320J1747180P167710j74209n975495p981044p006991n329410m098774
7044b444713k507137L24756L483195N304754N530033M743598K161812l451153
$$ plain form
7036 13145145 3075624 -9404271 -17600240 -18932581 -16803886 -15233332 -14250739 -12378190
7028 -12378190 -10973506 -12573362 -16123798 -17760042 -16237524 -13783359 -11363191 -7809240
7020 -7809240 -4944259 -7861755 -16439183 -21899928 -17678361 -9580232 -7631203 -10713380
7012 -10713380 -8905314 -649119 3648960 -1455409 -6831715 -3162749 4085094 3855332
7004 3855332 -2789051 -5677825 -2681287 -1372905 -4064056 -3770100 2289394 6865612
6996 6865612 5455997 4560717 10012429 15790874 13532626 6700234 5013581 8820741
6988 8820741 9940348 6645085 6707555 13672324 19671087 16261387 5727224 -3032340
6980 -3032340 -5016908 -1221776 5640562 12553893 15717077 13328571 8201993 4540025
$$ packed form
7036A3145145j0069521j2479895q195969j332341K128695J570554R82593J872549
7028a2378190J404684j599856l550436j636244J522518K454165K420168L553951
7020g809240K864981k917496q577428n460745M221567Q098129J949029l082177
7012a0713380J808066Q256195M298079n104369n376306L668966P247843k29762
7004C855332o644383k888774K996538J308382k691151K93956O059494M576218
6996F865612j409615q95280N451712N778445k258248o832392j686653L807160
6988H820741J119607l295263O2470O964769N998763l409700j0534163q759564
6980c032340j984568L795132O862338O913331L163184k388506n126578l661968
$$ plain form
6972 4540025 2917787 1166673 -708596 227818 5344060 11711229 15004699 13893327
6964 13893327 10704158 8587217 9041732 11909627 16305223 20454266 21559588 18070760
6956 18070760 12417014 9017711 8330155 5551736 -2391268 -11095849 -13489323 -8680969
6948 -8680969 -1941861 2902523 6180800 7913490 6352085 2248215 -621607 -1281038
6940 -1281038 -3155035 -7460573 -10016079 -8164507 -6190432 -9096808 -14575887 -16400555
6932 -16400555 -13202774 -8513403 -3996184 1608101 7578186 10793477 10444520 8510746
6924 8510746 5433011 104040 -5398713 -6359016 -2498369 78474 -3342313 -9906875
6916 -9906875 -13663105 -13392760 -12673327 -13676345 -14151597 -10745350 -3598515 3001520 4602674
$$ packed form
6972D540025j622238j751114j875269R36414N116242O367169L293470j111372
6964A3893327l189169k116941M54515K867895M395596M149043J105322l488828
6956A8070760n653746l399303o87556k778419p943004q704581k393474M808354
6948h680969O739108M844384L278277J732690j561405m103870k869822o59431
6940a281038j873997m305538k555506J851572J974075k906376n479079j824668
6932a6400555L197781M689371M517219N604285N970085L215291l48957j933774
6924H510746l077735n328971n502753r60303L860647K576843l420787o564562
6916i906875l756230K70345P19433j003018m75252L406247P146835O600035J601154
$$ plain form
6907 4602674 1504705 -976999 1719638 8236676 13677916 16108574 17833218 20617554
6899 20617554 23109920 23643115 22392709 19662560 14997261 9370820 5478006 4229853
6891 4229853 3428316 1423377 -599904 -1803082 -4280885 -9706554 -15454243 -17119087
6883 -17119087 -13911989 -9160718 -6274508 -6246120 -8225718 -10270550 -9780020 -5148849 2449311
6874 2449311 9520626 12785762 11962618 10914632 14717475 23105192 27926385 21194031
6866 21194031 5766173 -6728800 -9580154 -7032226 -4597813 -442200 8161149 15921622
6858 15921622 15434658 8990895 5913908 9119914 12716089 13184796 14012757 16749190 16069642
6849 16069642 8812167 1353472 1650206 8106231 12441465 10797568 6204797 2083625
$$ packed form
6907D602674l097969k481704K696637O517038N441240K430658J724644K784336
6899B0617554K492366N33195j250406k730149m665299n626441l892814j248153
6891D229853q01537k004939k023281j203178k477803n425669n747689j664844
6883a7119087L207098M751271K886210K8388j979598k044832M90530M631171P598160
6874B449311P071315L265136q23144j047986L802843Q387717M821193o732354
6866B1194031j5427858j2494973k851354K547928K434413M155613Q603349P760473
6858A5921622m86964o443763l076987L206006L596175M68707Q27961K736433o79548
6849A6069642p257475p458695K96734O456025M335234j643897m592771m121172
$$ plain form
6841 2083625 -733577 -1483612 58700 290948 -5574025 -16204205 -24087870 -24568270 -20768440
6832 -20768440 -17309536 -13488761 -6544294 1568881 5808435 5241004 3540968 2070359
6824 2070359 -2480963 -11480514 -19576555 -20162660 -13325611 -4826716 1291307 5408297
6816 5408297 8716333 11193356 13266278 15375475 15325343 10525842 4066093 3280134 9381799
6807 9381799 13865297 10070596 3600670 4160849 10041038 9781586 -378279 -9856662
6799 -9856662 -8206173 1105314 7026299 5787389 2649739 1781865 1731614 722022 -63965
6790 -63965 -209114 -1986927 -5632482 -6206250 1040975 13529582 22818715 23169316 16303419
6781 16303419 7380717 -1174230 -9998863 -18538884 -23640488 -23269218 -19395968 -15283036
$$ packed form
6841B083625k817202p50035J542312K32248n864973j0630180p883665m80400L799830
6832b0768440L458904L820775O944467Q113175M239554n67431j700036j470609
6824B070359m551322q999551q096041n86105O837049Q498895O118023M116990
6816E408297L308036K477023K072922K109197n0132m799501o459749p85959O101665
6807I381799M483498l794701o469926N60179N880189k59452j0159865r478383
6799i856662J650489R311487N920985j238910l137650q67874n0251j009592p85987
6790f3965j45149j777813l645555n73768P247225J2488607R289133L50601o865897
6781A6303419q922702q554947q824633q540021n101604L71270L873250M112932
$$ plain form
6773 -15283036 -11214356 -5311132 1925119 6735147 6703764 4298481 4429855 9311906 16426045
6764 16426045 20809922 19111353 12433010 5453498 1892556 1210733 1009496 1358222 3612247
6755 3612247 5521018 2265390 -5923007 -11649035 -9307891 -2824026 -131775 -2199419
6747 -2199419 -2625209 2579633 10019393 14667385 16193839 17433619 19621318 21651215
6739 21651215 22300607 21066646 17921154 13992124 11660530 12264721 13980998 13457227 9870766
6730 9870766 6403934 6895790 11201031 14849728 14099883 10577379 9139396 11177887 12656584
6721 12656584 10170940 6321570 6127024 9701383 12243300 10989689 8226395 6350402
6713 6350402 3583788 -2880724 -11671318 -18093922 -19552095 -17890041 -16347356 -15955330
$$ packed form
6773a5283036M068680N903224P236251M810028l1383k405283J31374M882051P114139
6764A6426045M383877j698569o678343o979512l560942o81823k01237L48726K254025
6755C612247J908771l255628q188397n726028K341144O483865K692251k067644
6747b199419m25790N204842P439760M647992J526454J239780K187699K029897
6739B1651215O49392j233961l145492l929030k331594O04191J716277n23771l586461
6730I870766l466832M91856M305241L648697p49845l522504j437983K038491J478697
6721A2656584k485644l849370j94546L574359K541917j253611k763294j875993
6713F350402k766614o464512q790594o422604j458173J662054J542685L92026
$$ plain form
6705 -15955330 -15608768 -14619494 -13849047 -13894974 -13106796 -9134288 -2882604 1026121 -526316
6696 -526316 -4869464 -6889250 -5757225 -5236329 -7348656 -9307780 -8041523 -4671972 -2300621
6687 -2300621 -1522227 -544916 1702644 4865024 8442289 11602019 12652032 10981856 8921260
6678 8921260 9383591 11963632 13590209 12876985 11390302 10371807 8901464 6467590 5046246
6669 5046246 6678822 10328425 13083841 13705297 13149178 12157819 10494427 8663481 8191178
6660 8191178 9305052 10075439 9051168 7235570 6051924 5027819 3630131 3717704 6661370
6651 6661370 8661635 3526574 -8421789 -18348734 -18731971 -12084404 -6342998 -4116324
6643 -4116324 -1115359 5846784 14113432 18845855 17667318 11228694 2714878 -2713609
$$ packed form
6705a5955330L46562R89274P70447m5927P88178L972508O251684L908725j552437
6696e26316m343148k019786J132025N20896k112327j959124J266257L369551K371351
6687b300621P78394R77311K247560L162380L577265L159730J050013j670176k060596
6678H921260M62331K580041J626577p13224j486683j018495j470343k433874j421344
6669E046246J632576L649603K755416O21456n56119r91359j663392j830946m72303
6660H191178J113874P70387j024271j815598j183646j024105j397688Q7573K943666
6651F661370K000265n135061j1948363r926945l83237O647567N741406K226674
6643d116324L000965O962143Q266648M732423j178537o438624q513816n428487
$$ plain form
6635 -2713609 -1717705 2994244 5513879 4258448 2653312 1920004 -1098353 -6613537 -8420196
6626 -8420196 -2263898 7157824 13113098 16753798 23316966 31070586 32130044 24357765
6618 24357765 15089109 11306211 12321584 14474684 16980748 19253953 17360196 8432683
6610 8432683 -3665094 -11472950 -11709388 -6962188 -1108835 3702827 6442930 6837279
6602 6837279 5763164 4091939 1608202 -1218827 -1575374 2941574 10396228 16050760
6594 16050760 17930277 18376286 19666844 20669954 19128756 15369993 11960600 10509802
6586 10509802 10290746 9794073 8542286 7236197 6829834 7842791 10272958 13617218 16688666
6577 16688666 17790974 15858056 11715864 7774139 6137573 7138264 9506332 11382048
$$ packed form
6635b713609R95904M711949K519635j255431j605136p33308l018357n515184j806659
6626h420196O156298R421722N955274L640700O563168P753620J059458p772279
6618B4357765r268656l782898J015373K153100K506064K273205j893757q927513
6610H432683j2097777p807856k36438M747200N853353M811662K740103L94349
6602F837279j074115j671225k483737k827029l56547M516948P454654N654532
6594A6050760J879517M46009J290558J003110j541198l758763l409393j450798
6586A0509802k19056m96673j251787j306089m06363J012957K430167L344260L071448
6577A6688666J102308j932918m142192l941725j636566J000691K368068J875716
$$ plain form
6569 11382048 11444889 10216749 10304211 13827631 19076560 21422807 18687570 13939378 11190305
6560 11190305 9725813 5279306 -3602508 -13018897 -18056800 -17704361 -14788739 -12737717
6552 -12737717 -13248480 -15708711 -17793603 -17384360 -14520779 -10837093 -7189639 -3373160
6544 -3373160 -383365 -712434 -4974832 -9845556 -11116972 -7875390 -2287567 3493817
6536 3493817 8392830 11567316 12980678 14426472 17599787 21116622 21694411 18524244
6528 18524244 14219708 11038059 8669363 6664103 6398523 8816213 12162026 13945970
6520 13945970 13818640 12949296 12183623 12466031 14926200 18008706 16656680 8116435 -2552880
6511 -2552880 -7012144 -3736362 518449 133537 -2588938 -1974715 3067416 8265346 9063959
$$ packed form
6569A1382048O2841j228140Q7462L523420N248929K346247k735237m748192k749073
6560A1190305j464492m446507q881814r416389n037903L52439K915622K051022
6552a2737717n10763k460231k084892M09243K863581L683686L647454L816479
6544c373160K989795l29069m262398m870724j271416L241582N587823N781384
6536C493817M899013L174486J413362J445794L173315L516835N77789l170167
6528A8524244m304536l181649k368696k005260k65580K417690L345813J783944
6520A3945970j27330q69344p65673K82408K460169L082506j352026q540245j0669315
6511b552880m459264L275782M254811l84912k722475O14223N042131N197930P98613
$$ plain form
6502 9063959 4411612 -2716163 -6934180 -4612250 1930471 6407611 5934604 3480855
6494 3480855 1488494 -2541157 -10426170 -17361195 -17344992 -12368619 -9949830 -12106561 -12966895
6485 -12966895 -8061726 -151441 6064942 9853290 12244264 12137940 8167875 2052105
6477 2052105 -2671066 -3758461 -933928 4130188 7483730 5756612 935314 -930932
6469 -930932 2543667 7217870 9082283 9275158 9435300 6970385 101239 -5914885 -3830804
6460 -3830804 5721959 14841790 18086103 16614912 13217202 8633272 3593984 -62837
6452 -62837 -1744645 -2381492 -1757011 1167686 4790858 5185409 865368 -5418420 -10087635
6443 -10087635 -11449287 -9315810 -5085883 -1971434 -1737502 -1557114 2152257 7415510
$$ packed form
6502I063959m652347p127775m218017K321930O542721M477140m73007k453749
6494C480855j992361m029651p885013o935025J6203M976373K418789k156731q60334
6485a2966895M905169P910285O216383L788348K390974j06324l970065o115770
6477B052105m723171j087395K824533N064116L353542j727118m821298j866246
6469i30932L474599M674203J864413J92875J60142k464915o869146o016124K084081
6460c830804R552763R119831L244313j471191l397710m583930n039288l656821
6452f2837j681808o36847O24481K924697L623172L94551m320041o283788m669215
6443a0087635j361652K133477M229927L114449K33932J80388L709371N263253
$$ plain form
6435 7415510 8894120 6044722 3626347 3897420 4547491 5237167 8879081 14081954 14220040
6426 14220040 8305417 5080713 10126533 15971427 13189993 5642822 4724675 11852608
6418 11852608 17450874 16399447 13629243 12871985 10128399 2278745 -6218092 -10272322
6410 -10272322 -11226908 -12054095 -11692995 -9892037 -11857306 -20526839 -28226323 -24801613 -12798182
6401 -12798182 -5876339 -10808585 -18668319 -17234912 -6009048 6017152 13098307 16709195
6393 16709195 18355451 15581926 7732257 1023830 3288960 14805209 27828417 34955826
6385 34955826 34710032 28780335 18280711 5531145 -3963035 -6226267 -4750575 -7244381
6377 -7244381 -15831954 -24321070 -26384178 -22640340 -17561562 -13130720 -9100313 -6726191
$$ packed form
6435G415510J478610k849398k418375K71073O50071O89676L641914N202873J38086
6426A4220040n914623l224704N045820N844894k781434p547171r18147P127933
6418A1852608N598266j051427k770204p57258k743586p849654q496837m054230
6410a0272322r54586q27187L61100J800958j965269q669533p699484L424710J2003431
6401a2798182O921843m932246p859734J433407J1225864J2026200P081155L610888
6393A6709195J646256k773525p849669o708427K265130J1516249J3023208P127409
6385C4955826k45794n929697j0499624j2749566r494180k263232J475692k493806
6377g244381q587573q489116k063108L743838N078778M430842M030407K374122
$$ plain form
6369 -6726191 -7508740 -9202329 -7786631 -3821903 -2537530 -6208758 -10467546 -10697728 -8542522
6360 -8542522 -8238248 -9109374 -7010888 -2614072 -2296127 -8757096 -15821678 -16452955 -12213664
6351 -12213664 -9640078 -9563820 -6495888 1292769 7592528 6677626 904024 -3502359 -4313631
6342 -4313631 -3144983 -749460 3044351 6878307 9650857 12955333 17512228 19246401
6334 19246401 14222380 6170833 3019520 5981157 8249884 5458777 1164483 -109007
6326 -109007 867376 2037198 4775082 10035896 14037107 12871234 8649852 6391732 6933034
6317 6933034 7296845 6270556 5192376 4437215 3258541 2239272 2181896 1569305 -1127957
6308 -1127957 -3741647 -3218835 -1414071 -3429709 -9942089 -15559131 -15834987 -12257149 -9038303
$$ packed form
6369f726191p82549j693589J415698L964728J284373l671228m258788k30182K155206
6360h542522L04274q71126K098486M396816L17945o460969p064582o31277M239291
6351a2213664K573586P6258L067932P788657O299759r14902n773602m406383q11272
6342d313631J168648K395523L793811L833956K772550L304476M556895J734173
6334A9246401n024021q051547l151313K961637K268727k791107m294294j273490
6326a09007R76383J169822K737884N260814M001211j165873m221382k258120N41302
6317F933034L63811j026289j078180p55161j178674j019269n7376o12591k697262
6308a127957k613690N22812J804764k015638o512380n617042k75856L577838L218846
$$ plain form
6299 -9038303 -8112450 -8698488 -9251129 -8489378 -6381752 -4912695 -6151334 -9248368 -11169403
6290 -11169403 -10414276 -8069153 -5496222 -3252481 -1861121 -1128614 733744 4536952
6282 4536952 7582566 7141483 5431305 6690628 9898167 9756817 5164892 733053 -1309417
6273 -1309417 -4082474 -8351881 -8934286 -3674544 109087 -5067621 -15201894 -19896913
6265 -19896913 -16909847 -14074453 -16975384 -21700968 -21494288 -15322653 -7545974 -2571135
6257 -2571135 -1582866 -2011767 648576 8056748 15815176 17916986 14534648 12001546 14545859
6248 14545859 19695673 22908661 22942383 20799633 16911442 12078706 8576522 7437588
6240 7437588 6431226 3243444 -1018427 -4047044 -6421323 -10318535 -14931899 -16424368
$$ packed form
6299i038303R25853n86038n52641P61751K107626J469057j238639l097034j921035
6290a1169403P55127K345123K572931K243741J391360P32507J862358L803208
6282D536952L045614m41083j710178J259323L207539j41350m591925m431839k042470
6273a309417k773057m269407n82405N259742L783631n176708j0134273m695019
6265a9896913K987066K835394k900931m725584K06680O171635P776679M974839
6257b571135R88269m28901K660343P408172P758428K101810l382338k533102K544313
6248A4545859N149814L212988L3722k142750l888191m832736l502184j138934
6240G437588j006362l187782m261871l028617k374279l897212m613364j492469
$$ plain form
6232 -16424368 -12725895 -5843417 1071713 6616613 10286428 11033216 8418509 3889062
6224 3889062 -887466 -6165996 -12716593 -18768725 -20920634 -18802181 -16295185 -16205306 -15836134
6215 -15836134 -10936845 -2740163 3139438 4940267 7018533 11921412 15035399 11193231
6207 11193231 2912069 -3310378 -6462872 -10430217 -15039235 -15207988 -10434329 -7770538
6199 -7770538 -11513920 -16028095 -14269167 -8876005 -8024752 -12715868 -15504979 -11971948
6191 -11971948 -6856693 -6530497 -10091822 -11196549 -6287796 1761236 7358107 8072175
6183 8072175 6942555 8634386 12692829 12588030 4214809 -6469017 -8998359 -1351810
6175 -1351810 7952464 11611739 11305805 11105396 9857707 5772825 3077073 5837755 8014108
$$ packed form
6232a6424368L698473O882478O915130N544900L669815P46788k614707m529447
6224C889062m776528n278530o550597o052132k151909K118453K506996Q9879L69172
6215a5836134M899289Q196682N879601J800829K078266M902879L113987l842168
6207A1193231q281162o222447l152494l967345m609018j68753M773659K663791
6199g770538l743382m514175J758928N393162Q51253m691116k789111L533031
6191a1971948N115255L26196l561325j104727M908753Q049032N596871P14068
6183H072175j129620J691831M058443j04799q373221j0683826k529342P646549
6175a351810R304274L659275l05934k00409j247689m084882k695752K760682K176353
$$ plain form
6166 8014108 -673454 -18384848 -29984561 -25727273 -13334153 -6176021 -6072182 -5276495
6158 -5276495 -1001938 1508115 -244415 -1136977 2992722 8587107 10283194 8941186
6150 8941186 9151098 11721073 13478969 13123499 12643846 12994903 12468000 10389003 9089901
6141 9089901 10349286 12281973 12103197 10463365 10277154 11637616 10820299 5476375 -1340235
6132 -1340235 -4460165 -2946971 -757402 -1018094 -2085761 -449623 4301657 9068679
6124 9068679 10549297 7372397 364649 -6936705 -9010931 -2814627 7928460 15352408
6116 15352408 15289815 10752475 7224408 6875908 8515919 10897589 13899529 17268443 19548993
6107 19548993 18046731 10266447 -2705781 -14413205 -17840476 -13314624 -8659462 -9747607
$$ packed form
6166H014108q687562j7711394j1599713M257288J2393120P158132J03839P95687
6158e276495M274557K510053j752530q92562M129699N594385J696087j342008
6150H941186K09912K569975J757896l55470m79653L51057n26903k078997j299102
6141I089901J259385J932687j78776j639832j86211J360462q17317n343924o816610
6132a340235l119930J513194K189569k60692j067667J636138M751280M767022
6124I068679J480618l176900p007748p301354k074226O196304J0743087P423948
6116A5352408o2593m537340l528067l48500J640011K381670L001940L368914K280550
6107A9548993j502262p780284j2972228j1707424l427271M525852M655162j088145
$$ plain form
6099 -9747607 -14011956 -15605044 -13290620 -9342488 -3928311 3690636 9835513 8648510
6091 8648510 464982 -7353429 -9575931 -8457978 -7939767 -7307680 -4323223 -1088474 -1929404
6082 -1929404 -6723122 -10584476 -10173464 -6850205 -2925361 2037823 9170284 16381610
6074 16381610 19313031 16487939 11394589 7963186 5406643 192319 -7224443 -11387239
6066 -11387239 -9240484 -5001601 -4292993 -6225103 -5979775 -3411143 -3104896 -6023370 -7638360
6057 -7638360 -6206947 -6591247 -12177779 -18392028 -19356766 -17055264 -18025502 -23349398 -27849863
6048 -27849863 -27990367 -24706641 -18701939 -8993037 2573847 10645140 12668693 12142179
6040 12142179 13310132 15857047 17106116 16326759 14041215 9708959 3491105 -1414361
$$ packed form
6099i747607m264349j593088K314424L948132N414177P618947O144877j187003
6091H648510q183528p818411k222502J117953N18211O32087K984457L234749q40930
6082a929404m793718l861354M11012L323259L924844M963184P132461P211326
6074A6381610K931421k825092n093350l431403k556543n214324p416762m162796
6066a1387239K146755M238883P08608j932110K45328K568632L06247k918474j614990
6057g638360J431413l84300n586532o214249r64738K301502r70238n323896m500465
6048b7849863j40504L283726O004702R708902J1566884Q071293K023553n26514
6040A2142179J167953K546915J249069p79357k285544m332256o217854m905466
$$ plain form
6032 -1414361 -1747012 1267103 3580320 4262161 6426988 11539869 15904693 14846089 8749170
6023 8749170 2959830 2399507 7670069 15466940 20660217 18338755 6928166 -8820172
6015 -8820172 -19724845 -19865846 -12541993 -6756002 -7537402 -11509309 -12416939 -8690637 -3788087
6006 -3788087 -710692 1035214 2989457 4680241 4434709 2245210 186586 -386976 -1023621
5997 -1023621 -4312792 -9830443 -13410777 -11579996 -5733068 -327150 2332875 3370775
5989 3370775 3809321 2691558 -498886 -4255172 -7277305 -9797200 -10921617 -7323198
5981 -7323198 2456238 13963973 20156951 18169599 10653482 1756877 -5253637 -7409853
5973 -7409853 -3071705 5502439 13083265 15996340 14663427 12192795 12170885 16686997 23629014
$$ packed form
6032a414361l32651L014115K313217O81841K164827N112881M364824j058604o096919
6023H749170n789340n60323N270562P796871N193277k321462j1410589j5748338
6015h820172j0904673j41001P323853N785991p81400l971907r07630L726302M902550
6006c788087L077395J745906J954243J690784k45532k189499k058624n73562o36645
5997a023621l289171n517651l580334J830781N846928N405918K660025J037900
5989C370775M38546j117763l190444l756286l022133k519895j124417L598419
5981g323198R779436J1507735O192978j987352p516117q896605p010514k156216
5973g409853M338148Q574144P580826K913075j332913k470632k1910M516112O942017
$$ plain form
5964 23629014 26552225 20640393 8896837 -739346 -4301164 -4118467 -2486459 1653052
5956 1653052 8063372 12656312 13044650 12291169 12947978 11292045 2993479 -8179674 -13833741
5947 -13833741 -12383478 -10603572 -13002256 -15940203 -14965498 -12548689 -13937371 -18565097
5939 -18565097 -20766375 -18168419 -14929133 -15866114 -20444406 -24090575 -23847666 -21277289
5931 -21277289 -20149180 -22002302 -24345141 -23740067 -20540628 -18961620 -21338653 -24012144
5923 -24012144 -21347912 -13097499 -4865856 -1168618 -1181688 -2388490 -5064686 -10570179
5915 -10570179 -17513724 -22804129 -25393979 -26208909 -25387255 -22563628 -18990864 -15887698
5907 -15887698 -11198892 -2168097 8553533 14092179 12391679 9673240 11978742 16965471
$$ packed form
5964B3629014K923211n911832j1743556r636183l561818J82697J632008M139511
5956A653052O410320M592940L88338p53481O56809j655933q298566j1173153n654067
5947a3833741J450263J779906k398684k937947R74705K416809j388682m627726
5939a8565097k201278K597956L239286r36981m578292l646169K42909K570377
5931b1277289J128109j853122k342839O05074L199439J579008k377033k673491
5923b4012144K664232Q250413Q231643L697238j3070j206802k676196n505493
5915a0570179o943545n290405k589850q14930Q21654K823627L572764L103166
5907a5887698M688806R030795J0721630N538646j700500k718439K305502M986729
$$ plain form
5899 16965471 17831735 12644226 5718650 1637398 1879215 5888962 11290170 13864743
5891 13864743 11395591 7172904 5998516 7319837 6478641 2355414 -1161147 -1996496
5883 -1996496 -3280922 -8165592 -15297443 -21328313 -24296253 -22928113 -16807493 -9596353
5875 -9596353 -7802948 -12948229 -18502906 -18188387 -13798248 -10477986 -7764675 -1426936
5867 -1426936 7524526 12476517 10475478 5934352 3157200 316933 -5737902 -12426305
5859 -12426305 -13764820 -8575013 -2502870 -1409712 -5300550 -9766118 -11662614 -11754108
5851 -11754108 -12285948 -13577310 -13743513 -11135643 -6211178 -1075667 2274495 3309598
5843 3309598 2952381 2036030 -163055 -4542382 -8666200 -7019116 2301529 12444832
$$ packed form
5899A6965471Q66264n187509o925576m081252K41817M009747N401208K574573
5891A3864743k469152m222687j174388J321321q41196m123227l516561q35349
5883a996496j284426m884670p131851o030870k967940J368140O120620P211140
5875i596353J793405n145281n554677L14519M390139L320262K713311O337739
5867a426936Q951462M951991k001039m541126k777152k840267o054835o688403
5859a2426305j338515N189807O072143J093158l890838m465568j896496r1494
5851a1754108n31840j291362j66203K607870M924465N135511L350162J035103
5843C309598l57217r16351k199085m379327m123818J647084R320645J0143303
$$ plain form
5835 12444832 13558251 4248138 -6587300 -10670882 -9016173 -7320842 -6932381 -4859953
5827 -4859953 -332212 3706425 5158668 4795764 3759651 2472282 1893344 2346168 1151516
5818 1151516 -4459793 -11255110 -11177114 -1014560 12258577 18617930 15328951 7666774
5810 7666774 1534135 -1254596 -1634070 -1245741 -2091236 -4885349 -6639177 -2812865 6272202
5801 6272202 13741731 13708548 8681654 5776011 6531238 5483102 -119718 -4690536 -2201300
5792 -2201300 4530480 8137181 7921887 9996785 16352510 20862423 18504026 12575575
5784 12575575 9009011 8239885 7262261 6311366 8588827 15195626 24200674 32896889 37668494
5775 37668494 34485192 24182730 14936576 13916834 17633755 16247806 7064856 -2280923
$$ packed form
5835A2444832J113419r310113j0835438m083582J654709J695331L88461K072428
5827d859953M527741M038637J452243l62904j036113j287369n78938M52824j194652
5818A151516n611309o795317P7996J0162554J3273137O359353l288979p662177
5810G666774o132639k788731l79474L88329q45495k794113j753828L826312R085067
5801F272202P469529l3183n026894k905643P55227j048136n602820m570818K489236
5792b201300O731780L606701k15294K074898O355725M509913k358397n928451
5784A2575575l566564p69126r77624r50895K277461O606799R005048Q696215M771605
5775C7668494l183302j0302462r246154j019742L716921j385949r182950r345779
$$ plain form
5767 -2280923 -4871439 -2743675 -1836659 -3902006 -7060400 -10789576 -15921982 -20814499
5759 -20814499 -21057806 -13847001 -1585877 9424963 14253052 13443881 11031412 8546025
5751 8546025 3750741 -3325240 -7174794 -3841183 1815390 1648747 -4317962 -8115674
5743 -8115674 -5298606 143615 3133046 3363413 2011307 -1140172 -4401609 -3650358 1365732
5734 1365732 5128246 4373459 3205771 6092549 10372492 10650272 6866249 2921433 547072
5725 547072 -259438 2271643 8957857 15556419 17086763 14719624 12922327 11446145 6475925
5716 6475925 -1083280 -5493557 -5267038 -5823165 -10747447 -15974498 -16158951 -12708342 -11277220
5707 -11277220 -13404869 -14603996 -10673224 -3390696 1209184 -163273 -3838938 -3411392
$$ packed form
5767b280923k590516K127764R07016k065347l158394l729176n132406m892517
5759b0814499k43307P210805J2261124J1010840M828089q09171k412469k485387
5751H546025m795284p075981l849554L333611N656573j66643n966709l797712
5743h115674K817068N442221K989431K30367j352106l151479l261437P51251N016090
5734A365732L762514p54787j167688K886778M279943K77780l784023l944816k374361
5725E47072q06510K531081O686214O598562J530344k367139j797297j476182m970220
5716F475925p559205m410277K26519n56127m924282n227051j84453L450609J431122
5707a1277220k127649j199127L930772P282528M599880j372457l675665M27546
$$ plain form
5699 -3411392 2103989 7345858 9120516 11678496 19406928 27525508 26345486 14059663
5691 14059663 -767153 -9847973 -12418331 -10947866 -6419311 -1013212 482487 -3189553
5683 -3189553 -6201152 -3064843 3294534 5487702 1224853 -5665847 -11435270 -14321036
5675 -14321036 -12018700 -3665933 5472582 7433893 1365465 -5180729 -6730157 -6456164
5667 -6456164 -9193999 -13081526 -13329289 -10719549 -9970276 -11182819 -9641360 -4577746 -1662009
5658 -1662009 -4437792 -8851163 -9927712 -9226701 -10818080 -13351681 -12133169 -7537719
5650 -7537719 -5297892 -8327781 -13601302 -17775954 -20509386 -20748553 -15505072 -5632193
5642 -5632193 1994238 2648266 877068 4613042 14239222 22511972 24437131 22200623
$$ packed form
5699c411392N515381N241869J774658K557980P728432Q118580j180022j2285823
5691A4059663j4826816r080820k570358J470465M528555N406099J495699l672040
5683c189553l011599L136309O359377K193168m262849o890700n769423k885766
5675a4321036K302336Q352767R138515J961311o068428o546194j549428K73993
5667f456164k737835l887527k47763K609740P49273j212543J541459N063614K915737
5658a662009k775783m413371j076549P01011j591379k533601J218512M595450
5650g537719K239827l029889n273521m174652k733432k39167N243481R872879
5642e632193P626431O54028j771198L735974R626180Q272750J925159k236508
$$ plain form
5634 22200623 19860668 17766233 14259704 9813365 6727652 5782457 5220074 3154508
5626 3154508 -82830 -2715061 -4420799 -7097498 -11523534 -14673341 -13280384 -9685221
5618 -9685221 -10100958 -15861074 -20617310 -18841623 -13174276 -9552755 -8452361 -5887594
5610 -5887594 -844080 3714354 6199056 7588637 7815043 6122938 4866702 7403985
5602 7403985 11570250 11042780 4968256 567284 3103104 8273616 8773536 4400319 363711
5593 363711 -1964720 -6404750 -13859118 -18400846 -14477427 -5254434 -67237 -3585412
5585 -3585412 -10296768 -11224045 -4267335 4631550 9531719 9849713 7170855 1395134 -6925849
5576 -6925849 -14085531 -17306538 -18833138 -21525197 -22831243 -18764438 -12131752 -9785378
$$ packed form
5634B2200623k339955k094435l506529m446339l085713r45195n62383k065566
5626C154508l237338k632231j705738k676699m426036l149807J392957L595163
5618i685221m15737n760116m756236J775687N667347L621521J100394K564767
5610e887594N043514M558434K484702J389581K26406j692105j256236K537283
5602G403985M166265n27470o074524m400972K535820N170512M99920m373217m036608
5593C63711k328431m440030p454368m541728L923419R222993N187197l518175
5585c585412o711356r27277O956710Q898885M900169L17994k678858n775721q320983
5576f925849p159682l221007j526600k692059j306046M066805O632686K346374
$$ plain form
5568 -9785378 -11539917 -9186882 1228455 12751538 16869540 14288758 11901766 12845271
5560 12845271 14445029 13964211 12045926 10812603 10874050 9912369 4056880 -7036220 -16439708
5551 -16439708 -15495840 -4682694 5460724 6862966 3047350 2324820 6226326 9692140
5543 9692140 9726795 8152089 6981177 6272410 6617348 9525049 14524293 18703640 19755355
5534 19755355 17716853 13894783 9798055 6832935 5555105 5317305 5071117 3644298
5526 3644298 -389582 -6688017 -11121617 -9502929 -4044235 -1606897 -3942084 -4892984
5518 -4892984 -121489 6019251 7719613 6418992 6343142 5934020 1082857 -6097070 -9653917
5509 -9653917 -9628637 -11867772 -18122357 -23344140 -23456871 -19541254 -13707820 -7130734 -2995978
$$ packed form
5568i785378j754539K353035J0415337J1523083M118002k580782k386992R43505
5560A2845271J599758m80818j918285j233323O1447r61681n855489j1093100r403488
5551a6439708R43868J0813146J0143418J402242l815616p22530L901506L465814
5543I692140L4655j574706j170912p08767L44938K907701M999244M179347J051715
5534A9755355k038502l822070m096728k965120j277830k37800k46188j426819
5526C644298m033880o298435m433600J618688N458694K437338k335187r50900
5518d892984M771495O140740J700362j300621p5850m09122m851163p179927l556847
5509i653917K5280k239135o254585n221783j12731L915617N833434O577086M134756
$$ plain form
5500 -2995978 -4610564 -8698287 -7200644 1277993 7844846 5018448 -3053663 -6671940
5492 -6671940 -2879235 3451543 8096723 11269732 13356560 12200989 7027025 2277948
5484 2277948 3864435 11025861 14903429 8410467 -3646702 -8998025 -3293644 4395147
5476 4395147 4234343 -2199496 -7554591 -10659510 -14826956 -18281729 -16152142 -10529352
5468 -10529352 -8514472 -10098047 -8050437 -1186770 2782539 589610 -943399 2789598
5460 2789598 6474660 5784951 6280867 13233719 21037891 22409100 21096540 24492013 28844947
5451 28844947 24015778 10529283 27672 -1173097 1682531 2968249 3859132 5598959
5443 5598959 4630965 -1055106 -7180311 -9094290 -7739898 -6285983 -4873168 -1935626
$$ packed form
5500b995978j614586m087723J497643Q478637O566853k826398q072111l618277
5492f671940L792705O330778M645180L173009K086828j155571n173964m749077
5484B277948J586487P161426L877568o492962j2057169n351323N704381P688791
5476D395147j60804o433839n355095l104919m167446l454773K129587N622790
5468a0529352K014880j583575K047610O863667L969309k192929j533009L732997
5460B789598L685062o89709M95916O952852P804172J371209j312560L395473M352934
5451B8844947m829169j3486495j0501611j200769K855628J285718Q90883J739827
5443E598959r67994n686071o125205j913979J354392J453915J412815K937542
$$ plain form
5435 -1935626 2206007 5500414 5990289 3023087 -849227 -245681 6494431 12468771 10086972
5426 10086972 3140667 2986663 11510678 17134272 11781758 2794045 1137502 5298536
5418 5298536 6005990 1930317 287491 3676359 6357890 4412115 1013985 -451531
5410 -451531 -1060493 -1313265 1674950 7868396 11071292 7259697 1837118 2715119 8930620
5401 8930620 12293487 9153783 4410497 3389320 5376159 7251076 9005750 12364673
5393 12364673 16612405 19112341 18820399 16851811 14318484 11549421 8917925 6936480
5385 6936480 5981663 6650514 8917585 9846109 4588906 -7489067 -19227203 -21735975
5377 -21735975 -13797826 -2384240 5596325 8609933 8027428 5146938 2237430 2453878
$$ packed form
5435a935626M141633L294407M89875k967202l872314O03546O740112N974340k381799
5426A0086972o946305j54004Q524015N623594n352514q987713j656543M161034
5418E298536P07454m075673j642826L388868K681531j945775l398130j465516
5410d51531o08962k52772K988215O193446L202896l811595n422579Q78001O215501
5401H930620L362867l139704m743286j021177J986839J874917J754674L358923
5393A2364673M247732K499936k91942j968588k533327k769063k631496j981445
5385F936480r54817O68851K267071R28524n257203j2077973j1738136k508772
5377b1735975P938149J1413586P980565L013608n82505k880490k909508K16448
$$ plain form
5369 2453878 6124461 10017769 12499941 16240752 22989053 28887766 29004290 24312566
5361 24312566 19705684 16363738 10955287 2432395 -5048623 -7372871 -5213977 -2062762
5353 -2062762 -337529 -910895 -3735461 -6805138 -6490775 -1304248 5613149 9514000 8787135
5344 8787135 5335138 1420542 -1778711 -3081736 -1394252 2321365 5047929 5080885 4264380
5335 4264380 5344284 7999871 9669204 9983221 11357997 14141147 14522106 10230332 5730598
5326 5730598 7120912 12673731 13745333 6292989 -3412472 -7275420 -5544022 -4668283
5318 -4668283 -7725056 -11400220 -11564847 -8138659 -4373019 -3813409 -7877882 -14527277 -19568665
5309 -19568665 -20476766 -17978393 -13117095 -5348769 4349504 11394782 12275739 9506208
$$ packed form
5369B453878L670583L893308K482172L740811O748301N898713J16524m691724
5361B4312566m606882l341946n408451q522892p481018k324248K158894L151215
5353b062762J725233n73366k824566l069677L14363N186527O917397L900851p26865
5344H787135l451997l914596l199253j303025J687484L715617K726564L2956q16505
5335D264380J079904K655587J669333L14017J374776K783150L80959m291774m499734
5326E730598J390314N552819J071602p452344r705461l862948J731398Q75739
5318d668283l056773l675164j64627L426188L765640N59610m064473o649395n041388
5309a9568665r08101K498373M861298P768326R698273P045278Q80957k769531
$$ plain form
5301 9506208 8129257 8628509 7243077 2314483 -3833547 -8759852 -11448089 -10302934
5293 -10302934 -4111376 4453731 10234028 11191931 9338753 6288106 2073444 -1660683
5285 -1660683 -2447851 -2003266 -5157597 -11766478 -14715610 -8980720 1532920 9353401
5277 9353401 11796241 10671688 7617355 4059793 2747901 4458388 5100134 801342
5269 801342 -5445129 -7051320 -3217514 -19368 -1305822 -3233819 -436870 5615315
5261 5615315 8140725 4040099 -2107502 -4299032 -3099378 -4526743 -11123973 -17450345
5253 -17450345 -16635738 -9201963 -2064704 223239 -487113 -601640 432197 1137234 548412
5244 548412 -1764219 -5540826 -8366397 -7024296 -1766974 3223663 4849217 3878885 1697301
$$ packed form
5301I506208j376951M99252j385432m928594o148030m926305k688237J145155
5293a0302934O191558Q565107N780297R57903j853178l050647m214662l734127
5285a660683p87168M44585l154331o608881k949132N734890J0513640P820481
5277I353401K442840j124553l054333l557562j311892J710487O41746m298792
5269H01342o246471j606191L833806L198146j286454j927997K796949O052185
5261E615315K525410m100626o147601k191530J199654j427365o597230o326372
5253a7450345Q14607P433775P137259K287943p10352j14527J033837P05037n88822
5244E48412k312631l776607k825571J342101N257322M990637J625554r70332k181584
$$ plain form
5235 1697301 -2137528 -6982846 -9157378 -5937086 729458 7063698 11998758 16677919
5227 16677919 21583097 26328281 30131958 30590707 24749108 13826136 4192719 926599
5219 926599 2678958 5052945 5932397 4925608 1396702 -3116819 -3903761 1095690 7162203
5210 7162203 8676858 6207878 3316113 -89340 -5203120 -8154586 -3913382 4616080
5202 4616080 8672180 5074283 -960128 -4883585 -7733261 -10250629 -8887745 -1423380
5194 -1423380 7954750 12764905 10589672 3152562 -6771242 -16021644 -21077896 -20023881
5186 -20023881 -13932676 -5995535 -261286 213187 -3236222 -4673339 -419928 5126566
5178 5126566 4803602 -1644754 -8568661 -13693003 -19333105 -24431783 -23632128 -16542930 -10321026
$$ packed form
5235A697301l834829m845318k174532L220292O666544O334240M935060M679161
5227A6677919M905178M745184L803677M58749n841599j0922972r633417l266120
5219I26599J752359K373987Q79452j006789l528906m513521p86942M999451O066513
5210G162203J514655k468980k891765l405453n113780k951466M241204Q529462
5202D616080M056100l597897o034411l923457k849676k517368J362884P464365
5194a423380R378130M810155k175233p437110r923804r250402n056252J054015
5186b0023881O091205P937141N734249M74473l449409j437117M253411N546494
5178E126566l22964o448356o923907n124342n640102n098678P99655P089198O221904
$$ plain form
5169 -10321026 -9561408 -10444595 -8767493 -6815065 -7300283 -7284403 -4571410 -4182371 -10582208
5160 -10582208 -17860474 -16474612 -7487600 -1300221 -2638318 -5165998 -2411205 3410995
5152 3410995 6617357 6412147 5818288 5605793 3570208 -967498 -4795329 -3459656 4580391
5143 4580391 16586049 27939109 35434069 37977758 35320538 28222094 19539417 12355332
5135 12355332 6523807 -176471 -7106885 -10739874 -10687199 -11423687 -15713281 -20423926 -21648362
5126 -21648362 -19752440 -16014017 -8957875 1146744 8208758 6632644 -916661 -7511334
5118 -7511334 -11124972 -14061838 -15869925 -13735989 -8682242 -4596177 -1547173 3613568
5110 3613568 10387132 14771461 16030748 16676466 15838330 10156739 2082674 -716404 3534141
$$ packed form
5169a0321026P59618q83187J677102J952428m85218J5880K712993L89039o399837
5160a0582208p278266J385862Q987012O187379j338097k527680K754793N822200
5152C410995L206362k05210n93859k12495k035585m537706l827831J335673Q040047
5143D580391J2005658J1353060P494960K543689k657220p098444q682677p184085
5135A2355332n831525o700278o930414l632989N2675p36488m289594m710645j224436
5126b1648362J895922L738423P056142J0104619P062014j576114p549305o594673
5118g511334l613638k936866j808087K133936N053747M086065L049004N160741
5110C613568O773564M384329J259287O45718q38136n681591q074065k799078M250545
$$ plain form
5101 3534141 7795886 7429377 6863536 10910109 16360314 17573637 14739007 11018667 6568686
5092 6568686 1391214 -444849 3697289 8578599 7221193 1520071 -122720 5225709
5084 5225709 12049777 15340302 16034004 16048423 13428514 5418158 -6612131 -17447782
5076 -17447782 -21654589 -16657801 -4810674 7012397 12453307 11235130 7933227 5369095
5068 5369095 2159532 -2716520 -6619821 -6879579 -5322968 -6157281 -10160226 -13695390 -13764072
5059 -13764072 -11811836 -11244772 -12423603 -12026167 -7553220 -994040 2984719 1931276
5051 1931276 -2003674 -4114661 -1307060 4652203 7540202 2252793 -8518651 -15240195
5043 -15240195 -11692097 -2486157 2632265 303881 -4622819 -7198186 -6566103 -2092552
$$ packed form
5101C534141M261745l66509n65841M046573N450205J213323k834630l720340m449981
5092F568686n177472j836063M142138M881310j357406n701122j642791N348429
5084E225709O824068L290525O93702J4419k619909q010356j2030289j0835651
5076a7447782m206807M996788J1847127J1823071N440910j218177l301903k564132
5068E369095l209563m876052l903301k59758J556611q34313m002945l535164o8682
5059a3764072J952236N67064j178831L97436M472947O559180L978759j053443
5051A931276l934950k110987K807601N959263K887999n287409j0771444o721544
5043a5240195L548098R205940N118422k328384m926700k575367O32083M473551
$$ plain form
5035 -2092552 7930036 21065671 29811748 29877998 25654949 24069091 26627835 30888766
5027 30888766 35604229 39577065 38596440 29271753 14922938 3219275 -1587244 -1056273
5019 -1056273 1359414 3350481 4206712 5179697 7912063 10362969 7388093 -1524811 -9053279
5010 -9053279 -9252027 -6182288 -7342079 -11794196 -12285349 -7122396 -1558261 2120451 6951749
5001 6951749 12351298 11638139 2388234 -7527009 -8896414 -1540822 7833448 13665462
4993 13665462 13900521 8782650 1756548 -1305385 2238026 8492432 11617262 9589963
4985 9589963 4003573 -2498538 -6443258 -4595299 2399039 9790481 13921940 15019624
4977 15019624 13962467 10419406 5737419 2889515 1299348 -3071404 -9626825 -11277335
$$ packed form
5035b092552J0022588J3135635Q746077O6250m223049j585858K558744M260931
5027C0888766M715463L972836r80625r324687j4348815j1703663m806519N30971
5019a056273K415687J991067Q56231R72985K732366K450906k974876q912904p528468
5010i053279j98748L069739j159791m452117m91153N162953N564135L678712M831298
5001F951749N399549p13159r249905r915243j369405P355592R374270N832014
4993A3665462K35059n117871p026102l061933L543411O254406L124830k027299
4985I589963n586390o502111l944720J847959O994338P391442M131459J097684
4977A5019624j057157l543061m681987k847904j590167m370752o555421j650510
$$ plain form
4969 -11277335 -5393342 -709675 -6496659 -19006693 -26251722 -23757064 -17894415 -14691793
4961 -14691793 -13080158 -10024112 -5719613 -1685102 1566115 3305176 2846178 1996701
4953 1996701 3548573 6567684 6949470 3565252 239743 590784 4247984 9034990 13342201
4944 13342201 15237749 12940673 7970706 4675539 4753170 5139761 3272581 1391073 2791829
4935 2791829 6174596 7155768 4294230 366243 -2077028 -3373588 -4445848 -4603712 -3084201
4926 -3084201 -581197 2798308 9040401 18252928 24381323 20058631 6968201 -4016636
4918 -4016636 -6328156 -6047036 -11347388 -18660771 -17942740 -8955844 -1677379 -75969 3320714
4909 3320714 13100295 21731412 20932071 13716047 7733128 3710428 -1337586 -5063067
$$ packed form
4969a1277335N883993M683667n786984j2510034p245029K494658N862649L202622
4961a4691793J611635L056046M304499M034511L251217J739061m58998q49477
4953A996701J551872L019111L81786l384218l325509L51041L657200M787006M307211
4944A3342201J895548k297076m969967l295167P7631L86591j867180j881508J400756
4935B791829L382767R81172k861538l927987k443271j296560j072260j57864J519511
4926c084201K503004L379505O242093R212527O128395m322692j3090430j0984837
4918d016636k311520K81120n300352p313383P18031Q986896P278465J601410L396683
4909C320714R779581Q631117p99341p216024n982919m022700n048014l725481
$$ plain form
4901 -5063067 -2524564 5686330 15022764 22899621 27182677 24140098 14662666 6892655
4893 6892655 5727056 6288562 5016698 8193340 19458285 28901533 28056275 26249577
4885 26249577 35680794 48948029 50715443 44199594 43975105 49167820 49646420 52974345
4877 52974345 73324617 96941974 99645960 103264270 162614412 270802893 327362459
4870 327362459 249187588 83462444 -42941294 -70849883 -51719725 -50054968 -64404551
4863 -64404551 -62382034 -42633747 -27479409 -23277120 -20921726 -19845987 -25239038 -31559040
4855 -31559040 -29952183 -24641066 -24983395 -28442583 -26717028 -21952986 -22057062 -25342837
4847 -25342837 -23668911 -16747271 -11169992 -9051707 -8564598 -11339522 -18266653 -22227072
$$ packed form
4901e063067K538503Q210894R336434P876857M283056l042579r477432p770011
4893F892655j165599N61506j271864L176642J1264945R443248q45258j806698
4885B6249577R431217J3267235J767414o515849k24489N192715M78600L327925
4877E2974345K0350272K3617357K703986L618310N9350142J08188481N6559566
4870C27362459p8174871j65725144j26403738k7908589J9130158J664757j4349583
4863f4404551K022517J9748287J5154338M202289K355394J075739n393051o320002
4855c1559040J606857N311117l42329l459188J725555M764042j04076l285775
4847b5342837J673926O921640N577279K118285M87109k774924o927131l960419
$$ plain form
4839 -22227072 -16560614 -7475530 -6635760 -13850980 -18261734 -14996714 -9608517 -6569401
4831 -6569401 -3892153 165514 4115541 7737457 11738285 12895092 7425590 -717523
4823 -717523 -2855036 2558379 8500367 10298894 10514293 11953435 13044809 11887085 8870181
4814 8870181 4073826 -2361310 -6924029 -5989678 -2784013 -4458261 -11457249 -16752439
4806 -16752439 -16878759 -16241504 -18014030 -18254870 -13328723 -7145167 -5842921 -9207447 -12070221
4797 -12070221 -11717987 -10056437 -9967300 -12350438 -15888353 -18161043 -17620453 -14577478 -9330954
4788 -9330954 -992561 9137962 15133769 12180997 4165214 563598 5488375 14274717
4780 14274717 20885630 23526972 22391246 17467290 10580521 5354953 3389926 3589402
$$ packed form
4839b2227072N666458R085084Q39770p215220m410754L265020N388197L039116
4831f569401K677248M057667L950027L621916M000828J156807n469502q143113
4823g17523k137513N413415N941988J798527K15399J439142J091374j157724l016904
4814H870181m796355o435136m562719R34351L205665j674248o998988n295190
4806a6752439j26320O37255j772526k40840M926147O183556J302246l364526k862774
4797a2070221L52234J661550Q9137k383138l537915k272690N40590L042975N246524
4788i330954Q338393J0130523N995807k952772q015783l601616M924777Q786342
4780A4274717O610913K641342j135726m923956o886769n225568j965027J99476
$$ plain form
4772 3589402 5324755 8204098 9329625 6338374 3124169 6140762 14160768 18320656
4764 18320656 13876718 5414639 -1120380 -4296818 -3114649 4454378 14774882 18350402
4756 18350402 11775841 3181786 365813 441045 -2344328 -5582221 -4000003 -424325
4748 -424325 -1873618 -7548136 -9733024 -5589542 -379590 596430 -3103872 -9347492 -14557577
4739 -14557577 -13778220 -5931754 1942225 2024618 -3597653 -6189454 -3501417 -1969951 -5135428
4730 -5135428 -7844075 -4990264 382227 1994475 -751736 -2972736 -1456140 1530664
4722 1530664 1254268 -3914654 -10172036 -12218276 -9563960 -6525821 -5226960 -2799207
4714 -2799207 1959817 4321716 839517 -3918654 -4179791 -2283253 -3636675 -6332558
$$ packed form
4772C589402J735353K879343J125527k991251l214205L016593Q020006M159888
4764A8320656m443938q462079o535019l176438J182169P569027J0320504L575520
4756A8350402o574561q594055k815973P5232k785373l237893J582218L575678
4748d24325j449293n674518k184888M143482N209952R76020l700302o243620n210085
4739a4557577P79357P846466P873979Q2393n622271k591801K688037J531466l165477
4730e135428k708647K853811N372491J612248k746211k221000J516596K986804
4722A530664k76396n168922o257382k046240K654316L038139J298861K427753
4714b799207M759024K361899l482199m758171k61137J896538j353422k695883
$$ plain form
4706 -6332558 -5240800 -3592141 -9117696 -19227962 -22284055 -15646955 -10443352 -14222304
4698 -14222304 -20293806 -20426666 -17726911 -18852494 -21849420 -20585900 -15027733 -8968100
4690 -8968100 -3213913 1128728 -1438881 -12646972 -23363624 -24423211 -20468488 -22675207
4682 -22675207 -30746765 -33416461 -25815670 -15154509 -8315271 -4232644 -759938 442053
4674 442053 -868497 -1629343 -2243567 -7659472 -18005251 -25365088 -24159517 -18161186 -12774933
4665 -12774933 -7092879 729293 6392141 5060721 37029 -1492439 955235 1616329
4657 1616329 -1728120 -4898087 -4415670 -2078917 -1485191 -4026716 -9225149 -15685248 -20784293
4648 -20784293 -22151980 -20448652 -18799424 -19028721 -20017203 -19689568 -16936817 -11869314 -6063681
$$ packed form
4706f332558J091758J648659n525555j0110266l056093O637100N203603l778952
4698a4222304o071502j32860K699755j125583k996926J263520N558167O059633
4690h968100N754187M342641k567609j1208091j0716652j059587L954723k206719
4682b2675207q071558k669696P600791J0661161O839238M082627L472706J201991
4674D42053j310550p60846o14224n415905j0345779p359837J205571N998331N386253
4665a2774933N682054P822172N662848j331420n023692j529468K447674O61094
4657A616329l344449l169967M82417K336753N93726k541525n198433o460099n099045
4648b0784293j367687J703328J649228k29297r88482L27635K752751N067503N805633
$$ plain form
4639 -6063681 -2357740 -2460332 -4755556 -6166727 -6041521 -6325144 -7857236 -8586310 -6332237
4630 -6332237 -1992158 1197324 1426986 683291 2671069 7961653 12094991 10066301 2331939
4621 2331939 -5679918 -9873458 -10623509 -9545237 -6960400 -4052307 -3655705 -6323858 -9006292
4612 -9006292 -10365629 -13401996 -18905221 -20664839 -13301873 -1937332 3189809 562739
4604 562739 -1691728 990678 3212168 -1258237 -10513609 -17958377 -19607771 -15056025
4596 -15056025 -6274681 1322719 1698988 -4014394 -7140587 -2909306 2558998 1600642
4588 1600642 -3683025 -6168331 -5901533 -9330115 -17810927 -25060150 -26674897 -25041257
4580 -25041257 -23139766 -19965608 -14862481 -10979849 -10845599 -12402291 -12809844 -13010165 -15087166
$$ packed form
4639f063681L705941j02592k295224j411171J25206k83623j532092p29074K254073
4630f332237M340079L189482K29662p43695J987778N290584M133338k028690p734362
4621B331939q011857m193540p50051J078272K584837K908093L96602k668153k682434
4612i006292j359337l036367n503225j759618P362966J1364541N127141k627070
4604E62739k254467K682406K221490m470405r255372p444768j649394M551746
4596a5056025Q781344P597400L76269n713382l126193M231281N468304r58356
4588A600642n283667k485306K66798l428582q480812p249223j614747J633640
4580b5041257J901491L174158N103127L882632J34250j556692m07553k00321k077001
$$ plain form
4571 -15087166 -17485579 -16345841 -10388902 -1866709 6330403 12312564 14904513 14022908
4563 14022908 11230574 8505188 6498858 4692114 2842449 1704991 2509746 5454538
4555 5454538 8013834 5708231 -3351310 -14838318 -21429001 -20085705 -14236616 -8682350
4547 -8682350 -4901792 -1886187 1236654 4635243 7525335 7635214 3645999 -873300
4539 -873300 474381 8641683 16039927 14892970 6648109 -44283 751917 7263674 13590742
4530 13590742 15159500 11284858 5191913 1528353 2047925 4173428 5018140 5197106 6763720
4521 6763720 9545078 12558103 17061002 23921414 28926512 25853027 15177669 5209913
4513 5209913 2262780 3064070 -62485 -8531224 -15317442 -13179612 -2779240 7999628
$$ packed form
4571a5087166k398413J139738N956939Q522193Q197112N982161K591949q81605
4563A4022908k792334k725386k006330j806744j849665j137458Q04755K944792
4555E454538K559296k305603r059541j1487008o590683J343296N849089N554266
4547h682350L780558L015605L122841L398589K890092J09879l989215m519299
4539h73300J347681Q167302P398244j146957q244861o692392P96200O511757O327068
4530A3590742J568758l874642o092945l663560N19572K125503Q44712J78966J566614
4521F763720K781358L013025M502899O860412N005098l073485j0675358r967756
4513E209913k947133Q01290l126555q468739o786218K137830J0400372J0778868
$$ plain form
4505 7999628 11816595 8430503 3916892 4133337 9692769 17103966 23053984 26278397
4497 26278397 26621664 24623528 22035236 20925926 21790015 23462130 24744792 25012637 23516288
4488 23516288 19554823 13623456 7633537 3933005 4020592 6848717 7912061 2457226
4480 2457226 -8384937 -16824517 -16711839 -10978759 -7287357 -7621533 -6909205 -2077787 2621095
4471 2621095 1540732 -4591547 -9518450 -8288211 -1638041 4901194 5473278 -529833
4463 -529833 -6755175 -6164916 426262 5086344 2789851 -3092149 -6939550 -8182467 -9313747
4454 -9313747 -10548852 -11059961 -12867713 -18216575 -24308344 -25976986 -23474209 -22228299
4446 -22228299 -23755209 -22133418 -12528494 728568 8633648 7933988 3120944 -747269
$$ packed form
4505G999628L816967l386092m513611K16445N559432P411197N950018L224413
4497B6278397L43267j998136k588292j109310Q64089J672115J282662K67845j496349
4488B3516288l961465n931367n989919l700532Q7587K828125J063344n454835
4480B457226j0842163q439580J12678N733080L691402l34176P12328M831418M698882
4471B621095j080363o132279m926903J230239O650170O539235N72084o003111
4463e29833o225342N90259O591178M660082k296493n882000l847401j242917j131280
4454i313747j235105n11109j807752n348862o091769j668642K502777J245910
4446b2228299j526910J621791R604924J3257062P905080o99660m813044l868213
$$ plain form
4438 -747269 -2800056 -3655362 -2466867 850222 3380026 2518427 26432 -687586 -608386
4429 -608386 -4310313 -12326339 -18445422 -17178472 -11052422 -7443539 -10105831 -16745126
4421 -16745126 -23071693 -25738691 -22673892 -14535488 -5491979 831549 5660258 12058702
4413 12058702 18862976 22003034 20854968 17847523 12320334 1760125 -9769449 -12443857
4405 -12443857 -3830253 5696038 6216486 1351890 1541487 8566224 14316957 12774605
4397 12774605 5995618 -1123843 -5743221 -6835149 -5542882 -5735615 -9176814 -10607601
4389 -10607601 -3282672 10589158 20963099 22360405 19177759 17108821 15520517 11509735
4381 11509735 6361306 3790517 4879352 7924892 10695890 10628593 6047719 -373551
$$ packed form
4438g47269k052787q55306J188495L317089K529804q61599k491995p14018P9200
4429f08386l701927q016026o119083J266950O126050L608883k662292o639295
4421a6745126o326567k666998L064799Q138404R043509O323528M828709O398444
4413A2058702O804274L140058j148066l007445n527189j0560209j1529574k674408
4405a2443857Q613604R526291N20448m864596J89597P024737N750733j542352
4397A2774605o778987p119461m619378j091928J292267j92733l441199j430787
4389a0607601P324929J3871830J0373941J397306l182646k068938j588304m010782
4381A1509735n148429k570789J088835L045540K770998o7297m580874o421270
$$ plain form
4373 -373551 -2860285 -89401 2001550 -1682541 -7884334 -9685333 -5823642 -658020
4365 -658020 2937887 5382230 6301213 4248228 787282 -136676 1973089 3303875 2210573
4356 2210573 2366515 6961801 13231267 16119079 15172219 14227972 15391400 16918697 17079257
4347 17079257 16807887 17348789 17665248 15927673 12157455 7718968 3186797 -1507164 -5534102
4338 -5534102 -7951644 -9921405 -13736086 -18865229 -21168952 -17591264 -10187528 -4074108
4330 -4074108 -2743480 -6606312 -13841655 -20089722 -19464812 -10229461 836966 4158237
4322 4158237 -1427570 -7033651 -5109224 1270488 3459963 -1476200 -8664387 -12947864
4314 -12947864 -13786143 -12397542 -8435548 -1862179 4281815 5706379 1036959 -7134583
$$ packed form
4373c73551k486734K770884K090951l684091o201793j800999L861691N165622
4365f58020L595907K444343R18983k052985l460946r23958K109765J330786j093302
4356B210573J55942M595286O269466K887812r46860r44247J163428J527297J60560
4347A7079257k71370N40902L16459j737575l770218m438487m532171m693961m026938
4338e534102k417542j969761l814681n129143k303723L577688P403736O113420
4330d074108J330628l862832p235343o248067O24910R235351J1066427L321271
4322D158237n585807n606081J924427O379712K189475m936163p188187m283477
4314a2947864q38279J388601L961994O573369O143994J424564m669420q171542
$$ plain form
4306 -7134583 -14569113 -17412589 -13080684 -2061903 10197033 15630256 10506634 -225398
4298 -225398 -7621911 -7891224 -4887817 -3445063 -3407935 -2072930 390823 1396874 389887
4289 389887 -748851 -1253995 -2033406 -2845477 -2575111 -2679821 -6375336 -13142231 -17958351
4280 -17958351 -18000442 -16286582 -15800998 -13757099 -6142061 4401574 10416601 8883538
4272 8883538 4104642 976266 -385217 -1975065 -3676403 -4372973 -5054761 -7828565 -12236307
4263 -12236307 -14536902 -11127702 -2225864 7740035 13433897 13104898 10028980 8643555
4255 8643555 9134976 7245978 154223 -8983957 -14022638 -12661412 -8411228 -5705951
4247 -5705951 -4985297 -3484125 814591 7705766 16036808 23960763 28122826 25608363
$$ packed form
4306g134583p434530k843476M331905J1018781J2258936N433223n123622j0732032
4298b25398p396513k69313L003407J442754L7128J335005K463753J006051j006987
4289C89887j138738n05144p79411q12071K70366j04710l695515o766895m816120
4280a7958351m2091J713860M85584K043899P615038J0543635O015027j533063
4272H883538m778896l128376j361483j589848j701338o96570o81788k773804m407742
4263a2236307k300595L409200Q901838R965899N693862l28999l075918j385425
4255H643555M91421j888998p091755r138180n038681J361226M250184K705277
4247e705951P20654J501172M298716O891175Q331042P923955M162063k514463
$$ plain form
4239 25608363 18079315 11598977 10141504 10935900 8835219 3968298 1546629 4155373
4231 4155373 7866490 7341439 2169705 -3465476 -5520247 -3136822 1241306 3478085
4223 3478085 1166329 -3379216 -5412173 -4038619 -3438188 -5869495 -6730827 -502369 10331497
4214 10331497 17076099 15390802 9688630 6184814 5763654 5800403 5469834 5816982 6418220
4205 6418220 5515109 3094830 987783 -330933 -2569583 -6442946 -9670490 -9472342 -5840643
4196 -5840643 -1211425 1915598 1795220 -2535225 -9590386 -14476829 -12650737 -5367684
4188 -5367684 1078283 2674480 1961525 3494374 7376455 9760400 8301076 4491742
4180 4491742 1254756 334938 1533872 2778883 1592693 -2242672 -6738063 -11245705
$$ packed form
4239B5608363p529048o480338j457473P94396k100681m866921k421669K608744
4231D155373L711117n25051n171734n635181k054771K383425M378128K236779
4223C478085k311756m545545k032957J373554O00431k431307q61332O228458J0833866
4214A0331497O744602j685297n702172l503816m21160L6749l30569L47148O01238
4205F418220r03111k420279k107047j318716k238650l873363l227544J98148L631699
4196e840643M629218L127023j20378m330445p055161m886443J826092P283053
4188e367684O445967J596197p12955J532849L882081K383945j459324l809334
4180D491742l236986r19818J198934J245011j186190l835365m495391m507642
$$ plain form
4172 -11245705 -16972044 -21862487 -19169213 -6000991 9550024 15879369 11194205 3580801
4164 3580801 -880154 -3018228 -3954983 -1860622 2561103 4635808 2865124 1346786
4156 1346786 2290745 2535615 554582 -41071 2046856 1994327 -2462831 -5519008 -2639427
4147 -2639427 1029034 -1275802 -6976763 -8853656 -6020759 -2581233 520675 4608745
4139 4608745 7759660 7180693 3501405 -2848599 -13339924 -23347864 -22504868 -13296509
4131 -13296509 -17017587 -43462848 -64363738 -41899404 17909220 66297051 71357945
4124 71357945 51727409 40668332 41255606 35841021 21423917 11625637 12067741 15258865
4116 15258865 16853908 19435491 21413576 17304089 8932793 3596456 1616080 -2269334
$$ packed form
4172a1245705n726339m890443K693274J3168222J5551015O329345m685164p613404
4164C580801m460955k138074r36755K094361M421725K074705j770684j518338
4156A346786R43959K44870j981033n95653K087927n2529m457158l056177K879581
4147b639427L668461k304836n700961j876893K832897L439526L101908M088070
4139D608745L150915n78967l679288o350004j0491325j0007940Q42996R208359
4131a3296509l721078k6445261k0900890K2464334N9808624M8387831N060894
4124G1357945j9630536j1059077N87274n414585j4417104r798280M42104L191124
4116A5258865J595043K581583J978085m109487q371296n336337j980376l885414
$$ plain form
4108 -2269334 -6175094 -2734440 6094132 8856391 1627262 -6406089 -7562704 -5150839
4100 -5150839 -4340844 -3446001 424883 4936975 7056651 7881601 8702116 7852799 5102005
4091 5102005 3688437 4599289 4158972 616443 -2017875 -84644 4303954 6796318 5623154
4082 5623154 1246821 -3809059 -3643657 6009436 19503052 25219206 20657213 15959878
4074 15959878 18672193 23376299 22006701 16072125 10976025 5659510 -2426785 -7547216
4066 -7547216 -1914535 10748136 18094786 14939087 7290940 1197346 -3211769 -5814301
4058 -5814301 -3887206 1799526 5793527 6046281 6753774 10024440 11156043 6425828 5266
4049 5266 -2115652 -1144703 -3060410 -9521817 -15956025 -17446471 -12781971 -3839188 5450016
$$ packed form
4108b269334l905760L440654Q828572K762259p229129q033351j156615K411865
4100e150839Q09995Q94843L870884M512092K119676Q24950Q20515q49317k750794
4091E102005j413568R10852m40317l542529k634318J933231M388598K492364j173164
4082E623154m376333n055880J65402R653093J3493616N716154m561993m697335
4074A5959878K712315M704106j369598n934576n096100n316515q086295n120431
4066g547216N632681J2662671P346650l155699p648147o093594m409115k602532
4058e814301J927095N686732L994001K52754P07493L270666J131603m730215o420562
4049E266k120918R70949j915707o461407o434208j490446M664500Q942783R289204
$$ plain form
4040 5450016 10208171 8192465 2733759 93285 3705127 11985018 20685166 25729161
4032 25729161 24966241 19610121 13800812 11030329 11140679 11873473 12307728 13076700 14239187
4023 14239187 15153983 15873150 16407392 15044444 10002534 3027323 -955671 1557611 9893984
4014 9893984 20736106 29973347 33194602 28084405 18077776 10681149 9776990 11894422
4006 11894422 12494994 13111908 18155008 26324601 30480801 26694793 18970844 13268893
3998 13268893 10537600 8022268 4378486 506850 -2422725 -2656050 2442290 12436690
3990 12436690 20498027 18512129 6554222 -5952901 -9985733 -5428153 1348888 5550777
3982 5550777 7096552 7665989 8142406 9123691 11337462 14504403 17248531 18854250 19663164
$$ packed form
4040E450016M758155k015706n458706k640474L611842Q279891Q700148N043995
4032B5729161p62920n356120n809309k770483J10350P32794M34255P68972J162487
4023A4239187R14796P19167N34242j362948n041910o975211l982994K513282Q336373
4014I893984J0842122R237241L221255n110197j0006629p396627r04159K117432
4006A1894422O00572O16914N043100Q169593M156200l786008p723949n701951
3998A3268893k731293k515332l643782l871636k929575k33325N098340R994400
3990A2436690Q061337j985898j1957907j2507123m032832M557580O777041M201889
3982E550777J545775N69437M76417R81285K213771L166941K744128J605719Q08914
$$ plain form
3973 19663164 18913433 14179352 5225784 -2681960 -2549565 6539720 17829655 24088719
3965 24088719 23928730 19736074 12888697 4475064 -1885540 -2895470 -558063 181100
3957 181100 -1621373 -3083597 -4174001 -7814634 -12149716 -10062989 -121578 8760644
3949 8760644 9226865 6391322 9737846 18321718 22404965 17828883 10389183 6113857
3941 6113857 4868954 4495500 4372741 3342073 110266 -2894476 -1790697 1684155 1733430
3932 1733430 -1643111 -1549910 4780507 11435619 13821997 15550478 20231929 23670376 21287237
3923 21287237 17749805 21117089 30619050 37632097 36747293 29585127 20020308 12283663
3915 12283663 11586388 18912901 25747325 21398071 6428974 -7332922 -10999191 -7037656
$$ packed form
3973A9663164p49731m734081q953568p907744J32395R089285J1289935O259064
3965B4088719j59989m192656o847377q413633o360604j009930K337407P39163
3957A81100j802473j462224j090404l640633m335082K086727R941411Q882222
3949H760644M66221k835543L346524Q583872M083247m576082p439700m275326
3941F113857j244903l73454j22759j030668l231807l004742J103779L474852M9275
3932A733430l376541R3201O330417O655112K386378J728481M681451L438447k383139
3923B1287237l537432L367284R501961P013047q84804p162166r564819p736645
3915A2283663o97275P326513O834424m349254j4969097j3761896l666269L961535
$$ plain form
3907 -7037656 -2673097 -1134362 -1768559 -3616138 -5628558 -6567034 -6984773 -8803059 -11688060
3898 -11688060 -12593658 -9842148 -5006048 -425268 2097734 379480 -6110539 -12835519
3890 -12835519 -13463814 -7839821 -2286303 -568358 533248 4368729 8222769 7719003
3882 7719003 3473319 -955932 -4981252 -10470869 -16976414 -21489220 -22360655 -20545243
3874 -20545243 -17432924 -13599943 -9049094 -3160905 4388762 11397805 13858879 10748518
3866 10748518 5944075 3164762 1337101 -2152547 -5891279 -6089772 -2659327 564426
3858 564426 1856542 4205614 10671241 19565782 25609384 24576521 16128942 3384518
3850 3384518 -9176912 -17624448 -19370346 -13747418 -3570241 4690485 5823458 2336214
$$ packed form
3907g037656M364559J538735o34197j847579k012420r38476m17739j818286k885001
3898a1688060r05598K751510M836100M580780K523002j718254o490019o724980
3890a2835519o28295N623993N553518J717945J101606L835481L854040n03766
3882G719003m245684m429251m025320n489617o505545m512806q71435J815412
3874b0545243L112319L832981M550849N888189P549667P009043K461074l110361
3866A0748518m804443k779313j827661l489648l738732j98493L430445L223753
3858E64426J292116K349072O465627Q894541O043602j032863q447579j2744424
3850C384518j2561430q447536j745898N622928J0177177Q260726J132973l487244
$$ plain form
3842 2336214 2716469 10661256 19031317 18413633 9577996 2448243 3211320 7600964 8044278
3833 8044278 2828520 -4138643 -8904589 -9551921 -5319127 2395116 8893947 9538098 4999130
3824 4999130 1146281 2878384 9322011 15785269 19301905 21034624 23475571 26531769
3816 26531769 27332285 23820298 17565368 12197257 9406474 7589213 4682971 1199936
3808 1199936 -551654 313344 2158912 3135471 3381762 4181524 5900157 8043450 10772595
3799 10772595 14482720 17656254 17251243 12542340 7037394 4842750 6227973 8681498
3791 8681498 11188393 14586698 17896274 17682108 12640276 6733752 5789149 11511384 19613685
3782 19613685 23258690 18485606 7911763 -557534 -553985 6364702 12565944 12844701 8863108
$$ packed form
3842B336214L80255P944787Q370061o17684q835637p129753P63077M389644M43314
3833H044278n215758o967163m765946o47332M232794P714243O498831O44151m538968
3824D999130l852849J732103O443627O463258L516636J732719K440947L056198
3816B6531769Q00516l511987o254930n368111k790783j817261k906242l483035
3808A199936j751590Q64998J845568R76559K46291P99762J718633K143293K729145
3799A0772595L710125L173534m05011m708903n504946k194644J385223K453525
3791H681498K506895L398305L309576k14166n041832n906524r44603N722235Q102301
3782A9613685L645005m773084j0573843q469297L549O918687O201242K78757l981593
$$ plain form
3773 8863108 4628474 985870 -2903787 -5252286 -2725236 4536274 11935540 14978623
3765 14978623 13156922 9205873 5990391 4338052 2951322 334187 -2856648 -4072927
3757 -4072927 -2053503 1295197 3096079 2572265 1043969 104324 852053 3458485 6009086
3748 6009086 5191908 68605 -5771947 -7668292 -4845235 -396420 2883105 5030846
3740 5030846 7877802 12781638 18727899 21809684 17907835 7072858 -6068012 -17076433
3732 -17076433 -24769724 -28642797 -26766304 -19075710 -9942505 -4042899 -1798668 -1935224
3724 -1935224 -5383074 -12071313 -16753461 -14275305 -7792502 -5318788 -8195185 -9499955
3716 -9499955 -4889355 1476289 4098774 3445367 2928758 3365021 3966680 5019166 6031596
$$ packed form
3773H863108m234634l642604l889657k348499K527050P261510P399266L043083
3765A4978623j821701l951049l215482j652339j386730k617135l190835j216279
3757d072927K019424L348700J800882n23814j528296r39645P47729K606432K550601
3748F009086q17178n123303n840552j896345K823057M448815L279525K147741
3740E030846K846956M903836N946261L081785l901849j0834977j3140870j1008421
3732a7076433p693291l873073J876493P690594R133205N899606K244231j36556
3724a935224l447850o688239m682148K478156O482803K473714k876397j304770
3716i499955M610600O365644K622485o53407n16609M36263O01659J052486J012430
$$ plain form
3707 6031596 4303374 -1333204 -7778275 -11385884 -11950876 -10519314 -6016622 2791662
3699 2791662 13747234 22290499 24956693 21045002 13208517 7088788 6839873 9720177
3691 9720177 8979118 3302990 -1721444 -3455678 -6795877 -14512224 -19625183 -14561220
3683 -14561220 -3393527 3140766 2292724 859969 3241078 6151640 6097960 4945167
3675 4945167 5746039 8125715 9850294 9280801 5336131 -1463585 -7632835 -9808610 -8666178
3666 -8666178 -6216940 -1233710 7216921 13818434 12214129 5606396 3632170 7824168
3658 7824168 9409700 4008537 -1384450 -839445 777502 -2187581 -4794610 365290
3650 365290 9585240 12952818 9227328 5420635 3546123 -1386789 -9908214 -15100639
$$ packed form
3707F031596j728222n636578o445071l607609n64992J431562M502692Q808284
3699B791662J0955572Q543265K666194l911691p836485o119729k48915K880304
3691I720177p41059n676128n024434j734234l340199p716347n112959N063963
3683a4561220J1167693O534293q48042j432755K381109K910562n3680j152793
3675D945167Q00872K379676J724579n69493l944670o799716o169250k175775J142432
3666h666178K449238M983230Q450631O601513j604305o607733j974226M191998
3658G824168J585532n401163n392987N45005J616947k965083k607029N159900
3650C65290R219950L367578l725490l806693j874512m932912q521425n192425
$$ plain form
3642 -15100639 -13669621 -11075068 -11864350 -12619825 -9286065 -4966500 -4637549 -6922548 -7178910
3633 -7178910 -5441718 -5329760 -7225418 -8460446 -9241847 -12495832 -17438161 -18802754 -14479560
3624 -14479560 -9722493 -10855397 -17484661 -23932611 -26551343 -26263887 -24632787 -21174897
3616 -21174897 -15622330 -9886728 -5566040 -1247429 5132792 12062968 15304640 13056022
3608 13056022 7949903 3636650 1749584 2659423 6308080 10966610 13814166 14396424
3600 14396424 14942788 15623803 12930865 5591555 -1549425 -3945382 -4634944 -9420112 -16725563
3591 -16725563 -19246342 -15670795 -13374891 -17250369 -22463445 -22086425 -16535004 -10765750
3583 -10765750 -6319133 -1505380 3146018 4837813 2616160 -2473857 -9694257 -16961372
$$ packed form
3642a5100639J431018K594553p89282p55475L333760M319565L28951k284999k56362
3633g178910J737192J11958j895658j235028p81401l253985m942329j364593M323194
3624a4479560M757067j132904o629264o447950k618732K87456J631100L457890
3616b1174897N552567N735602M320688M318611O380221O930176L241672k248618
3608A3056022n106119m313253j887066R09839L648657M658530K847556N82258
3600A4396424N46364O81015k692938p339310p140980k395957o89562m785168p305451
3591a6725563k520779L575547K295904l875478n213076L77020N551421N769254
3583a0765750M446617M813753M651398J691795k221653n090017p220400p267115
$$ plain form
3575 -16961372 -18713474 -10608958 4037238 17125829 24917936 29652247 32124087 28730804
3567 28730804 18483496 8033197 5160238 9222568 11942084 7374269 -1573260 -6942778
3559 -6942778 -4354863 3074856 8974522 10740294 11110643 12963688 15017648 14403556 11382392
3550 11382392 8605006 7007032 5743037 5246363 6481788 7621165 5943698 3302949
3542 3302949 4697402 10180612 13600113 11899126 10165516 13221720 17082537 14773848
3534 14773848 7500971 3148202 4709656 7011965 5823294 4108114 6463476 11678399
3526 11678399 14533301 12975474 10231486 9884278 10733326 7752876 -1262152 -10792014
3518 -10792014 -12164409 -4425415 2682324 158778 -8426160 -11561960 -4815904 4824567
$$ packed form
3575a6961372j752102Q104516J4646196J3088591P792107M734311K471840l393283
3567B8730804j0247308j0450299k872959M062330K719516m567815q947529n369518
3559f942778K587915P429719N899666J765772L70349J853045K053960o14092l021164
3550A1382392k777386j597974j263995m96674J235425J139377j677467k640749
3542C302949J394453N483210L419501j700987j733610L056204L860817k308689
3534A4773848p272877m352769J561454K302309j188671j715180K355362N214923
3526A1678399K854902j557827k743988l47208Q49048k980450r015028r529862
3518a0792014j372395P738994P107739k523546q584938l135800O746056R640471
$$ plain form
3510 4824567 9663929 9643486 7953276 4832117 2728 -3529699 -3265139 -1851960 -3190617
3501 -3190617 -5926687 -5205353 544844 8509099 15756771 20698058 21605058 18040961 13328120
3492 13328120 11737308 13468869 15813209 18443121 23301228 29427715 32424200 29845178
3484 29845178 23377162 15218763 6455152 -199724 -836771 4160488 8732659 7814076
3476 7814076 2718442 -2029677 -4351499 -4985492 -4841860 -4223819 -2796649 771609 6509037
3467 6509037 9988399 5920717 -3364224 -8205175 -3634953 4014497 6961457 7111180
3459 7111180 10910752 17509755 20462811 18955761 18230854 19130937 16549072 9945540 6257452
3450 6257452 8674877 10885275 7788484 4457178 7347370 12559158 11519617 4739118
$$ packed form
3510D824567M839362k0443j690210l121159m829389l532427K64560J413179j338657
3501c190617k736070P21334N750197P964255P247672M941287R07000l564097m712841
3492A3328120j590812J731561K344340K629912M858107O126487K996485k579022
3484B9845178o468016q158399q763611o654876o37047M997259M572171r18583
3476G814076n095634m748119k321822o33993J43632O18041J427170L568258N737428
3467F509037L479362m067682r284941m840951M570222P649450K946960J49723
3459G111180L799572O599003K953056j507050p24907R00083k581865o603532l688088
3450F257452K417425K210398l096791l331306K890192N211788j039541o780499
$$ plain form
3442 4739118 629363 1851154 2092941 -2336862 -6140464 -3681267 2604399 7002642
3434 7002642 8842344 10855460 12599794 11346716 8297690 8362474 12901625 16877527 15063101
3425 15063101 8246822 1198784 -3334417 -5835585 -6404448 -3536294 2441981 7401352
3417 7401352 7272846 2771115 -2058949 -5401571 -9026721 -13908851 -17587434 -17343293 -13470531
3408 -13470531 -7470042 647117 10628436 19440958 23607248 22956130 19210096 12494257
3400 12494257 3255156 -3633639 -2372441 5172360 9734969 6027454 -656987 -2460068
3392 -2460068 701198 3578198 5209990 9631846 17146747 20908961 14946287 2434198
3384 2434198 -6951187 -7044878 -982873 2647053 -1431352 -10405257 -17296580 -18939738 -18196701
$$ packed form
3442D739118m109755J221791K41787m429803l803602K459197O285666M398243
3434G002642J839702K013116J744334j253078l049026O4784M539151L975902j814426
3425A5063101o816279p048038m533201k501168n68863K868154N978275M959371
3417G401352j28506m501731m830064l342622l625150m882130l678583K44141L872762
3408a3470531O000489Q117159R981319Q812522M166290o51118l746034o715839
3400A2494257r239101o888795J261198P544801M562609l707515o684441j803081
3392b460068L161266K877000J631792M421856P514901L762214n962674j2512089
3384B434198r385385r3691O062005L629926m078405q973905o891323j643158P43037
$$ plain form
3375 -18196701 -17822697 -15300375 -6898592 4969260 12861361 13125680 9835519 8578089
3367 8578089 9461894 8474790 3655082 -2582597 -6305769 -5252336 296953 7940181 14130512
3358 14130512 15986135 13339139 9485889 9261111 14530038 20700276 19752836 9143822
3350 9143822 -3617459 -8388964 -3714592 2944022 6036002 7947056 12387769 16787153
3342 16787153 15618615 8566189 807587 -3727230 -5410238 -5728585 -4954759 -3684682
3334 -3684682 -3678056 -5703814 -7971791 -7642781 -3523293 2432189 5938934 4078916 -775301
3325 -775301 -2574091 1134159 5620443 5172152 696837 -2401028 -2090202 -739878 971481
3316 971481 5678724 13746714 20960378 24125016 25230318 27356811 29251218 26754673
$$ packed form
3375a8196701L74004K522322Q401783J1867852P892101K64319l290161j257430
3367H578089Q83805r87104m819708o237679l723172J053433N549289P643228O190331
3358A4130512J855623k646996l853250k24778N268927O170238r47440j0609014
3350I143822j2761281m771505M674372O658614L091980J911054M440713M399384
3342A6787153j168538p052426p758602m534817j683008l18347P73826J270077
3334c684682O626k025758k267977L29010M119488N955482L506745j860018m854217
3325g75301j798790L708250M486284m48291m475315l097865L10826J350324J711359
3316I71481M707243Q067990P213664L164638J105302K126493J894407k496545
$$ plain form
3308 26754673 18020807 5601879 -5069773 -8580527 -3726479 3932726 6807703 4194192
3300 4194192 3033952 7659953 12847776 10886775 2412709 -4573375 -4880426 -830853
3292 -830853 2521460 2892632 1494366 1318339 4661467 10153480 13089365 10887520 6567571
3283 6567571 4097356 2599590 -859221 -4923458 -5766697 -4166538 -4699859 -7608275 -7708880
3274 -7708880 -3162009 490599 -1810399 -7271013 -9366235 -6091857 -729568 3071966
3266 3071966 3784730 1452322 -2525545 -6197887 -9285397 -13046322 -16970939 -18147568
3258 -18147568 -15229625 -10202252 -4802366 1421971 7627969 10188594 7584893 3237835
3250 3237835 271443 -2809306 -7270645 -8888553 -3161478 6584042 12260875 11256192
$$ packed form
3308B6754673q733866j2418928j0671652l510754M854048P659205K874977k613511
3300D194192j160240M626001N187823j961001q474066o986084l07051M049573
3292h30853L352313L71172j398266j76027L343128N492013K935885k201845m319949
3283F567571k470215j497766l458811m064237q43239J600159n33321k908416j00605
3274g708880M546871L652608k300998n460614k095222L274378N362289L801534
3266C071966P12764k332408l977867l672342l087510l760925l924617j176629
3258a8147568K917943N027373N399886O224337O205998K560625k603701m347058
3250C237835k966392l080749m461339j617908N727075R745520N676833j004683
$$ plain form
3242 11256192 8168919 6700352 5231941 1289447 -4083382 -7863759 -8045393 -4469860
3234 -4469860 938605 4904442 5916489 5529699 4449206 254536 -6913280 -9791399
3226 -9791399 -1790762 12304110 20887342 20441083 18025691 18337226 17330598 11624485
3218 11624485 5331304 2220971 -1463616 -9768833 -18482607 -21055599 -18705521 -17243241
3210 -17243241 -17060256 -13882861 -7618601 -3067451 -2415484 -3466447 -4957959 -7372590
3202 -7372590 -8504529 -4690753 2506118 6648334 4941611 1241290 -818231 -2208638
3194 -2208638 -3894597 -3398020 446888 3767421 3012775 895356 2466622 7310124 10327783
3185 10327783 9610171 9021282 12032917 16474200 17526087 14047345 9447610 6665472
$$ packed form
3242A1256192l087273j468567j468411l942494n372829l780377j81634L575533
3234d469860N408465L965837J012047l86790j080493m194670p167816k878119
3226i791399Q000637J4094872Q583232m46259k415392L11535j006628n706113
3218A1624485o293181l110333l684587q305217q713774k572992K350078J462280
3210a7243241J82985L177395O264260M551150O51967j050963j491512k414631
3202g372590j131939L813776P196871M142216j706723l700321k059521j390407
3194b208638j685959M96577L844908L320533p54646k117419J571266M843502L017659
3185A0327783p17612n88889L011635M441283J051887l478742m599735k782138
$$ plain form
3177 6665472 4706742 1322743 -2627140 -3915979 -1633210 1627802 3863340 6115344
3169 6115344 9448317 12344164 13324395 13465581 13481021 11028103 4697357 -1698334 -3526502
3160 -3526502 -2375080 -3380279 -6463151 -6287644 -1329425 3093086 2311355 -2810098 -10212867
3151 -10212867 -19611528 -27942892 -28068069 -17382887 -3552030 3931148 5066436 6933181
3143 6933181 12373090 17062962 17011851 13217562 8196066 2596997 -3140203 -7094831 -7702180
3134 -7702180 -5640758 -3074296 -2147521 -3962966 -7375131 -9092729 -6770385 -1841613
3126 -1841613 2197354 3799676 4096552 4363773 4648600 4483632 3365339 1062176 -1271886
3117 -1271886 -1404212 1049032 3407039 3289943 1328815 -1443196 -6119595 -12389290 -15155060
$$ packed form
3177F665472j958730l383999l949883j288839K282769L261012K235538K252004
3169F115344L332973K895847R80231J41186J5440k452918o330746o395691j828168
3160c526502J151422j005199l082872J75507M958219M422511p81731n121453p402769
3151a0212867r398661q331364j25177J0685182J3830857P483178J135288J866745
3143F933181N439909M689872n1111l794289n021496n599069n737200l954628o07349
3134g702180K061422K566462R26775j815445l412165j717598K322344M928772
3126a841613M038967J602322K96876K67221K84827j64968j118293k303163k334062
3117a271886j32326K453244K358007j17096j961128k772011m676399o269695k765770
$$ plain form
3108 -15155060 -9888882 -250213 5270750 4460879 3409047 6201313 8681484 5926665
3100 5926665 1063227 1443859 8285143 15122242 16516530 14587443 15691248 22589486
3092 22589486 31456582 36463289 36292822 34754283 34618186 33127707 26116769 15038639
3084 15038639 6082206 2531980 2134806 2647276 5340190 10950880 16438066 18886557
3076 18886557 19245981 18915594 15983105 9018486 1816799 -622505 796282 1158704 -547266
3067 -547266 -716565 2048420 5146058 7753647 12432947 18747438 20995356 16280299 10353781
3058 10353781 10319819 14405520 14506204 7537243 -1236854 -6129035 -7079386 -6705704 -6061970
3049 -6061970 -5534784 -6062510 -6663211 -4060390 1813547 4808971 -384765 -9660299 -13000479
$$ packed form
3108a5155060N266178R638669N520963q09871j051832K792266K480171k754819
3100E926665m863438L80632O841284O837099J394288j929087J103805O898238
3092B2589486Q867096N006707j70467j538539j36097j490479p010938j1078130
3084A5038639q956433l550226l97174N12470K692914N610690N487186K448491
3076A8886557L59424l30387k932489o964619p201687k439304J418787L62422j705970
3067e47266j69299K764985L097638K607589M679300O314491K247918m715057n926518
3058A0353781l3962M085701J00684o968961q774097m892181r50351L73682O43734
3049f061970N27186n27726o00701K602821N873937K995424n193736r275534l340180
$$ plain form
3040 -13000479 -6611531 3254043 9567510 12468842 15125453 16280109 12072399 3284585
3032 3284585 -4438520 -7590624 -7943206 -8339374 -9201822 -10047012 -10626484 -9064488 -2649964
3023 -2649964 7227153 14556456 16274871 16946673 21606896 26962391 25802370 18787126
3015 18787126 14492545 16564713 18282076 13643173 7279541 7277557 12943944 17212950 18242306
3006 18242306 19926784 21740256 17848908 8702787 4189601 9820641 17188790 15354339
2998 15354339 6329927 1095834 3803242 8751222 11284332 12420545 12325680 8286426
2990 8286426 1668311 -953094 2779666 6990669 6792884 5350124 7205919 10293878
2982 10293878 10242921 8223485 8526065 11455150 14235486 16496900 19563184 22371528 23083564
$$ packed form
3040a3000479O388948R865574O313467K901332K656611J154656m207710q787814
3032C284585p723105l152104l52582l96168q62448q45190n79472J561996O414524
3023b649964R877117P329303J718415O71802M660223N355495j160021p015244
3015A8787126m294581K072168J717363m638903o363632j984N666387M269006J029356
3006A8242306J684478J813472l891348r146121m513186N631040P368149j834451
2998A5354339r024412n234093K707408M947980K533110J136213r4865m039254
2990H286426o618115k621405L732760M211003j97785j442760J855795L087959
2982A0293878n0957k019436L02580K929085K780336K261414L066284K808344P12036
$$ plain form
2973 23083564 22865377 23417725 22815837 18435035 11750351 5643086 12209 -4423385 -1626091
2964 -1626091 12699797 31474676 41798047 39632561 31644832 23628369 16034093 10936335
2956 10936335 13012582 20644376 25148378 22902529 20215773 21903764 23173108 18464414
2948 18464414 11011005 6900854 5615324 3390492 860824 215256 -781723 -4328348
2940 -4328348 -5761773 666766 11323696 16441893 13031444 7364795 4826464 4342504
2932 4342504 3793183 4337369 6721165 7863376 4196965 -3662859 -11241421 -14154278 -11550943
2923 -11550943 -6467050 -2038835 2854560 11540278 22291975 27576269 23600003 16246696
2915 16246696 13010944 12924138 10067567 3771534 -1386352 -3681139 -5268959 -5973469 -3051058
$$ packed form
2973B3083564k18187N52348o01888m380802o684684o107265n630877m435594K797294
2964a626091J4325888J8774879J0323371k165486p987729q016463p594276n097758
2956A0936335K076247P631794M504002k245849k686756J687991J269344m708694
2948A8464414p453409m110151j285530k224832k529668o45568r96979l546625
2940d328348j433425O428539J0656930N118197l410449n666649k538331m83960
2932D342504n49321N44186K383796J142211l666411p859824p578562k912857K603335
2923a1550943N083893M428215M893395Q685718J0751697N284294l976266p353307
2915A6246696l235752q6806k856571o296033n157886k294787j587820p04510K922411
$$ plain form
2906 -3051058 2457833 5418408 3686089 285111 -2158672 -3992236 -4787449 -2259130
2898 -2259130 3522465 8928107 10922763 9244358 4804465 -122420 -988711 4796318
2890 4796318 13210480 18172252 19775373 22196222 24720372 22454268 15920633 11522863
2882 11522863 10969026 8642258 2102472 -3150653 -3189729 -1996941 -3498155 -4586708 -1781009
2873 -1781009 1663949 1659691 798795 3321652 7128079 7504868 5091992 3595485 2724650
2864 2724650 -150874 -3905132 -5403702 -5094212 -4957693 -3175743 2899562 10197620 12727163
2855 12727163 10030307 7103060 6731320 7543406 8970047 12288495 16704206 19667012
2847 19667012 21163093 22721400 22387384 16337321 6151443 -1100158 -1785256 -218522
$$ packed form
2906c051058N508891K960575j732319l400978k443783j833564p95213K528319
2898b259130N781595N405642J994656j678405m439893m926885q66291N785029
2890D796318Q414162M961772J603121K420849K524150k266104o533635m397770
2882A1522863n53837k326768o539786n253125l9076J192788j501214j088553K805699
2873a781009L444958m258q60896K522857L806427L76789k412876j496507q70835
2864B724650k875524l754258j498570L09490J36519J781950O075305P298058K529543
2855A2727163k696856k927247l71740Q12086J426641L318448M415711K962806
2847A9667012J496081J558307l34016o050063j0185878p251601o85098J566734
$$ plain form
2839 -218522 -2350568 -8643894 -14977964 -17449501 -14670826 -8156898 -2108246 -637385
2831 -637385 -3821681 -7944085 -10041850 -10504944 -11068888 -12149416 -12482253 -10236498 -5035607
2822 -5035607 111129 707259 -3436281 -6541922 -3922093 1544715 3804534 2557775
2814 2557775 3112415 8344372 15696648 21997007 26577435 29161123 28765244 25384682 19635234
2805 19635234 11161925 959896 -5946373 -5145926 304091 3103786 1886035 2389661
2797 2389661 7815546 14277817 17599533 18419873 17776043 13521855 5151194 -2431917 -4155169
2788 -4155169 -420886 5628552 12511205 18527364 19783763 15093017 9954685 10491677
2780 10491677 15051609 16533609 12207011 6973599 6871682 12531079 19245003 21311218
$$ packed form
2839b18522k132046o293326o334070k471537K778675O513928O048652J470861
2831f37385l184296m122404k097765m63094n63944j080528l32837K245755N200891
2822e035607N146736N96130m143540l105641K619829N466808K259819j246759
2814B557775N54640N231957P352276O300359M580428K583688l95879l380562n749448
2805A9635234q473309j0202029o906269Q00447N450017K799695j217751N03626
2797B389661N425885O462271L321716Q20340o43830m254188q370661p583111j723252
2788d155169L734283O049438O882653O016159J256399m690746n138332N36992
2780A0491677M559932J482000m326598n233412j01917N659397O713924K066215
$$ plain form
2772 21311218 16504879 8065038 1946660 969622 2545554 2856717 1344251 -159633
2764 -159633 -474029 539683 2575633 4113984 3137271 225835 -1563968 -1663260 -3721963
2755 -3721963 -9868585 -16435735 -18721240 -17161254 -15024720 -12682330 -8679286 -4449531
2747 -4449531 -2992739 -3992439 -4921682 -5875801 -8094456 -8443150 -1780541 9887122 16563630
2738 16563630 11649346 101956 -7694703 -6735213 891397 11441429 22028345 29399562
2730 29399562 31174856 29110484 28058770 30656543 35170049 39322325 43703126 49358798
2722 49358798 53712921 52068702 43569783 33191513 26437985 23762393 21873152 18916233
2714 18916233 15800889 13316715 11099183 9593800 10008913 11599054 11934819 10998765 11987066
$$ packed form
2772B1311218m806339q439841o118378r77038J575932L11163j512466j503884
2764a59633l14396J013712K035950J538351r76713k911436j789803r9292k058703
2755c721963o146622o567150k285505J559986K136534K342390M003044M229755
2747d449531J456792r99700r29243r54119k218655l48694O662609J1667663O676508
2738A6563630m914284j1547390p796659R59490P626610J0550032J0586916P371217
2730B9399562J775294k064372j051714K597773M513506M152276M380801N655672
2722D9358798M354123j644219q498919j0378270o753528k675592j889241k956919
2714A8916233l115344k484174k217532j505383M15113J590141L35765r36054R88301
$$ plain form
2705 11987066 16222960 20022494 18997050 13354972 6641865 1230545 -2583724 -5043604
2697 -5043604 -7064957 -9909698 -12066373 -8923997 779897 10316529 11398556 4269958
2689 4269958 -3189484 -5852787 -5865556 -6636140 -7826368 -8145839 -8279355 -8033539 -4300688
2680 -4300688 4420310 13683527 16890773 12727306 6410730 4016955 7207135 12877090
2672 12877090 16455077 15872209 13144055 11522557 10994407 8338589 2439157 -2646641
2664 -2646641 -1999036 3876397 9131142 8762073 3457363 -1614127 -2173892 721793 1606763
2655 1606763 -2947913 -9039510 -8978684 -890505 8166403 10701529 7540139 4833688 4886754
2646 4886754 4909504 3917605 4854113 8339419 9779762 6028412 633515 -1839261 -3193369
$$ packed form
2705A1987066M235894L799534j025444n642078o713107n411320l814269k459880
2697e043604k021353k844741k156675L142376R703894R536632J082027p128598
2689D269958p459442k663303j2769p70584j190228l19471j33516K45816L732851
2680d300688Q720998R263217L207246m163467o316576k393775L190180N669955
2672A2877090L577987n82868k728154j621498n28150k655818n899432n085798
2664b646641O47605N875433N254745l69069n304710n071490n59765K895685Q84970
2655A606763m554676o091597O0826Q088179R056908K535126l161390k706451N3066
2646D886754K2750r91899R36508L485306J440343l751350n394897k472776j354108
$$ plain form
2637 -3193369 -7769595 -13557720 -14066892 -9032538 -6068072 -9458305 -14071516 -14558459 -14468780
2628 -14468780 -19723701 -27261149 -28247664 -21001889 -12496265 -6602197 729044 11646048
2620 11646048 19500206 17540446 9592352 5519366 8222631 10959491 7105947 -2016515
2612 -2016515 -9411432 -9235803 -1028237 10431918 19140173 23051812 24734339 26279386
2604 26279386 26115651 22920371 19569038 19208368 19408044 14981025 5992238 -1580785 -3382856
2595 -3382856 -927733 1960501 3006283 1219356 -3155614 -7097090 -6690334 -2040272
2587 -2040272 2658888 5066921 7437306 12131949 18017336 23258724 28011140 31505031
2579 31505031 29912261 21312775 10903862 6812353 10835784 16749131 18218284 15530325
$$ packed form
2637c193369m576226n788125n09172N034354K964466l390233m613211m86943Q9679
2628a4468780n254921p537448r86515P245775Q505624N894068P331241J0917004
2620A1646048P854158j959760p948094m072986K703265K736860l853544r122462
2612b016515p394917J75629Q207566J1460155Q708255L911639J682527J545047
2604B6279386j63735l195280l351333l60670J99676m427019q988787p573023j802071
2595c382856K455123K888234J045782j786927m374970l941476M06756M650062
2587b040272M699160K408033K370385M694643N885387N241388M752416L493891
2579C1505031j592770q599486j0408913m091509M023431N913347J469153k687959
$$ plain form
2571 15530325 13422421 14453109 16526017 16561950 14944865 14994609 17987105 20406831 18032141
2562 18032141 11961966 7680005 7534467 7243631 1940814 -6723709 -12577739 -12757275 -10112379
2553 -10112379 -7859840 -5356303 -734042 4855006 8291752 8854943 8990735 10576535
2545 10576535 12688450 14107907 16055585 20253261 25125034 26490608 22486648 15952733
2537 15952733 11330449 10740927 13426106 16878392 17625674 13317283 5794320 182649
2529 182649 -958678 -838575 -3848943 -9676733 -14306306 -14984164 -11483972 -4505099 3532292
2520 3532292 7622027 4497345 -2496708 -6860137 -7262956 -8402967 -13136381 -17898216
2512 -17898216 -17414490 -10919480 -2529344 2013304 -1311922 -11255723 -20347363 -21182087
$$ packed form
2571A5530325k107904J030688K072908L5933j617085M9744K992496K419726k374690
2562A8032141o070175m281961j45538k90836n302817q664523n854030j79536K644896
2553a0112379K252539K503537M622261N589048L436746N63191J35792J585800
2545A0576535K111915J419457J947678M197676M871773J365574m003960o533915
2537A5952733m622284n89522K685179L452286P47282m308391p522963n611671
2529A82649j141327J20103l010368n827790m629573o77858L500192O978873Q037391
2520C532292M089735l124682o994053m363429m02819j140011m733414m761835
2512a7898216M83726O495010Q390136M542648l325226r943801r091640q34724
$$ plain form
2504 -21182087 -15058615 -10980602 -14505006 -20949703 -21750004 -14660031 -5293898 -634170
2496 -634170 -2954741 -8523516 -10960856 -7247551 -726609 3570824 5555997 8466822
2488 8466822 11527203 9771954 2136484 -6021183 -10646487 -13757319 -17733719 -20500926
2480 -20500926 -20218522 -19449917 -20165196 -19724308 -16962117 -16866181 -22443951 -26709275 -21283877
2471 -21283877 -9935955 -4088120 -5940339 -6101687 603058 6746263 3890034 -5238489
2463 -5238489 -11842918 -12745334 -10879105 -8073355 -4039924 -755091 -1382319 -4593630 -5400018
2454 -5400018 -2954020 -2491446 -6545545 -8571101 -826624 12965305 19435193 11990385
2446 11990385 -174659 -3732254 2517314 9322885 12073029 15530874 22692074 27706853
$$ packed form
2504b1182087O123472M078013l524404o444697q00301P089973R366133M659728
2496f34170k320571n568775k437340L713305O520942M297433J985173K910825
2488H466822L060381j755249p635470q157667m625304l110832l976400k767207
2480b0500926K82404P68605p15279M40888K762191R5936n577770m265324N425398
2471b1283877J1347922N847835j852219j61348O704745O143205k856229r128523
2463e238489o604429r02416J866229K805750M033431L284833o27228l211311q06388
2454e400018K445998M62574m054099k025556P744477J3791929O469888p444808
2446A1990385j2165044l557595O249568O805571K750144L457845P161200N014779
$$ plain form
2438 27706853 24400203 15471602 7646397 2376272 -2589767 -5913880 -3762767 3158113
2430 3158113 9440233 11477060 9834704 6184278 2305344 1134775 4171973 8293497
2422 8293497 9189761 7175164 5532461 4318148 718659 -4952096 -8545800 -7529170
2414 -7529170 -2987031 3488574 10527615 14973049 13887365 8761559 3618814 -606462
2406 -606462 -5367092 -9313125 -9628994 -8189313 -9814888 -13607415 -12703613 -4612735 4385773
2397 4385773 7852552 6748617 5508268 5613047 6370944 7761989 9129076 8522314 6171477
2388 6171477 5423994 7996516 11533999 13497376 13592484 10856145 3213095 -7512622 -14742683
2379 -14742683 -14394407 -9227872 -3571703 2034345 8405656 14468874 19377346 23635240
$$ packed form
2438B7706853l306650q928601p825205n270125m966039l324113K151113O920880
2430C158113O282120K036827j642356l650426l878934j170569L037198M121524
2422H293497Q96264k014597j642703j214313l599489n670755l593704J016630
2414g529170M542139O475605P039041M445434j085684n125806n142745m225276
2406f06462m760630l946033l15869J439681j625575l792527R03802Q090878Q998508
2397D385773L466779j103935j240349J04779P57897J391045J367087o06762k350837
2388F171477p47483K572522L537483J963377R5108k736339p643050j0725717p230061
2379a4742683L48276N166535N656169N606048O371311O063218M908472M257894
$$ plain form
2371 23635240 25688875 22380554 15372523 11173115 11336429 9255674 1386449 -5404808
2363 -5404808 -4274411 310871 22357 -3709382 -2994354 2910990 7270931 7788753 9120549
$$ packed form
2371B3635240K053635l308321p008031m199408J63314k080755p869225o791257
2363e404808J130397M585282k88514l731739P15028N905344M359941N17822J331796
$$ [...]
##END NTUPLES=NMR SPECTRUM
##END=
