##TITLE=31Pdec_DE-75H_DEK
 D2O, 64 sc
 31.1.2025
##JCAMPDX= 6.0         $$ Bruker NMR JCAMP-DX V2.0
##DATA TYPE= NMR SPECTRUM
##DATA CLASS= NTUPLES
##ORIGIN= UXNMR, Bruker Analytische Messtechnik GmbH
##OWNER= root
$$ XWIN-NMR		Version 3.5
$$ Fri Jan 31 14:32:37 2025 Russian Standard Time (UT+4h)  she@DPX200
##.OBSERVE FREQUENCY= 81.013821
##.OBSERVE NUCLEUS= ^31P
##.ACQUISITION MODE= SIMULTANEOUS
##.ACQUISITION SCHEME= undefined
##.AVERAGES= 64
##.DIGITISER RES= 17
##SPECTROMETER/DATA SYSTEM= spect
##.PULSE SEQUENCE= zgpg30
##.SOLVENT NAME= CDCl3
##.SHIFT REFERENCE= (INTERNAL, CDCl3, 0, 198.062)
##AUDIT TRAIL= $$ (NUMBER, WHEN, WHO, WHERE, WHAT)
$$ ##TITLE= Audit trail, XWIN-NMR		Version 3.5
$$ ##JCAMPDX= 5.01
$$ ##ORIGIN= Bruker BioSpin GmbH
$$ ##OWNER= she
$$ F:/spectra/data/she/nmr/P31/2/pdata/1/auditp.txt
$$ ##AUDIT TRAIL=  $$ (NUMBER, WHEN, WHO, WHERE, WHAT)
(   1,<2025-01-31 14:31:27.50 +0400>,<she>,<DPX200>,
      <created by zg, POWCHK disabled, PULCHK disabled
       configuration hash MD5:
       00 E9 B6 7A A2 85 ED C7 34 08 36 98 17 FE 4E 26
       data hash MD5: 32K
       B9 BA D2 D4 35 0A 71 10 BE 69 B2 2B 14 91 FD AA>)
(   2,<2025-01-31 14:31:29.96 +0400>,<she>,<DPX200>,
      <Start of raw data processing
       efp BC_mod = 2 LB = 1.5 FT_mod = 6 PKNL = 1 PHC0 = 1591.23 PHC1 = 460.2905 SI = 64K 
       data hash MD5: 64K
       4A 6D 74 61 53 D6 10 D8 98 F4 2A A0 F8 62 8C E9>)
(   3,<2025-01-31 14:32:01.09 +0400>,<she>,<DPX200>,
      <pk PHC0 = 68.69398 PHC1 = -203.3996 
       data hash MD5: 64K
       01 54 FB 6E F1 E8 8C 05 A3 51 F2 0A 1F B2 4A 74>)
(   4,<2025-01-31 14:32:06.71 +0400>,<she>,<DPX200>,
      <abs ABSG = 5 
       data hash MD5: 64K
       8B B0 E2 77 C1 E0 15 31 14 E6 98 50 D4 9C 45 47>)
$$ ##END=
$$ 
$$ hash MD5
$$ 17 36 00 16 CE BD E2 76 E6 3F F8 99 CD CC 05 99
##$RELAX= 
##$RELAX= 
##$RELAX= 
##$RELAX= 
##$RELAX= 
##$RELAX= 
##$RELAX= 
##$RELAX= 
$$ Bruker specific parameters
$$ --------------------------
##$DU= <F:/spectra>
##$EXPNO= 2
##$NAME= <P31>
##$PROCNO= 1
##$TYPE= <nmr>
##$USER= <she>
##$AMP= (0..31)
100 100 100 100 100 100 100 100 100 100 100 100 100 100 100 100 100 100 
100 100 100 100 100 100 100 100 100 100 100 100 100 100 
##$AQSEQ= 0
##$AQ_mod= 1
##$AUNM= <au_zg>
##$AUTOPOS= <>
##$BF1= 81.014009
##$BF2= 200.13
##$BF3= 200.13
##$BF4= 200.13
##$BF5= 200.13
##$BF6= 200.13
##$BF7= 200.13
##$BF8= 200.13
##$BYTORDA= 1
##$CFDGTYP= 0
##$CFRGTYP= 5
##$CHEMSTR= <none>
##$CNST= (0..31)
1 1 145 1 1 1 1 1 1 1 1 1 1 1 1 1 1 1 1 1 1 1 1 1 1 1 1 1 1 1 1 1 
##$CPDPRG= <waltz16>
##$CPDPRG1= <>
##$CPDPRG2= <waltz16>
##$CPDPRG3= <>
##$CPDPRG4= <mlev>
##$CPDPRG5= <mlev>
##$CPDPRG6= <mlev>
##$CPDPRG7= <mlev>
##$CPDPRG8= <mlev>
##$CPDPRGB= <>
##$CPDPRGT= <>
##$D= (0..31)
0 1 0 0 0 0 0 0 0 0.06 0 0.03 2e-05 3e-06 0 0 0.0002 0 0 0 0 0 0 0 0 0 
0 0 0 0 0 0 
##$DATE= 1738319487
##$DBL= (0..7)
120 120 120 11 120 120 24 19 
##$DBP= (0..7)
150 150 150 150 150 150 150 150 
##$DBP07= 0
##$DBPNAM0= <>
##$DBPNAM1= <>
$$ [...]
##$SUBNAM3= <"">
##$SUBNAM4= <"">
##$SUBNAM5= <"">
##$SUBNAM6= <"">
##$SUBNAM7= <"">
##$SUBNAM8= <"">
##$SUBNAM9= <"">
##$SW= 400.765351723535
##$SWIBOX= (0..15)
0 1 3 0 0 0 0 0 0 0 0 0 0 0 0 0 
##$SW_h= 32467.5324675325
##$TD= 32768
##$TD0= 1
##$TE= 0
##$TE2= 300
##$TE3= 300
##$TEG= 300
##$TL= (0..7)
0 120 53 12 22 120 120 120 
##$TP= (0..7)
150 150 150 150 150 150 150 150 
##$TP07= 0
##$TPNAME0= <>
##$TPNAME1= <>
##$TPNAME2= <>
##$TPNAME3= <>
##$TPNAME4= <>
##$TPNAME5= <>
##$TPNAME6= <>
##$TPNAME7= <>
##$TPOAL= (0..7)
0.5 0.5 0.5 0.5 0.5 0.5 0.5 0.5 
##$TPOFFS= (0..7)
0 0 0 0 0 0 0 0 
##$TUNHIN= 0
##$TUNHOUT= 0
##$TUNXOUT= 0
##$USERA1= <user>
##$USERA2= <user>
##$USERA3= <user>
##$USERA4= <user>
##$USERA5= <user>
##$V9= 5
##$VALIST= <valist>
##$VCLIST= <CCCCCCCCCCCCCCC>
##$VD= 0
##$VDLIST= <DDDDDDDDDDDDDDD>
##$VPLIST= <PPPPPPPPPPPPPPP>
##$VTLIST= <TTTTTTTTTTTTTTT>
##$WBST= 1024
##$WBSW= 4
##$XGAIN= (0..3)
0 0 0 0 
##$XL= 0
##$YL= 0
##$YMAX_a= 5707
##$YMIN_a= -12708
##$ZGOPTNS= <>
##$ZL1= 120
##$ZL2= 120
##$ZL3= 120
##$ZL4= 120
##$ABSF1= 198.0616
##$ABSF2= -202.7028
##$ABSG= 5
##$ABSL= 3
##$ALPHA= 0
##$AQORDER= 0
##$ASSFAC= 0
##$ASSFACI= 0
##$ASSFACX= 0
##$ASSWID= 0
##$AUNMP= <proc_1d>
##$AZFE= 0.1
##$AZFW= 0.5
##$BCFW= 0
##$BC_mod= 2
##$BYTORDP= 0
##$COROFFS= 0
##$CY= -3
##$DATMOD= 1
##$DC= 0
##$DFILT= <>
##$DTYPP= 0
##$F1P= 0
##$F2P= 0
##$FCOR= 1
##$FTSIZE= 65536
##$FT_mod= 6
##$GAMMA= 0
##$GB= 0
##$INTBC= 1
##$INTSCL= 9.790993e-09
##$ISEN= 30
##$LB= 1.5
##$LEV0= 0
##$LPBIN= 0
##$MAXI= 10000
##$MC2= 0
##$MEAN= 0
##$ME_mod= 0
##$MI= 50
##$NCOEF= 0
##$NC_proc= -9
##$NLEV= 6
##$NOISF1= 182.463
##$NOISF2= 159.3651
##$NSP= 0
##$NTH_PI= 0
##$NZP= 0
##$OFFSET= 198.0616
##$PC= 4
##$PHC0= 1659.924
##$PHC1= 256.8909
##$PH_mod= 1
##$PKNL= yes
##$PPARMOD= 0
##$PSCAL= 0
##$PSIGN= 0
##$REVERSE= no
##$SF= 81.0140089999434
##$SI= 65536
##$SIGF1= 159.3651
##$SIGF2= -187.1042
##$SINO= 113.3802
##$SIOLD= 16384
##$SREGLST= <1H.CDCl3>
##$SSB= 0
##$STSI= 65536
##$STSR= 0
##$SW_p= 32467.5324675325
##$SYMM= 0
##$S_DEV= 0
##$TDeff= 32768
##$TDoff= 0
##$TI= <>
##$TILT= no
##$TM1= 0
##$TM2= 0
##$TOPLEV= 0
##$USERP1= <user>
##$USERP2= <user>
##$USERP3= <user>
##$USERP4= <user>
##$USERP5= <user>
##$WDW= 1
##$XDIM= 65536
##$YMAX_p= 403230647
##$YMIN_p= -319553177
$$ End of Bruker specific parameters
$$ ---------------------------------
##NTUPLES= NMR SPECTRUM
##VAR_NAME=  FREQUENCY,     SPECTRUM/REAL,   SPECTRUM/IMAG
##SYMBOL=    X,             R,               I
##VAR_TYPE=  INDEPENDENT,   DEPENDENT,       DEPENDENT
##VAR_FORM=  AFFN,          ASDF,            ASDF
##VAR_DIM=   65536,         65536,           65536
##UNITS=     HZ,            ARBITRARY UNITS, ARBITRARY UNITS
##FACTOR=    0.49542278885378, 1,            1
##FIRST=     16045.7642231865, 0,            0
##LAST=      -16421.768244346, 0,            0
##MIN=       -16421.768244346, -319553177,   0
##MAX=       16045.7642231865, 403230647,    0
$$ Real data points
##PAGE= N=1
##DATA TABLE= (X++(R..R)), XYDATA
$$ [...]
##PAGE= N=2
##DATA TABLE= (X++(I..I)), XYDATA
7355A4906665o863682j0273575p207930j282495J178231K69903P55770L412781
7347e104332L998139M25079m235946o511780o110058m032497p67812K634435M540471
7338a5164301M570041L378754Q79891k756063m954397k955552J780890M590160
7330a0630577L338631L65802j360255j216328m7984R69230P47955L5332J795712
7321f002482O776077J0046430O142134l075788j0082046j0723020p161120k632230
7313a6712045J270425K300350j311729o466343p495051l787539K83276L152117
7305b8766539O847755R454707N530360l309017p272039k358416L282990K756468
7297a3833731J297188N727658J1129888Q550482L36675l677914j861547j004985
$$ plain form
7355 14906665 8042983 -2230592 -9438522 -10721017 -9542786 -9272883 -8517113 -5104332
7347 -5104332 -1106193 -681114 -4917060 -11428840 -17538898 -21571395 -22339207 -19704772 -15164301
7338 -15164301 -10594260 -7215506 -6335615 -9091678 -14046075 -17001627 -15220737 -10630577
7330 -10630577 -7291946 -6926144 -8286399 -9502727 -9550711 -8581481 -7833526 -7798194 -6002482
7321 -6002482 773595 10820025 16962159 13886371 3804325 -6918695 -14079815 -16712045
7313 -16712045 -15441620 -13141270 -14452999 -20919342 -28414393 -32201932 -31918656 -28766539
7305 -28766539 -21918784 -12464077 -6933717 -10242734 -17514773 -19873189 -16590199 -13833731
7297 -13833731 -12536543 -6808885 4321003 12871485 13208160 9530246 7668699 6663714
7289F663714k631694j260481L038899K291198n878634j2605716j0450064l409719
7281b4242497R26058K071944L649310N575083N714214N285998O445231P149802
7273A2575143M037128j306383l977130k788250j431491k835168n605443o140748
7265g472342k241250M872115J0606569J0257436L874562l383058p015077p368401
7257B130554o731861n200290k132104Q15809J612186J159152J292230R66740j816302
7248g903886n353220n716104k775645o86970j657823k864065r49846L302991O473808
7239a8130760O620727M446986J847131L88285J92976p0066j048392j062585J496197
7230e319501M823761N645479M166535L416165L451162Q49959m493955p107870
$$ plain form
7289 6663714 4032020 2771539 5810438 8101636 2223002 -10382714 -20832778 -24242497
7281 -24242497 -23316439 -21244495 -17595185 -12020102 -6305888 -1019890 5425341 12575143
7273 12575143 16612271 15305888 11328758 8540508 7109017 4273849 -1331594 -7472342
7265 -7472342 -9713592 -4841477 5765092 16022528 19897090 16514032 9498955 2130554
7257 2130554 -4601307 -9801597 -11933701 -11117892 -9505706 -8346554 -7054324 -6087584 -7903886
7248 -7903886 -13257106 -18973210 -21748855 -22435825 -24093648 -26957713 -27907559 -24604568 -18130760
7239 -18130760 -11510033 -7063047 -5215916 -4827631 -4634655 -4704721 -5753113 -6815698 -5319501
7230 -5319501 -495740 5149739 9316274 12732439 16183601 17033560 12539605 5431735
7222E431735l704448J191352J717899r13666j709110n67660j304627l645503l146002
7213f650030Q67896L880300L647980K783984K495781M28350k808656j932666M106872
7204F819811P867338L442560m494921p573435n029339j755959N67637K870453
7196B714145K815570j742044n601647j900261N780063O778308m73796n878651
7188B491687l750094r26643l814513p191614l714492L050099M482165Q86305j31244
7179h618344L187201M680340J184407k889903l465972k379998k472401k534264
7171a3308934m49599K291026K535919k7523k789163l562272k345825l35492J688499
7162a6303364L853631O126184P113096N288062J884712N85198K761709M780280
$$ plain form
7222 5431735 1727287 2918639 4636538 3722872 2013762 1446102 141475 -3504028 -6650030
7213 -6650030 -5782134 -1901834 1746146 4530130 7025911 7454261 4645605 2712939 6819811
7204 6819811 14687149 18129709 13634788 6061353 1032014 -723945 -156308 2714145
7196 2714145 5529715 3787671 -1813976 -3714237 2065826 8844134 8370338 2491687
7188 2491687 -1258407 -2185050 -5999563 -13191177 -16905669 -13855570 -9373405 -8487100 -8618344
7179 -8618344 -5431143 -750803 433604 -2456299 -5922271 -8302269 -10774670 -13308934
7171 -13308934 -13758533 -11467507 -8931588 -8959111 -11748274 -15310546 -17656371 -17991863 -16303364
7162 -16303364 -12449733 -6323549 789547 6077609 7962321 8547519 11309228 16089508
7154A6089508K285872l946564q722249q347140l890191R12714L221464K888392
7146D91806K015532K453023L362316K442552l22636k402166k607585k186264j275442
7137A971136J579840M598685K509811n269563j1032869q541933k389093j317806
7129a7891792n178358n868053M160O845540Q875637O654957L672275K066793L062264
7120B243423O544672Q914528O174758K83092k467407n15008P96346k259795o424389
7111A3290220o969807l823424K66395L228655L097704j268053o353596n981915
7103d513821l26952K390545k568368q478607o428987J614214N997229L320062
7095h994685j57918J095608M808402O013040M148124K179802J618388J163180
$$ plain form
7154 16089508 18375380 14428816 5706567 -2640573 -6530764 -5618050 -2396586 491806
7146 491806 2507338 4960361 8322677 10765229 10442593 8040427 5432842 3246578 1971136
7137 1971136 3550976 8149661 10659472 5389909 -5642960 -14184893 -16573986 -17891792
7129 -17891792 -23070150 -28938203 -28934043 -22088503 -13212866 -6557909 -2885634 -818841 2243423
7120 2243423 8788095 17702623 23877381 24160473 21693066 21178058 21974404 19714609 13290220
7111 13290220 6320413 2496989 2763384 5992039 9089743 7821690 1468094 -4513821
7103 -4513821 -4840773 -2450228 -5018596 -13497203 -19926190 -18311976 -12314747 -8994685
7095 -8994685 -9152603 -8056995 -3248593 2764447 6912571 9092373 10710761 11873941
7087A1873941q94299m528368p645697p419855l008680K684480N287021L764800
7079A13343J719471K528140M137016J313628o152642j0633902n595677M274405
7071h296218P378859N90446n873017k632857N634063P518821J095621n412851
7063B867o871217n816343m025942M99652N821131N038315k320424o343823m53902
7054a4469686P926049P794689K05245m722562k850998L67334p1389k729225m121614
7045a2672157l196000n75743K373575L312081J158916j638224k006832n55861
7037a3800245m0468q53828j287159j000209j037120j592193k432162l710580l899577
7028b9653541R8009P507708J1894464R045186L045959l04991j888170m750016
$$ plain form
7087 11873941 10979642 6451274 -1194423 -8614278 -11622958 -8938478 -3651457 113343
7079 113343 1832814 4360954 8497970 9811598 3658956 -6974946 -12570623 -8296218
7071 -8296218 -917359 -326913 -6199930 -8832787 -3198724 4320097 5415718 2867
7063 2867 -6868350 -12684693 -16710635 -16210983 -10389852 -5351537 -7671961 -14015784 -14469686
7054 -14469686 -6543637 1251052 1456297 -3266265 -6117263 -5749929 -5821318 -8550543 -12672157
7045 -12672157 -15868157 -16443900 -14070325 -10758244 -9599328 -11237552 -13244384 -13800245
7037 -13800245 -13840713 -14694541 -15981700 -16981909 -18019029 -19611222 -22043384 -25753964 -29653541
7028 -29653541 -29555532 -22047824 -10153360 -1108174 1937785 1632794 -255376 -5005392
7020e005392n663430p6618P130060O158646k368088o662048m86770Q520334J0661123
7011A2207817O141628Q63494k484424l787628j894971K410286M014205m07510
7003A7062897o831786r080304o845543m225385k847441j085773J461462L003626
6995i388247K616525J357252O62903J261441K683523K927087M43244k846632l159663
6986c442567k37647K208690K328136K151974K344836K02349m201487n342884l48107
6977d336707M859927L232373l003824n827230l087231l04499j678822n210535
6969a5356548p000282n525721j135653M681307R043117R809095P792654M421077
6961F729046q58260p224010r407775l874020L726910M451867r22234k570978L536651
$$ plain form
7020 -5005392 -10668822 -10745440 -3615380 2543266 175178 -6486870 -6973640 1546694 12207817
7011 12207817 18349445 19212939 16728515 12940887 11045916 13456202 17470407 17062897
7003 17062897 10231111 1150807 -5694736 -9920121 -12767562 -13853335 -12391873 -9388247
6995 -9388247 -6771722 -5414470 -4751567 -3490126 -806603 2120484 2563728 -282904 -3442567
6986 -3442567 -3680214 -1471524 856612 3008586 5353422 5555771 1354284 -3988600 -4336707
6977 -4336707 523220 3755593 751769 -5075461 -8162692 -8467191 -10146013 -15356548
6969 -15356548 -22356830 -27882551 -29018204 -24336897 -15293780 -5484685 2307969 6729046
6961 6729046 5870786 -1353224 -10760999 -14635019 -10908109 -6456242 -7378476 -9949454 -6412803
6952f412803R739978Q816875M063732J997654J830307p08276m003255l209627
6944A2114585K76788J65563m361275p013059m122727L62036J524556k90174k283031
6935c626738l520516l586388j038321L352675N140721J814151k567081k331598
6927f363095J856505M151634J877060j443627j798252K22622J400127L23109j812294
6918a586211l151950k393056Q75096N540709Q912825Q277040L080536l990903
6910A5564086q205134o440526p93206K629700K90251m265007m707345k03171L542310
6901b588042K028288k219772l390751p893L683652L634434J176912R42945M104388
6892G364161N962695K367380l082387k879864K768174M447570k434499q608285
$$ plain form
6952 -6412803 3327175 12144050 16207782 18205436 20035743 19327467 15324212 12114585
6944 12114585 12391373 12556936 8195661 1182602 -2940125 -2578089 -1053533 -1343707 -3626738
6935 -3626738 -7147254 -10733642 -11771963 -8419288 -3278567 -1464416 -4031497 -6363095
6927 -6363095 -4506590 -354956 1522104 78477 -1719775 -1497153 -97026 226083 -1586211
6918 -1586211 -4738161 -7131217 -6256121 -715412 8197413 16474453 19554989 15564086
6910 15564086 7358952 918426 125220 2754920 3045171 -1219836 -5927181 -6130352 -2588042
6901 -2588042 -559754 -2779526 -6170277 -6178170 -2494518 1139916 2316828 3259773 7364161
6892 7364161 13326856 15694236 12611849 9731985 12500159 16947729 14513230 5904945
6884E904945l682494O754944P675754l064130j1342400q118036j574544j798029
6876i243990m875388j952943M742447O659777L916994L447133N690346N233744
6868A3618120K830234M373817P939082M430186o557755j3357222q930830n48665
6860C796967K473121J257411J148940J228456k173573p216679r175406p397499
6852a6058262l852924J153332O402399P391577K538679k270240j471358J657906
6844d508891P88084k782820k759345J258006L407911J240798j595606k466875
6836g418738k824568l278629j627165K484655N617007M907519J052633l540146
6828d627432o261846m514593J243567N119146J711702n263526o125102J484484
$$ plain form
6884 5904945 2222451 8977395 16653149 13589019 2246619 -5871417 -7445961 -9243990
6876 -9243990 -14119378 -16072321 -11329874 -4670097 -753103 2694030 8384376 13618120
6868 13618120 16448354 20822171 28761253 33191439 26633684 13276462 4345632 3796967
6860 3796967 6270088 7527499 8676439 9904895 7731322 514643 -8660763 -16058262
6852 -16058262 -19911186 -18757854 -12355455 -4963878 -2425199 -4695439 -6166797 -4508891
6844 -4508891 -3720807 -6503627 -9262972 -8004966 -4597055 -3356257 -4951863 -7418738
6836 -7418738 -10243306 -13521935 -15149100 -12664445 -7047438 -2139919 -1087286 -4627432
6828 -4627432 -10889278 -15403871 -14160304 -9041158 -7329456 -12592982 -18718084 -17233600
6820a7233600Q453529O460890j024711m775346k852976j375006l551505m490428
6812b0389153R19420R366597J2462191P356265r4297l610951m155820o176228
6804d321976q844401o516944J705771Q458586P129916L68967m223160l801884
6796a0045125j236676J287798M158136O317452M698741q48604n690915n425873
6788f785066q88016L037550K496076j776306n150697l773590P86464K900796j46481
6779i299270m783809o468304n460379m250213k094534L269061R915710J2560416
6771f611322Q966696J850054n042905r097458q193182k618303K638090K293016
6763a5815314k096394l738875K66541N842354Q468239Q059973O264679L617413
$$ plain form
6820 -17233600 -8780071 -2319181 -3343892 -8119238 -10972214 -12347220 -15898725 -20389153
6812 -20389153 -19469733 -10103136 2359055 9715320 9621023 6010072 1854252 -4321976
6804 -4321976 -13166377 -19683321 -17977550 -9518964 -2389048 -2020081 -6243241 -10045125
6796 -10045125 -11281801 -9994003 -5835867 481585 5180326 4331722 -1359193 -6785066
6788 -6785066 -7673082 -4635532 -2139456 -3915762 -9066459 -12840049 -12053585 -9152789 -9299270
6779 -9299270 -14083079 -20551383 -26011762 -30261975 -32356509 -29087448 -19171738 -6611322
6771 -6611322 2355374 4205428 -837477 -9934935 -18128117 -20746420 -18108330 -15815314
6763 -15815314 -17911708 -21650583 -21384042 -15541688 -7073449 986524 7251203 10868616
6755A0868616J108377L90686O32165j002512m217190n060204k268488K11287o59479
6746C258k528995j976214N45874K960078N030442O438889N069027R13895j591935
6737A4864319N97595L538292J079011o318650j1826101j0493613l640992M145503
6729h054636Q786601Q069851L085553j314918o98566L484781N121905J022109
6721A9502680m894854o343117k139721K723463L036710j172048n747880p681189
6713b715956p264444n149986m44000O136862R916145O949478j00540m818078n089343
6704b579862l812147k072682K274364P827854Q107784Q14217o636941o153264
6696b230677Q9873L483116J335631r15637P45225L259332J876072l242229q039154
$$ plain form
6755 10868616 11976993 12367679 12999844 11997332 7780142 2719938 451450 662737 3258
6746 3258 -2525737 -4501951 -3956077 -995999 4034443 10473332 15542359 16456254 14864319
6737 14864319 15461914 19000206 20079217 13760567 1934466 -8559147 -12200139 -8054636
6729 -8054636 731965 8801816 11887369 10572451 9873885 13358666 18480571 19502680
6721 19502680 14607826 8264709 6124988 8848451 11885161 10713113 4965233 -2715956
6713 -2715956 -9980400 -15130386 -15574386 -9437524 478621 7428099 7327559 2509481 -2579862
6704 -2579862 -6392009 -8464691 -6190327 1637527 9745311 10559528 3922587 -2230677
6696 -2230677 -2140804 1342312 2677943 1762306 2507531 5766863 7642935 4400706 -3638448
6687c638448r464283p385283l377790O21835L268999M583975N504009O280251
6679c606735N837149L253963l38824k152375q40633J135940O261l847721n399227
6670e952202j957736K105768J412806j886869j266592L240596M180265j617503
6662a741467p320751n951493l64498J808894p71156k823549r58829K763754M984480
6653a0374615M689636L030020K166563L497170N278224L874001r62382m851153
6645F347464m788579k848864j515057J81549K379528J345700m159643q215165
6637a1273067n801862j374969j971285n353687l854318K230738N008392K427155
6629a9962903J167478M411905O528221L569236L70661K124338N932638O283790
$$ plain form
6687 -3638448 -13102731 -20488014 -23865804 -23243969 -19974970 -15390995 -9886986 -3606735
6679 -3606735 2230414 5484377 5145553 2993178 2152545 3288485 3294746 -552975 -5952202
6670 -5952202 -7909938 -5804170 -4391364 -6278233 -7544825 -4304229 -123964 -1741467
6662 -1741467 -9062218 -15013711 -15378209 -13569315 -14340471 -17164020 -18122849 -15359095 -10374615
6653 -10374615 -5684979 -2654959 -488396 3008774 8286998 12160999 11198617 6347464
6645 6347464 1558885 -1289979 -2805036 -2623487 -243959 1101741 -3057902 -11273067
6637 -11273067 -17074929 -18449898 -20421183 -25774870 -29629188 -27398450 -22390058 -19962903
6629 -19962903 -18795425 -14383520 -7855299 -4286063 -3915402 -1791064 4141574 10425364
6621A0425364L235515l10829m431876r468854j1675072p722358p67204L486264
6613a7229050M494678N595777P321492P372695N604754L665183Q23748m432912
6605A3216365r376190r290931m833959j425403n40158K205371Q066769J0666034
6597H687898N180480k821531m236111L53128J580762m467571j0229933p826118
6589a3778996j76655M214498L507955K931056M626648M404619j38340m555624
6581A035161l798493Q60189M565279N156624L360842j99555m372180o217806m296028
6572c905967j575716j644452l667037m357410k955109o48178K707476O948660
6564i097733Q722405N356413K88699q17227J330505P68544l847816o590685l167320
$$ plain form
6621 10425364 13660879 13350050 8918174 -550680 -12225752 -19948110 -20715314 -17229050
6613 -17229050 -12734372 -7138595 182897 7555592 13160346 16825529 17649277 13216365
6605 13216365 3840175 -5450756 -10284715 -11710118 -12250276 -10044905 -1978136 8687898
6597 8687898 13868378 11046847 6810736 7163864 8744626 4277055 -5952878 -13778996
6589 -13778996 -13955651 -9741153 -6233198 -3302142 1324506 5729125 5590785 1035161
6581 1035161 -2763332 -1903143 2662136 7818760 11179602 10980047 6607867 390061 -3905967
6572 -3905967 -5481683 -7126135 -10793172 -15150582 -18105691 -18753869 -16046393 -9097733
6564 -9097733 -375328 4981085 5269784 4452557 5783062 6551606 2703790 -3886895 -7054215
6555g054215K722779M577603J043009l646300m680355p02353N054687P059325
6547D374180K965302l396701o644977o136616m666492l073127p11894O36234q87898
6538a7541989k232214P55406N277619M524680j371664n027192l153471j01454
6530a8870279J247618L280879N940890M623556k57358r26876N182559R464900
6522I685889N322972j122788j310337K463537K951737N33095Q6912P12088j149829
6513A8173276k687305M77428L899119R3454p432734p867884l92905M239475Q00555
6504I302479l576804l022115k124401n690025q788708m956404K001478K863310
6496a3991190l359697p983786m353266M407078J0202544R167320M451602J091560
$$ plain form
6555 -7054215 -4331436 246167 1289176 -2357124 -7037479 -7739832 -2685145 4374180
6547 4374180 7339482 3942781 -2702196 -8838812 -13505304 -16578431 -17290325 -16654091 -17541989
6538 -17541989 -19774203 -19018797 -13741178 -9216498 -10588162 -15615354 -18768825 -18870279
6530 -18870279 -17622661 -14341782 -8400892 -3777336 -4034694 -4961570 220989 9685889
6522 9685889 15008861 13886073 12575736 15039273 17991010 18524105 18611017 19323105 18173276
6513 18173276 15485971 15963399 19862518 19955972 12523238 4655354 4262449 8501924 9302479
6504 9302479 5725675 2703560 579159 -5110866 -13899574 -18855978 -16854500 -13991190
6496 -13991190 -17350887 -25334673 -29687939 -25280861 -15078317 -5910997 -1459395 -367835
6488c67835J7888j458538m037158m791463k569740j005315k705921m198450j555995
6479b2672527K302286K247121K51886K334099P336745P431369P85672m718885
6471d702234l208407J153734J717793j273264l313528k759514q31580J770006
6463a1446994M106734L746458q7642m211330m969539k089121K510819P004284
6455e436331R229407P221427K265496j252710q05287J773129L558417L392761
6447A9946309R47451l401273o839911n959761j422822K440226K976065P35242
6439I421526l385879p648848p450882n17560O581532N194905k045952m115569
6431c966727R48335K717833l853647r336734n222219K730147N453484M918601
$$ plain form
6488 -367835 -349947 -1808485 -5845643 -10637106 -13206846 -14212161 -16918082 -21116532 -22672527
6479 -22672527 -20370241 -18123120 -17871234 -15537135 -8200390 -769021 16651 -4702234
6471 -4702234 -7910641 -6756907 -5039114 -6312378 -9625906 -12385420 -13217000 -11446994
6463 -11446994 -7340260 -3593802 -3681444 -7892774 -12862313 -14951434 -12440615 -5436331
6455 -5436331 3793076 11014503 13279999 12027289 11222002 12995131 16553548 19946309
6447 19946309 20893760 17492487 10652576 4692815 3269993 5710219 8686284 9421526
6439 9421526 6035647 -1613201 -9064083 -9581643 -3000111 2194794 148842 -3966727
6431 -3966727 -3018392 -300559 -4154206 -13490940 -18713159 -15983012 -10529528 -5610927
6423e610927O803321P445008P35888q115771q880944k404480K168572K932688
6415d926645M851577O245914J60688j0485181j3409479n354350K919727L752297
6407a6245452K350959M379695N687745J753374k499891q26745L793170M910686
6399C303541K942453J881709P85970l249131p213263n392700J248365N761104
6391F8048M537735M08130l031457n263653o799755o927084m350664J070816O641014
6382a3646870P259732Q48837o417253n575387K561950O548769j20449q968931
6374a7509602q214324Q41749P011412N326584J071139r72771k101978l196917
6366a7744708r21488N840130J1548156J0497949M446131n760L46437K747560L026474
$$ plain form
6423 -5610927 1192394 8637402 9373290 1257519 -7623425 -10027905 -7859333 -4926645
6415 -4926645 -75068 6170846 6331534 -4153647 -17563126 -22917476 -19997749 -16245452
6407 -16245452 -13894493 -9514798 -3827053 -2073679 -4573570 -5400315 -1607145 3303541
6399 3303541 6245994 8127703 8913673 5664542 -1548721 -6941421 -5693056 68048
6391 68048 4605783 5013913 1982456 -3281197 -10080952 -17008036 -21358700 -20287884 -13646870
6382 -13646870 -6387138 -5538301 -11955554 -17530941 -14968991 -8420222 -8540671 -17509602
6374 -17509602 -25723926 -24882177 -17870765 -12544181 -11473042 -12445813 -14547791 -17744708
6366 -17744708 -18666196 -12826066 -1277910 9220039 13666170 13660410 14006847 16754407 19780881
6357A9780881J16704l874055o431640o711359n170950k246109J197034K585668
6349g53826l23552n082080n439336Q02195P465585P075505N05519m329582k536933
6340b616505K769832N338387K366765l779688p761981n493386J394664O157636
6332a624276M532890J66053p99220J524935K160998r2864j403028k46492K24549
6323D443545j529473k668822j654172j164441k518765k518790M06312J821063
6315e383543k040185o907947n346264K930296J0566672J1485575O251701p43992
6307A0812313n709811p178406o137949m521611k400913J603669N882154N528999
6299b121555k50197m461719j477427L384062Q08158p479304r556350p16383Q836926
$$ plain form
6357 19780881 19897585 16023530 9591890 2880531 -2290419 -4536528 -3339494 -753826
6349 -753826 -1077378 -6159458 -11598794 -10796599 -3331014 3744491 4250010 -79572 -2616505
6340 -2616505 153327 5491714 7858479 4078791 -3683190 -9176576 -7781912 -1624276
6332 -1624276 2908614 3074667 2275447 3800382 5961380 5868516 4465488 4218996 4443545
6323 4443545 2914072 245250 -1408922 -2573363 -5092128 -7610918 -7204606 -5383543
6315 -5383543 -7423728 -14331675 -19677939 -16747643 -6180971 5304604 11556305 10812313
6307 10812313 5102502 -2075904 -8213853 -12735464 -15136377 -13532708 -7650554 -2121555
6299 -2121555 -2371752 -6833471 -8310898 -4926836 -4118678 -11597982 -21154332 -21870715 -13033789
6290a3033789Q330733J178976j463087L005888O984482N362415J600973J96004
6282A2162595J38941j074698k156794r47321O05324j082814n074474o282880k175263
6273e887384L853751O547610M261791k55164l029748k295876J9926N1348l499461
6264b33207o853260n221483N57111M322343K628578o27488K0514L850400N413735
6255C857243K224240k704219n320435l998871R76565P366635J0138196N012283
6247A7551637n471338j2735588j0882513k299741O257123J0054546P961510J668175
6239A2103811m587505o899094o148421o062187n826981n61097Q108595R533096
6231c39783j430046j3768369j3292162k095050N406097L650095J136380L705214
$$ plain form
6290 -13033789 -4703056 -3524080 -4987167 -1981279 5003203 10365618 11966591 12162595
6282 12162595 12301536 11226838 9070044 8122723 8728047 7645233 2570759 -3712121 -5887384
6273 -5887384 -2033633 4513977 8775768 8520604 5490856 3194980 3214906 3266254 -233207
6264 -233207 -7086467 -12307950 -11750839 -7428496 -4799918 -5427406 -5406892 -1556492 3857243
6255 3857243 6081483 3377264 -1943171 -5942042 -4965477 2401158 12539354 17551637
6247 17551637 12080299 -655289 -11537802 -13837543 -7580420 2474126 10435636 12103811
6239 12103811 7516306 617212 -5531209 -11593396 -17420377 -17981474 -9872879 -339783
6231 -339783 -1769829 -15538198 -28830360 -30925410 -25519313 -21869218 -20732838 -17027624
6223a7027624N482772J599823j282969M198932J2340407J1303119J24700j0099409
6215F639751j0780471m355074J655993L295168K079292J986793M869132P088765
6207A2479349K835344o878167j2485671p700031P57240J746207m714541q376021
6199b2336291m222916J840456M096480M961942P781559R103151M419859k983804
6191B660436n550514j689988L201076N000074M882429M793546L631365o0561m530969
6182A2336894o443913m938479k202697l97971L68894P90127O91997j39756n75111
6173e10015L84766J166778o51649l755100l480098J542392O384067O214842K702103
6164I998086L16954r50537m032262p611858o717984q30696M352787M838731L136582
$$ plain form
6223 -17027624 -11544852 -9945029 -11227998 -7029066 5311341 16614460 16739160 6639751
6215 6639751 -4140720 -8495794 -6839801 -3544633 -1465341 521452 5390584 12479349
6207 12479349 15314693 8436526 -4049145 -11749176 -10991936 -9245729 -13960270 -22336291
6199 -22336291 -26559207 -24718751 -20622271 -15660329 -7878770 1224381 5644240 2660436
6191 2660436 -2890078 -4580066 -1378990 3621084 8503513 13297059 16928424 16867863 12336894
6182 12336894 5892981 954502 -1248195 -1646166 -1277272 -487145 204852 65096 -510015
6173 -510015 -125249 1041529 389880 -3365220 -6845318 -5302926 1081141 7295983 9998086
6164 9998086 10315040 9364503 5332241 -2279617 -8997601 -9828297 -5475510 -636779 2499803
6155B499803L099036M311655M139393J840160j732945n455410p008836l954542
6147b261686K144688N943604M858920K153009J339497J186220r49106m369923
6139A0045223o855317q031049p705930m175183K108948O337008N022746J275246
6131a978308K35932J761453J978428l03962l298838n962134p194187l990040L799858
6122a4951798R184446N498021k975425n363481P05023O256270M853682J343697
6114D550435K848569P701252Q962550M738204o68026l605050m119405l207731
6106A7200798j295800L29745l96979l725100o803320o024719j192581K774900
6098H66944J70553p975547j2998028q396122J475804P022269O095106M873902
$$ plain form
6155 2499803 5598839 9910494 14049887 15890047 14157102 8701692 1692856 -2261686
6147 -2261686 -116998 5826606 10685526 12838535 14178032 15364252 14415146 10045223
6139 10045223 3189906 -4841143 -12547073 -16722256 -14613308 -8276300 -3253554 -1978308
6131 -1978308 -1742376 19077 1997505 1693543 -1605295 -7567429 -14761616 -18751656 -14951798
6122 -14951798 -5767352 -269331 -3244756 -8608237 -7903214 -1646944 3206738 4550435
6114 4550435 7399004 15100256 24062806 28801010 28132984 24527934 20408529 17200798
6106 17200798 15904998 16234743 15837764 12112664 5309344 -715375 -1907956 866944
6098 866944 1037497 -6938050 -19936078 -28332200 -26856396 -19834127 -13739021 -8865119
6090h865119O434837O279310J645085k454918j411385J046180o02228l928404
6082a856642k586010K934426O142935M841158L171911L179422J405561m112668
6074A3120093r307600r684694o338806l146791j008402J633371M337506M395057
6066f000266J154909j926503j034231K936723M827927J685817k764144k778700
6058c898468R49147J822374k504562n751306k493086K916836L055441m99339N5322
6049f347641N171254O400153N3351o534272o437914k865149j613560q88254L352303
6040i709729P160008L607684m269449n902218Q63415O046594K610662l775897
6032c368930n130514l446195n117393q587807o705921P06973N631815L935521
$$ plain form
6090 -8865119 -2430282 3849028 5494113 3039195 1627810 2673990 2071762 -1856642
6082 -1856642 -4442652 -1508226 4634709 9475867 12647778 15827200 17232761 13120093
6074 13120093 3812493 -5872201 -12211007 -15357798 -16366200 -14732829 -10395323 -6000266
6066 -6000266 -4845357 -6771860 -7806091 -4869368 -41441 1644376 -1119768 -3898468
6058 -3898468 -2949321 -1126947 -3631509 -9382815 -11875901 -8959065 -5903624 -6402963 -6347641
6049 -6347641 -1176387 5223766 5277117 -1257155 -7695069 -10560218 -12173778 -13062032 -9709729
6040 -9709729 -2549721 1057963 -3211486 -9113704 -8250289 -2203695 406967 -3368930
6032 -3368930 -8499444 -11945639 -17063032 -25650839 -32356760 -31649787 -26017972 -22082451
6024b2082451R79349K567597O520871P210388M110017J293559P76987M87035j865404
6015b052n657845p904983n767011L93930N813123N417518K05665l330989j718735
6006a2551379J233106J269904M13792K222944M269683K145001j211719J600516
5998f08152R797497J2975397N456899m985311p686222l059616k4880k823786o855756
5989B186070o675499k567590J502886K578022L71090l073137m595545k643363
5981a2917066Q79985K841165K619542K037984K060453J558162n45650l465892
5973d931317n156779l900564L14537N062273O739727L766522j730487o108896
5965e944984p514600o570882m855663l350216j448260K536042Q187642J0730144
$$ plain form
6024 -22082451 -21103102 -18535505 -12014634 -4804246 -694229 599330 1376317 1863352 -2052
6015 -2052 -5659897 -13564880 -19331891 -18937961 -13124838 -7707320 -7501655 -10832644 -12551379
6006 -12551379 -11318273 -10048369 -9634577 -7411633 -3141950 -996949 -2208668 -608152
5998 -608152 9189345 22164742 27621641 22636330 14950108 11890492 11865612 9041826 2186070
5989 2186070 -4489429 -7057019 -5554133 -2976111 -2605021 -5678158 -10273703 -12917066
5981 -12917066 -12037081 -9195916 -6576374 -4538390 -2477937 -919775 -1465425 -4931317
5973 -4931317 -10088096 -13988660 -13674123 -8611850 -1872123 1894399 163912 -5944984
5965 -5944984 -13459584 -20030466 -24886129 -28236345 -29684605 -27148563 -18960921 -8230777
5957h230777N486794m386971q872600k701341P483739J1302534P022601J334863
5949H438842p35969q4532J198970K669365K842844q54577p225226j0459234o862145
5940a1071662K54425M714803M381784J714101q19955l124742n450814o192688
5932a5594748l263938K343411N918461L811928j647483m702931l788598k907187
5924a9831085m258383m310071l32903M002919M489874L604160N569690P759278
5916c306521M804100j028718k502562K92936o61m674955n917650l54946M331037
5907h357940J836992k506138j141044L265126L233571r28569k932877j650785
5899i181664j622230l909821m565389k159109Q5446L03349M41915K003380M020373
$$ plain form
5957 -8230777 -2743983 -7130954 -16003554 -18704895 -11221156 81378 7103979 8438842
5949 8438842 7702873 7618341 8817311 11486676 14329520 13474943 6249717 -4209517 -11071662
5940 -11071662 -10817237 -6102434 -1720650 -6549 -826504 -3951246 -9402060 -15594748
5932 -15594748 -18858686 -16515275 -10596814 -6784886 -8432369 -13135300 -16923898 -19831085
5924 -19831085 -24089468 -28399539 -28732442 -24729523 -20239649 -16635489 -11065799 -3306521
5916 -3306521 1497579 468861 -2033701 -1740765 -1741426 -6416381 -12334031 -12688977 -8357940
5907 -8357940 -6520948 -9027086 -10168130 -6903004 -3669433 -4598002 -7530879 -9181664
5899 -9181664 -10803894 -14713715 -19279104 -21438213 -21352767 -21049418 -20607503 -18604123 -14583750
5890a4583750N587205O306531M626616J6802l973101l529763o25442j32516j798933
5881h106351j159783J846799K165075j356664l351009r43410J346145k66553j727276
5872a1553027K277984Q740119R520923K381546o384484r712562o109555J155169
5864i683887P261588Q280019M063750o56187j039977J408223L75754n970070j0763489
5855f724276o748414L420712R712570P331396J859159M0034O04110j158345l749788
5846D587158j741353L498016L836137k795400p598957l502876M195587O016636
5838F494948J755219j655768j795155j973775l027829k361990n43293r49432k810528
5829f867603k104964N59427Q58845k65313K467794P608467O978974j76928l726549
$$ plain form
5890 -14583750 -8996545 -2690014 1936602 1953404 -2019697 -5549460 -6174902 -6307418 -8106351
5881 -8106351 -9266134 -7419335 -5254260 -6610924 -9961933 -10905343 -9559198 -9825751 -11553027
5872 -11553027 -9275043 -534924 8985999 11367545 4983061 -4729501 -10839056 -9683887
5864 -9683887 -2422299 5857720 9921470 9265283 8225306 9633529 10009283 4039213 -6724276
5855 -6724276 -13472690 -10051978 -339408 6991988 8851147 8891181 9495291 8336946 4587158
5846 4587158 2845805 6343821 10179958 7384558 -214399 -3717275 478312 6494948
5838 6494948 8250167 6594399 4799244 2825469 -202360 -2564350 -3107643 -4057075 -6867603
5829 -6867603 -8972567 -8413140 -7554295 -7819608 -5351814 2256653 9235627 9058699 5332150
5820E332150J171560M895007j273208r605006o812480N396970J2662950Q245816
5812B0013759m95857n502958p022916p370190n413540j365636L68756j858513
5804h647095k465110L507081J1401777J1407673J239075j0212510j3162925p930390
5796a4862424k926641k750619k627005K921983J0115382J0848897N757721L735201
5788A0212495P000378O433814k939367j1204482p414767K782489M909946k779481
5780G001025p975447l800561K713293L780383J416088O10778J027825O06756L49286
5771E729426P34985o05114l484625l302688J414323N423743M686294J952887M49140
5762A2998371j442248m314128l498900K805573P357164L496242l946999n509942
$$ plain form
5820 5332150 6503710 11398717 10125509 520503 -6291977 -895007 11767943 20013759
5812 20013759 19517902 14014944 6992028 -378162 -5791702 -7157338 -6788582 -8647095
5804 -8647095 -11112205 -7605124 3796653 15204326 16443401 6230891 -6932034 -14862424
5796 -14862424 -17789065 -20539684 -23166689 -20244706 -10129324 719573 6477294 10212495
5788 10212495 17212873 23646687 20707320 9502838 2088071 4870560 9780506 7001025
5780 7001025 -974422 -4774983 -2061690 1718693 3134781 3745559 4773384 5380140 5729426
5771 5729426 6464411 5859297 2374672 -928016 486307 5910050 10596344 12549231 12998371
5762 12998371 11556123 7241995 3743095 6548668 13905832 17402074 13455075 7945133
5754G945133r99818J994311P45695k86798J473542L686147M904468N861013M890546
5745C0214239o10099p710948j0105419p529975n866119o783347n214233L29063
5737a3276838L110531j201160n929014k194135P579041J2017927N604596m712320
5729I98628q599272m044108J964555K526852j712281m617765k612218J617320
5721a4478289L827105L666113L138556K216063l35541l338481m516132m481452
5713a4302058n240828n636065l122658M83864P60098j487520m22216N168179Q760454
5704a5038750N631206k76003k976122k803502l269983l775472j285974L082002
5696b0712598M755795K303811q38458r89336K218231O088131O626217J851544
$$ plain form
5754 7945133 6945315 8939626 9685321 9398523 10872065 14558212 19462680 25323693 30214239
5745 30214239 29604140 21893192 11787773 4257798 -1608321 -8391668 -13605901 -13276838
5737 -13276838 -10166307 -11367467 -17296481 -19490616 -11911575 106352 5710948 998628
5729 998628 -7600644 -11644752 -9680197 -7153345 -8865626 -13483391 -16095609 -14478289
5721 -14478289 -10651184 -6985071 -3846515 -1630452 -1965993 -5304474 -9820606 -14302058
5713 -14302058 -19542886 -25178951 -28301609 -27817745 -27057647 -28545167 -28967383 -23799204 -15038750
5704 -15038750 -9407544 -9683547 -12659669 -15463171 -18733154 -22508626 -23794600 -20712598
5696 -20712598 -15956803 -13652992 -14491450 -15480786 -13262555 -7174424 -548207 1303337
5688A303337m558957n686961k97298L959871M29868o633926p746936j767018L056894
5679a7941126J605046j528281k74108L915557N391307K964755O50491J182123
5671d034236K780094K603563N71092j422179k447069l021666l109376j596748
5663i676525J255726K458502l68160m921379o220091k880923J517763L971692
5655a4863395N435839P041048O738498K919164j528547k685779j230028o65070
5647A161730j356351o14515J856800K953098J134647j228755j542361k29577Q94588
5638C029304J448046K444698M356979N736592L807957k334612q725989r350014
5630D12961l719219J348078M50824l029517k643138P94107O78730m522171q536789
$$ plain form
5688 1303337 -3255620 -8942581 -9239879 -5280008 -4850140 -11484066 -19231002 -20998020 -17941126
5679 -17941126 -16336080 -17864361 -18138469 -14222912 -8831605 -5866850 -5216359 -4034236
5671 -4034236 -1254142 1349421 1920513 498334 -1948735 -4970401 -8079777 -9676525
5663 -9676525 -8420799 -5962297 -6330457 -11251836 -17471927 -20352850 -18835087 -14863395
5655 -14863395 -9427556 -2386508 4351990 7271154 5742607 3056828 1826800 1161730
5647 1161730 -194621 -809136 1047664 4000762 5135409 3906654 2364293 2134716 3029304
5638 3029304 4477350 6922048 11279027 17015619 20823576 18488964 9762975 412961
5630 412961 -3306258 -1958180 -1507356 -4536873 -7180011 -6385904 -5707174 -10229345 -18766134
5621a8766134o563109j468098J701757K823517N202398R862806J3975077J3475788
5613B0244002O383260m420838j1613246r807453k128628K798413R86409l328398
5605h86479m710281k691649M62799L475207N021855L107989j357262l655775j106434
5596b340030L016376M440969L842948M206336M774893K186661l262287o783199
5588A0082667n255947j343824j4560k293897m185868k339447N10383j420132p779601
5579a4040226j0124617k950852P000859Q905331L280125R71627O433701J1297391
5571A0773339P875303L42818l237218k897626l773405o516786q105441q279750
5563a3818766p952264m447996M239512J2803506J3640296P095698M6220m011040
$$ plain form
5621 -18766134 -25329243 -26797341 -25095584 -22272067 -17069669 -7206863 6768214 20244002
5613 20244002 26627262 22206424 10593178 785725 -1342903 1455510 2441919 -886479
5605 -886479 -5596760 -8288409 -7825610 -4350403 671452 3779441 2422179 -1233596 -2340030
5596 -2340030 676346 5117315 8960263 13166599 17941492 20128153 16865866 10082667
5588 10082667 4826720 3482896 3468336 1174439 -3011429 -5350876 -4840493 -6260625 -14040226
5579 -14040226 -24164843 -27115695 -20114836 -11209505 -7929380 -6957753 -524052 10773339
5571 10773339 18648642 18991460 15754242 12856616 9083211 2566425 -5539016 -13818766
5563 -13818766 -21771030 -26219026 -21979514 -9176008 4464288 11559986 11606206 7595166
5555G595166o359038o336229j675796M535269N652605J478026j225832K27086
5547C891257Q51974k017234l372049L34101L946696J638065l274679l484493P69816
5538g16546K421858j493058o070265o194981k885844l37127p1992j92049J270590
5529a4269414M127373O730176P670791O419318K959409j958840n885951n725735
5521F7127j430832K547559J906761j953184l645518r39031K723772L372966J271314
5512C920934p48177j276170q59528j38981O70343J054383K69635j796630m097171
5503c001362m772418k659330J003042L318170L065770K062691K026637J815024
5495B858224k01838k615731k500708M42872L632618M629098K495639k204479o455564
$$ plain form
5555 7595166 1236128 -5100101 -6775897 -2240628 3411977 4890003 3664171 3891257
5547 3891257 4743231 2725997 -646052 -311951 3634745 5272810 1998131 -1486362 -716546
5538 -716546 1705312 212254 -5858011 -12052992 -14938836 -15275963 -15347955 -15540004 -14269414
5529 -14269414 -10142041 -3411865 4258926 10678244 13637653 11678813 5792862 67127
5521 67127 -1363705 1183854 3090615 1137431 -2508087 -3447118 -723346 2649620 3920934
5512 3920934 3172757 1896587 1037059 898078 1568421 2622804 2892439 1095809 -3001362
5503 -3001362 -7773780 -10433110 -9430068 -6111898 -3046128 -983437 1043200 2858224
5495 2858224 2656386 40655 -2460053 -2017181 1615437 6244535 8740174 6535695 80131
5486H0131o089763j118975K731709J585717m98565J786895N188911K096505o645925
5477h83360j1373524p073576M03892L775933K952959J370591L28408O67552M157220
5468e673905R071600R681949M456889k60884N44669K525906j205832q956122j2364697
5459b180427p584654P34578N776869M952534P28170k147051j194512P01276q91921
5450a105138m482998l788116J852330M537185n43390o821001n915522p2021K687188
5441a3651483J644626K507374N656779N118834k42087l551250n51597L884631
5433H15827L495250o16814k940446j509901Q65242J224612n50684k488244k853385
5424d558543k148852k538265m289437m176924L46463O710954R726282P331815
$$ plain form
5486 80131 -6009632 -7128607 -4396898 -2811181 -3309746 -1522851 3666060 5762565 -883360
5477 -883360 -12256884 -19330460 -18926568 -15150635 -12197676 -10827085 -10498677 -9831125 -5673905
5468 -5673905 3397695 13079644 17536533 17275649 17820318 20346224 19140392 10184270 -2180427
5459 -2180427 -9765081 -9030503 -3253634 1698900 2427070 280019 -914493 -213217 -1105138
5450 -1105138 -5588136 -9376252 -7523922 -2986737 -3530127 -10351128 -16266650 -16338671 -13651483
5441 -13651483 -12006857 -9499483 -3842704 1276130 1034043 -2517207 -3068804 815827
5433 815827 4311077 3694263 753817 -756084 109158 1333770 783086 -1705158 -4558543
5424 -4558543 -6707395 -9245660 -13535097 -17712021 -17365558 -10654604 -928322 6403493
5416F403493J152027o602515j2820146j2277983k687888R321443J3300522P346530
5408C135483K83411p6298M149189O031771L209784j225735l864446l538535r83931
5399G120693J148496k11957m461741o504474k811108L118233M565519M51567k902891
5390d87663M9641O605939Q917031L873855k888987m089343L02819L965480K958094
5381A9206866q8888j009595K81088R62868o26276l952291p054516o985532k150680
5372a416956M452843P431791N709757L240625J835008j248613o059216o922157
5364G023082j390444M018090L213646j25717J24385J615533j033288m933241l998953
5355D513093j680108n956838j3053674j0081376M253971J5048269J1815458J847348
$$ plain form
5416 6403493 7555520 953005 -11867141 -24145124 -26833012 -17511569 -4211047 3135483
5408 3135483 3418894 3342596 7491785 13523556 16733340 15507605 11643159 8104624 7120693
5399 7120693 8269189 8057232 3595491 -2908983 -5720091 -2601858 1963661 2415228 -487663
5390 -487663 -438022 6167917 15084948 18958803 16069816 11980473 12283292 16248772 19206866
5381 19206866 19117978 18108383 18389471 19352339 18726063 14773772 7719256 733724 -1416956
5372 -1416956 3035887 10467678 16177435 19418060 21253068 20004455 13945239 7023082
5364 7023082 5632638 9650728 12864374 12738657 12863042 14478575 13445287 8512046 4513093
5355 4513093 2832985 -3123853 -16177527 -26258903 -22004932 -6956663 4858795 6706143
5347F706143k900789j540883L58826J681562L361595K177454m076296r885647
5339d118035q331516q20981N564026O945268L784183k443752q290850q564354
5331a6276011l107376J069742l35455k344362M5205K555902j37550k835898K814543
5322a8551260J2919980J4891611N650653m519322p241994n190436l707279k510901
5314h258948J77882K369988J773272k60098j652261k441407k384910p0746L271172
5305g476056L449926o00743m384823m012372j014059J437517L062832M183313
5297e354465K761876k270363p369210p949296l889364J616638O591401J0136069
5289e726714R933941M766848j043993q20480N548824J0034107O163597k809636
$$ plain form
5347 6706143 3805354 2264471 2623297 4304859 7666454 9843908 5767612 -4118035
5339 -4118035 -12449551 -13270532 -7706506 -761238 3022945 579193 -7711657 -16276011
5331 -16276011 -19383387 -18313645 -18649100 -20993462 -20948257 -18392355 -18529905 -21365803 -18551260
5322 -18551260 -5631280 9260331 14910984 10391662 3149668 -2040768 -5748047 -8258948
5314 -8258948 -8081066 -5711078 -3937806 -4197904 -5850165 -8291572 -10676482 -10747228 -7476056
5305 -7476056 -4026130 -4626873 -9011696 -13024068 -14038127 -12600610 -9537778 -5354465
5297 -5354465 -2592589 -4862952 -12232162 -20181458 -24070822 -22454184 -15862783 -5726714
5289 -5726714 4207227 8974075 7930082 7109602 12658426 22692533 28856130 26046494
5281B6046494q293296o547877j115582L233778M747533L275016q24881n203338
5273A5317847o807374o175594o737121q356826o412329j671M522605K829776j26164
5264a1946851J462636L925401R21776l824818j719804N172380O625534K217726
5256B833980K521125R418186J0443178l49170j0351021p703058j00485j077934
5248E634801p500106o210053L300620Q923600N564366k46998m024425p317375
5240a875570q235965k153692O741009Q095883J944233n01601M413150O934712
5232A5362159J566879l208873k66900L700215O22293m704405l940201l81253k613772
5223F136142q638453q722055j301138N339550O367673N194784M679296K991729
$$ plain form
5281 26046494 17753198 11205321 10089739 13323517 18071050 21346066 20521185 15317847
5273 15317847 8510473 2334879 -4402242 -12759068 -19171397 -19173068 -14650463 -11820687 -11946851
5264 -11946851 -10484215 -6558814 -5637038 -9461856 -11181660 -6009280 616254 2833980
5256 2833980 5355105 14773291 25216469 24867299 14516278 6813220 6712735 5634801
5248 5634801 -1865305 -8075358 -4774738 4148862 9713228 9466230 5441805 -1875570
5240 -1875570 -10111535 -12265227 -5524218 2571665 4515898 4014297 8427447 15362159
5232 15362159 16929038 13720165 13453265 17153480 17775773 13071368 9131167 8749914 6136142
5223 6136142 -2502311 -11224366 -12525504 -7185954 -818281 4376503 9055799 12047528
5215A2047528J41728L83867M652829O820071J731998o933686j0851184p071400
5207I21751o33149K160785N38696j474121j313583j127147l402762n379984j782432
5198a1491946O710507J2291987R509532K032228l174040m928697o752942r129945
5190d933316q263584k582045L874262N938847K781157k006809m099469j761259
5182a1052216K992578N987670M569252K8392m031847n420295m858303m218402
5174a6003171m139964l527338j151399K480262N336345O052574M930326K400672
5166c621693j646734n664247n825254l46167O993696J0594760R186903N460688
5158A5131952J392254k206584l286326q61455J218656j455707o051624n418917
$$ plain form
5215 12047528 12189256 12573123 17225952 24046023 25778021 18844335 7993151 921751
5207 921751 288602 2449387 2988083 1513962 200379 -926768 -4329530 -9709514 -11491946
5198 -11491946 -4781439 7510548 17020080 19052308 15878268 10949571 4196629 -4933316
5190 -4933316 -13196900 -15778945 -11904683 -5965836 -3184679 -5191488 -9290957 -11052216
5182 -11052216 -8059638 -2071968 2497284 2525676 -1506171 -6926466 -11784769 -16003171
5174 -16003171 -20143135 -23670473 -24821872 -22341610 -17005265 -10952691 -6022365 -3621693
5166 -3621693 -5268427 -10932674 -16757928 -17104095 -10110399 484361 9671264 15131952
5158 15131952 16524206 14317622 11031296 10169841 11388497 9932790 3881166 -1537751
5150a537751M02758K732910l095862j0346290j0317453l719100K291638M196757
5142a9392393L896323L155377J524910j046876l182650l541922j821452O64164
5134a9744519J116606j467843l062689J305081R444040J2862812P612288n56697
5126G509079m187528k473213Q43236K817607J712229k649645n867236k083292
5118d378763O357741Q916216J199498p569242p539183j928321P7933j839311r79227
5109g682659L598930O219998M803606K726626J189527j833015n198541n063041
5101a238569j990668l90256p58179M15408K988902K853958k74869k222701k288069
5092b905043m141416p471653o758796r49121L243044J375750j909991k81736N414598
$$ plain form
5150 -1537751 -1134993 1597917 -1497945 -11844235 -22161688 -25880788 -23589150 -19392393
5142 -19392393 -15496070 -12340693 -10815783 -11862659 -15045309 -18587231 -20408683 -19744519
5134 -19744519 -18627913 -20095756 -23158445 -21853364 -12409324 453488 8065776 7509079
5126 7509079 3321551 848338 1691574 4509181 6221410 3571765 -2295471 -4378763
5118 -4378763 1978978 10895194 12094692 4525450 -3013733 -4942054 -4864121 -6703432 -7682659
5109 -7682659 -4083729 2136269 6939875 9666501 10856028 9023013 3824472 -1238569
5101 -1238569 -3229237 -3619493 -4377672 -3962264 -973362 1880596 1605727 -616974 -2905043
5092 -2905043 -7046459 -14518112 -21276908 -22226029 -18982985 -17607235 -19517226 -19798962 -14384364
5083a4384364R684245R386694M921052j280855m606797j334918N136595O211389
5075A3733041k16226n469089k299400L887748K827379m974518q336730q68014
5067a715809J0497176J4358375P651329k826139q745140p592684l149013q56405
5059G621690k761224o099156o528562k699825K505972N083678L764958O11279
5051A498810j729535k441152k025816p48622R76996J646312M50801l02973K469849
5042b05330P274808Q201399K118942o789056j1472287r006531k019004M295753
5034g601306N456903J115690l452700k638080J771674K738162j056555k987696
5026f653908n9207J227730l802920q534347n149336K195861M290467K083286L495687
$$ plain form
5083 -14384364 -4700119 4686575 9607627 8326772 3719975 2385057 7521652 13733041
5075 13733041 13516815 8047726 5748326 9636074 12463453 7488935 -847795 -1715809
5067 -1715809 8781367 23139742 30791071 27964932 19219792 11627108 8478095 7621690
5059 7621690 4860466 -1238690 -7767252 -10467077 -7961105 -2877427 887531 1498810
5051 1498810 -230725 -2671877 -4697693 -5446315 -4469319 -2823007 -2372206 -2675179 -205330
5042 -205330 7069478 15270877 17389819 10600763 -871524 -9878055 -11897059 -7601306
5034 -7601306 -2144403 -1028713 -4481413 -7119493 -5347819 -2609657 -3666212 -6653908
5026 -6653908 -6713115 -5485385 -9288305 -17822652 -22971988 -20776127 -16485660 -14402374 -10906687
5017a0906687Q053070P479732J291464j215052L094260N531712N00346m947098
5009H881747l095574J990404K094226j775448k419199J089717K501974j217345
5001H050502n625253n724195k205391J021877K541902M099245O180027N682950
4993A4021664K79559o354518p971187m647375k543596l035314J94231Q490929
4985a565607J1566446K550155p969351n624494M996909O369037m794461j2645972
4977g117338o836323L690075P194055N298970M517814L576087r01364m989039
4969D432937l738200l88975m16204j826731K53309L961380L846656L28487j282148
4960E170511R77718M256405N799180M990239K494172L38035L58299J015166n87039
$$ plain form
5017 -10906687 -2853617 4626115 5917579 4702527 7796787 13328499 13828845 8881747
5009 8881747 5786173 7776577 9870803 8095355 5676156 6765873 9267847 8050502
5001 8050502 2425249 -3298946 -5504337 -4482460 -1940558 2158687 8338714 14021664
4993 14021664 14301223 7946705 -24482 -4671857 -7215453 -10250767 -10056536 -1565607
4985 -1565607 10000839 12550994 4581643 -1042851 3954058 10323095 5528634 -7117338
4977 -7117338 -13953661 -10263586 -3069531 2229439 6747253 10323340 9421976 4432937
4969 4432937 694737 305762 -110442 -1937173 -1683864 2277516 6124172 6452659 5170511
4960 5170511 6148229 10404634 16203814 21194053 23688225 24026260 24384559 25399725 24812686
4951B4812686l092710k834066j406738l596903p145322m410569L536548N680050
4943A1542976j688384p933117m603233K070473K936559l73548k347699m085726
4935d481699o898772m989454M158164J0561855N166988m703398o012225J05586
4927g092955K518127p14414j440021K827568N739017M232580K135696J352260
4919I557858m60505k949605k587105M13753K102389J659835J918931L659044M766770
4910A8081365L872983Q52899l560926n642516j119617P007722R731353M661079
4902C3884342p34261k013240l366704n930387l525643L462006M501761k478671
4894B3799203m844474K426457O122517j015084n390908K200660P618513n32233
$$ plain form
4951 24812686 21719976 18885910 17479172 13882269 6736947 2326378 5862926 11542976
4943 11542976 9854592 1921475 -2681758 -611285 2325274 1951726 -395973 -4481699
4935 -4481699 -11380471 -16369925 -12211761 -1649906 3517082 -1186316 -7198541 -7092955
4927 -7092955 -4574828 -5289242 -6729263 -3901695 1837322 6069902 8205598 9557858
4919 9557858 9097353 6147748 3560643 3974396 6076785 7736620 9655551 13314595 18081365
4910 18081365 21954348 22807247 19246321 13603805 12484188 19491910 29223263 33884342
4902 33884342 33150081 31136841 27770137 21839750 18314107 21776113 26277874 23799203
4894 23799203 18954729 21381186 27503703 26488619 21097711 23298371 30916884 30384651
4886C0384651p776916m70221P004180j94722o066567O456282J8452449P866949
4878E5656085m724465Q605936K6979243K1056594K6246029R1732107J61939138
4871C87490667J12274300o5364746k10601912j89533692o3372219J3761679R09956
4864a4435967k0478650j881654J6934227M755080p473182N443346J6384506Q21137
4856F8843j7873375j2398034K759931K913232m113978R31860J1765398J0917960
4848e028163J206011l479764l203644n245013n860263R51068P755942M582701
4840h321125m068488p958058p282336p006865n067305R97618N224429L286997
4832c0195133K191515Q128943J3685377R307573m58121m295677j209113J015019
$$ plain form
4886 30384651 22607735 22137514 29141694 28946972 22880405 29336687 47789136 55656085
4878 55656085 50931620 59537556 86516799 107573393 133819422 225551529 387490667
4871 387490667 499764967 434400221 223798309 34264617 -29107602 -15345923 -14435967
4864 -14435967 -34914617 -36796271 -19862044 -15106964 -22580146 -17136800 -752294 68843
4856 68843 -17804532 -30202566 -27442635 -24529403 -28643381 -27711521 -15946123 -5028163
4848 -5028163 -3822152 -7301916 -10505560 -15750573 -21610836 -20659768 -12903826 -8321125
4840 -8321125 -12389613 -20347671 -27630007 -34636872 -39704177 -38706559 -33482130 -30195133
4832 -30195133 -28003618 -19874675 -6189298 3118275 2660154 -1635523 -2844636 -1829617
4824a829617p64144l252310m275084l876165j553037J584133K351186J324914
4816a0290124K817891N731113L232662m326044o822517o37157L784482j443147
4808g952841q531935p238526j031604J080455P5079K099401N103892K844016k557421
4799a6109484l765580n30174J616311J888697L698298O288181O177408M658264
4791C921921N245563N847723J799804n090841q359682o469438l803542l415525
4783a0324017m584044n846145n540480j891775L235839M664764K099260K078364
4775a6108234O442183O444796l478421j3378312j0169155K703014R919753N838671
4767a1785705n99249j650484K40794O25734P8098J32161j51472p98939K26366
$$ plain form
4824 -1829617 -2593761 -5846071 -10121155 -13997320 -15550357 -13966224 -11615038 -10290124
4816 -10290124 -7472233 -1741120 1491542 -2834502 -9657019 -10294176 -6509694 -7952841
4808 -7952841 -16484776 -23723302 -24754906 -23674451 -23599372 -21499971 -16396079 -13552063 -16109484
4799 -16109484 -19875064 -20405238 -18788927 -16900230 -13201932 -6913751 -736343 3921921
4791 3921921 9167484 15015207 16815011 11724170 3364488 -3104950 -6908492 -10324017
4783 -10324017 -14908061 -20754206 -26294686 -28186461 -24950622 -20285858 -18186598 -16108234
4775 -16108234 -9666051 -3221255 -6699676 -20077988 -30247143 -27544129 -17624376 -11785705
4767 -11785705 -12384954 -14035438 -13794644 -13168910 -13090812 -12958651 -13110123 -13909062 -13682696
4758a3682696L117871N677848O762410N944724J388625o254358r847049k966062
4750i858687R599680J5765433J0625878M78425p270055j1072580j1795887r617416
4742a3145209o065072l429587r42685L451119P393511N908228p13517o466816
4734a4010028p469630m857308j69540N773618R247424N927362j755780n860456
4726a3174338l137211J768667M427380N550967O095429M054620q67889m817359
4718i9734n056290l312840j810122n68760l54522l003932o557037n453194J493504
4709b4722927Q178046R246078O429490L869431J893866r02266l600045m837835
4701d446162n184116m293514K23209P122491R011962J101418j0262094j3860189
$$ plain form
4758 -13682696 -10564825 -4886977 1875433 7820157 9208782 2954424 -6892625 -9858687
4750 -9858687 -259007 15506426 26132304 26610729 19340674 8268094 -3527793 -13145209
4742 -13145209 -19210281 -22639868 -23582553 -20131434 -12737923 -6829695 -7543212 -14010028
4734 -14010028 -21479658 -26336966 -26506506 -20732888 -11485464 -5558102 -7313882 -13174338
4726 -13174338 -16311549 -14542882 -10115502 -4564535 1530894 5585514 4717625 -99734
4718 -99734 -5156024 -8468864 -10278986 -10847746 -11202268 -14206200 -20763237 -26216431 -24722927
4709 -24722927 -16544881 -7298803 -869313 3000118 4893984 3991718 391673 -4446162
4701 -4446162 -9630278 -13923792 -13700583 -6578092 2433870 3535288 -6726806 -20586995
4693b0586995p445542K44071J565542j144760p79563M282166Q651727P505082
4685g708272K401722j524009k083771j253629n37324J325325M566259N729100
4677I15401K100330l394113n558651l780004j520590k52656J247325K081891o09389
4668h770456n601377p059021k407756L662168N844432N109010N611157P552768
4660C940925O974902J658659n564535r332628o561668M72760N448676L939455
4652I76546j491631m029120q98358L569365M295733K220979K253364N743920P817985
4643B0458783L118447o866528j3864007j1302828j951046N003134M293410r98860
4635b109495n621330q121834q465701m911064K055300O647539M406720p29590
$$ plain form
4693 -20586995 -28032537 -27788466 -26222924 -27367684 -28147247 -23865081 -15213354 -7708272
4685 -7708272 -5306550 -6830559 -8914330 -10167959 -10705283 -9379958 -4813699 915401
4677 915401 3015731 -378382 -5937033 -9717037 -11237627 -11490283 -10242958 -8161067 -8770456
4668 -8770456 -14371833 -21430854 -23838610 -20176442 -14332010 -9223000 -3611843 3940925
4660 3940925 10915827 12574486 7009951 -2322677 -8884345 -8411585 -2962909 976546
4652 976546 -515085 -4544205 -5442563 -1873198 2422535 4643514 6896878 12640798 20458783
4643 20458783 23577230 16710702 2846695 -8456133 -10407179 -5404045 -1110635 -2109495
4635 -2109495 -7730825 -15852659 -24318360 -29229424 -27174124 -20526585 -16119865 -16849455
4627a6849455j596550K345902O040089O990371N828688J563072n729471r645645
4619a1052999m231120M870458O018863j499115o762791m575235j716560k686640
4611b1635139j684373N053803J0347894P771265K614359K010087K578376j930864
4603E125408p867330p688722l345743k369426m529908l616997K82246J449724
4595b2560748k83865J09015K500178K510335J915457O308315J2021226Q333330
4587A0853243m443165j1990297o538177J483647M2412o680909p079677q03344
4579b5156267K945057J227709j51908J595651K691980J512626J394586K822940
4571a1117626J362387l472161n155069o07574L249462k28266o113454m967150
$$ plain form
4627 -16849455 -18446005 -16100103 -10060014 -3069643 2759045 4322117 -1407354 -11052999
4619 -11052999 -15284119 -10413661 -4394798 -5893913 -12656704 -17231939 -18948499 -21635139
4611 -21635139 -23319512 -18265709 -7917815 -146550 2467809 4477896 7056272 5125408
4603 5125408 -2741922 -10430644 -13776387 -16145813 -20675721 -24292718 -24010472 -22560748
4595 -22560748 -22844613 -22735598 -20235420 -17725085 -15809628 -9501313 2519913 10853243
4587 10853243 6410078 -5580219 -12118396 -10634749 -10592337 -17273246 -24352923 -25156267
4579 -25156267 -22211210 -20983501 -21135409 -19539758 -16847778 -15335152 -13940566 -11117626
4571 -11117626 -9755239 -13227400 -18382469 -18990043 -15740581 -15968847 -22082301 -27049451
4563b7049451K181639N227381O97181l676037k256841J56973j576484l066276
4555b9361915J304134O548371L808696m508058p434414k467190J566451K47615
4547c0296310M12917O626786J1689408Q168083P47409j792549j71111n98579k555284
4538g769230j145139J919923Q62408k312747N7905P031434Q325479M34509p034210
4529C70332n651060K09229J751223j629067m548073m683560l026227N35961N503066
4520a1168176P990397N584108K000746J242718M42512m655021r873617o848227
4512a5284560L291202R308787N143436k021947k972003R62992K346399k11135
4504E63171j498379Q60102L392717L130527J013106j770006n255841p205916m011022
$$ plain form
4563 -27049451 -24867812 -19640431 -18943250 -22619287 -24876128 -24719155 -26295639 -29361915
4555 -29361915 -28057781 -21509410 -17700714 -22208772 -29643186 -32110376 -30543925 -30296310
4547 -30296310 -29883393 -23256607 -11567199 -3399116 -2651707 -4444256 -4615367 -5213946 -7769230
4538 -7769230 -8914369 -6994446 -6132038 -8444785 -8386880 -1355446 6970033 7404542 370332
4529 370332 -5280728 -5071499 -3320276 -4949343 -9497416 -14180976 -17207203 -16671242 -11168176
4520 -11168176 -3177779 2406329 4407075 5649793 6092305 1437284 -8436333 -15284560
4512 -15284560 -11993358 -2684571 2458865 436918 -2535085 -1572093 774306 563171
4504 563171 -935208 -75106 3317611 6448138 7461244 5691238 435397 -6770519 -10781541
4495a0781541K273273L718253k295543p092139k099035P972603J1181761N206940
4487H084572q43143j325201j099799m809688p973459m412118L682996R230930
4479E35090R469465O178657P00021n388918p921620m732528m17302o51780l689985
4470e918900l547605k7371J211117j710569l971046k111724P24095J32759k890254
4461a8109498l361461J342040P964058R891091M105467l913912n241468Q85473
4453f438210N022447N99199o359994o611872j580408P72853J43939L069793R115954
4444b266299R725055K722273l197197k390370m68373l107347n883301k461358
4436g326917M351508P535423O375914M503450J933161l128543p651965o637568
$$ plain form
4495 -10781541 -8508268 -4790015 -7085558 -14177697 -16276732 -8304129 2877632 8084572
4487 8084572 7241429 5916228 4816429 6741 -7966718 -12378836 -8695840 535090
4479 535090 10004555 16183212 16883233 11494315 3572695 -1159833 -1577135 -2228915 -5918900
4470 -5918900 -9466505 -9493876 -8282759 -9993328 -13964374 -16076098 -15352003 -15219244 -18109498
4461 -18109498 -21470959 -20128919 -12164861 -2273770 1831697 -2082215 -7323683 -6438210
4453 -6438210 -1415763 -816564 -7176558 -13788430 -15368838 -14595985 -14452046 -11382253 -2266299
4444 -2266299 7458756 10181029 6983832 4593462 4125089 1017742 -4865559 -7326917
4436 -7326917 -2975409 4560014 10935928 15439378 17372539 14243996 6592031 -45537
4428d5537j164122K739953K294780j08860j831997k014155k28940K186222J214702
4419C042046m513478r237381o276155K473539Q582839P720461K847763k365160
4411B274474p012655r296125n828023K673023R528423R299489M383606J796964
4403G819176M738161R280059R075378K491594n263062p856121n409052l877045
4395A0999088o054093p150250k493558M182363N592041J839782m1309K773644
4387I647708N044453K481964j705561k903642k652301m965385q196330o619793
4379i868887K72903N560594L895163j181191k221504J900328M847862J917243
4371E122511l845737o653240n667041l979387k208937J704913O627971P706073
$$ plain form
4428 -45537 -1209659 1530294 3825074 3716214 1884217 -129938 -358878 1827344 3042046
4419 3042046 -1471432 -10708813 -16984968 -14511429 -5928590 1791871 4639634 2274474
4411 2274474 -4738181 -14034306 -19862329 -17189306 -7660883 1638606 6022212 7819176
4403 7819176 12557337 21837396 30912774 33404368 28141306 20285185 14876133 10999088
4395 10999088 4944995 -2205255 -4698813 -516450 5075591 6915373 6874064 9647708
4387 9647708 14692161 17174125 15468564 12564922 9912621 4947236 -3249094 -9868887
4379 -9868887 -9595984 -4035390 -140227 -1321418 -3542922 -1642594 3205268 5122511
4371 5122511 1276774 -5376466 -11043507 -15022894 -17231831 -15526918 -8898947 -1192874
4363a192874L395430j705714l547059l871953n616756p099700n003247j06321
4355b4748194M383615P701198J0109893R032837K267922o061749q662103m437101
4347a0413682M80580J695441J300220K127179K452554k89824m146352m984202
4339a1778086k499595l28619n34177j001304P51475L285402L012308j08902j471621
4330a0673119J826394O008129N671959K263620K005652N263635M971602j580774
4322A5757098o723256l820969J620752K78938o136300q062826l737607q43255
4314a1667425k295499j675770L857196O720744J314528n266809l378849M006804
4306h385080N619680j388350q228183p851932l232897j61431J292045M009899
$$ plain form
4363 -1192874 2202556 496842 -3050217 -6922170 -12538926 -19638626 -24641873 -24748194
4355 -24748194 -20364579 -12663381 -2553488 6479349 8747271 2685522 -5976581 -10413682
4347 -10413682 -9933102 -8237661 -6937441 -4810262 -2357708 -2647532 -6793884 -11778086
4339 -11778086 -14277681 -14606300 -15140477 -16141781 -15390306 -12104904 -9092596 -9201498 -10673119
4330 -10673119 -8846725 -2838596 2833363 5096983 7102635 12366270 17337872 15757098
4322 15757098 9033842 5212873 6833625 7112563 976263 -7086563 -10824170 -11667425
4314 -11667425 -13962924 -15638694 -11781498 -5060754 -3746226 -9013035 -12391884 -8385080
4306 -8385080 -2765400 -4153750 -12381933 -20233865 -23466762 -23628193 -22336148 -18326249
4298a8326249P275253Q169086P213993P359393P708116L626288m923773j0016706
4290H085401n455440K903939K979995p238478j6025318j3337620l521640K709666
4282b8899495L707608O239741J1799083J2951865N146171n375960r368783n398991
4274i198761Q13957M059577K900212j748293p197605r539511o917811j765579
4266b8593814K173416M034389N155058N490298L470602m37854k459761M23116
4258a0744550N681627O700105N98692o858461p381516r58876L965896K600974
4250f396109N14030M039622R321287Q141243J489741j561759J845682M232840
4242B1626577J46121n493395n699828j802242j69891k575556m914836l404440
$$ plain form
4298 -18326249 -11050996 -2881910 4332083 11691476 19399592 23025880 18102107 8085401
4290 8085401 2629961 5533900 8513895 1275417 -14749901 -28087521 -31609161 -28899495
4282 -28899495 -25191887 -18952146 -7153063 5798802 10944973 5569013 -3799770 -9198761
4274 -9198761 -8384804 -4325227 -1425015 -3173308 -10370913 -19910424 -26828235 -28593814
4266 -28593814 -26420398 -22386009 -17230951 -11740653 -8270051 -8707905 -11167666 -10744550
4258 -10744550 -5062923 1637182 2235874 -4622587 -12004103 -12962979 -8997083 -6396109
4250 -6396109 -5882079 -1842457 7478830 15620073 17109814 15548055 17393737 21626577
4242 21626577 21772698 16279303 10579475 8777233 8607342 6031786 1116950 -2287490
4234b287490J658379O782619P592780K331556n005102p548459l533997J342438
4226A332724J661828o41536J07705M949858Q998784P807428K403277k373744l377216
4217B0869108k196771k121522k770053o25319M193808O047651J874841l305133
4209B1966610l978876k775348m747247p282092m722488K4976o97178n181022l918426
4200a1311091M155174R354400P366148M880947N287476K136478o724046j1310371
4192C835115m656425M957587O430640J094196l929722q273781j3510968j4259257
4184b8312615o170788L512432N155182J433660J752272O616470Q710228N857752
4176a445407K276160k12476k798055m506418m541725n675942p888805m910109
$$ plain form
4234 -2287490 -629111 6153508 13746288 16077844 11072742 3524283 -9714 1332724
4226 1332724 2994552 2353016 2460721 7410579 16409363 24216791 26620068 24246324 20869108
4217 20869108 18672337 16550815 13780762 13155443 17349251 23396902 25271743 21966610
4209 21966610 17987734 15212386 10465139 3183047 -1539441 -1514465 -2211643 -7392665 -11311091
4200 -11311091 -7155917 2198483 9564631 14445578 19733054 21869532 15145486 3835115
4192 3835115 -821310 4136277 10566917 11661113 7731391 -542390 -14053358 -28312615
4184 -28312615 -34483403 -30970971 -25815789 -24382129 -22629857 -16013387 -7303159 -1445407
4176 -1445407 830753 618277 -2179778 -6686196 -11227921 -16903863 -24792668 -29702777
4168b9702777M496405R734893L330133n591483m999862J193965K065458o99560
4160b0172828J447722N268994J004451q114405r820557l360178J349987K081393
4152c0315421M226219N800479R28769n194135l701230K66448k637085n621298
4144c6247254R31054M992916p947019k0552786p323200J4552890Q795618m609987
4136d7407768L7162804J28376241J65192126P8103972n8581010j15130351p0511114
4129A17204900j6566171j6111831l5631115k6459527K7748Q809678M79081l449059
4121B8303704j446031m129933p337482j965042M572409P16087p344821o470603
4113D898288Q56600K833462j113407k312695R93919L469486L736759M141153L692430
$$ plain form
4168 -29702777 -25206372 -15471479 -12141346 -17732829 -22732691 -21538726 -19473268 -20172828
4160 -20172828 -18725106 -13456112 -12451661 -20566066 -30386623 -33746801 -32396814 -30315421
4152 -30315421 -26089202 -20288723 -19359954 -24554089 -28255319 -27988871 -30625956 -36247254
4144 -36247254 -35316200 -30323284 -38270303 -58823089 -66146289 -51593399 -42797781 -47407768
4136 -47407768 -10244964 118131277 283323403 361427375 302846365 187716014 117204900
4129 117204900 100638729 84526898 48895783 22436256 22464004 31273682 31752763 28303704
4121 28303704 26857673 22727740 15390258 13425216 17997625 18713712 11368891 4898288
4113 4898288 5754888 8588350 7474943 5162248 6156167 9625653 13362412 17503565 21195995
4104B1195995L73155l430674m425124k974086k18614L167801L111242m010783
4096A2788912j1497378p766223N089809J1309217M669089k670161q61829L435166
4088A4496602K266002L44384K585693K160350n763011j1235013m890944N182372
4080E146435O710575K889465L315446N198580P04790n220542k615509L884328
4072B0013568J580890q063595j1709700o220992r42914P33070M475711R435338
4064I301376P007724k381915p232450l250342Q41410m48354j433174J660397K961045
4055G025717j618816o660996p071393n662716n415586l655917O58541K840263
4047a9560903R64802J3308K658325M396133K584834J419274K779338J559040l617424
$$ plain form
4104 21195995 21569150 18138476 13713352 10739266 10520652 13688453 16799695 12788912
4096 12788912 1291534 -6474689 -1384880 9924337 14593426 11923265 11061436 14496602
4088 14496602 16762604 17106988 19692681 21853031 16090020 4855007 -35937 5146435
4080 5146435 11857010 14746475 18061921 23260501 23965291 18744749 16129240 20013568
4072 20013568 21594458 13530863 1821163 -4399829 -5342743 -4609673 -133962 9301376
4064 9301376 16309100 13927185 6694735 3444393 4285803 3837449 2404275 4064672 7025717
4055 7025717 5406901 -1254095 -8325488 -13988204 -19403790 -23059707 -22401166 -19560903
4047 -19560903 -18596101 -18582793 -15924468 -11528335 -8943501 -7524227 -4744889 -3185849 -6803273
4038f803273m578965L399262J1261370Q464477q74471m395207L20391M365820
4030A1159404K284671j534809j754487L91847O71633j835903m155848l053296
4022B173212J369402M934280L389485k159159o000880m773347q02624K177122
4014C07491K850849R64302l087441n626159k010727N658058Q546541K512085n478136
4005D636863o626571j374250L511165M544450K915589J26231j948347K18508O833674
3996A2837312J0857582N542636n219507j0374640n624447J698291K723686k533248
3988I907665o740936m441126K199870O061091L076982k693659l675633J455841
3980E150095N899025L906741k200187o820957q608808r141838p882619l884649
$$ plain form
4038 -6803273 -11382238 -7982976 3278394 11742871 10868400 6473193 6793584 11159404
4030 11159404 13444075 11909266 10154779 10546626 11218259 9382356 5226508 2173212
4022 2173212 3542614 8476894 11866379 9707220 3706340 -1067007 -1869631 307491
4014 307491 3158340 4122642 1035201 -4590958 -6601685 -943627 7602914 10114999 4636863
4005 4636863 -1989708 -3363958 147207 4691657 7607246 7733477 5785130 6003638 12837312
3996 12837312 23694894 29237530 24018023 13643383 8018936 9717227 12440913 9907665
3988 9907665 3166729 -1274397 925473 6986564 10063546 7369887 3694254 5150095
3980 5150095 11049120 14955861 12755674 5934717 -2674091 -11815929 -19698548 -23583197
3972b3583197k8667K28683r95805J297728O763808R584471O655312R37008l708422
3963b849081o195212o121294l011434R06845J804020Q6475P45935N300881P753088
3954a579777K685690n760991q261148k561386L969815M837679K317344J838151
3946b514623K691831k1890n609135o721167j21099P290913P509160K186864j102678
3937C588176k06718O33216o10929j618289k050146m315972o741525l762828M275115
3928a0809900Q887845N024743j640832l428073n27691K582973M396333M548599
3920I033997Q88567n209970o498968j42160N283408J492971o056236o321518N3927
3911g475982L165386R94079J281190O036328P149987P75163n390650m473618o14705
$$ plain form
3972 -23583197 -23611864 -23383181 -24378986 -23081258 -16317450 -6732979 -77667 859341 -2849081
3963 -2849081 -9044293 -15165587 -18177021 -17270176 -15466156 -15379681 -14633746 -9332865 -1579777
3954 -1579777 1105913 -4655078 -12916226 -15477612 -11507797 -6670118 -4352774 -2514623
3946 -2514623 177208 155318 -5453817 -12174984 -12296083 -5005170 2503990 4690854 3588176
3937 3588176 3381458 4014674 3403745 1785456 -264690 -4580662 -11322187 -15085015 -10809900
3928 -10809900 -1922055 3102688 1461856 -1966217 -2493908 89065 4485398 9033997
3920 9033997 9922564 4712594 -1786374 -1928534 3354874 4847845 -1208391 -7529909 -7475982
3911 -7475982 -4310596 -3316517 -2035327 4001001 11150988 11926151 6535501 2061883 1447178
3902A447178o31987l190402l014342j32594J684232J733938J946466K504815K346047
3893D693351J576148K32785k422342m915437l691010J130716M393042L214105
3885D211358J045831J156356J206743j385220l816659l108621k419398n686329
3877h795939r435796p146120J42134M731676L193405k67049j661455k042410k900566
3868b4182120k319091J389405N938570P912227P176899O160081O094956N826760
3860A3997687L864217O05123j604955r68184R46691J44615m701420r267809p921194
3851d905229q77171N074128L797099l243233q162293m997916L332075P534582
3843b447958K470285o268778q983933m061597Q57784M42290j200839J690896O532931
$$ plain form
3902 1447178 815191 -2375211 -5389553 -5522147 -3837915 -2103977 -157511 2347304 4693351
3893 4693351 6269499 6502284 4079942 -835495 -4526505 -3395789 997253 4211358
3885 4211358 5257189 6413545 7620288 6235068 2418409 -690212 -3109610 -8795939
3877 -8795939 -18231735 -25377855 -25235721 -20504045 -17310640 -17577689 -19239144 -21281554 -24182120
3868 -24182120 -26501211 -25111806 -19173236 -11261009 -4084110 2075971 8170927 13997687
3860 13997687 17861904 18467027 16862072 15893888 16840579 16985194 12283774 3015965 -4905229
3851 -4905229 -5782400 -708272 3088827 -154406 -8316699 -13314615 -9982540 -2447958
3843 -2447958 22327 -6246451 -15230384 -19291981 -18434197 -17991907 -19192746 -17501850 -10968919
3834a0968919O147008K41595l581345r38918L019723J364312m296876n592934
3826a4606354J145568R019900Q368908j039340q985020p105880R44369N053894
3818g203955K216674q60989J231892N143498M991939R69947k408960l085707k178068
3809a183729o36921O48157k72361l360624m760376k208931M13805r85604k982042
3800a5328626M92636P115878P983968J147574m617184k512643K693585K445300
3792e79512l337414p323246n180421L03615M213983M360994J667593r87878o69866
3783g532152K287856L611436L99124l953757l686232Q56521L027314o32765n011189
3774a0633844l647234J880395M443984J901227k94934K023117N437103M645650
$$ plain form
3834 -10968919 -4821911 -4580316 -8161661 -9100579 -6080856 -4716544 -9013420 -14606354
3826 -14606354 -13460786 -4440886 3928022 2888682 -6096338 -13202218 -12257849 -7203955
3818 -7203955 -4987281 -5848270 -4616378 527120 5519059 6489006 4080046 994339 -1183729
3809 -1183729 -1820650 -1172493 -1444854 -4805478 -9565854 -11774785 -11360980 -12346584 -15328626
3800 -15328626 -14835990 -7720112 263856 1411430 -3205754 -5718397 -3024812 -579512
3792 -579512 -3916926 -11240172 -16420593 -16116978 -11902995 -7542001 -5874408 -6862286 -7532152
3783 -7532152 -5244296 -1632860 -1233736 -5187493 -8873725 -8017204 -4989890 -5622655 -10633844
3774 -10633844 -14281078 -12400683 -7956699 -6055472 -6350406 -4327289 1109814 5755464
3766E755464N45481j760657n42511J788957L876711N979798O073984J580108m326362
3757A8970973m678332P53287L361030k027877q830294q189792j776028J927780
3749d89253P97092L92832L038399L843501l34644m557189k492828M200932P423799
3740A1822641K777022m703486o119311O54611P956690P808042K343419M8565K305177
3731B4893370J279842o164042j1172131o234695J682384J211847n312595n660880
3723e476900K591481Q793255O358051Q46393k058713m815846r070246r271776
3715a2104301k574939L723617K845921o44605O91838M313456L171822p76492L57063
3706i96620N863948O111376k264319j0375909r331780j262269N562039P249778
$$ plain form
3766 5755464 6300945 4540288 3997777 5786734 9663445 15643243 21717227 23297335 18970973
3757 18970973 14292641 15045928 18406958 16379081 7548787 -641005 -2417033 -489253
3749 -489253 307839 700671 3739070 7582571 7247927 2690738 197910 4398842 11822641
3740 11822641 14599663 9896177 3776866 4431477 12388167 20196209 22539628 22588193 24893370
3731 24893370 26173212 20009170 8837039 2602344 4284728 5496575 183980 -5476900
3723 -5476900 -2885419 5907836 12265887 13112280 11053567 6237721 -2832525 -12104301
3715 -12104301 -14679240 -10955623 -8109702 -8754307 -8062469 -3749013 -577191 -1353683 -996620
3706 -996620 4867328 10978704 8714385 -1661524 -10993304 -12255573 -6693534 556244
3698E56244N906848M265384K734711P06477j575390k535719o58657K898162M132971
3689A6431031N96032m932914p586545o487600m865058m550029l658364l13552
3681a5366999M124707O654283N637851J616712l141795n472892l642933K09663
3673i381403J507129j645127n713831n524573n47110M215945M552749K746199
3665i790022M138905Q129151P197124k034741j1138670r523224M33495N834771
3657f753211J243617m466976k436355L454220M368023M46365j179272J473699
3649c849890L449525J933142j29646L01902K549629M297824L422890j333539p531122
3640C110715q894090k960606L475932K685350k483904k991585J974757M302088
$$ plain form
3698 556244 6463092 10728476 13463187 14169664 12594274 10058555 9399898 12298060 16431031
3689 16431031 17027063 12094149 4507604 -1979996 -6845054 -11395083 -15053447 -15366999
3681 -15366999 -11242292 -4588009 1049842 2666554 -475241 -5948133 -9591066 -9381403
3673 -9381403 -7874274 -9519401 -15233232 -20757805 -21304915 -17088970 -12536221 -9790022
3665 -9790022 -5651117 2478034 9675158 7640417 -3498253 -13021477 -12587982 -6753211
3657 -6753211 -5509594 -9976570 -12412925 -8958705 -4590682 -4144317 -5323589 -3849890
3649 -3849890 -400365 1532777 1403131 1705033 4254662 8552486 11975376 10641837 3110715
3640 3110715 -5783375 -8743981 -5268049 -2582699 -5066603 -8058188 -6083431 -1781343
3632a781343J293636L76881N648549R261522L179955p326042j0320251l647398
3624c314491L393289L572751l81247k212677m71046K086681L538288L976603L254580
3615A3442731N76721l281582n319255l459261L15693J938639M91082r13645k48962
3606C542161N59903p2800K17963L282969N471709K480598k702367l024826J888769
3597A1644079M857133J913218k622322l947977l364661l778362m284001l463833
3589c046726l309070m995137m700097P51484O685461N071908m318473j2368838
3581b0229488j1160955k667311M397955M513853Q05833O67896O329436J1272630
3573f070151P952105k156443r781037q905480k354209M058385P696934P736932
$$ plain form
3632 -1781343 -487707 -110826 5537723 14799245 17979200 10653158 332907 -3314491
3624 -3314491 78798 3651549 3270302 1057625 586579 2673260 6211548 10188151 13442731
3615 13442731 14019452 10737870 5418615 1959354 2275047 4213686 4704768 3791123 3542161
3606 3542161 4102064 4029264 4247227 7530196 13001905 15482503 12780136 9755310 11644079
3597 11644079 16501212 18414430 15792108 11844131 8479470 4701108 417107 -3046726
3589 -3046726 -6355796 -11350933 -16051030 -15299546 -8614085 -3542177 -7860650 -20229488
3581 -20229488 -31390443 -34057754 -29659799 -25145946 -24340113 -23672217 -17342781 -6070151
3573 -6070151 1881954 -274489 -10055526 -18961006 -21315215 -17256830 -9559896 -1822964
3565a822964L465967k448754m053421l2706K742713j330018p504853p092747O5076
3556a8011707O288609P413017O255153N110265K189433k725253n354437k881520
3548a716440J403155K636491O45575j219054j354534j028074j182875q03355J038464
3539a580647L027801K882467P94245m3267K047925L559267p8839o967517r773956
3530f132521n677362n60855l77981k880362k280530J658835M583350M918492M609036
3521b139898M295058L375529L463090N953213P289351L027546l857814n618091
3513A5787984j237518J757516j259174n675157n860231l538658l507400n539930
3505i072568n389724j249647M565426Q499593P753061J713586o152445j0088218
$$ plain form
3565 -1822964 1643003 -805751 -4859172 -4891878 -2149165 -3479183 -10984036 -18076783 -18011707
3556 -18011707 -11723098 -4310081 1945072 7055337 9244770 6519517 1165080 -1716440
3548 -1716440 -313285 2323206 2968781 1749727 395193 -632881 -1815756 -2619111 -1580647
3539 -1580647 1447154 4329621 5123866 5080599 7128524 10687791 10608952 3641435 -6132521
3530 -6132521 -11809883 -12370738 -12748719 -15629081 -17909611 -16250776 -11667426 -6748934 -2139898
3521 -2139898 2155160 5530689 8993779 14946992 22236343 25263889 21406075 15787984
3513 15787984 14550466 16307982 15048808 9373651 3513420 -25238 -3532638 -9072568
3505 -9072568 -14462292 -15711939 -11146513 -2646920 5106141 6819727 667282 -9420936
3497i420936p993823l511069n44336J414949M342459P136199P145765M339231
3489B908439J208824k62203K09866J527332J442831j580143n635560o761967l937121
3480a0879702N743K998281N563403P203298N827882K769114L036525P282782Q812894
3471C2620220L204068l936002m682998m24072R89695k754982o457075o514661
3463A2044193n020385m117530k422693R76116L422340J857384l331024q556376
3455e147975r515237m257492L909489Q141943N632324J389949R12881K097294
3447C163176k17139m552704n073439k155991k111263n835909o649352j869679
3439b5302300K087864L27598k619719r69968K965475L968860K789448K814553
$$ plain form
3497 -9420936 -17414759 -20925828 -21470164 -20055215 -15712756 -8576557 -1430792 2908439
3489 2908439 4117263 3855060 4064926 5592258 7035089 5454946 -180614 -6942581 -10879702
3480 -10879702 -10873959 -7875678 -2312275 4891023 10718905 13488019 16524544 23807326 32620220
3471 32620220 35824288 31888286 27205288 26781216 27770911 25015929 18558854 12044193
3463 12044193 7023808 2906278 483585 1459701 4882041 6739425 3408401 -5147975
3455 -5147975 -14663212 -18920704 -15011215 -6869272 -1236948 153001 1065882 3163176
3447 3163176 2946037 -1606667 -6680106 -8836097 -10947360 -16783269 -23432621 -25302300
3439 -25302300 -23214436 -22886838 -25506557 -26476525 -23511050 -19542190 -16752742 -13938189
3431a3938189K619254l66122k392859J687381P909846O739837k447709q926590
3423i115151n085422L687378P225060L316412k082083l723499j658198J307476
3415f128027K799959J587853k259633o851910q829846n445860K335715Q773731
3407a4018018P816817L38396n439333l492668K276876L705578j39746k405767
3399a1357865J027325O199998P532509M638474O75339j849105j528936J601000
3391F938739L939048P13087o792890j0641365o290364P72812K590922p16404k971425
3382a2457840j643089K48988N08365L28349N97489N38657M73855J773970L458797
3373f172459K551380j417052n318869o331016m281320k78532L977370N758290
$$ plain form
3431 -13938189 -11318935 -11685057 -14077916 -12390535 -4480689 2259148 -188561 -9115151
3423 -9115151 -14200573 -10513195 -3288135 28277 -2053806 -5777305 -7435503 -6128027
3415 -6128027 -3328068 -1740215 -3999848 -10851758 -19681604 -25127464 -22791749 -14018018
3407 -14018018 -6201201 -5862805 -11302138 -14794806 -12517930 -8812352 -8952098 -11357865
3399 -11357865 -10330540 -4130542 3401967 8040441 8715780 6866675 5337739 6938739
3391 6938739 10877787 11590874 4797984 -5843381 -12133745 -11360933 -8770011 -9486415 -12457840
3382 -12457840 -14100929 -13851941 -13343576 -13015227 -12417738 -11879081 -11405226 -9631256 -6172459
3373 -6172459 -3621079 -5038131 -10357000 -16688016 -20969336 -21247868 -17270498 -11512208
3365a1512208L503782m66318k339797j492456J04864J686241K833561O90186o052731
3356a3044876j1364024p380106L602674J0332487P791302L140828L138577M284814
3348E01676J412995j871582K27224M425885L207534k462830m759749j546443J939013
3339A073723L247363N192214P441696M985789k374310p282747n338855j336100
3331E608773q72046k181446j260784N51395J4480j271212J29016K445809Q72120
3322D036105m397570p776206n974954j805742L07809m04343r71133J794223P597912
3313g593899J1690561R089979R64826n556421n909040l641076m471970p607064
3305a3034104p407275k174219L673359O165196O061301N626037M874442K811607
$$ plain form
3365 -11512208 -8008426 -8474744 -10814541 -12306997 -12202133 -10515892 -7682331 -6992145 -13044876
3356 -13044876 -24408900 -31789006 -28186332 -17853845 -10062543 -6921715 -3783138 501676
3348 501676 1914671 43089 270313 4696198 7903732 5440902 681153 -865290 1073723
3339 1073723 4321086 9513300 16954996 21940785 19566475 12283728 6944873 5608773
3331 5608773 4736727 2555281 1294497 1845892 1860372 589160 718176 3163985 4036105
3322 4036105 -361465 -8137671 -14112625 -15918367 -15610558 -16014901 -16986034 -15191811 -7593899
3313 -7593899 4096662 13186641 14151467 8595046 2686006 -955070 -5427040 -13034104
3305 -13034104 -20441379 -22615598 -18942239 -12777043 -6715742 -1089705 3784737 6596344
3297F596344m3065k156449k791176k352284j676584j168365o1668K772158O362519
3288E481430P339911L821724j666865n162916n788120n056116l515404j330648
3280e877004n38016k456321l767510o4263O677854R365739N533975N89844o54150
3271H810148l88400k312595m437523k542110J791753K174135l651524r954784
3263a0510900r308335q86637Q255132R864613K970332m595076m972451k6321J427641
3254g782002l524195p485472m114514K013798K636505j556107k983822N04483
3246b2291326L519654K907977J518462J062696q88945m192078l864007J507628
3238b0719939N650014L646431p72797k205929j969358l013067k119863M142122
$$ plain form
3297 6596344 6553279 4396830 1605654 -746630 -2423214 -3591579 -3653247 -881089 5481430
3288 5481430 12821341 16643065 14976200 9813284 4025164 -1030952 -4546356 -5877004
3280 -5877004 -6415020 -8871341 -12638851 -12703114 -6025260 3340479 8874454 9464298 8810148
3271 8810148 8421748 6109153 1671630 -870480 921273 3095408 -556116 -10510900
3263 -10510900 -19819235 -20705872 -12450740 -2586127 384205 -4210871 -9183322 -9209643 -7782002
3254 -7782002 -11306197 -18791669 -22906183 -20892385 -18255880 -19811987 -22795809 -22291326
3246 -22291326 -18771672 -15863695 -14345233 -13282537 -14171482 -18363560 -22227567 -20719939
3238 -20719939 -15069925 -11423494 -12196291 -14402220 -16371578 -19384645 -21504508 -17362386
3230a7362386R748300N948243l728068o211728J960713Q894570M712949m853042
3222h90449q438361m767365n22725J755661M476900O668240M179179j736738l884545
3213c160203J018680P691585R446309N544268j95117m086194m286802j517468
3205A0455058L47378k191075o842082p408414k602234J391857k08986l704201
3197a0762699k814639J705057L656991J048270j396552J53650L243718L444375
3189a721829R81724K12147L426866P414575O826924L40451p319590j0039040o612921
3180f490693j271236J870195K742058K858534J577987k389507p004788p833757
3172a5941207l509800K113181M329169K639344M55746O91836K684524L468764
$$ plain form
3230 -17362386 -7614086 -1665843 -5393911 -11605639 -9644926 -750356 3962593 -890449
3222 -890449 -9328810 -14096175 -14618900 -12863239 -8386339 -1718099 2461080 724342 -3160203
3213 -3160203 -2141523 5550062 14996371 20540639 20345522 16259328 11972526 10455058
3205 10455058 10802436 8611361 1769279 -5639135 -8241369 -6849512 -7058498 -10762699
3197 -10762699 -13577338 -11872281 -8215290 -7167020 -8563572 -8409922 -5166204 -1721829
3189 -1721829 -740105 -527958 2898908 10313483 17140407 17480858 10161268 122228 -6490693
3180 -6490693 -7761929 -5891734 -3149676 -291142 1286845 -1102662 -8107450 -15941207
3172 -15941207 -19451007 -17337826 -13008657 -10369313 -9913567 -9221731 -6537207 -3068443
3164c068443J738221n6040J391717N258305O645114L085780j185668n43452L689517
3155A6955051M460582r13027o353890n368555k65970J237491l031368p171086
3147d50772o227420k972405k735038m812886l823951J090368L581340j152616
3139a7503380q537307r420091j301851R047010J3968377J2044550O104560j537845
3131B864023q845354j2046588q280807N8539O732596P672490L683090k003048
3123a0165059n928379m764146K287486J0185584J1123095L650109m263065m723243
3115b597618q4484R57282l748887o689470j927325O029557Q605430M696288N05799
3106E746572l41803m32988k012229k994710k031369k128636n000554o129806j024542
$$ plain form
3164 -3068443 -1330222 -1386262 5455 5263760 11908874 14994654 13808986 13265534 16955051
3155 16955051 21415633 20502606 14148716 8780161 8514191 9751682 6720314 -450772
3147 -450772 -6678192 -9650597 -12385635 -17198521 -21022472 -19932104 -16350764 -17503380
3139 -17503380 -26040687 -35460778 -36762629 -27715619 -13747242 -1702692 4401868 2864023
3131 2864023 -5981331 -18027919 -26308726 -26250187 -19517591 -11845101 -8162011 -10165059
3123 -10165059 -16093438 -20857584 -18570098 -8384514 2738581 6388690 2125625 -2597618
3115 -2597618 -2682102 -1724820 -5473707 -12163177 -14090502 -8060945 544485 5240773 5746572
3106 5746572 5404769 4971781 2959552 -35158 -2066527 -4195163 -9195717 -15325523 -16350065
3097a6350065O534119Q952928N922768L763519L862261L50025p932705j1706508
3089f603658l833200Q410976J1761385M616813k033789o55674L913513L442563
3081A9018929k337768o960978n843708l33012M601360M536819o01563n478879
3073F601200m260031K224870O765806M622249p50865k891958n95516J849727R12198
3064A4477680k697504o044690p053765n804313m212911l844749l247007P08299
3056a7718960P272743J0143587M649902m854911q834664l696997M721958R228562
3048I11220Q675908N771506J880446k388690m416819k137122J668018K157559
3040A2122026m60314j123946J770368L042913j437539p571743q075921k465773
$$ plain form
3097 -16350065 -9815946 -863018 5059750 8823269 12685530 13035555 5102850 -6603658
3089 -6603658 -10436858 -2025882 9735503 14352316 12318527 11662853 15576366 19018929
3081 19018929 16681161 9720183 3876475 3543463 8144823 12681642 12080079 6601200
3073 6601200 2341169 4566039 11331845 15954094 15203229 12311271 11715755 13565482 14477680
3064 14477680 11780176 5735486 -1318279 -7122592 -11335503 -15180252 -18427259 -17718960
3056 -17718960 -10446217 -302630 4347272 -507639 -9342303 -13039300 -8317342 911220
3048 911220 9587128 15358634 17239080 14850390 10433571 8296449 9964467 12122026
3040 12122026 11661712 10537766 12308134 15351047 13913508 6341765 -1734156 -4199929
3032d199929K800394L409739J748872J832944L758951M745247K914855j217795
3024A5793278m944707m718458J01961M866387M373054Q4169j700945N14920J050738
3015A5420397l576521q582824q027644l105485J235676L604627M906514L791266
3007E666006n35960m117792l314731j409365l268117n880771k349701N914867
2999i295564R814512N785484j96912l205182n229595p797258p350884k437582
2991a9912981J823488J577293L36034K143595M526620L812139J921319J699984
2983b072509O76486l480447n921339j361364N368239M811201k210920m744643
2975h935296J927719Q967788O863648j433896n961749l934333j845678m461741
$$ plain form
3032 -4199929 -1399535 2010204 3759076 5592020 9350971 14096218 17011073 15793278
3024 15793278 10848571 6130113 6232074 11098461 15471515 15555684 13854739 14369659 15420397
3015 15420397 11843876 3261052 -4766592 -7872077 -6636401 -3031774 1874740 5666006
3007 5666006 5130046 1012254 -2302477 -3711842 -6979959 -12860730 -15210431 -9295564
2999 -9295564 518948 6304432 6107520 2902338 -2327257 -10124515 -17475399 -19912981
2991 -19912981 -18089493 -16512200 -16176166 -14032571 -9505951 -5693812 -3772493 -2072509
2983 -2072509 -1396023 -4876470 -10797809 -12159173 -6790934 -1979733 -4190653 -8935296
2975 -8935296 -7007577 1960211 8823859 7389963 1428214 -2506119 -4351797 -8813538
2967h813538p807771n410182K068426P388428O334086K819786K636422N269883
2959D485540N525947J532499l312944n977851o889707p000849o092892m732628
2951b2462885l746245j433755L792584P994366N515107r96836k515499K070652
2943a1782511L074736l817712q608391k276123P935554R127993J820841l467773
2935g993386l619653l781360l896924J438794R811610J1448457M981578J50902
2927H540018J595228K240772k568953o372082l584113M94413m76595l238707k661103
2918f031122j767209m350579m731286L740752J4531411J4278758J952708r151883
2910H471550r353619l285395m65417k764955m838117k231655M086300Q842800
$$ plain form
2967 -8813538 -16621309 -22031491 -19963065 -12574637 -6240551 -3420765 -784343 4485540
2959 4485540 10011487 11543986 8231042 2253191 -4636516 -11637365 -17730257 -22462885
2951 -22462885 -26209130 -27642885 -23850301 -15855935 -10340828 -11337664 -13853163 -11782511
2943 -11782511 -8707775 -12525487 -21133878 -23410001 -15474447 -6346454 -4525613 -7993386
2935 -7993386 -11613039 -15394399 -19291323 -17852529 -8040919 3407538 8389116 8540018
2927 8540018 10135246 12376018 9807065 3434983 -149130 345283 -131312 -3370019 -6031122
2918 -6031122 -7798331 -12148910 -16880196 -13139444 1391967 15670725 17623433 8471550
2910 8471550 -882069 -4167464 -4632881 -7397836 -12235953 -14467608 -10381308 -1538508
2902a538508P050949l36363n958876m298288Q75841J618387k745897n052303j501891
2893a1886949K979053L135016J497597L567832Q404276R327926L160301n469986
2885A4715066r589760o916249q01204L702007L803032O20336j997367j228255
2877B307606J438339J899174p70247k279305Q06517M810433K999821m223728q336678
2868a348068l993168L564214O253019M058049K638470L085973J158948m048387
2860A1369050p866132p630336o203018n894286m591757p53659K776291L365793
2852a5428054K955498M385190O650817O998111M994460J943959r97148k126714
2844I376119R995L133326K485967k110966m935115k941719n66556j929771l486046
$$ plain form
2902 -1538508 5512441 5176078 -782798 -5081086 -4205245 -2586858 -5332755 -10385058 -11886949
2893 -11886949 -8907896 -5772880 -4275283 -707451 7696825 17024751 20185052 14715066
2885 14715066 5125306 -1790943 -2592147 1109860 4912892 5533228 3535861 2307606
2877 2307606 3745945 5645119 4874872 2595567 3402084 8212517 11212338 6988610 -1348068
2868 -1348068 -5341236 -1777022 4475997 8534046 11172516 14258489 15417437 11369050
2860 11369050 3502918 -4127418 -10330436 -16224722 -20816479 -21570138 -18793847 -15428054
2852 -15428054 -12472556 -8087366 -1436549 5561562 10556022 12499981 11502833 9376119
2844 9376119 9386114 12519440 15005407 12894441 7959326 5017607 4451051 2521280 -964766
2835i64766j84928N226221N872265J230372k814155l150715k318954k487667k417605
2826b009932j165860j18971k54786p62660r90626j207887j573226k403082m276839
2817a4763869n801898l702952J853340N056109J832884l443574l861626n1797
2809b2883383J840086L98720k1633K039629L015192J820620K179795N049837N322406
2800a238731k26973o875096q035205l744218Q78078K910033L445257L675189K800598
2791f411068M5180l182468l921109n52713M864451Q144022P587598N465535L735523
2782A5774951R77826l818323p343469o026021k008076m34556k149005l773749
2774h800422l727043k996894j074080L064187O441882M656471r04143m323028
$$ plain form
2835 -964766 -1149694 4076527 9948792 11179164 8365009 5214294 2895340 407673 -2009932
2826 -2009932 -3175792 -3294763 -3549549 -4312209 -5302835 -6510722 -8083948 -10487030 -14763869
2817 -14763869 -20565767 -24268719 -22415379 -17359270 -15526386 -18969960 -22831586 -22883383
2809 -22883383 -21043297 -20644577 -20666210 -18626581 -15611389 -13790769 -11610974 -6561137 -1238731
2800 -1238731 -1465704 -8340800 -16376005 -20120223 -19242145 -16332112 -12886855 -9211666 -6411068
2791 -6411068 -6365888 -9548356 -13469465 -14022178 -9157727 -1013705 6573893 12039428 15774951
2782 15774951 16752777 12934454 5590985 -435036 -2443112 -2877668 -5026673 -8800422
2774 -8800422 -12527465 -15524359 -16598439 -13534252 -7092370 -2435899 -3340042 -7663070
2766g663070l837024l191968m113396m070867k273551j037639j64907K931491
2758b3420931O492242N775291K507815L755219Q893254Q208506r38133p569141
2750C704122l832194K250303L67271n115208l813779K240433K716019k619255
2742d102288m063188O34409L154965K73125o76598M177455P583610L360844l355724
2733F986610m787653j890838k41586o59948q18737j302984l153189l190270J304933
2724g753662O070790M893092o76874l376385j037877J448353J090921Q65209L080069
2715D603636M797625L029578k21909j720452j980875k598636j986156J373177
2707E295988L859455P89901n178724n983142K78637N561374K667146m927611q275687
$$ plain form
2766 -7663070 -11500094 -14692062 -18805458 -22876325 -25149876 -26187515 -26352422 -23420931
2758 -23420931 -16928689 -11153398 -8645583 -4890364 4002890 12211396 11273263 3704122
2750 3704122 -128072 2122231 2489502 -2625706 -6439485 -4199052 -1483033 -4102288
2742 -4102288 -8165476 -7531067 -4376102 -4102977 -4779575 -602120 6981490 10342334 6986610
2733 6986610 2198957 308119 66533 -593415 -1412152 -2715136 -5868325 -9058595 -7753662
2724 -7753662 -1682872 3210220 2533346 -843039 -1880916 -432563 658358 1523567 4603636
2715 4603636 9401261 12430839 12208930 10488478 8507603 5908967 3922811 5295988
2707 5295988 9155443 9945344 4766620 -1216522 -937885 4623489 7290635 2363024 -5912663
2698e912663m675636O11700K516413J285389l1860O86555L417941N623974L672777
2689G194590k615159q011382p624323l094377O08038K501426M666141N842476
2681e32570K706163k673986l860121J62750L056489J046472j953617j883368n41016
2672d472804n17724n22598J48236j286691m941888n479407p28793L210285J590197
2663a3001187o19689K615168P370888O310807J407516J63491K564031K339272
2655I150297q79088j643033j33337k148465o836422n983182J629319O226406K182622
2646A565117k812796k74444N680701N434438j367808o394196m861620j0040L230512
2637A89864L232591P44356k631181m770798m450554k476715m35884N35282o02869
$$ plain form
2698 -5912663 -10588299 -9976599 -7460186 -6174797 -6206657 -5520102 -2102161 3521813 7194590
2689 7194590 4579431 -3431951 -11056274 -14150651 -13542613 -11041187 -6375046 -532570
2681 -532570 2173593 -500393 -4360514 -4197764 -1141275 -94803 -2048420 -3931788 -4472804
2672 -4472804 -4990528 -5513126 -5364890 -6651581 -11593469 -17072876 -17801669 -14591384 -13001187
2663 -13001187 -13620876 -11005708 -3634820 2675987 4083503 4246994 6811025 9150297
2655 9150297 8271209 6628176 6494839 4346374 -2490048 -8473230 -6843911 -617505 1565117
2646 1565117 -1247679 -1522123 4158578 9593016 8225208 1831012 -3030608 -3040648 189864
2637 189864 3422455 4166811 1535630 -3235168 -7685722 -10162437 -10598321 -10063039 -10665908
2628a0665908l978729p076611o798798l967718k299049k111338N63711O865071
2620b9469369J1601144R712374K822679l244874m644394j506951K900806L704003
2612h124582r12163n499495k845716N149953Q694052M511271J095746N014719
2604G083785J0219620Q182671J423821k281856l400625p358628j1441458p424384
2596d997054L011270P609175J043735p149436o440098J346524P550529Q457751
2588A0432396N902303J699273k504468l642330q70492J939842J503303k51697
2580A4208130q32052k390184o834702r424264m533048L930367N931199k26376
2572a70930m685304k54601P053050O965314m29603n791782m107047L03J088568
$$ plain form
2628 -10665908 -14644637 -21721248 -28520046 -32487764 -34786813 -36898151 -36334440 -29469369
2620 -29469369 -17868225 -8155851 -5333172 -8578046 -13222440 -14729391 -11828585 -8124582
2612 -8124582 -9036745 -14536240 -17381956 -12232003 -3537951 973320 2069066 7083785
2604 7083785 17303405 25486076 26909897 24628041 21227416 13868788 2427330 -4997054
2596 -4997054 -1985784 5623391 6667126 -482310 -6922408 -5575884 1974645 10432396
2588 10432396 16334699 18033972 15529504 11887174 11016682 12956524 14459827 14208130
2580 14208130 13376078 10985894 4151192 -5273072 -9806120 -5875753 55446 -170930
2572 -170930 -4856234 -5110835 1942215 8907529 8477926 2686144 -1420903 -1420600 -332032
2563c32032M21637J534387L199637J683839k519019n357337n818559o721993q271251
2554b2180691o060605J682168R016679Q935018K973075o99397J596727M736382
2546f44L026122j566864k795191P03139L802146K248161k025597m322109l362977
2537d293814j751759j476511j522009j94795K071092L214217K066656k50331j191065
2528c328319P70203L960235M455550N67571m327710n556711l194390j308337j235810
2519i197718J20647L858776N705194K507607j847243j661675K165080L973805
2511E624473J722036j511565k993022k313503O65021M494087M355008k097850
2503G944685q395609o190164J995141N420194J007348l110437k066801j536096
$$ plain form
2563 -332032 89605 1623992 4823629 6507468 3988449 -1368888 -7187447 -13909440 -22180691
2554 -22180691 -28241296 -26559128 -17542449 -8607431 -5634356 -6333753 -4737026 -644
2546 -644 3025478 1458614 -1336577 -633438 3168708 5416869 3391272 -930837 -4293814
2537 -4293814 -6045573 -7522084 -9044093 -9238888 -7167796 -3953579 -1886923 -2137254 -3328319
2528 -3328319 -2558116 1402119 5857669 6425240 2097530 -3459181 -6653571 -7961908 -9197718
2519 -9197718 -9077071 -5218295 486899 2994506 1147263 -514412 1650668 5624473
2511 5624473 7346509 5834944 2841922 528419 1193440 5687527 10042535 7944685
2503 7944685 -450924 -6641088 -4645947 774247 1781595 -1328842 -3395643 -4931739
2495d931739n631587q102934l408533K467015K016804k52385M292876J2003449
2487a547034J1198065J153052n685421k023818M528587L742922l518944q603441
2479g56032o574287k04572M264536K745728l024846o588826l799430J988714M807145
2470g141870M188500L692052L407001M88042l606808l705256M61906L061399J107443
2461A952409j698930j855048o50425K12156J628835L298852K594963j61526p64261
2452D557025J835643K999887n8838l460169k740798R71944M081520N327626M551737
2443A8065577J262664k714799l778874k231630k342758m589666m172304q3328
2435e85118J782533j145904k612073J796087O027923L201679k838937m431189
$$ plain form
2495 -4931739 -10563326 -18666260 -22074793 -19607778 -17590974 -17843359 -13550483 -1547034
2487 -1547034 9651031 10804083 5118662 3094844 7623431 11366353 7847409 -756032
2479 -756032 -7330319 -7534891 -3270355 -524627 -3549473 -10138299 -13937729 -11949015 -7141870
2470 -7141870 -2953370 738682 4145683 4633725 1026917 -2678339 -2216433 844966 1952409
2461 1952409 253479 -1601569 -2251994 -2039838 -411003 2887849 5482812 5321286 4557025
2452 4557025 6392668 9392555 9333717 5873548 3132750 4104694 8186214 13513840 18065577
2443 18065577 19328241 16613442 12834568 10602938 8260180 3670514 -501790 -585118
2435 -585118 1197415 51511 -2560562 -764475 5263448 8465127 5626190 1195001
2427A195001k914189m541898p750802n496274J583600N072789J889327k080663
2419a3043109k360217j160228p84051J83656J973348K048235O82172J665086N232788
2410e562320O447984L060731p25614r15901J000452J887986J313674k01318k732555
2401C573119m715093l649693q85776j006782m535192o192628k766519K148079
2393a8030485M018788L512084L783873N463458P011394O789789L228459l041049
$$ plain form
2427 1195001 -1719188 -6261086 -14011888 -19508162 -17924562 -12851773 -10962446 -13043109
2419 -13043109 -15403326 -16563554 -17347605 -17163949 -15190601 -13142366 -12460194 -10795108 -5562320
2410 -5562320 885664 3946395 3220781 2304880 3305332 5193318 6506992 6305674 3573119
2401 3573119 -1141974 -4791667 -5677443 -6684225 -11219417 -17412045 -20178564 -18030485
2393 -18030485 -14011697 -10499613 -6715740 -1252282 5759112 12548901 15777360 12736311
$$ [...]
##END NTUPLES=NMR SPECTRUM
##END=
