##TITLE=31Pdec_DE-75H2
 D2O, 64 sc
 6.2.2025
##JCAMPDX= 6.0         $$ Bruker NMR JCAMP-DX V2.0
##DATA TYPE= NMR SPECTRUM
##DATA CLASS= NTUPLES
##ORIGIN= UXNMR, Bruker Analytische Messtechnik GmbH
##OWNER= root
$$ XWIN-NMR		Version 3.5
$$ Thu Feb  6 13:46:28 2025 Russian Standard Time (UT+4h)  she@DPX200
##.OBSERVE FREQUENCY= 81.013821
##.OBSERVE NUCLEUS= ^31P
##.ACQUISITION MODE= SIMULTANEOUS
##.ACQUISITION SCHEME= undefined
##.AVERAGES= 64
##.DIGITISER RES= 17
##SPECTROMETER/DATA SYSTEM= spect
##.PULSE SEQUENCE= zgpg30
##.SOLVENT NAME= CDCl3
##.SHIFT REFERENCE= (INTERNAL, CDCl3, 0, 198.062)
##AUDIT TRAIL= $$ (NUMBER, WHEN, WHO, WHERE, WHAT)
$$ ##TITLE= Audit trail, XWIN-NMR		Version 3.5
$$ ##JCAMPDX= 5.01
$$ ##ORIGIN= Bruker BioSpin GmbH
$$ ##OWNER= she
$$ F:/spectra/data/she/nmr/P31/2/pdata/1/auditp.txt
$$ ##AUDIT TRAIL=  $$ (NUMBER, WHEN, WHO, WHERE, WHAT)
(   1,<2025-02-06 13:45:22.54 +0400>,<she>,<DPX200>,
      <created by zg, POWCHK disabled, PULCHK disabled
       configuration hash MD5:
       00 E9 B6 7A A2 85 ED C7 34 08 36 98 17 FE 4E 26
       data hash MD5: 32K
       3D F8 F3 2E DC A9 BB B0 12 41 04 BC 68 81 D7 20>)
(   2,<2025-02-06 13:45:28.59 +0400>,<she>,<DPX200>,
      <Start of raw data processing
       efp BC_mod = 2 LB = 1.5 FT_mod = 6 PKNL = 1 PHC0 = 1220.513 PHC1 = 1369.295 SI = 64K 
       data hash MD5: 64K
       AB 2D F2 5C 9C 50 87 3F CB B4 51 C8 80 34 6C 6B>)
(   3,<2025-02-06 13:45:54.15 +0400>,<she>,<DPX200>,
      <pk PHC0 = 141.9245 PHC1 = -390.3998 
       data hash MD5: 64K
       5C 94 1D 21 BD B5 31 63 35 56 AE 02 8E D2 0B FE>)
(   4,<2025-02-06 13:45:58.03 +0400>,<she>,<DPX200>,
      <abs ABSG = 5 
       data hash MD5: 64K
       C2 4C 97 9D F9 EB 6C 48 2D 52 D5 F8 E9 15 67 E7>)
$$ ##END=
$$ 
$$ hash MD5
$$ 2D CF 10 94 D1 68 67 51 13 24 D4 7E 92 7E 12 C6
##$RELAX= 
##$RELAX= 
##$RELAX= 
##$RELAX= 
##$RELAX= 
##$RELAX= 
##$RELAX= 
##$RELAX= 
$$ Bruker specific parameters
$$ --------------------------
##$DU= <F:/spectra>
##$EXPNO= 2
##$NAME= <P31>
##$PROCNO= 1
##$TYPE= <nmr>
##$USER= <she>
##$AMP= (0..31)
100 100 100 100 100 100 100 100 100 100 100 100 100 100 100 100 100 100 
100 100 100 100 100 100 100 100 100 100 100 100 100 100 
##$AQSEQ= 0
##$AQ_mod= 1
##$AUNM= <au_zg>
##$AUTOPOS= <>
##$BF1= 81.014009
##$BF2= 200.13
##$BF3= 200.13
##$BF4= 200.13
##$BF5= 200.13
##$BF6= 200.13
##$BF7= 200.13
##$BF8= 200.13
##$BYTORDA= 1
##$CFDGTYP= 0
##$CFRGTYP= 5
##$CHEMSTR= <none>
##$CNST= (0..31)
1 1 145 1 1 1 1 1 1 1 1 1 1 1 1 1 1 1 1 1 1 1 1 1 1 1 1 1 1 1 1 1 
##$CPDPRG= <waltz16>
##$CPDPRG1= <>
##$CPDPRG2= <waltz16>
##$CPDPRG3= <>
##$CPDPRG4= <mlev>
##$CPDPRG5= <mlev>
##$CPDPRG6= <mlev>
##$CPDPRG7= <mlev>
##$CPDPRG8= <mlev>
##$CPDPRGB= <>
##$CPDPRGT= <>
##$D= (0..31)
0 1 0 0 0 0 0 0 0 0.06 0 0.03 2e-05 3e-06 0 0 0.0002 0 0 0 0 0 0 0 0 0 
0 0 0 0 0 0 
##$DATE= 1738835121
##$DBL= (0..7)
120 120 120 11 120 120 24 19 
##$DBP= (0..7)
150 150 150 150 150 150 150 150 
##$DBP07= 0
##$DBPNAM0= <>
##$DBPNAM1= <>
$$ [...]
##$SUBNAM3= <"">
##$SUBNAM4= <"">
##$SUBNAM5= <"">
##$SUBNAM6= <"">
##$SUBNAM7= <"">
##$SUBNAM8= <"">
##$SUBNAM9= <"">
##$SW= 400.765351723535
##$SWIBOX= (0..15)
0 1 3 0 0 0 0 0 0 0 0 0 0 0 0 0 
##$SW_h= 32467.5324675325
##$TD= 32768
##$TD0= 1
##$TE= 0
##$TE2= 300
##$TE3= 300
##$TEG= 300
##$TL= (0..7)
0 120 53 12 22 120 120 120 
##$TP= (0..7)
150 150 150 150 150 150 150 150 
##$TP07= 0
##$TPNAME0= <>
##$TPNAME1= <>
##$TPNAME2= <>
##$TPNAME3= <>
##$TPNAME4= <>
##$TPNAME5= <>
##$TPNAME6= <>
##$TPNAME7= <>
##$TPOAL= (0..7)
0.5 0.5 0.5 0.5 0.5 0.5 0.5 0.5 
##$TPOFFS= (0..7)
0 0 0 0 0 0 0 0 
##$TUNHIN= 0
##$TUNHOUT= 0
##$TUNXOUT= 0
##$USERA1= <user>
##$USERA2= <user>
##$USERA3= <user>
##$USERA4= <user>
##$USERA5= <user>
##$V9= 5
##$VALIST= <valist>
##$VCLIST= <CCCCCCCCCCCCCCC>
##$VD= 0
##$VDLIST= <DDDDDDDDDDDDDDD>
##$VPLIST= <PPPPPPPPPPPPPPP>
##$VTLIST= <TTTTTTTTTTTTTTT>
##$WBST= 1024
##$WBSW= 4
##$XGAIN= (0..3)
0 0 0 0 
##$XL= 0
##$YL= 0
##$YMAX_a= 10112
##$YMIN_a= -10368
##$ZGOPTNS= <>
##$ZL1= 120
##$ZL2= 120
##$ZL3= 120
##$ZL4= 120
##$ABSF1= 198.0616
##$ABSF2= -202.7028
##$ABSG= 5
##$ABSL= 3
##$ALPHA= 0
##$AQORDER= 0
##$ASSFAC= 0
##$ASSFACI= 0
##$ASSFACX= 0
##$ASSWID= 0
##$AUNMP= <proc_1d>
##$AZFE= 0.1
##$AZFW= 0.5
##$BCFW= 0
##$BC_mod= 2
##$BYTORDP= 0
##$COROFFS= 0
##$CY= -3
##$DATMOD= 1
##$DC= 0
##$DFILT= <>
##$DTYPP= 0
##$F1P= 0
##$F2P= 0
##$FCOR= 1
##$FTSIZE= 65536
##$FT_mod= 6
##$GAMMA= 0
##$GB= 0
##$INTBC= 1
##$INTSCL= 9.790993e-09
##$ISEN= 30
##$LB= 1.5
##$LEV0= 0
##$LPBIN= 0
##$MAXI= 10000
##$MC2= 0
##$MEAN= 0
##$ME_mod= 0
##$MI= 50
##$NCOEF= 0
##$NC_proc= -9
##$NLEV= 6
##$NOISF1= 182.463
##$NOISF2= 159.3651
##$NSP= 0
##$NTH_PI= 0
##$NZP= 0
##$OFFSET= 198.0616
##$PC= 4
##$PHC0= 1362.438
##$PHC1= 978.8953
##$PH_mod= 1
##$PKNL= yes
##$PPARMOD= 0
##$PSCAL= 0
##$PSIGN= 0
##$REVERSE= no
##$SF= 81.0140089999434
##$SI= 65536
##$SIGF1= 159.3651
##$SIGF2= -187.1042
##$SINO= 113.3802
##$SIOLD= 16384
##$SREGLST= <1H.CDCl3>
##$SSB= 0
##$STSI= 65536
##$STSR= 0
##$SW_p= 32467.5324675325
##$SYMM= 0
##$S_DEV= 0
##$TDeff= 32768
##$TDoff= 0
##$TI= <>
##$TILT= no
##$TM1= 0
##$TM2= 0
##$TOPLEV= 0
##$USERP1= <user>
##$USERP2= <user>
##$USERP3= <user>
##$USERP4= <user>
##$USERP5= <user>
##$WDW= 1
##$XDIM= 65536
##$YMAX_p= 399463871
##$YMIN_p= -156518220
$$ End of Bruker specific parameters
$$ ---------------------------------
##NTUPLES= NMR SPECTRUM
##VAR_NAME=  FREQUENCY,     SPECTRUM/REAL,   SPECTRUM/IMAG
##SYMBOL=    X,             R,               I
##VAR_TYPE=  INDEPENDENT,   DEPENDENT,       DEPENDENT
##VAR_FORM=  AFFN,          ASDF,            ASDF
##VAR_DIM=   65536,         65536,           65536
##UNITS=     HZ,            ARBITRARY UNITS, ARBITRARY UNITS
##FACTOR=    0.49542278885378, 1,            1
##FIRST=     16045.7642231865, 0,            0
##LAST=      -16421.768244346, 0,            0
##MIN=       -16421.768244346, -156518220,   0
##MAX=       16045.7642231865, 399463871,    0
$$ Real data points
##PAGE= N=1
##DATA TABLE= (X++(R..R)), XYDATA
$$ [...]
40582b1138874M91718M397535M475618K178647M39616O57581K120691K398131
40574c979337p7645k685039r62368M352896O952246L997166O89472K141000N260895
40565A5689286L627370k926833q643425r520658o302026j610036K131968L420165
40557d134189L098851L287805L323042J90919n225853p228233l659468O4920o57052
40548a0939258k567721j034199J583611M21033l125724l849711r24261K567148
40540a7869082N393166P519875O894639L066379O45250K705545M601786J590732
40532A4548290j827824P94007N270244K546210n369174p600720k234445J045238
40524G171826j927764l324867J391006M395232p05341o756292m425258K410081
$$ plain form
40582 -21138874 -20647156 -16249621 -11774003 -9595356 -9155740 -8498159 -6377468 -3979337
40574 -3979337 -4056982 -6742021 -7704389 -3351493 3600753 7597919 8287391 10428391 15689286
40565 15689286 19316656 16389823 7746398 -1774260 -8076286 -9686322 -7554354 -4134189
40557 -4134189 -1035338 2252467 5575509 5766428 540575 -6687658 -10347126 -10282206 -10939258
40548 -10939258 -13506979 -14541178 -12957567 -12536534 -15662258 -19511969 -20436230 -17869082
40540 -17869082 -12475916 -4956041 1938598 5004977 5650227 8355772 12957558 14548290
40532 14548290 12720466 13514473 18784717 21330927 15961753 8361033 6126588 7171826
40524 7171826 5244062 1919195 3310201 7705433 7000092 243800 -4181458 -1771377
40516a771377L411023j465585l111781J384440N233199L887590J113114R51592
40508I632215J212404j369678m889635n449556l297692j665181j148046Q07597
40500f167572M855277P560152N777129J044225k749828m863431p535044j0128931
40492a2208023p638774K153450J2993334J5847010R286099M52010l820964l040909
40484A4023233l53712J863830K408047P52392j869409l051656k224386j216915
40476A0331424j078789n93014J087225K535225K013408l54779l233278n241360
40468E466062m935594j648640K761940M802661L019904m82449k721016k592298
40460C670570n63219K599033N654619O461378L111043l820105j0019296r733878
$$ plain form
40516 -1771377 1639646 174061 -2937720 -1553280 3679919 7567509 8680623 9632215
40508 9632215 10844619 9474941 4585306 -864250 -4161942 -5827123 -6975169 -6167572
40500 -6167572 -1312295 6247857 12024986 13069211 10319383 5455952 -2079092 -12208023
40492 -12208023 -19846797 -17693347 -4700013 11146997 20433096 20885106 17064142 14023233
40484 14023233 13669521 15533351 17941398 18693790 16824381 13772725 11548339 10331424
40476 10331424 9252635 8659621 9746846 12282071 14295479 13940700 10707422 5466062
40468 5466062 530468 -1118172 1643768 6446429 9466333 8983884 6262868 3670570
40460 3670570 3107351 5706384 11361003 17822381 20933424 17113319 7094023 -2639855
40452b639855j648877P743737R989799M673145m01937m05077O14965j667512l686756
40443A2571632p91345K995358O07044n812571p748585m008450j673167l260553
40435g120637l321708J54832J286394k704336n400665j601303M170936N641346
40427h895141M219746L975371L592021N44561k120537p71069J540365M67885j053142
40418A500060J976401O110069L651809m048527p287052k785109J444613j168174
40410f05910o213100o197696j844076N89727k60188L03357M281263O820175L053637
40401g2811m505319q972920p909099m889972k264302K246980Q866721J1119411
40393f381311M117002n771808p352948L56397P680615Q847118P673543P051570
$$ plain form
40452 -2639855 -4288732 3455005 13444804 18117949 17716012 17310935 17925900 16258388 12571632
40443 12571632 11780287 14775645 15382689 9570118 1821533 -2186917 -3860084 -7120637
40435 -7120637 -10442345 -10287513 -9001119 -11705455 -17106120 -18707423 -14536487 -8895141
40427 -8895141 -4675395 -700024 2891997 3436558 1316021 544952 2085317 2553202 1500060
40418 1500060 3476461 9586530 13238339 9189812 1902760 -882349 562264 -605910
40410 -605910 -6819010 -13016706 -14860782 -14271055 -14531243 -14227886 -9946623 -3126448 -72811
40401 -72811 -4578130 -13551050 -21460149 -26350121 -28614423 -26367443 -17500722 -6381311
40393 -6381311 -2264309 -8036117 -15389065 -15032668 -7352053 1495065 9168608 16220178
40385A6220178L343920m021801p535492l431616K93866l514181q371487m494465
40377a1511078M380018O649083J221244k618084j694466j935306m578060k876377
40369a2963026M257862P652536K317567l940236k960924J512735J718374j013864
40361c418976J90114N430434P946367M722214l4508j949624j389837n29675K37494
40352A1204003J377310K135494J069202j873185m650517n068331l393087j766330
40344i65441o35990J604244L882666J457756o260356j1110574o276685J999116
40336a6305264J984595n132619n496893O144939J6795645J3392083J279039m580021
40328H081504k91461N303469N830980L616865J549104j475995n205423n889433
$$ plain form
40385 16220178 19564098 15542297 8006805 4575189 4869055 1354874 -7016613 -11511078
40377 -11511078 -7131060 -481977 739267 -1878817 -3573283 -5508589 -10086649 -12963026
40369 -12963026 -8705164 -1052628 1264939 -2675297 -5636221 -4123486 -2405112 -3418976
40361 -3418976 -3228862 2201572 10147939 14870153 14835645 12886021 11496184 10966509 11204003
40352 11204003 12581313 14716807 15786009 13912824 9262307 4193976 800889 -965441
40344 -965441 -1601431 2813 3885479 5343235 -917121 -12027695 -18304380 -16305264
40336 -16305264 -14320669 -19453288 -24950181 -18805242 -2009597 11382486 12661525 8081504
40328 8081504 7790043 13093512 18924492 22541357 24090461 22614466 17409043 11519610
40320A1519610k463062P47023M16659j075814j84929K193984K792696J162787
40312A5108954l46446n92377r05024k382624l783303l045893m57508Q70045j253563
40303C212261m426960l816225J442141O304356N888150J545115j330831j99368
40295H618639K325771K311857j494724o931176r794099o699592J274664Q217861
40287b170799Q760059L733737j264259k617723j832350j734633j918344K48655
40279A204343M756318P084021K825107n915601j1048311p445529K60305L167810
40271e111537l87025l414151j076993K513908J450232k629723l277728J295254
40263a0637763O494633P780384M375695k369482r554328j2028288o183638M411917
$$ plain form
40320 11519610 9056548 9803571 10220230 9144416 8959487 11153471 13946167 15108954
40312 15108954 14762508 14170131 13265107 10882483 7099180 4053287 3595779 4465824 3212261
40303 3212261 -1214699 -5030924 -3588783 2715573 8603723 10148838 8818007 8618639
40295 8618639 10944410 13256267 11761543 4830367 -4963732 -11663324 -10388660 -2170799
40287 -2170799 6589260 10322997 9058738 6441015 4608665 2874032 955688 1204343
40279 1204343 5960661 13044682 15869789 9954188 -1094123 -8539652 -8279347 -5111537
40271 -5111537 -5498562 -8912713 -9989706 -7475798 -6025566 -8655289 -11933017 -10637763
40263 -10637763 -4143130 3637254 8012949 5643467 -3910861 -15939149 -22122787 -17710870
40255a7710870J1177202R832781M428905Q70610j25589j340509k997535j842514
40247B292481L754215R829645R472409K62341j1223186j4498703o411997M440494
40239b082301P113382Q79594m952843l386157K087891L084988k783307r051654
40231i090407p744003J693661J1052074J1410351K723115o179838q048834n009777
40223i193658l450238m192137k720263K089610N412512L656870p87833l837020
40215a3022157m508725l284152L65211N899516J0049585J0033190O550638K041366
40207A4124472j547831k246728Q81870M422829K854775l118024n461115j82250
40199I727998N404657K980744l723239m571955R27414L364723n76816k817959
$$ plain form
40255 -17710870 -6533668 3299113 7728018 8598628 8473039 7132530 4134995 2292481
40247 2292481 6046696 15876341 25348750 25611091 14387905 -110798 -6522795 -2082301
40239 -2082301 5031081 5910675 957832 -2428325 -340434 2744554 -38753 -9090407
40231 -9090407 -16834410 -15140749 -4088675 7321676 10044791 3864953 -4183881 -9193658
40223 -9193658 -12643896 -16836033 -19556296 -17466686 -12054174 -8397304 -9185137 -13022157
40215 -13022157 -17530882 -20815034 -20449823 -14550307 -4500722 5532468 12083106 14124472
40207 14124472 12576641 10329913 11211783 15634612 18489387 15371363 9910248 9727998
40199 9727998 15132655 18113399 14390160 9818205 10745619 14110342 13533526 10715567
40191A0715567J594576M957184n47489q653070p669874R78365M539298j150472
40183D764085n340221K46708Q084292O593730j961522n436403m86602L557048
40175A0021115L24827m285064k936511J194340N07008m221182n569098j705597
40167f670162J634887J387579J074962K555305J897306k342276l962596J305360
40159c119635O682884L213926n481505p062957J119058P567968L817737l124354
40151C613122k080349N305034P868344K130661l441626k074914J909680R50850
40143A4180802m650507q496766p259678l014908J516246N185228O689941N145817
40135I296175K597977K125562K929858J098800l733983o542497l929567N81999
$$ plain form
40191 10715567 12310143 17267327 16719838 8066768 396894 1375259 5914557 4764085
40183 4764085 -576136 -329428 7754864 14348594 12387072 6950669 6464067 10021115
40175 10021115 10345942 6060878 3124367 4318707 4825715 604533 -4964565 -6670162
40167 -6670162 -5035275 -3647696 -2572734 -17429 1879877 -462399 -4424995 -3119635
40159 -3119635 3563249 6777175 1295670 -5767287 -4648229 2919739 6737476 3613122
40151 3613122 1532773 6837807 14706151 16836812 13395186 11320272 13229952 14180802
40143 14180802 9530295 1033529 -6226149 -9241057 -7724811 -2539583 4150358 9296175
40135 9296175 11894152 14019714 16949572 18048372 14314389 7771892 3842325 4424324
40127D424324J535531r29408k570981k247890k693952m240822k967057K780740
40119f909515P965867O448302r20412p135164p343642l443558k13862O27641J281406
40110i642937M039148P874716Q895546M203908m325867j0589933r791722l602100
40102a2939241J475420J473487o50700O76794N989180R832932P965841L138111
40094A6961824J501812M297979O136699K394985m318886p531830n367795k330783
40086A1744005k308703l268648j313569K359089K571211j820378n106142k190801
40078F66064L801704M895178j520209r260200j0745203n014642K848718P685072
40070f643518P596525L453547j894197m583195k623700J951092N399786O198282
$$ plain form
40127 4424324 5959855 5030447 2459466 211576 -2482376 -6723198 -9690255 -6909515
40119 -6909515 1056352 7504654 6584242 -550922 -7894564 -11338122 -11551984 -10924343 -9642937
40110 -9642937 -5603789 2270927 11166473 15370381 11044514 454581 -9337141 -12939241
40102 -12939241 -11463821 -9990334 -10641034 -9964240 -3975060 5857872 13823713 16961824
40094 16961824 18463636 22761615 28898314 31293299 26974413 19442583 14074788 11744005
40086 11744005 9435302 6166654 4853085 7212174 9783385 7963007 2856865 666064
40078 666064 4467768 9362946 7842737 -1417463 -12162666 -17177308 -14328590 -6643518
40070 -6643518 953007 4406554 2512357 -2070838 -4694538 -2743446 2656340 8854622
40062H854622M928358J659015l219789o183944l094785M290948Q517447N468700
40054B1220572l58884k542984j290961j215021l096693l111605K45150L268757
40046A3118331K052022k894412p803773q870595m318004L593629Q452150N225358
40038H554706l205975q474873o674916k131336O5674N95011J937940K428516m62645
40029g367898l502245o27336P510191J2590763R098932J416208k474745j293931
40021A5349939n74173l674613o917217n054275J157362N630153M646444J199480
40013A1763100M99236L045807M523002K071543j999467l698768k505425j242525
40005A2456503j840355l258066l678695l118028k883637l108459k156607Q36281
$$ plain form
40062 8854622 13782980 15441995 12222206 6038262 2943477 7234425 15751872 21220572
40054 21220572 20861688 18318704 17027743 15812722 12716029 9604424 9849574 13118331
40046 13118331 15170353 12275941 4472168 -4398427 -8716431 -5122802 3329348 8554706
40038 8554706 5348731 -3126142 -9801058 -11932394 -11866720 -11271709 -9333769 -6905253 -7367898
40029 -7367898 -10870143 -11497479 -3987288 8603475 17702407 19118615 16643870 15349939
40021 15349939 14775766 11101153 4183936 -870339 287023 5917176 10563620 11763100
40013 11763100 12262336 15308143 19831145 21902688 19903221 16204453 13699028 12456503
40005 12456503 10616148 7358082 3679387 561359 -2322278 -5430737 -7587344 -6751063
39997f751063L643530K927899j022319l577988j538430K029853J489270l654692
39989f453940p999849p222538k448994K816763O387344O788226L043299k417520
39981g507209m125819l148N414011P264693O660131O729045N810442N59578n994339
39972A4807385o513405q1929N418178L804555j615717l630588n58430L214089
39964A4844138L648153J095836q72329P80238M861183O115058J477859m534392
39956B7415744m876863k86585J242703l308490p026816l919621J901218L545117
39948A4686407K070617K416956K995642j528817r012432j0929078n244026M31092
39940d113639M73243j740027j303189Q41413J817618K052540K428658J430741
$$ plain form
39997 -6751063 -3107533 -179634 -1201953 -4779941 -6318371 -4288518 -2799248 -6453940
39989 -6453940 -14453789 -21676327 -24125321 -21308558 -14921214 -8132988 -5089689 -7507209
39981 -7507209 -11633028 -11636176 -6222165 1042528 7702659 14431704 20242146 20801724 14807385
39972 14807385 8293980 8212051 13630229 17434784 15819067 12188479 11630049 14844138
39964 14844138 18492291 19588127 18715798 19496036 24357219 30472277 31950136 27415744
39956 27415744 22538881 22252296 23494999 20186509 13159693 9240072 11141290 14686407
39948 14686407 16757024 19173980 22169622 20640805 11628373 699295 -4544731 -4113639
39940 -4113639 -3640396 -5380423 -6683612 -5842199 -4024581 -1972041 456617 1887358
39932A887358p04483J7875M723646P790742M583470j243496l485048k394919k154614
39923I020531l016851k419556j008493r13167m74948K563148N021901K747032
39915A1519597j204818j074501R20830j901992p519087o834607M38742L719361
39907a936475r95112l905881K011282Q817988P075344J499110J819908N684277
39899B0070441L672547l331988n321230m2482M029858K108656r79483j002282
39891A9204037k8657N52320K970028N874800L529652l794765p473221l489111
39883A7345083N90278k447399q199000q514731m171009j395707m84170L087952
39875d188703Q615321R996177N533682P06758L9747J734260J885902k00331k622193
$$ plain form
39932 1887358 1182875 1200750 5924396 13715138 18298608 17055112 13570064 11175145 9020531
39923 9020531 6003680 3584124 2575631 1662464 1187516 3750664 8772565 11519597
39915 11519597 10314779 9240278 10161108 8259116 740029 -6094578 -5655836 -1936475
39907 -1936475 -2931587 -6837468 -4826186 3991802 11067146 12566256 14386164 20070441
39899 20070441 23742988 20411000 15089770 15047288 19077146 21185802 20206319 19204037
39891 19204037 19175380 19727700 22697728 28572528 32102180 28307415 20834194 17345083
39883 17345083 17935361 15487962 7288962 -1225769 -5396778 -6792485 -7276655 -4188703
39875 -4188703 4426618 14422795 19956477 20663235 20702982 22437242 24323144 24122813 21500620
39866B1500620l941662m093250l673092l111779k288253j463770k173259m926871
39858d171316o282526k253376M524087O318416J460331j974445J883827O947304
39850F452302M247105l660584o014133K32534O584897N728544M33576k450096
39842A1554145r98611J577970J860464p55449l639130l267042j39818M61171l754908
39833B898792o543621j426086O948994P992096R26326m148753k162016K56165
39825D741897k147871l696747J613003Q093326O243697k135251o099880r60436
39817E651738O558324Q357023L716494k533484n712623m467570j507269r90055
39809I072578l022742k871255J510258M691227J384894m334232m042260K528411
$$ plain form
39866 21500620 17558958 13465708 9792616 6680837 4392584 2928814 755555 -4171316
39858 -4171316 -10453842 -12707218 -8183131 -1864715 -404384 -2378829 -495002 6452302
39850 6452302 10699407 7038823 1024690 1257224 7842121 13570665 14004241 11554145
39842 11554145 10555534 12133504 13993968 13238519 9599389 6332347 6192529 6653700 2898792
39833 2898792 -3644829 -5070915 1878079 9870175 10796501 6647748 4485732 4741897
39825 4741897 2594026 -1102721 510282 8603608 14847305 12712054 6612174 5651738
39817 5651738 12210062 20567085 24283579 21750095 16037472 11569902 10062633 9072578
39809 9072578 6049836 3178581 4688839 9380066 10764960 6430728 2388468 4916879
39801D916879P250734N573450J324323j409633l661847o198369n706261o97977
39793A391299M061921L769933K75220j824402k092741k576106k623633q21629
39785d40138N09658j304537l242343m38020M788154N042172l23303l215973P08327
39776B083997N097181L185505j758722l087315k365332n329136r379616n613848
39768a7167286O280218J5149827J3332858N858802O58346k097667n064385n837217
39760A1113496k108542R62532k224669o922364l905096N685946J1094951P446827
39752B1143081J146677j414470j604061k476644l049037k097243r33241O78227
39744A1393289M820482Q864538N951645m144546j1851823j0173765l559417M32365
$$ plain form
39801 4916879 12167613 17741063 19065386 17655753 13993906 7795537 2089276 1391299
39793 1391299 5453220 9223153 9498373 7673971 5581230 3005124 381491 -440138
39785 -440138 69520 -1235017 -4477360 -4915380 -127226 4914946 4591643 1375670 2083997
39776 2083997 7181178 10366683 8607961 5520646 3155314 -2173822 -11553438 -17167286
39768 -17167286 -10887068 4262759 17595617 23454419 24112765 22015098 16950713 11113496
39760 11113496 9004954 9967486 7742817 820453 -3084643 2601303 13696254 21143081
39752 21143081 22289758 20875288 19271227 16794583 13745546 11648303 10715062 11393289
39744 11393289 16213771 25078309 31029954 26885408 15033585 4859820 1300403 1732768
39736A732768J443894K668089L685201L492842M513701O878344N050303k618541
39728B6846601p863843m576865K83740j771321n530124j661284M353306n54314
39720I525896j3070854j4900740n90359J3303757J2838596M810947J487165J119701
39712A4524109m238651j1595506j1293273l050033M333684O575405P088289Q158439
39704A0502463P910994N763986L677605J920128p39714l048829k517434n1180
39696B3418019J087343J09490j330651k572499l674334l596872k331924k437109
39688H671463m559439m453617Q36898O929882P772950M563709K771799K651038
39680B5184683n1473n063657o823331l235832J406831L326298L322345K925253
$$ plain form
39736 1732768 3176662 5844751 9529952 13022794 17536495 24414839 29465142 26846601
39728 26846601 18982758 14405893 14689633 12918312 7388188 5726904 10080210 9525896
39720 9525896 -3544958 -18445698 -19036057 -5732300 7106296 11917243 13404408 14524109
39712 14524109 10285458 -1310048 -12603321 -15653354 -11319670 -4744265 2344024 10502463
39704 10502463 18413457 24177443 27855048 29775176 29035462 25986633 23469199 23418019
39696 23418019 24505362 24614852 23284201 20711702 17037368 13440496 11108572 8671463
39688 8671463 4112024 -341593 495305 7425187 15198137 19761846 22533645 25184683
39680 25184683 25133210 20069553 13246222 10010390 11417221 14743519 18065864 20991117
39672B0991117J994923J363885K649840M117778J809845l681553o541599l753659
39664A8950577P40961J993997L9218k258489l615494m186295l863721k760760
39656E039994j476867j86675N92525q27592m163821m801510L63758N969407L816699
39647D325918m522903q491049l514107L062638M295878L458351N985245R068377
39639A3668348O850594Q77902k459141j636024o7481P86057J511941L94221l844950
39630A6081467o770852l195053L585917N214218Q50122j649791J589295M522129
39622B0227452J106938n431952p647270l643490K209624M990056K435132m337292
39614I909198j0230506r333803j818550N060318N760187L174266L096448N166090
$$ plain form
39672 20991117 22986040 24349925 26999765 31117543 32927388 29245835 22704236 18950577
39664 18950577 19691538 21685535 21724753 19466264 15850770 11664475 7800754 5039994
39656 5039994 3563127 3376452 3968977 3141385 -1022436 -5823946 -5460188 509219 4325918
39647 4325918 -196985 -8688034 -12202141 -9139503 -4843625 -1385274 4599971 13668348
39639 13668348 20518942 21396844 18937703 17301679 17234198 18020255 19532196 19926417 16081467
39630 16081467 9310615 6115562 9701479 14915697 15765819 14116028 15705323 20227452
39622 20227452 21334390 15902438 8255168 4611678 6821302 11811358 14246490 9909198
39614 9909198 -321308 -9655111 -11473661 -6413343 -653156 2521110 5617558 10783648
39606A0783648M246351r15399n639298n776699j881893L255260P135752P179567
39598A8387289K316015l550257l973109J548690N366422J581805n163360n833723
39590A0679772J15197M347446K262674q49738R44684M949550M920745J009261
39582B8379591j849978k802513m912284p050489m199548K671381N285281M92605
39574A6014046l389085J381712R620627J0529760L248597l462860m926151m834118
39566B4182528n888521n274055j811965L61617r47930j753578O67351K146978
39558A1682425j066412m579052k221435L459679M696098P91154j088582K007788
39550A3681663L698058j477706q698989r071968k091682L759954K510981k072073
$$ plain form
39606 10783648 15029999 14114600 8475302 2698603 816710 4071970 11207722 18387289
39598 18387289 20703304 17153047 13179938 14728628 20095050 21676855 16513495 10679772
39590 10679772 10794969 15142415 17405089 16555351 17500035 22449585 27370330 28379591
39582 28379591 26529613 23727100 18814816 11764327 7564779 10236160 15521441 16014046
39574 16014046 12624961 14006673 23627300 34157060 37405657 33942797 29016646 24182528
39566 24182528 18294007 13019952 11207987 11569604 10621674 8868096 9535447 11682425
39558 11682425 10616013 6036961 3815526 7275205 11971303 12762457 11673875 13681663
39550 13681663 17379721 15902015 7203026 -1868942 -3960624 -200670 2310311 238238
39542B38238k573470K100204O272456N910896L430142K672734K661391J74328
39534B0886919l325034k793968J656031K977422k333228o903888j823957R137658
39526A7477955J2267454J838290j1647589j4738218p170890O16546K477480J949213
39518C070241L243231M367071K330159m34610q1938J487912l74562m136316k989428
39509F481760M078164Q894563N552250n56550j040810K530365J925928l433925
39501B4431745m790837J766122Q233052O420344j39614k414513O86949K506194
39493C6699442R4734k014663j39588K337258m46582q997391j7101755j7353324
39485f921869q143301L910703R731090P139402K315891O85120M58362j561919
$$ plain form
39542 238238 -2335232 -235028 6037428 11948324 15378466 18051200 20712591 20886919
39534 20886919 17561885 14767917 16423948 19401370 17068142 10164254 8340297 17477955
39526 17477955 29745409 31583699 19936110 5197892 -1972998 -1356452 1121028 3070241
39518 3070241 6313472 10680543 13010702 12576092 12494154 13982066 13607504 9471188 6481760
39509 6481760 10559924 19454487 25006737 24450187 23409377 25939742 27865670 24431745
39501 24431745 19640908 21407030 29640082 36060426 35920812 33506299 34193248 36699442
39493 36699442 36794176 34779513 34639925 36977183 36530601 27533210 10431455 -6921869
39485 -6921869 -15065170 -11154467 -1423377 5716025 8031916 8717036 9175398 7613479
39477G613479k828985M0427L063862o5376o522080p210808j238795K305986p57062
39468e599352l171822O80640M825266K301408k125192M72756P846833R204778
39460A4435315J364712p176602q488432l523071K693666O970279P391941L221673
39452A6889481k325969m265452k591201k003138l556637k462329L200289P568875
39444A0453919N168860p02600k967051p88762R81662K65396l48895K37373o02785
39435A1697117l789278n509608k456064K823791M964705K677014m24523j340840
39427H642314r40991j070474j331501p19968l19532j412253k097309N16353M770648
39418F037287N222836K66273m993969n823510l993532l520797l990066k830428
$$ plain form
39477 7613479 4784494 4824921 7888783 7823407 1301327 -5909481 -7148276 -4842290 -5599352
39468 -5599352 -8771174 -8090534 -3265268 -963860 -3089052 -2616296 5230537 14435315
39460 14435315 15800027 8623425 134993 -3388078 -694412 6275867 13667808 16889481
39452 16889481 14563512 10298060 7706859 5703721 2147084 -315245 2885044 10453919
39444 10453919 15622779 14920179 11953128 11164366 12146028 12411424 12062529 12299902 11697117
39435 11697117 7907839 2398231 -57833 2765958 7730663 10407677 9983154 8642314
39427 8642314 7701323 6630849 5299348 4579380 4259848 2847595 750286 1266639 6037287
39418 6037287 11260123 11526396 6532427 708917 -3284615 -6805412 -10795478 -13625906
39410a3625906j290516k211628l498763m45136N568582P458688K876866j970183
39402g137996j273302L153345O340141O593275M282756n68098n474688n146744
39394G68689J222223O515474M773679j71057j098911J140117J4115m879635o773708
39385A510986k918542J034008K54897k136442q71692L271707N341557L568514
39377I054993J106515J535259M974632Q075048O977163J433070l844604l956238
39369B5355838q5792J751405j191601m840922m367585o40598J828849J036933
39361A8846527j197377k614699k622957j803591j407541k768419n419293o316788
39353e304138k836381L393158P188178N030458j002739n185890m163684m63739
$$ plain form
39410 -13625906 -14916422 -17128050 -20626813 -21071949 -15503367 -8044679 -5167813 -7137996
39402 -7137996 -8411298 -5257953 1082188 7675463 11958219 11390121 5915433 768689
39394 768689 1990912 8506386 13280065 13109008 12010097 13150214 13164329 8284694 1510986
39385 1510986 -1407556 -373548 -118651 -2255093 -3126785 144922 5486479 9054993
39377 9054993 10161508 11696767 16671399 24746447 31723610 33156680 29312076 25355838
39369 25355838 25270046 27021451 25829850 20988928 16621343 15980745 17809594 18846527
39361 18846527 17649150 15034451 12411494 10607903 9200362 6431943 1012650 -5304138
39353 -5304138 -8140519 -4747361 2440817 7471275 6468536 1282646 -2881038 -3344777
39345c344777R95911m26757l32340L690034P413411N830220J427898J363316O607672
39336B3224588R657472M926922l656281q640480q523895p113822o334096m486222
39328i45814p20215K789717L414580N81884l903459o464145m067101J938609N804374
39319a571570L686816j452084l883558k437101n36955l18388o82929o65163o23985
39310h484917J30171K948018O334182O562545K993086o95747j985858k578642
39302E222838l880908l235601J653548P137592P137793J577099l172378l099912
39294I340071j788580m394192r313020r867793l731401L472949N655386M142889
39286f483691M737711Q509008R939511N050847k443707n585143k543343K127672
$$ plain form
39345 -3344777 -2348866 -2775623 -3107963 582071 7995482 13825702 15253600 16616916 23224588
39336 23224588 32882060 37808982 34152701 25512221 16988326 9874504 3540408 -945814
39328 -945814 -1666029 1123688 4538268 5120152 1216693 -5247452 -9314553 -7375944 -1571570
39319 -1571570 2115246 663162 -3220396 -5657497 -6194452 -6512840 -7195769 -7860932 -8484917
39310 -8484917 -8354746 -5406728 927454 7489999 10483085 9787338 7801480 5222838
39302 5222838 1341930 -1893671 -240123 6897469 14035262 15612361 12439983 9340071
39294 9340071 7551491 3157299 -6155721 -16023514 -19754915 -16281966 -10626580 -6483691
39286 -6483691 -1745980 6763028 16702539 21753386 19309679 13724536 11181193 13308865
39278A3308865L483507J066094j817122j986523L22752J404614j783639p090347
39270F908201q777895m546516J660773N314635O383104O180865L094027l764474
39262A2452720r393890p488667N68693O939421P499185N213853L014907l70665
39254A8435557n346447p903098m828397J173485M744908L681168m91708m740684
39246D724784n624548j625170L721870M556377L02400l481190l570322l150800
39238d146599m568678m045460J305389O363323M546738j890678m923329j997012
39230i356306K426431N208374P614884J0058715R875753N552938r67263o601731
39222B3811795q641895n390564P52200L101233j258431n760987l138789K777152
$$ plain form
39278 13308865 16792372 17858466 16041344 14054821 14377573 15782187 13998548 6908201
39270 6908201 -1869694 -6416210 -4755437 559198 6942302 13123167 16217194 12452720
39262 12452720 3058830 -4429837 -3861144 3078277 10577462 15791315 18806222 18435557
39254 18435557 13089110 5186012 357615 1531100 6276008 9957176 9465468 4724784
39246 4724784 -899764 -2524934 1196936 5753313 6055713 2574523 -995799 -4146599
39238 -4146599 -8715277 -12760737 -11455348 -5092025 -545287 -2435965 -7359294 -9356306
39230 -9356306 -6929875 -1721501 5893383 15952098 25827851 31380789 30413526 23811795
39222 23811795 15169900 9779336 10531536 13632769 12374338 6613351 3474562 6251714
39214F251714K510644l532056n485173m97184K718462r66762m804852k762047
39206f567254K37212j380965k675905K653862R408042Q595306K775503J536520
39198A4582321M787183L393709m023750p665062k310893M624113M960707M91831
39190A8840159k891109l902113l506539p48976L376868L562103k520010r115356
39182C095027r925968o448168l503415r19255M043936R544166J1214053Q971015
39174A6071391N489948M47895o603549r922780l155365Q569394J1378529N37254
39166B2812717j2107621j3095164l690779M150918L680474r23449k494038J072706
39158e94236O374834Q247594L988024l703976q751968q575774p033996p948341
$$ plain form
39214 6251714 8762358 5230302 -254871 -752055 1966407 999645 -3805207 -6567254
39206 -6567254 -6330042 -7711007 -10386912 -7733050 1674992 10270298 13045801 14582321
39198 14582321 19369504 22763213 18739463 11074401 8763508 13387621 18348328 18840159
39190 18840159 15949050 12046937 8540398 7791422 11168290 14730393 12210383 3095027
39182 3095027 -6830941 -13279109 -16782524 -17701779 -13657843 -4113677 7100376 16071391
39174 16071391 21561339 22009234 15405685 5482905 2327540 10896934 22275463 22812717
39166 22812717 10705096 -2390068 -6080847 -1929929 1750545 827096 -1666942 -594236
39158 -594236 5780598 14028192 18016216 14312240 5560272 -3015502 -10049498 -17997839
39150a7997839q445208l323695N548394R989385O251506j84042k388419m0241
39142a0590159L014909N215608P118948P204478K794373m756370r612666p650186
39134g261065j057679M473097N748788L914442J174088k194048o311997q304426
39126i818800l561771P464678J5831306J1996875j925899j2086917q221327L855622
39118C533767R410374K987174n882295o058065J257987N616217J510053n459743
39110F915469o942384k343119J732945P59490k617934l519177j660028l05046
39102g979784p8597J877960O055441Q246676N539886J228541K19006J951521J940883
39093A9001533j186381m485168n654713m910268k434972J531585M368591L756214
$$ plain form
39150 -17997839 -26443047 -29766742 -24218348 -14228963 -7977457 -8161499 -10549918 -10590159
39142 -10590159 -7575250 -2359642 4759306 11963784 14758157 10001787 389121 -7261065
39134 -7261065 -8318744 -3845647 1903141 5817583 6991671 4797623 -1514374 -9818800
39126 -9818800 -13380571 -5915893 9915413 21912288 19986389 7899472 -321855 3533767
39118 3533767 12944141 15931315 10049020 3990955 5248942 10865159 12375212 6915469
39110 6915469 -26915 -2370034 -637089 122401 -2495533 -6014710 -7674738 -7979784
39102 -7979784 -8058381 -6180421 -124980 8121696 13661582 14890123 15109129 17060650 19001533
39093 19001533 17815152 13329984 7675271 2765003 330031 1861616 6230207 9986421
39085I986421K537402N141818Q926695O415200j967164n950487q23951L829070
39077B8095004j373414r663642p684260L169592P892006L79384q046191o621439
39069F147040l36626K42379m107565m254379J788372O321799M300806k70802k080765
39060G750259j942564k900612l467954K63437P178412J0479741N928537k018970
39052B1270286n088465j372451K579049P20324m710179p034283m193869R3927
39044B264339K839624M408888M484075Q18653n780815r597848o396070J011686
39036e947468O225459O032281J734872l450246n914814l447277J663353L836137
39028G32297J178131j621056l12531K471786J894989j266483k754523k291794
$$ plain form
39085 9986421 12523823 17665641 26592336 33007536 31040372 25089885 24265934 28095004
39077 28095004 26721590 17057948 9373688 12543280 20435286 20814670 12768479 6147040
39069 6147040 5810414 6052793 1945228 -2309151 -520779 5801020 10101826 9831024 7750259
39060 7750259 5807695 2907083 -560871 -297434 6880978 17360719 23289256 21270286
39052 21270286 16181821 14809370 17388419 18108743 13398564 6364281 2170412 2264339
39044 2264339 5103963 9512851 13996926 14815579 9034764 -563084 -6959154 -5947468
39036 -5947468 277991 6310272 8045144 4594898 -1319916 -4767193 -3103840 732297
39028 732297 1910428 289372 -23159 2448627 4343616 3077133 322610 -1969184
39020a969184k828121l771256j651323K474361L017208j205984m040324o60463
39012a0635086N624271Q237168N280140j58192m374140n000814j480214L542112
39004A035245N397724K379538k069212l627094j536144K187941N089473M614205
38996A3471676k98750o069813o739241j887386J729831l10073l371180j269737
38988d744673L558664L981678j26730j692843K099099N450521L018093k696941
38980H846868o043421n577469l361454p46457J447786J490001o72239j513136
38972f129521J558744N381592M779044K97924k014340J123907O011500P172706
38964A8181556L607507j682601n521461n876305k050733L489326N457916J556649
$$ plain form
39020 -1969184 -4797305 -8568561 -10219884 -7745523 -4728315 -5934299 -9974623 -10635086
39012 -10635086 -5010815 3226353 8506493 8348301 3974161 -1026653 -2506867 1035245
39004 1035245 6432969 8812507 6743295 3116201 1580057 3767998 8857471 13471676
38996 13471676 13172926 7103113 363872 -1523514 206317 -103756 -3474936 -4744673
38988 -4744673 -1186009 2795669 2668939 976096 3075195 8525716 11543809 8846868
38980 8846868 2803447 -2774022 -6135476 -6881933 -5434147 -3944146 -4616385 -6129521
38972 -6129521 -4570777 810815 5589859 5887783 3873443 4997350 11008850 18181556
38964 18181556 21789063 20106462 14585001 8708696 6657963 10147289 15605205 17161854
38956A7161854l141878j820367M137305N725423j413618j0094429j0700702l510485
38948c656897L168661M793862M185516L787010J439431l639572o625728l309779
38940A42504L218222O681760N749795L439840O12540m269893r319592q936873
38932b681697j282471P787866J0687092O030680q11200l463912J0578N761873
38924B2038809P531198K835476l982395o421889l137992J695666M601069N625511
38916C0785453M804683O84938n435104q260851n203291r90465j335340m731383
38908A0318640n633567l778526l876950o159976m448148L587287J0397763P850143
38900H256666j304967p027072n108045p27417Q22469Q10961K513140N084299N591440
$$ plain form
38956 17161854 14019976 12199609 16336914 22062337 20648719 10554290 -146412 -3656897
38948 -3656897 -488236 4305626 8491142 12278152 13717583 10078011 3452283 142504
38940 142504 3360726 10042486 15792281 19232121 19844661 15574768 6255176 -2681697
38932 -2681697 -3964168 3823698 14510790 20541470 19730270 16266358 16276936 22038809
38924 22038809 29570007 32405483 28423088 22001199 18863207 20558873 25159942 30785453
38916 30785453 35590136 36275074 30839970 22579119 17375828 16385363 15050023 10318640
38908 10318640 4685073 906547 -2970403 -9130379 -13578527 -9991240 406523 8256666
38900 8256666 6951699 -75373 -5183418 -5910835 -5088366 -4277405 -1764265 3320034 8911474
38891H911474L956924K096811J95881k435311m195729k748083Q94294L453996
38883A0130257M139268M543549M186283Q75122l839115m861094j393493M71242
38875A4252019l471136q600243p972105k289359K013066K197932R29863P3700
38867b866263j057307j714331p8080K095725J196636j257208P2053M588107M692256
38858E671588k160749p576712l917774M026974O009944Q14156l804946l186306
38850d123825N5904L094142O364271Q928574P210923Q87182n058645o735374n748212
38841D874940n017376m150801j626661J679086L894570M608618L746741N68874
38833H577991l946992o243257m274415l89344K306230M354319P846060J1551826
$$ plain form
38891 8911474 12868398 14965209 15161090 12725779 8530050 5781967 6676261 10130257
38883 10130257 14269525 18813074 22999357 23874479 20035364 15174270 13780777 14252019
38875 14252019 10780883 2180640 -5791465 -8080824 -6067758 -3869826 -2939963 -2866263
38867 -2866263 -3923570 -5637901 -5715981 -3620256 -2423620 -3680828 -3608775 979332 5671588
38858 5671588 3510839 -4065873 -7983647 -3956673 2053271 2867427 -937519 -4123825
38850 -4123825 -4067921 -973779 5390492 14319066 21529989 22417171 17358526 10623152 4874940
38841 4874940 -142436 -4293237 -5919898 -4240812 -346242 4262376 8009117 8577991
38833 8577991 4630999 -1612258 -5886673 -6276017 -3969787 384532 8230592 19782418
38825A9782418J1389915N422372l699662j0844643j1756302n900769K053034N068968
38817A1515331M67532p025571j0707540q899478m560275j91206L444343N138147
38809a0818717M082708K471079L051123M069141J260513m338852n867962n89541
38801f680508M469242J480349o627160r265901k186008P025110Q795862K694375
38793b94639l900520n364791k556948R41006L577029N637327O680371N579780
38785A0298615K820441P54024P02817J048632l76329k607431k255399J557286
38777A1942656M900901L541231j157161l322490j05176M187611L429023k102116
38769B1314479n645965k595645L300285M336999j710848q821195r463413k510812
$$ plain form
38825 19782418 31172333 36594705 32895043 22050400 10294098 4393329 6446363 11515331
38817 11515331 11982863 4957292 -5750248 -14649726 -19210001 -19401207 -15956864 -10818717
38809 -10818717 -6736009 -4264930 -1213807 2855334 4115847 -223005 -6090967 -6680508
38801 -6680508 -2211266 -730917 -7358077 -16623978 -18809986 -11784876 -2989014 -294639
38793 -294639 -4195159 -9559950 -12116898 -11175892 -7598863 -1961536 4718835 10298615
38785 10298615 13119056 13873080 14575897 15624529 15248200 12640769 10385370 11942656
38777 11942656 16843557 20384788 19227627 15905137 15799961 19987572 23416595 21314479
38769 21314479 15668514 13072869 16373154 20710153 18999305 10178110 714697 -1796115
38761a796115N857911Q025556J840808o840753q725804l69829J0849929J3716852
38753B2558555O017229k781883l589319J258613K868112j254282n001713l801141
38745A6274171n96898J78150p23986k12828J344564J261580o57690k218212k556308
38736A2092543k494112j971214j98239J902965K111934l5875k487249k996859
38728E923894j000476K127921L473874O50693m777854p626183n124876q09218
38720g162225M66288o53861q7292K537971L815069K940915K622616L244001J902977
38711I626459j337983k111960Q43192K642287K02230k158143J44109L892576L043083
38702A4785850j693805m650239m225537l422451k813791j86469K818925J025237
$$ plain form
38761 -1796115 4061796 12087352 13928160 7087407 -1638397 -2008226 8841703 22558555
38753 22558555 28575784 25793901 22204582 23463195 26331307 25077025 20075312 16274171
38745 16274171 15677273 15855423 15131437 14918609 16263173 17524753 16867063 14648851 12092543
38736 12092543 9598431 7627217 7428978 9331943 11443877 11408002 8920753 5923894
38728 5923894 4923418 7051339 10525213 11175906 6398052 -1228131 -6353007 -7162225
38720 -7162225 -6695937 -7349798 -7437090 -4899119 -1084050 1856865 4479481 7723482 9626459
38711 9626459 8288476 6176516 7019708 9661995 9864225 7706082 7850191 11742767 14785850
38702 14785850 13092045 8441806 4216269 793818 -2019973 -2206442 612483 1637720
38694A637720n597163r931608p118517p51542L131032L401478K031821l09229
38686a3506008k630367j451893M740792J1209799J1807147O693767J186012j705757
38678A6343492l281722m554350m258644j915607Q21285K725630M081331M710456
38670A4671871L641945J251997q38452k370834m238850n357814l057565K273721
38662E976019O156712N472538K263582R4876p41430j809101k656649j752667J2712
38653A3016592K84480o39796J06341L404754O478860O519028L606453q37129o072261
38644B5867322j0891352j2355484q159621j33087O148100N966236p4895n916080
38636D51139n143193K360575R302470Q562101J708522k927442j108070K369891
$$ plain form
38694 1637720 -3959443 -13891051 -21009568 -21761110 -18630078 -15228600 -13196779 -13506008
38686 -13506008 -16136375 -17588268 -12847476 -1637677 10169470 16863237 18049249 16343492
38678 16343492 13061770 8507420 4248776 2333169 3154454 5880084 9961415 14671871
38670 14671871 18313816 19565813 18727361 16356527 12117677 6759863 3702298 5976019
38662 5976019 12132731 17605269 19868851 19963727 19222297 17413196 14756547 13003880 13016592
38653 13016592 13301072 12661276 12767617 16172371 22651231 29170259 32776712 31939583 25867322
38644 25867322 14975970 2620486 -5539135 -5672222 475878 6442114 6367219 451139
38636 451139 -4692054 -2331479 6970991 15533092 17241614 14314172 13206102 15575993
38628A5575993J690678j393875j568444N68608m80387n235244p268418l031411
38620a142500K336092K663378l82038p21128K868659N864335M899272J149791
38612A7535861k475875l776814j553373K820501M679177Q92491m828645n822671
38604G470652k021024o14036n334281r946211o359111L795813J0524134P844554
38596E360490O55890k113650J478558M977030K813851k023245k304929K670208
38588A1514203N226401J27405p157851p532833p95578M801371M383240J281722
38580A1848080n24281j978194m451519n694588m023886j834793j177521j35474
38572g972176K669995M586130M230634N222965Q990450Q983364o5741j0793166
$$ plain form
38628 15575993 17266671 15872796 14304352 14872960 14392573 9157329 1888911 -1142500
38620 -1142500 1193592 3856970 3474932 2753804 5622463 11486798 16386070 17535861
38612 17535861 15059986 11283172 9729799 12550300 17229477 18121968 13293323 7470652
38604 7470652 5449628 4835592 -498689 -10444900 -16804011 -13008198 -2484064 5360490
38596 5360490 6016380 3902730 5381288 10358318 13172169 11148924 8843995 11514203
38588 11514203 16740604 16868009 9710158 2177325 1381747 6183118 10566358 11848080
38580 11848080 11323799 9345605 4894086 -800502 -4824388 -6659181 -7836702 -7972176
38572 -7972176 -5302181 -716051 3514583 8737548 17727998 26711362 26645621 15852455
38564A5852455j0742115l02371O610307J299933r115116j3004361q377166j267241
38556a9045675L623471N193768L452690L06822j59910L096323N195434K035016
38548C697939k829355l009050J033046K727820q24518n331751o241469m223267
38540a5000605j852928J012836N404491R349815R549605O351961L766486L705752
38532B2287413K984892j637845p254785p595622k308685J233776j639153m944044
38524A125947k94247R233267J1429139K322639o767245m131193O523444J1758794
38516C1200545O145191l135812q035643q348195p437487n896518l069646p83061
38508F39374j329976l301349k698811J941362P471826R478523O835617K565028
$$ plain form
38564 15852455 5110340 4807969 11418276 12718209 3603093 -9401268 -17778434 -19045675
38556 -19045675 -15422204 -10228436 -6775746 -6468924 -6628834 -3532511 1662923 3697939
38548 3697939 868584 -2140466 -1107420 1620400 795882 -4535869 -10777338 -15000605
38540 -15000605 -16853533 -15840697 -10436206 -1086391 8463214 14815175 18581661 22287413
38532 22287413 25272305 23634460 16379675 8784053 6475368 7709144 6069991 1125947
38524 1125947 831700 10064967 21494106 23816745 17049500 12918307 19441751 31200545
38516 31200545 37345736 34209924 26174281 17826086 10388599 4492081 1422435 639374
38508 639374 -690602 -3991951 -6690762 -4749400 2722426 12200949 19036566 21601594
38500B1601594J94765l32312j991495n643978p758741n086509P4045K411778Q90772
38491D359919M4964L264469P850926Q486217L684475k928728o631928n646713
38483A2483601k034446M80252N8285j684905k274626j794620j925114k292251
38475A016176q46869J789178J937670j571524m814271m332370k314671k683704
38467a1820385m312223k773281J949298M497278J921773j834160j611768J744196
38459a2239272K857476p58889n357955n112313J535456R719183J2372966P504292
38451A0520944Q89732m16501L018818L940404r49166n809433m347618M74730R95570
38442H317480l256479n141940j338620K999307L229154K168712L754925N230386
$$ plain form
38500 21601594 21796359 21464047 19472552 13828574 6069833 983324 1057369 3469147 4359919
38491 4359919 4404883 7669352 15520278 24006495 27690970 24762242 18130314 12483601
38483 12483601 10449155 10929407 10987692 9302787 7028161 5233541 3308427 1016176
38475 1016176 169307 1958485 3896155 2324631 -2489640 -6822010 -9136681 -11820385
38467 -11820385 -16132608 -18905889 -16956591 -12459313 -10537540 -12371700 -13983468 -12239272
38459 -12239272 -9381796 -10140685 -15498640 -20610953 -19075497 -9356314 3016652 10520944
38451 10520944 11410676 10994175 14012993 17953397 17004231 11194798 6847180 7321910 8317480
38442 8317480 5061001 -80939 -1419559 1579748 4808902 6977614 10732539 15962925
38434A5962925J733126m572736o490747j869240L917089N412146K221291l185968
38426A3127886p909441q357814k477405O243254J1004657R456751N752164L902435
38418C0742487L247505J948648L81397j268129m254816p101501m801738L467923
38410B2361776R793263O300230l820018r848625p136332j570244k38003k864185
38402A2977862m209474j149695M779271R535257R611589M542401k417273o997234
38394B6672704p573803n421167k297992L44527O72624k190819n962639o653761
38386b410326k697816L836508R678507J2119100R386004K322934m560853o893877
38378B0780181n431092m162890l670364o98112M800128P348780L732663j138564
$$ plain form
38434 15962925 17696051 13123315 6632568 4763328 8680417 14092563 16313854 13127886
38426 13127886 5218445 -3139369 -5616774 626480 11631137 21087888 26840052 30742487
38418 30742487 33989992 35938640 36320037 35051908 30797092 23695591 18893853 22361776
38410 22361776 32155039 38455269 34635251 24786626 17650294 16080050 15842047 12977862
38402 12977862 8768388 7618693 12397964 21933221 31544810 36087211 33669938 26672704
38394 26672704 19098901 13677734 11379742 11724269 12396893 10206074 4243435 -2410326
38386 -2410326 -5108142 -1271634 8406873 20525973 29911977 32234911 27674058 20780181
38378 20780181 15349089 11186199 7515835 6817723 11617851 18966631 22699294 21560730
38370B1560730o70140L805841N155630J251516j951511N18081N237867N346138
38362D0254152J81125m123872l206437P0961O1587m288861q773723r458823o426077
38353D290032k083848J933751N225454P469622Q089510O698383L566399J60299
38345C5349602j200779L26130K314998J563581j494818l202964j949736k46520
38337C1459494m75165j556423j671081j465306k129186k661838j635281K96398
38329B0161612J922447L314464M034587K408669q17078j550788J482278L427724
38321C4383915O37111k624923q15923K988188J529688m194440n622996l8419N160638
38312C1402839L712544j324899l786711k764396j230846q99471j539120k026750
$$ plain form
38370 21560730 20890590 24696431 29852061 31103577 29152066 29670147 34908014 40254152
38362 40254152 40435277 36311405 33104968 33175929 33237516 28948655 20174932 10716109 4290032
38353 4290032 2206184 4139935 9365389 16835011 24924521 31622904 35189303 35349602
38345 35349602 34148823 34474953 36789951 38353532 36858714 33655750 31706014 31459494
38337 31459494 30984329 29427906 27756825 26291519 24162333 21500495 19865214 20161612
38329 20161612 22084059 25398523 29433110 31841779 31024701 29473913 30956191 34383915
38321 34383915 35021026 32396103 31580180 34568368 36098056 31903616 26280620 26242201 31402839
38312 31402839 35115383 33790484 30003773 27239377 26008531 25109060 23569940 21543190
38304B1543190m90848L146285M774434J161083l181226j129178N042278N642701
38296C6508719p37301l646313K863491J0420716R558379L592040P67396M07584
38288E9734711k951302p474730p058720k841340j119247j983587j63008M087193
38280D0229970M926877J611964j90577J561518K704487J387340P00233J248676
38272E4180488n57190m480477m729866M91532M838405L035899j803781l861516
38264D7113494k314940K57942K408454L305919K005885K64228J796755N961698
38256F0799435O904123K222311k402105j382674K285305J692486l824145q182440
38248E8112296o645181l81352O004115Q341866N332439j49372k937590p79616
$$ plain form
38304 21543190 21052342 24198627 28973061 30134144 26952918 25823740 30866018 36508719
38296 36508719 35771418 32125105 34988596 45409312 54967691 58559731 59327127 59734711
38288 59734711 56783409 49308679 42249959 39408619 38289372 36305785 36142777 40229970
38280 40229970 45156847 46768811 46578234 48139752 50844239 52231579 52931812 54180488
38272 54180488 53623298 49142821 44412955 44904487 49742892 52778791 50975010 47113494
38264 47113494 44798554 45056496 47464950 50770869 52776754 53040982 54837737 60799435
38256 60799435 67703558 69925869 67523764 66141090 68426395 70118881 66294736 58112296
38248 58112296 51467115 51085763 57089878 65431744 70764183 70614811 67677221 66897605
38240F6897605L165992M355557K010863j059137k280987j565899p64122j562336
38232F9197536k995823j561741M268503J0562495J1923174Q236143L872833J052711
38224A04555831j295261k442232N06081O668366J0443223Q341878K347402m335572
38216A24789716r604620j0162422m003945L184726K139387o322248j0061862k544401
38208H7414331P602781J0176696P893624Q659036J0891979P646035O25371j743692
38200A39166161J625315L349487L92234j981344j44410K851511L951107M152321
38192A53362382M138588K882816K194744N652075J1096596J1146132L761538m033452
38184A90201419n728245k683150Q50486M017641P072557Q184368O726165N653263
$$ plain form
38240 66897605 70063597 74419154 76430017 75370880 73089893 71523994 70759872 69197536
38232 69197536 66201713 64639972 68908475 79470970 91394144 99630287 103503120 104555831
38224 104555831 103260570 100818338 101324419 107992785 118436008 126777886 129125288 124789716
38216 124789716 115185096 105022674 101018729 104203455 106342842 100020594 89958732 87414331
38208 87414331 95017112 105193808 113087432 121746468 132638447 140284482 140909853 139166161
38200 139166161 140791476 144140963 144533197 142551853 142407443 145258954 149210061 153362382
38192 153362382 157500970 160383786 162578530 168230605 179327201 190473333 194234871 190201419
38184 190201419 184473174 181790024 182640510 186658151 193730708 201915076 208641241 214294504
38176B14294504O825849P467569M671445L02042j664342m9809L509497O632431
38168B41989186O669083K567646k155832k152886K551521O422617O836567P141286
38160B69869188R199446R403663N951667L618631N880589Q078814N019621M53149
38152C17474768J320007O285013Q446861P097297P672951J0629117R851002L904672
38144C72681688J04776L372428Q028287O134991o74740l698272O45509O480856
38136C93075523O388348k0230o571569p713989l835486M16947J993669K027177
38128C85760390K349186J962753q09574m623788o834696p719592r168840r856683
38120C51059156o443478j93243K609600r35133n739838n618011j442865J149937
$$ plain form
38176 214294504 221120353 228587922 233259367 233561409 231897067 231847258 235356755 241989186
38168 241989186 248658269 251225915 249070083 246917197 249468718 255891335 262727902 269869188
38160 269869188 279068634 288472297 294423964 298042595 303923184 312001998 317021619 317474768
38152 317474768 318794775 325079788 333526649 340623946 348296897 358926014 368777016 372681688
38144 372681688 372786464 376158892 384187179 390322170 389647430 385949158 386594667 393075523
38136 393075523 399463871 399443641 392872072 385158083 381322597 381739544 383733213 385760390
38128 385760390 388109576 390072329 389262755 384638967 377804271 370084679 360915839 351059156
38120 351059156 344615678 344422435 347032035 346096902 340357064 334739053 333296188 334446125
38112C34446125l21854l544415o131224p895692q778499q053679o024603m038032
38104B89658127k724186k384364m561468j0151231j5906394j6351037j0388741
38097B27190706l096489M53864K35929j582750m982613j0090549j3483621j1334104
38089A83310373n498222j744211j616229q19213L025216O019026M228794j66830
38081A86738704l095071n286330r482702j3583712j2934297q417618n539736n155717
38073A23243521k239524M213169P390744K823512m001082n629401l042813j743960
38065A21014166j961432n59274L37230m229428j1593017j2665032n358163J465342
38057H6450392P15142l568439m018727q41913P01719q09858k399029k095025J17231
$$ plain form
38112 334446125 334124271 330579856 324448632 316552940 307774441 299720762 293696159 289658127
38104 289658127 286933941 284549577 279988109 269836878 253930484 237579447 227190706
38097 227190706 224094217 224548081 224784010 223201260 218218647 208128098 194644477 183310373
38089 183310373 177812151 176067940 174451711 173632498 176657714 182676740 186905534 186738704
38081 186738704 183643633 178357303 168874601 155290889 142356592 133938974 128399238 123243521
38073 123243521 121003997 125217166 132607910 135431422 131430340 125800939 122758126 121014166
38065 121014166 119052734 118493460 118830690 114601262 103008245 90343213 84985050 86450392
38057 86450392 87165534 83597095 79578368 78736455 79438174 78628316 76229287 74134262 74251493
38048G4251493M251902Q641504Q867488L144304l575525n742529n024131o537326
38040G8277180r617676q940149l620016J815924N327104Q967421J1833935R065886
38032I3109609M07629p106517q513465o984639o838101o503928l232561O07168
38024E4945195J683198J769226L597661M472823P64394m220213m289550n14332
38016E8208402M14902k601848l482854M39994L892504K240174k019025m645088
38008E2447161n783455o779447n796021j211418M174012O665361O569038N713609
38000E5998840L173846j935121n905956m078018J888665N244230K612530k810300
37992E4188716o386438o223480k139069M716069R657043O596831m106333j2915326
$$ plain form
38048 74251493 78503395 87144899 96012387 99156691 95581166 89838637 84814506 78277180
38040 78277180 68659504 59719355 56099339 57915263 63242367 72209788 84043723 93109609
38032 93109609 93517238 86410721 77897256 70912617 64074516 57570588 54338027 54945195
38024 54945195 56628393 58397619 61995280 66468103 67232497 63012284 58722734 58208402
38016 58208402 58623304 56021456 52538602 52978596 56871100 59111274 57092249 52447161
38008 52447161 46663706 39884259 34088238 32876820 37050832 43716193 50285231 55998840
38000 55998840 59172686 57237565 51331609 47253591 49142256 54386486 56999016 54188716
37992 54188716 47802278 41578798 39439729 44155798 53812841 60409672 56303339 43388013
37984D3388013j0554055P47946R354816P778142L40430m237277m107875m166005
37976C8544135o627423p492208l745394J098602K384820J550112K915518N533626
37968C4161788M358355q35438m012419j688346K550610M531656M941635N150617
37960D9158458L082341k104934n750392l704212P01891J566978l01601N15344
37952D3163873M285979N545314K331003q43021p63194j58837j960742m090125
37944D7510250l514756j691215k032637m241247m791572k033117K017192M691393
37936C5914291N533403N967164O995302P481922N069939o18079o436798q718956
37928E1188188p225378m501386k044859O39440L480741M847989L572473K41889
$$ plain form
37984 43388013 32833958 33581904 42936720 50714862 51055292 46818015 42710140 38544135
37976 38544135 31916712 24424504 20679110 21777712 24162532 25712644 28628162 34161788
37968 34161788 38520143 37684705 33672286 31983940 34534550 39066206 44007841 49158458
37960 49158458 52240799 50135865 44385473 40681261 41383152 42950130 42648529 43163873
37952 43163873 47449852 52995166 55326169 54483148 53719954 53561117 51600375 47510250
37944 47510250 43995494 42304279 40271642 36030395 31238823 29205706 31222898 35914291
37936 35914291 41447694 47414858 54410160 61892082 66962021 66343942 59907144 51188188
37928 51188188 43962810 39461424 37416565 38056005 41536746 46384735 49957208 50199097
37920E0199097l647545o382167o333472l384044L21838K605297L399752L233092
37912D0011848J391442k113085m844859n177241m937645n375702l538907K347520
37904A7763371O994927M520024j167211p90770N884381R336316N444470J594228
37896D9579736L723932O441971K330272o090980j0881145r936583o783972l273407
37888B5109824O90098L236813K732117J517561K026286J896265j678681n817457
37880B9712826o082730l811980k933840k168505K367317Q509725R618675M447192
37872C9658680j477120m402992n676731o154735m070131M5812K293022J325705
37864B1541510M82236K078350L782001K488432j627747o191809q800803p673404
$$ plain form
37920 50199097 46551552 40169385 33835913 30451869 30773707 33379004 36778756 40011848
37912 40011848 41403290 39290205 34445346 29268105 24330460 18954758 15415851 17763371
37904 17763371 24758298 29278322 28111111 27320341 33204722 42541038 47985508 49579736
37896 49579736 53303668 59745639 62075911 55984931 45103786 35167203 28383231 25109824
37888 25109824 25799922 29036735 31768852 33286413 35312699 37208964 35530283 29712826
37880 29712826 23630096 19818116 16884276 14715771 17083088 25592813 35211488 39658680
37872 39658680 38181560 33778568 28101837 21947102 17876971 17922783 20215805 21541510
37864 21541510 22023746 24102096 27884097 30372529 28744782 22552973 13752170 6078766
37856F078766l139332J554777L699418M221916M238260J413397m912460q084643
37848E070099j655543Q799975J0790047K651764l610012j66655N667760L727126
37840C1274561m133332q785086p362601m060430j186252K787339P732199J0717194
37832B6983592J0047014O336228O25746n128590p512665n312925k047617j403544
37824B2587239k071908o77461K259006L374872J937874K48189l76106m91177n12858
37815B6277670j022246l566881p699014q983009m166586K930539N337034K252233
37807A1359740k68848J691240M883778M482390J004760r09923J255234N096913
37799B8595284O262897L115901j620776l786650k230009L56121R73691p58215
$$ plain form
37856 6078766 2939434 4494211 8193629 12415545 16653805 18067202 13154742 5070099
37848 5070099 3414556 12214531 23004578 25656342 22046330 21879675 27547435 31274561
37840 31274561 27141229 18356143 10993542 6933112 5746860 8534199 16266398 26983592
37832 26983592 37030606 43366834 43992580 38863990 31351325 26038400 23990783 22587239
37824 22587239 20515331 19837870 22096876 25471748 27409622 27657811 27281705 26790528 26277670
37815 26277670 25255424 21688543 13989529 5006520 839934 3770473 9107507 11359740
37807 11359740 11090892 12782132 17665910 22148300 23153060 22243137 23498371 28595284
37799 28595284 34858181 37974082 36353306 32566656 30336647 30692768 31666459 30908244
37791C0908244l491099n933531o906626n738981l753467l256492m013658l292174
37783e477784n45332J192882K64287r84923q42930j263510k929400j886848L869822
37774h603736Q385199M776721m027580q281267m145967K863059O640800O366978
37766C974207L514875n37719k752675k25300M497027N091344J94392m517234m699719
37757D539198k623443j938924k414366k772608l847418n376887l943135J986550
37749a6391033Q383523J0532290Q361232L908585k383487q861200j0476914m957338
37741a1884342J972936L536375J740548L674866R403343J1211292N717944p63963
37733B4608999k029322q67404l320984q420405r677342n154206j79116P51939
$$ plain form
37791 30908244 27417145 21483614 14576988 8838007 5084540 1828048 -2185610 -5477784
37783 -5477784 -6023116 -4830234 -4565947 -5550870 -6393800 -7657310 -10586710 -12473558 -8603736
37774 -8603736 -218537 4558184 530604 -7750663 -11896630 -9033571 -2392771 3974207
37766 3974207 7489082 6951363 4198688 3973388 8470415 13561759 13756151 9238917 4539198
37757 4539198 1915755 -23169 -2437535 -5210143 -9057561 -14434448 -18377583 -16391033
37749 -16391033 -8007510 2524780 10886012 14794597 12411110 3549910 -6927004 -11884342
37741 -11884342 -9911406 -6375031 -4634483 -959617 8443726 19655018 25372962 24608999
37733 24608999 22579677 21712273 18391289 9970884 293542 -4860664 -5039780 -4287841
37725d287841M9795K343647O561054O589462j42252p933053q755946j714295N831220
37716a458209O714927J408937l923851m854514k201295P26529J763139N19476
37708a304861k330763n005955m969448r95397M842286Q059321N510750j301479
37700B504454o985928p219620l182717j00714r46780l011803j968658K113762
37692a8798004N162216M875078L227691K760390L182037K963626J810121k24930
37684D958225l609470o864507n796181R30938P166991N320107l005895p791261
37676h691053l513371L973301O341488L543067J099894P58525k3519j529484j381001
37667E77847k37929j578536m988555n443953r29691M311430O019268M608404J694444
$$ plain form
37725 -4287841 -4238046 -1894399 4666655 11256117 11113865 3180812 -5575134 -7289429 -1458209
37716 -1458209 5256718 6665655 2741804 -2112710 -4314005 -3587476 -1824337 -1304861
37708 -1304861 -3635624 -8641579 -13611027 -14606424 -9764138 -1704817 3805933 2504454
37700 2504454 -4481474 -11701094 -14883811 -14984525 -15931305 -18943108 -20911766 -18798004
37692 -18798004 -13635788 -8760710 -5533019 -2772629 409408 3373034 5183155 4958225
37684 4958225 1348755 -5515752 -11311933 -10380995 -3214004 2106103 -899792 -8691053
37676 -8691053 -12204424 -8231123 -1889635 1653432 2753326 3511851 3488332 1958848 577847
37667 577847 339918 -1238618 -6227173 -11671126 -12600817 -8289387 -2270119 2338285 4032729
37658D032729k896580p896033r424133o593175l735495l363341j771721L743813
37650b7903936Q261540O086687M85330n04638M243289Q399981P943962M657569
37642A1669784P05956l339779n221451k712538Q46373m14699n344569o286558
37634a0097481p94518M388218L685491q8037k349074l460972m080982p26048P371933
37625f151470J2491669P459160k874018p192385l045243J206414n92118n206119
37617c904110p311923o920121o179134m146271P85547O366997Q674887P348991
37609e285137N211328L549001J085661k412545m736813m584444l780154m165601
37601a5118704m058258o66181M593541O566847L097972j613750k273850J119543
$$ plain form
37658 4032729 1136149 -6759884 -16184017 -22777192 -26512687 -29876028 -31647749 -27903936
37650 -27903936 -19642396 -13555709 -13070379 -13575017 -9331728 -931747 7012215 11669784
37642 11669784 12375740 9035961 3814510 1101972 1948345 1533646 -3810923 -10097481
37634 -10097481 -10891999 -6503781 -2818290 -2906327 -5255401 -8716373 -12797355 -13523403 -6151470
37625 -6151470 6340199 13799359 10925341 3732956 687713 1894127 1302009 -3904110
37617 -3904110 -11216033 -18136154 -24315288 -28461559 -27676012 -21309015 -12634128 -5285137
37609 -5285137 -73809 3475192 4560853 2148308 -2588505 -7172949 -10953103 -15118704
37601 -15118704 -19176962 -19843143 -15249602 -8682755 -5584783 -7198533 -9472383 -8352840
37593h352840M339004M446647J742816k087480m942389m834571k300330p29669
37585a2718812j331300j04350N864429J1379371Q536729j547526r032772q171906
37577g126137l432673j057788q27903N97970L274030M616134L084776j097528
37569a969119n664045n981967J79609O967544O036672p70921k284750N468790
37561A981813J2437645R425303J153803k669922j526622p83944j042461l76494
37553A8599121j441072o045689p772332j338355N150313K84814j1177621j3296646
37545a7037467k941656O148618N400824K403086M650714O427963N22932p920122
37537b345108r155082k988120L578789O849382O805345K691126l930458o651486
$$ plain form
37593 -8352840 -4013836 432811 2175627 88147 -4854242 -9688813 -11989143 -12718812
37585 -12718812 -14050112 -14154462 -8290033 3089338 11626067 10078541 1045769 -7126137
37577 -7126137 -10558810 -11616598 -12444501 -11846531 -8572501 -3956367 -871591 -1969119
37569 -1969119 -7633164 -13615131 -13435522 -6467978 -431306 -1202227 -3486977 1981813
37561 1981813 14419458 23844761 24998564 22328642 20802020 20018076 18975615 18599121
37553 18599121 17158049 11112360 3340028 2001673 7151986 7436800 -3740821 -17037467
37545 -17037467 -19979123 -13830505 -8429681 -6026595 -1375881 5052082 5575014 -2345108
37537 -2345108 -11500190 -14488310 -10909521 -4060139 2745206 5436332 1505874 -5145612
37529e145612k401256K276006N56125l629909k220392L252126M165025p91326
37521c939213l402990J187512P534181Q054409K370716l751562n025752r73909
37513B053392L716237L299634k301735o551422m784268n40398P38146M86083L036734
37504h47597N997293L228478l383858m541260K196173P454348L410057n063553
37496H450081q073090m226151j96062J66007q6509K601440O648618P487115L174868
37487A5946317l296954p022411o354306m272876l651864k928469N62684M506548
37479f511331L971141M8300j8520O117606J0685938O459931j926294l783991K842533
37470A7885313R040169P475919O26513m873669o565659n959941m180778j652249
$$ plain form
37529 -5145612 -7546868 -5270862 -4714737 -8344646 -10565038 -7312912 -3147887 -3939213
37521 -3939213 -7342203 -6154691 1379490 9433899 11804615 8053053 3027301 2053392
37513 2053392 5769629 9069263 6767528 216106 -4568162 -5108560 -4370414 -3884331 -847597
37504 -847597 5149696 8378174 4994316 453056 2649229 10103577 13513634 8450081
37496 8450081 376991 -3849160 -4045222 -3879215 -3965724 -1364284 5284334 12771449 15946317
37487 15946317 12649363 5626952 -727354 -5000230 -8652094 -11580563 -11017879 -6511331
37479 -6511331 -2540190 -2491890 -2510410 3607196 14293134 20753065 18826771 15042780 17885313
37470 17885313 26925482 34401401 35027914 30154245 23588586 17628645 13447867 11795618
37462A1795618J26019n864p63462m93153m45043l115813p596158r445353o035964
37453a5979173j18091L005080Q87003m000554o837085m960865n80041J407033
37445b7176693n89005k122462J503856P547820Q223562J905099k950764J224283
37437a2434304R906105J1617847K695032q549333j2291248o816353K758422J0206481
37429b907351J1175238N388123j640502l060918Q15216K480248j971034o929619
37421C349401n969368j569376m48640k737531k679739J404843M773060M152715
37413B75365J984558J468788K218366K422386J488370o13218l104063l031472
37405C109080J604565O725557N297577k674672q529614o242551l65040J390217
$$ plain form
37462 11795618 11921637 11915773 11152311 10659158 10214115 7098302 -497856 -9943209 -15979173
37453 -15979173 -16097264 -13092184 -12205181 -16205735 -23042820 -28003685 -28583726 -27176693
37445 -27176693 -27765698 -29888160 -28384304 -20836484 -12612922 -10707823 -13658587 -12434304
37437 -12434304 -2528199 9089648 11784680 3235347 -9055901 -15872254 -13113832 -2907351
37429 -2907351 8267887 13656010 12015508 8954590 9769806 12250054 10279020 3349401
37421 3349401 -2619967 -4189343 -4637983 -7375514 -10055253 -8650410 -3877350 275365
37413 275365 2259923 3728711 5947077 8369463 9857833 9244615 6140552 3109080
37405 3109080 4713645 11439202 16736779 14062107 5532493 -710058 -1075098 315119
37397C15119r89407j948752k98787k81032l320199n221353l246703p76105j809555
37388a7576774m444481l861809l3954J978598k57069k584542l49256M417177N840859
37379a6871251L143463J782107M473710O220212K057426m232743m805204R38142
37371g294138O042356O410350M694713K952567j065150p121356r126120m048665
37363h555443J345818n95908o753590q022615l231749J70184j103634j475807
37355b8222744L210219Q397043Q090726L832016J445958K617906M546212N373987
37347I291323N293278L892444P70343k111373k572687k049029l490833n870152
37339C153314m973294j81941L671829K897439J1362k32061K444590L871423J148840
$$ plain form
37397 315119 -674288 -2623040 -2921827 -3202859 -6523058 -11744411 -14991114 -15767219 -17576774
37388 -17576774 -22021255 -25883064 -25917018 -23938420 -24195489 -26780031 -27129287 -22712110 -16871251
37379 -16871251 -13727788 -11945681 -7471971 -1251759 805667 -3427076 -8232280 -7294138
37371 -7294138 -1251782 5158568 9853281 12805848 11740698 4619342 -4506778 -8555443
37363 -8555443 -7209625 -7805533 -14559123 -22581738 -25813487 -25643303 -26746937 -28222744
37355 -28222744 -25012525 -16615482 -8524756 -4692740 -3246782 -628876 3917336 9291323
37347 9291323 14584601 18477045 19247388 17136015 14563328 12514299 9023466 3153314
37339 3153314 -1819980 -2001921 1669908 4567347 4578709 4346648 6791238 10662661 11811501
37330A1811501l958550p169218n898844j498138K070573K259189P19290Q21899
37322h42298K494262K127640j382407l789523j392190L029763M186234K281607
37314F713088J969478L878448L054332k645571q052487p719515l239228J47620
37306e893835P71223K62426q51095k368392j504361L649440Q852082P718867J030333
37297A1666688l635206k395872M46960K9357k658283m627912n618373n139726
37289a1932367n7230R377727J5057979R381344l554861j1513564q657025r07122
37281b805119L457973K786023J40542k209692l346591k420084l0197J289931L58717
37272b778497o76077N86134L579975O039036O417171L943414r55661m854893l439772
$$ plain form
37330 11811501 7852951 683733 -5215111 -6713249 -4642676 -2383487 -1664197 -842298
37322 -842298 1651964 3779604 2397197 -1392326 -2784516 245247 4431481 6713088
37314 6713088 8682566 12561014 15615346 12969775 4917288 -2802227 -6041455 -5893835
37306 -5893835 -5122612 -4860186 -5711281 -8079673 -9584034 -5934594 2917488 10636355 11666688
37297 11666688 8031482 5635610 6082570 6111927 3453644 -1174268 -6792641 -11932367
37289 -11932367 -11989597 -2611870 12446109 21827453 18272592 6759028 -1897997 -2805119
37281 -2805119 652854 3438877 3579419 1369727 -1976864 -4396948 -4427145 -3137214 -2778497
37272 -2778497 -3454574 -2868440 711535 6750571 13167742 17111156 16155495 11300602 7860830
37263G860830K196700N020842J174131m067578m013583p21904j092385n069546
37255A287507n610177m42253M263362M033557K160152J961327M32452m676526
37247C409401p863883l604660L299489L643216k208820m943311l17721N872671
37239b713618P597410N211160M75739o777166j3497710j2643819k949246O417735
37231a8879515O789409J042970j972340J15652K730918L227776L281003L634251
37223b9876K631569P4283j843146j317315K160647P819978J1678404Q268748j297512
37214B8145780p351168l986550J015599l052753j2702863j4559348n568875K896715
37206a5163463K729914p03978k5217L111538M282270M572328N784206M846706
$$ plain form
37263 7860830 10057530 15078372 16252503 12184925 8171342 7449438 6357053 1287507
37255 1287507 -4322670 -4764923 -501561 3531996 5692148 7653475 8085927 3409401
37247 3409401 -4454482 -8059142 -4759653 -1116437 -3325257 -8268568 -8586289 -2713618
37239 -2713618 4883792 10094952 10570691 3793525 -9704185 -22348004 -25297250 -18879515
37231 -18879515 -12090106 -11047136 -13019476 -12903824 -10172906 -6945130 -3664127 -29876
37223 -29876 2601693 2675976 832830 -484485 1676162 9496140 21174544 29443292 28145780
37214 28145780 20794612 16808062 17823661 14770908 2068045 -12491303 -18060178 -15163463
37206 -15163463 -12433549 -13137527 -13162744 -10051206 -5768936 -1196608 4587598 9434304
37198I434304j5698l950903l065413j247937k744581m380266k654724j855784
37190a0481002n944926q475982j637867R028966J1150277M553289J167228N818023
37182E178006R717924N937874L0473j990M309317N846252J959577m277245q513338
37173B0186850p523036j365064M574781M223424q35492k849432Q02796M002396
37165B1217223J794415k740548m741995m233750k574870J508905P464958R915908
37157B7610246N465136j782090o181815p664301q293302o594417j052002M650052
37149F157507N767530K971825j92608k865786n027989m322088n82536N81351m520021
37140b032815j0075915q341168j508206K288697K144341M013400Q419623Q978005
$$ plain form
37198 9434304 9418606 5467703 2402290 1154353 -1590228 -5970494 -8625218 -10481002
37190 -10481002 -16425928 -24901910 -26539777 -17510811 -6360534 -1807245 -640017 5178006
37182 5178006 14895930 20833804 20864277 20862287 25171604 31017856 32977433 28700188 20186850
37173 20186850 12663814 11298750 15873531 20096955 19261463 16412031 17214827 21217223
37165 21217223 23011638 20271090 15529095 11295345 8720475 10229380 17694338 27610246
37157 27610246 33075382 31293292 25111477 17447176 9153874 2559457 1507455 6157507
37149 6157507 11925037 14896862 14704254 11838468 6810479 2488391 1905855 2487206 -2032815
37140 -2032815 -12108730 -20449898 -21958104 -19669407 -17525066 -13511666 -5092043 3885962
37132C885962M253516J006508K571491L075365k185214q219925p801255j809774
37124e223326L327630M294184K166658j240999l755527k763512J054177K943538
37116H02823R39608l9681M258344R181499O769469k187216q571573p666403m721952
37107a235082n345714o204663n33999R960021J5072814R031611j490992n831858
37099A3422138k812028m77594k990566m441999J032303Q597101Q575478M27630
37091B1332463o146504m160675K775307O875280N148281p5947n018539o474129
37083A4255537l686449k06965m58516l244076l040350R14822K435353j971644
37075D997712p003108o258337j090459K910734L786843K583482o45203m466479
$$ plain form
37132 3885962 8139478 9145986 11717477 14792842 12607628 4387703 -3413552 -5223326
37124 -5223326 -1895696 2398488 4565146 3324147 -431380 -3194892 -2140715 802823
37116 802823 1742431 1702750 5961094 15142593 21912062 19724846 11153273 3486870 -1235082
37107 -1235082 -6580796 -12785459 -13319458 -3359437 11713377 20744988 19253996 13422138
37099 13422138 10610110 10132516 7141950 2699951 3732254 12329355 20904833 21332463
37091 21332463 15185959 11025284 13800591 20675871 25824152 25748205 20729666 14255537
37083 14255537 10569088 10362123 9903607 6659531 3619181 4534003 6969356 4997712
37075 4997712 -2005396 -8263733 -9354192 -6443458 -2656615 -73133 -718336 -5184815
37067e184815m009329K032551O162041J541117o370923o410694J844737P752315
37059b643000N512832M98891j872791l604715o652019o957681j654284M542566
37051a2830201N994581L850839J800932n61389m241986n601804j480316L927530
37043i141814M231192M52543j151274J040526L030042K850683K417579K181424
37035E910901N90465r35383Q65024M140381K792054l910436q991422p638827l301829
37026a0479072o60188J301255M496336N706102J817672k901243k184294J646314
37018a257118K67182p461199j2458320p793573K111338Q046885O904246K114776
37010i525783k479846m114536L05040J0514690J8618850J5321072K163559q162923
$$ plain form
37067 -5184815 -9194144 -7161593 -999552 541565 -5829358 -12240052 -10395315 -2643000
37059 -2643000 2869832 3368723 1495932 -2108783 -8760802 -15718483 -17372767 -12830201
37051 -12830201 -6835620 -2984781 -1183849 -1745238 -5987224 -11589028 -13069344 -9141814
37043 -9141814 -4910622 -4458079 -5609353 -4568827 -1538785 1311898 3729477 5910901
37035 5910901 6501366 5565983 6431007 10571388 13363442 9453006 461584 -7177243 -10479072
37026 -10479072 -11139260 -9838005 -5341669 364433 2182105 -719138 -2903432 -1257118
37018 -1257118 -989936 -8451135 -20909455 -28703028 -26591690 -18544805 -11640559 -9525783
37010 -9525783 -12005629 -16120165 -15815125 -5300435 13318415 28639487 30803046 22640123
37002B2640123o887752L09554K285595k242881n029290k016644J421977N66096
36994A1046778r36637J793946N546547L544548l443828p659028n679161k439632
36986A773533k395492k879480J23123M264389M001875p37133m086543k273007
36978b208735J854280L244126P49575k656421m016579l039335j226259R9615L38459
36969f861274r29470l455093m831162j466001O643891J3152810J0841155M98938
36961A3593794q813322r741338l984836J804199L847404K239013k086064o725816
36953i866966o634042P20236R633260J1117709M168109k930050l712521r36352
36945A559383o67248l601499n729814m449959n69999L537212M919882J524626
$$ plain form
37002 22640123 15752371 16061925 18347520 16104639 11075349 9058705 10480682 11046778
36994 11046778 10110141 11904087 17450634 20995182 17551354 9892326 4213165 1773533
36986 1773533 -621959 -3501439 -3378316 886073 4887948 4150815 64272 -2208735
36978 -2208735 -354455 2889671 3639246 982825 -3033754 -6073089 -7299348 -7199733 -6861274
36969 -6861274 -7790744 -11245837 -16076999 -17543000 -10899109 2253701 13094856 13593794
36961 13593794 4780472 -4960866 -8945702 -7141503 -3294099 -1055086 -3141150 -9866966
36953 -9866966 -16501008 -15780772 -6147512 4970197 9138306 6208256 2495735 1559383
36945 1559383 892135 -2709364 -8439178 -12889137 -13459136 -9921924 -5002042 -3477416
36937c477416m304369o106954o21479O920071Q518175L192625k752261m371398
36929c003006k699578n26889K078610N968374R276762Q251864J610021o823924
36921A4132234j0430664n946543K247783N832948J777478m348860o063146l918426
36913f717196k443708k264716o53029J749686J162839k251471l839128k238900
36905a7495623j491092l136186k586129K792819P730164O428248J465605n30477
36897f822671J152448J890538J21342j196460n49132P06138K504421N764240P826073
36888A1396937M435332k569901n757134k577938N75095j683743n209581l060122
36880d451055L089112M836991p50552o991774o783945j235062L372958M156661
$$ plain form
36937 -3477416 -7781785 -13888739 -14510218 -7590147 928028 4120653 1368392 -3003006
36929 -3003006 -5702584 -6229473 -4150863 1817511 11094273 19346137 20956158 14132234
36921 14132234 3701570 -2244973 2810 5835758 7613236 3264376 -2798770 -6717196
36913 -6717196 -9160904 -11425620 -12078649 -10328963 -9166124 -11417595 -15256723 -17495623
36905 -17495623 -18986715 -22122901 -24709030 -21916211 -14186047 -7757799 -6292194 -6822671
36897 -6822671 -5670223 -3779685 -3658343 -4854803 -5403935 -4697797 -2193376 3570864 11396937
36888 11396937 15832269 13262368 7505234 4927296 5502391 3818648 -1390933 -4451055
36880 -4451055 -1361943 3475048 2724496 -4267278 -11051223 -12286285 -8913327 -4756666
36872d756666L803872N134240O747186N378816R30370l002175l612678j983301
36864H639664q58263j103674k012724l559758n792405o804131m353741L64876
36856a5480156L414130L106722J551109M91918j179668m009864n023273j160854
36848a8289936N668275R686547P291544N73691m970393n456989j821797J577273
36840e741785J940215Q86911J058129J484231l93441l221144l179517j031434
36832h197835j642790m772498l384967M739267J0750954O901646p89760j018659
36824B585358N416650P329236J196663l923896j768182J683702n74153m859833
36816G085545l746197J576743M056721K012562m11408j854617m889659q889472
$$ plain form
36872 -4756666 -952794 4181446 10928632 16307448 17237818 14235643 10622965 8639664
36864 8639664 7781401 6677727 4665003 1105245 -4687160 -11491291 -15845032 -15480156
36856 -15480156 -12066026 -8959304 -7408195 -6916277 -8095945 -12105809 -17129082 -18289936
36848 -18289936 -12621661 -2935114 4356430 4930121 -40272 -5497261 -7319058 -5741785
36840 -5741785 -3801570 -2914659 -1856530 -372299 -765740 -3986884 -7166401 -8197835
36832 -8197835 -9840625 -14613123 -17998090 -13258823 -2507869 4393777 3604017 2585358
36824 2585358 8002008 15331244 16527907 12604011 10835829 12519531 11945378 7085545
36816 7085545 3339348 4916091 8972812 10985374 10573966 8719349 3829690 -5059782
36808e059782r066453m133227Q95489J814119N87285J041815K916386L358868
36800g645500J914537O88809N44215L2124j681421k802799q36067M003541Q007511
36791B224950O991941L50315p883363j2205024j0121143l928490J453963K557595
36783b0559256N232k556363k262315M64018L285624M738898M750910L667888K431072
36774f034292K526370L618947K666458j536279m453643j129517N152997N534223
36766F345264j855053q363513o904929j418536M97078j064112p10956K495083
36758a0979674M920449N604606O311909N642920N73690o217490p925765l621650
36750e691005P6989r69688l197641k506177l86861M83747J227048L171220L769160
$$ plain form
36808 -5059782 -14126235 -18259462 -17363973 -15549854 -14962569 -13920754 -11004368 -7645500
36800 -7645500 -5730963 -5042154 -4497939 -4465815 -6147236 -8950035 -9786102 -5782561 2224950
36791 2224950 9216891 9567206 1683843 -10521181 -20642324 -24570814 -23116851 -20559256
36783 -20559256 -20554024 -23110387 -25372702 -24908684 -21623060 -16884162 -12133252 -8465364 -6034292
36774 -6034292 -3507922 111025 2777483 1241204 -3212439 -4341956 811041 6345264
36766 6345264 4490211 -3873302 -10778231 -12196767 -11699689 -12763801 -13474757 -10979674
36758 -10979674 -6059225 -454619 5857290 11500210 12073900 5856410 -2069355 -5691005
36750 -5691005 -5614016 -6583704 -9781345 -12287522 -12674383 -12190636 -10963588 -7792368 -4023208
36741d023208O75956l281176l448628N50331N379706Q427799Q721187N824565
36733A8826532J035104k212471j951580q5792P89521O41965J04965j691447m762906
36724A0693891o601006n733175m281083m264589m389247l362382k769756l095932
36716b3803279r39758M989757Q862479M774933l833655q259675o201036k658175
36708b7068409n27684K083678M954861M015968j196077m873127k932743J353323
36700b4190210K829004J268000l32694n34752N69068L085865O049754O787397
36692d468568M034021j57061l068761l672851j655599K467256N141937J964780
36684E85154n611932r838696o010986J338632M964306M105163L013693L307663
$$ plain form
36741 -4023208 -3347252 -6628428 -10077056 -9526725 -4147019 4280780 13001967 18826532
36733 18826532 19861636 17649165 15697585 15611793 16401314 17043279 17148244 15456797 10693891
36724 10693891 4092885 -1640290 -5921373 -10185962 -14575209 -17937591 -20707347 -23803279
36716 -23803279 -24743037 -19753280 -10890801 -6115868 -9949523 -18209198 -24410234 -27068409
36708 -27068409 -27596093 -25512415 -20557554 -16541586 -17737663 -22610790 -25543533 -24190210
36700 -24190210 -21361206 -20093206 -20425900 -20960652 -20391584 -17305719 -11255965 -4468568
36692 -4468568 -434547 -591608 -3660369 -7333220 -8988819 -6521563 -1379626 585154
36684 585154 -5026778 -14865474 -20876460 -19537828 -14573522 -10468359 -7454666 -4147003
36676d147003K887033R63857p34534j429691j893713j688501M71867L339064L553630
36667A322009L40328k800195k076057K572539P790496R676969O441640o6849n350650
36658A7850230o156423l411584m59384P15783J95953j511193l484605l684387
36650E4390j081553J644013M13401m552750p769331m552512L402143R704084R693938
36641F955823M297992j964967n780871p328833q004214p282146l685637J553856
36633b1238997M685445M331990L366334L970872L744346k1076m458911l903809
36625i523806K171181Q138185R220872N807849O30284m245267o721694n203341
36617B74263j716437q01836k983192k922899K805117R394236R552532L473456
$$ plain form
36676 -4147003 -1259970 -296113 -1030647 -2460338 -4354051 -6042552 -5570685 -2231621 1322009
36667 1322009 1662337 -1137858 -3213915 -641376 7149120 16826089 23267729 23200880 17850230
36658 17850230 11693807 8282223 7822839 8538622 8734575 7223382 3738777 54390
36650 54390 -1027163 616850 1030251 -3522499 -11291830 -15844342 -12442199 -2738115 6955823
36641 6955823 11253815 9288848 3507977 -3820856 -11825070 -19107216 -22792853 -21238997
36633 -21238997 -16553552 -12221562 -8855228 -4884356 -1140010 -1161086 -5619997 -9523806
36625 -9523806 -7352625 785560 10006432 15814281 16444565 12199298 5477604 274263
36617 274263 -1442174 -2244010 -5227202 -8150101 -5344984 4049252 13601784 17075240
36609A7075240j847831k527600j784943l039209m040703j107480L948223N371305
36601A2047002J230148l854252m414508l10970L763465L518258r99803n596457
36593E382883n442581M28776P457904R641259O040193J665041P99645J606974
36585B7580094k79274m698569p240016o018593l986769l599457l119435l16551
36577a678570L322399M749125L393563M44444l711103q256908r942419o007891
36569a7687360J439891P086609Q197101O150083K929453n70189k829321k001523
36561B714744R43760K309487M40783j803391q85054K878184O118536O289518L228617
36552B2235184j812479o723984q657558n698983P37047O143308O742678L248843
$$ plain form
36609 17075240 15227409 12699809 10914866 7875657 3834954 2727474 6675697 12047002
36601 12047002 13277150 9422898 5008390 4697420 8460885 11979143 10979340 5382883
36593 5382883 -59698 369078 7826982 17468241 23508434 25173475 25973120 27580094
36585 27580094 27300820 22602251 15362235 9343642 5356873 1757416 -1362019 -1678570
36577 -1678570 1643829 6392954 9786517 10230961 6519858 -1737050 -11679469 -17687360
36569 -17687360 -16247469 -9160860 -963759 5186324 8115777 7545588 4716267 2714744
36561 2714744 3658504 5967991 6408774 4605383 3720329 6598513 12717049 19006567 22235184
36552 22235184 20422705 13698721 5041163 -657820 79227 6222535 12965213 16214056
36544A6214056K6885K0101J460610Q19927j979694l665907k664825r46117m0582
36535I244454J393268M145047N846501M594426K393615J684533J023677j786803
36527B8538718m536167l490490j38237K79914l177065n707407m017856k69570
36519G481840K357431L588199L867906K222345j468268m877645n717466l818818
36511C635524j92983L511847M698502K285289m99397M81244M095671N398293L118043
36502B6532033N47017j140303m047218o871433m393647L356304Q555460O620310
36494B9158523L197068M634511P589324N112967j620576n510723m568682l122143
36486C4870269l498082l617896k501763j955464k459634k333847j134950J54568
$$ plain form
36544 16214056 16240941 16261042 17721652 18541579 16561885 12895978 10231153 9285036 9244454
36535 9244454 10637722 14782769 20629270 25223696 27617311 29301844 30325521 28538718
36527 28538718 24002551 20512061 20373824 20653738 17476673 11769266 7751410 7481840
36519 7481840 9839271 13427470 17295376 19517721 18049453 13171808 7454342 3635524
36511 3635524 3442541 6954388 11652890 13938179 13438782 13920026 18015697 23413990 26532033
36502 26532033 27079050 25938747 21891529 15020096 10626449 13982753 22538213 29158523
36494 29158523 32355591 36990102 44579426 49692393 48071817 42561094 37992412 34870269
36486 34870269 31372187 27754291 25252528 23297064 20837430 18503583 17368633 17523201
36478A7523201J724765L855128M488788K054340q07201p49612Q79251J016983
36470B9985643J087794M264875Q202283P294214J677022k676492k953343k214165
36462D4667831k838791l663432m168178n047082m014657J964758R145002R220109
36454D5265560J358621n241489l910475J244090L253421J743242l9136j577844
36446D2095990l164346k502827J435814N009681N011365L491919L224508K394576
36438E6996680j441505n803917o688356m479809j984756K81115K487018K673780
36430D2040250K21521j400768j67818J30629l567843p036496n425759k361823
36422B2431893m122526p769608m783617M357291R198411M257553m013350p706183
$$ plain form
36478 17523201 19247966 23103094 27591882 29646222 28839021 28089409 28968660 29985643
36470 29985643 31073437 35338312 43540595 50834809 52511831 49835339 46881996 44667831
36462 44667831 41829040 38165608 33997430 28950348 24935691 26900449 36045451 45265560
36454 45265560 46624181 41382692 37472217 38716307 41969728 43712970 43673834 42095990
36446 42095990 38931644 36428817 37864631 42874312 47885677 51377596 54602104 56996680
36438 56996680 55555175 49751258 43062902 38583093 36598337 36879452 39366470 42040250
36430 42040250 42261771 40861003 40693185 40823814 37255971 30219475 24793716 22431893
36422 22431893 18309367 10539759 5756142 10113433 19311844 23569397 19556047 11849864
36414A1849864o690242m010618J49890N065615O441873K457201j831007j380585
36406A2051991J603305K504169K189307L639215L966420k056325j1048583j1978593
36398H70906q34285J2080575J4084041N272107l329890m272696m61693K246938
36390B5656003K999802L820666M242241K623213L64653o4523k37951l791388r246874
36381B6365842j0341004n301462n87993k015761o383099o388879r50802M353588
36373a249570N622138M485972L759146L420606J946008r56216l907305n029878
36365H090901l688142j611354r13561m78575K837087P963799Q496039J121864
36357B1818058q149211j0413792m177267M578568R814635Q756699J408718p469040
$$ plain form
36414 11849864 5159622 1149004 1298894 6364509 12806382 15263583 13432576 12051991
36406 12051991 13655296 16159465 18348772 21987987 25954407 23898082 12849499 870906
36398 870906 36621 12117196 26201237 31473344 28143454 23870758 23409065 25656003
36390 25656003 28655805 32476471 36718712 39341925 39706578 39642055 39404104 35612716 26365842
36381 26365842 16024838 10723376 10135383 8119622 1736523 -4652356 -5603158 -1249570
36373 -1249570 4372568 8858540 12617686 16038292 17984300 17028084 13120779 8090901
36365 8090901 4402759 2791405 1877844 1399269 4236356 12200155 20696194 21818058
36357 21818058 13668847 3255055 -922212 3656356 13470991 22227690 23636408 16167368
36349A6167368r009103Q4746J0478776J0256593O80740o070392m142593Q4386
36341A8530521R5945k243993l079087k838831k201395O88778M726710M516872
36333A8195520r67656m928833k621689J645652K283201P76896P44798R03735o92402
36324A5339222j133185J710698L163847j298205p498895q370202m254071j5543
36316b356334L752361Q242807R286848K616272o216444p463256j691048J427104
36308G598310j342316k899949J083434N266136M126238r3355k760725l282326
36300G695447k729566j108962J77544j131087l192820j852769J230154j16130
36292a028189n165302n206471K299414P835401M077199k617805k739931J699506
$$ plain form
36349 16167368 7158265 7243011 17721787 27978380 28659120 22588728 18446135 18530521
36341 18530521 18626466 16382473 13303386 10464555 8263160 8951938 13678648 18195520
36333 18195520 17227864 12299031 9677342 11322994 13606195 14383091 15127889 16031624 15339222
36324 15339222 14206037 15916735 19080582 17782377 10283482 1913280 -2340791 -2356334
36316 -2356334 1396027 9638834 18925682 21541954 15325510 7862254 6171206 7598310
36308 7598310 6255994 3356045 4439479 9705615 13831853 13738498 10977773 7695447
36300 7695447 4965881 3856919 4034463 2903376 -289444 -2142213 -912059 -1028189
36292 -1028189 -6193491 -11399962 -9100548 -1265147 2812052 194247 -2545684 -846178
36284h46178K266213j496612k735602N77448L488640K831690L24313k162293l495076
36275a247457q54612O342145J1435933P416361j665129m589704J018771N206313
36267B3062621N75103p478933r549398m653029J156735L811153L701720K239150
36259A2865122N43052j00159L50064K24737j000749j486505k31178J184732J672314
36250A4021430K336406L319211K559239M200q93340J082608J791748j720812n665929
36241A6834761n542381l929899n774382q726106o120498J296648N141784K130489
36233d689584j233367K39682K507467N60858k271436m43760L226211J549521m769636
36224e324044p520780l614604R26580J463623J462924M697930P223666L338815
$$ plain form
36284 -846178 1420035 -76577 -2812179 -2234731 1253909 4085599 4409912 2247619 -1247457
36275 -1247457 -2102069 4240076 15676009 23092370 21427241 16837537 17856308 23062621
36267 23062621 23637724 16158791 6609393 1956364 3113099 6924252 10625972 12865122
36259 12865122 13408174 13308015 13658079 13882816 12882067 11395562 11164384 12349116 14021430
36250 14021430 16357836 19677047 22236286 22240486 21347146 22429754 24221502 22500690 16834761
36241 16834761 11292380 7362481 1588099 -7138007 -13258505 -11961857 -6820073 -4689584
36233 -4689584 -5922951 -5683269 -3175802 -2614944 -4886380 -5330140 -2103929 -554408 -5324044
36224 -5324044 -12844824 -16459428 -15532848 -14069225 -12606301 -7908371 -684705 2654110
36216B654110m147442o304543Q4209Q459773J0841271O281563n0587l188363k242225
36207A2387766K55528J403512O19410n02372q00085o02558L15919L308263P363901
36198B3749284P691821J499604o380058q180240l309875Q24251r99032n258300
36190I637455n481854j041452K865460K057034k410009n911635m586039J129658
36182c741382O440295O721464K349386k372688m520936m232481j853064K419718
36174A210312N694201M066776j220657m070338k145594n8925j031087j321043
36166A123645K162012M470395m009o877616o947763q4370M573845K056942k977501
36157b504420n153009m813104l343822N06320O016324Q360166N317605J301641
$$ plain form
36216 2654110 -1493332 -7797875 -7713666 746107 11587378 17868941 17818354 14629991 12387766
36207 12387766 12643294 14046806 14666216 14163844 13363759 12761201 13077120 16385383 23749284
36198 23749284 31441105 32940709 26560651 18380411 15070536 15894787 14895755 9637455
36190 9637455 4155601 3114149 5979609 8036643 5626634 -285001 -4871040 -3741382
36182 -3741382 2698913 9420377 11769763 9397075 4876139 643658 -1209406 1210312
36174 1210312 6904513 10971289 9750632 5680294 3534700 3475775 2444688 1123645
36166 1123645 3285657 7756052 7752043 874427 -6073336 -6157706 -1583861 473081 -2504420
36157 -2504420 -7657429 -12470533 -15814355 -15308035 -9291711 -931545 4386060 5687701
36149E687701O76110J422717k58530k867567j995243K561617O418778O099008
36141A7744591J908331l353430o398447n861086m245756n188265p789674p206385
36133b0390121k185157K596624L851974M034937N239627M715609J183696l87522
36125a340333L224269O082156J585505n963333p393345l116771j341823l498719
36117a1762394k753848K296353M088932m24536l421627J251348Q091170Q904090
36109F269488M495833P38860q44454j720565r59830J740814K285455j568021m581828
36100E855752j944179J721119k93850m513504k550541L832774M448959k458670
36092D097860o805569k752635K895607L258920K179917N171253P929382L403870
$$ plain form
36149 5687701 6363811 7786528 7527998 4660431 2665188 5226805 11645583 17744591
36141 17744591 19652922 16299492 9901045 4039959 -205797 -5394062 -13183736 -20390121
36133 -20390121 -22575278 -19978654 -16126680 -12091743 -6852116 -2136507 -952811 -1340333
36125 -1340333 1883936 7966092 9551597 3588264 -3805081 -6921852 -8263675 -11762394
36117 -11762394 -14516242 -12219889 -8130957 -8555493 -11977120 -10725772 -2634602 6269488
36109 6269488 10765321 11504181 10659727 8939162 7979332 9720146 12005601 10437580 5855752
36100 5855752 3911573 5632692 5338842 825338 -1725203 2107571 6556530 4097860
36092 4097860 -2707709 -5460344 -2564737 694183 2874100 8045353 15974735 19378605
36084A9378605m861591o657597m40029M717502K942442j095145j221624Q80476
36076A3643039M6356l141252l402754K08460J909721k343537p814990o411399
36068g306356J962529Q189753N643512j271644m097528k288313k053264m788969
36060f010280m452656J822871P749931O627281N83901l647587l796095k000073
36052c122707K73298J882931K71843m016774m553596K465934J0018755Q527597
36044A1747281J35979m354500j831096O9647k827743m929860k315667N3930j588808
36035e840837k043913K796068O353464J534781n721607m207423M784472R038937
36027F693942L923485j941273j237254K035520J254666k190464k706064J38919
$$ plain form
36084 19378605 14517014 7859417 7419388 12136890 15079332 13984187 12762563 13643039
36076 13643039 13689395 10548143 7145389 7353849 9263570 6920033 -894957 -7306356
36068 -7306356 -5343827 2845926 8489438 7217794 3120266 831953 -1221311 -6010280
36060 -6010280 -10462936 -8640065 -890134 5737147 6321048 2673461 -1122634 -3122707
36052 -3122707 -2849409 -966478 -694635 -4711409 -9265005 -6799071 3219684 11747281
36044 11747281 11883260 7528760 5697664 5767311 2939568 -1990292 -4305959 -4252029 -5840837
36035 -5840837 -7884750 -5088682 1264782 2799563 -2922044 -7129467 -2344995 6693942
36027 6693942 10617427 8676154 7438900 9474420 10729086 8538622 5832558 5971477
36019E971477J712435n78371m392568n748012l124842R54402K065992r65343l868193
36010g973023k447891J174608J972996K81785Q88476M185015N014233J561456
36002D657655j501066j090944j62640r78911q27543J487409J868695j112249j382087
35993I58319M808207J0590335Q106063R41460k346287k453788o086116j1484999
35985C033194r864773j376482L135374o80234l575475J855698R021736Q059115
35977I608153O72067m078434l067364K7463K854236N185901M538717q93944o447609
35968H399186n694696l56525J659954j715429l900304n18368L632134J978230
35960C484182m293743q396490o941266k782296P8978J051357J924036L360443
$$ plain form
36019 5971477 7683912 7105541 2712973 -3035039 -6159881 -5205479 -3139487 -4104830 -7973023
36010 -7973023 -10420914 -9246306 -7273310 -6991525 -6103049 -1918034 3096199 4657655
36002 4657655 3156589 2065645 1903005 924094 96551 1583960 3452655 2340406 958319
35993 958319 5766526 16356861 24462924 25404384 23058097 20604309 14518193 3033194
35985 3033194 -6831579 -8208061 -5072687 -5752921 -9328396 -7472698 1549038 9608153
35977 9608153 10280220 6201786 3134422 3161885 6016121 11202022 15740739 14846795 8399186
35968 8399186 2704490 2347965 4007919 2292490 -1607814 -2126182 1505952 3484182
35960 3484182 -809561 -9206051 -16147317 -18929613 -18850635 -17799278 -15875242 -12514799
35952a2514799L949491K633310Q09095P59225K495948M038513M726618N592359
35944A2489760N917970L031971k547062n511820k617716K036132K629481l01791
35936A5126925k306586l043011n548624q550002o646323O63370O555966O014938
35928B266653K145079L94757J069655J272103P27822J497050L707356M910463
35920A7990938K941772k186487p909100r881258n644248J316769L980337k81443
35912C27280o827798r775689p518101j385167O370904J1219964Q573694J112869
35904B097956j522195M417407R297765K539743j1103958j6329540p298858N627273
35896a2274407J0302461O346784J496019O18571K539716M076829L391270R50572
$$ plain form
35952 -12514799 -8565308 -5931998 -5122903 -4363678 -1867730 2170783 6897401 12489760
35944 12489760 18407730 21439701 18892639 13380819 10763103 12799235 15428716 15126925
35936 15126925 12820339 9777328 4228704 -4321298 -10967621 -10304251 -3748285 2266653
35928 2266653 4411732 4806489 5876144 7148247 7876069 9373119 13080475 17990938
35920 17990938 20932710 18746223 10837123 955865 -4688383 -3371614 608723 327280
35912 327280 -6500518 -16276207 -23794308 -25179475 -18808571 -7588607 985087 2097956
35904 2097956 575761 4993168 14290933 16830676 5726718 -10602822 -17901680 -12274407
35896 -12274407 -1971946 4374838 5870857 6489428 9029144 13105973 16497243 17447815
35888A7447815q52357l39226Q24451k19422l035570m709074m793499n304926n701901
35879f683709k965930K118733M185969J289470j339475R63917N124574N176205
35871G869754J006574k331648k000516J17363J102693j28868k658794l902199
35863i25641j679913K121847K581600j247919l954956j922334K07258l259567
35855h079625q605268o734304L315522J2329718J3221342Q450442L147785k294071
35847A4751541q651959j2386333r575586k779456J296957K43425k004812j403210
35839b0509433J389198L099978K201587k1124j462837j240118q8778Q46153J405261
35830a4380113K148582K740711J706430j387031m235512l613378P52647M873636
$$ plain form
35888 17447815 16595458 16256232 17080683 16861261 13825691 9116617 4323118 -981808 -6683709
35879 -6683709 -9649639 -7530906 -3344937 -2055467 -3394942 -2431025 2693549 7869754
35871 7869754 8876328 6544680 4544164 4661527 5764220 5635352 2976558 -925641
35863 -925641 -2605554 -483707 2097893 849974 -3104982 -5027316 -4820058 -8079625
35855 -8079625 -16684893 -23419197 -20103675 -7773957 5447385 13897827 17045612 14751541
35847 14751541 6099582 -6286751 -15862337 -18641793 -17344836 -17101411 -19106223 -20509433
35839 -20509433 -19120235 -16020257 -13818670 -13839794 -15302631 -16542749 -16631527 -15785374 -14380113
35830 -14380113 -12231531 -9490820 -7784390 -9171421 -13406933 -17020311 -16267664 -11394028
35822a1394028M152436j164802n178789k681323L933214O727861K171573m075363
35814g509221m845418r24138J453286M78855K60410K602344L838907J932536N68838
35805b143601K290754K956033j351436o005278l623929L792706O445715R91810
35797C352774m492991k690333K620317L493160L0369j185955J523036K596774
35789E247151j079473m701888k721194L092008O575234N256039J579755k023375
35781A1224257n038485o493391m872561j111012J500172J415836M71134Q24455
35773b079595K671511N325880P647733O947685J161673o617108r757277o326986
35765a026484j713280m16032Q5285L117770N266805J558154m892828o112055j195748
$$ plain form
35822 -11394028 -7241592 -8406394 -13585183 -16266506 -12333292 -5605431 -3433858 -7509221
35814 -7509221 -12354639 -13278777 -11825491 -11346636 -11086226 -8483882 -4644975 -2712439 -2143601
35805 -2143601 147153 3103186 1751750 -4253528 -7877457 -4084751 2360964 3352774
35797 3352774 -1140217 -3830550 -1210233 2282927 2313296 1127341 2650377 5247151
35789 5247151 4167678 -534210 -3255404 -163396 6411838 11667877 13247632 11224257
35781 11224257 6185772 -307619 -5180180 -6291192 -4791020 -3375184 -2904050 -2079595
35773 -2079595 591916 5917796 13565529 20513214 21674887 15057779 5300502 -1026484
35765 -1026484 -2739764 -3155796 -3070511 47259 5314064 6872218 1979390 -4132665 -5328413
35756e328413K645527J466880n52634M29396J824322N09954j255528k89235J778940
35747A229209J754599K40837m77926p45769j660106j811175K8494J637816Q37821
35738A033800l66713N79617J534258j116839n854200p646669n055504j076478
35730a7968728K153616M804289O109191M419369O69125k132366k917503k775617
35722g638624k024250q45265j481387m939117o561497q56022R102531J3314418
35714a929213P348860k384527p625616o964879l262705J775046O609122Q227183
35706A793271O013787L887629M541450M734789N66706n480289p617878m917593
35698C521872j533795N7498J178411K570053K544241M34010j659206j844906p37024
$$ plain form
35756 -5328413 -2682886 -1216006 -1768640 -1339244 485078 995032 -260496 -549731 1229209
35747 1229209 2983808 3224645 2746719 2000950 340844 -1470331 -1441837 195979 1033800
35738 1033800 667087 1246704 2780962 1664123 -4190077 -11836746 -16892250 -17968728
35730 -17968728 -15815112 -11010823 -4901632 -482263 186862 -1945504 -4863007 -7638624
35722 -7638624 -9662874 -10508139 -11989526 -16928643 -23490140 -24346162 -15243631 -1929213
35714 -1929213 5419647 3035120 -4590496 -11555375 -14818080 -13043034 -6433912 1793271
35706 1793271 7807058 11694687 16236137 20970926 21537632 16057343 8439465 3521872
35698 3521872 1988077 2045575 3223986 5794039 8338280 8772290 7113084 5268178 4531154
35689D531154O4017k87353k101516m873336o216753l481739K406643O772116O428938
35680C242171L554870K458229L602160L396893j3652l581291l746208j962327
35672F950845k572368n602428n758328l47257N522214N285158K9554l338219j855707
$$ plain form
35689 4531154 4595171 4307818 2206302 -2667034 -8883787 -12365526 -9958883 -3186767 3242171
35680 3242171 6797041 9255270 12857430 16254323 16240671 12659380 8913172 6950845
35672 6950845 4378477 -1223951 -6982279 -7329536 -1807322 3477836 3507390 169171 -1686536
$$ [...]
##END NTUPLES=NMR SPECTRUM
##END=
