##TITLE=31Pdec_DE-75H
 D2O, 64 sc
 29.1.2025
##JCAMPDX= 6.0         $$ Bruker NMR JCAMP-DX V2.0
##DATA TYPE= NMR SPECTRUM
##DATA CLASS= NTUPLES
##ORIGIN= UXNMR, Bruker Analytische Messtechnik GmbH
##OWNER= root
$$ XWIN-NMR		Version 3.5
$$ Thu Jan 30 16:42:51 2025 Russian Standard Time (UT+4h)  she@DPX200
##.OBSERVE FREQUENCY= 81.013821
##.OBSERVE NUCLEUS= ^31P
##.ACQUISITION MODE= SIMULTANEOUS
##.ACQUISITION SCHEME= undefined
##.AVERAGES= 64
##.DIGITISER RES= 17
##SPECTROMETER/DATA SYSTEM= spect
##.PULSE SEQUENCE= zgpg30
##.SOLVENT NAME= CDCl3
##.SHIFT REFERENCE= (INTERNAL, CDCl3, 0, 198.062)
##AUDIT TRAIL= $$ (NUMBER, WHEN, WHO, WHERE, WHAT)
$$ ##TITLE= Audit trail, XWIN-NMR		Version 3.5
$$ ##JCAMPDX= 5.01
$$ ##ORIGIN= Bruker BioSpin GmbH
$$ ##OWNER= she
$$ F:/spectra/data/she/nmr/P31/2/pdata/1/auditp.txt
$$ ##AUDIT TRAIL=  $$ (NUMBER, WHEN, WHO, WHERE, WHAT)
(   1,<2025-01-30 16:40:59.01 +0400>,<she>,<DPX200>,
      <created by zg, POWCHK disabled, PULCHK disabled
       configuration hash MD5:
       00 E9 B6 7A A2 85 ED C7 34 08 36 98 17 FE 4E 26
       data hash MD5: 32K
       5E 10 21 AC B5 96 B2 56 21 60 D9 C8 05 C2 AC 8D>)
(   2,<2025-01-30 16:41:30.67 +0400>,<she>,<DPX200>,
      <Start of raw data processing
       efp BC_mod = 2 LB = 1.5 FT_mod = 6 PKNL = 1 PHC0 = 1710.5 PHC1 = 160.6906 SI = 64K 
       data hash MD5: 64K
       11 21 6C 79 56 77 37 C2 F9 C8 DC CA C6 94 BB 73>)
(   3,<2025-01-30 16:42:12.65 +0400>,<she>,<DPX200>,
      <pk PHC0 = -119.1186 PHC1 = 299.5999 
       data hash MD5: 64K
       F0 6A 13 A3 EF 7B BA 1E 42 5D 3D C1 0D 76 FE 77>)
(   4,<2025-01-30 16:42:16.23 +0400>,<she>,<DPX200>,
      <abs ABSG = 5 
       data hash MD5: 64K
       07 DD 3F D9 87 A9 FE 93 12 DD 48 68 2D 8D 41 95>)
$$ ##END=
$$ 
$$ hash MD5
$$ 0F 68 B2 D2 8E D0 01 D5 79 64 9D ED FE 24 E7 E5
##$RELAX= 
##$RELAX= 
##$RELAX= 
##$RELAX= 
##$RELAX= 
##$RELAX= 
##$RELAX= 
##$RELAX= 
$$ Bruker specific parameters
$$ --------------------------
##$DU= <F:/spectra>
##$EXPNO= 2
##$NAME= <P31>
##$PROCNO= 1
##$TYPE= <nmr>
##$USER= <she>
##$AMP= (0..31)
100 100 100 100 100 100 100 100 100 100 100 100 100 100 100 100 100 100 
100 100 100 100 100 100 100 100 100 100 100 100 100 100 
##$AQSEQ= 0
##$AQ_mod= 1
##$AUNM= <au_zg>
##$AUTOPOS= <>
##$BF1= 81.014009
##$BF2= 200.13
##$BF3= 200.13
##$BF4= 200.13
##$BF5= 200.13
##$BF6= 200.13
##$BF7= 200.13
##$BF8= 200.13
##$BYTORDA= 1
##$CFDGTYP= 0
##$CFRGTYP= 5
##$CHEMSTR= <none>
##$CNST= (0..31)
1 1 145 1 1 1 1 1 1 1 1 1 1 1 1 1 1 1 1 1 1 1 1 1 1 1 1 1 1 1 1 1 
##$CPDPRG= <waltz16>
##$CPDPRG1= <>
##$CPDPRG2= <waltz16>
##$CPDPRG3= <>
##$CPDPRG4= <mlev>
##$CPDPRG5= <mlev>
##$CPDPRG6= <mlev>
##$CPDPRG7= <mlev>
##$CPDPRG8= <mlev>
##$CPDPRGB= <>
##$CPDPRGT= <>
##$D= (0..31)
0 1 0 0 0 0 0 0 0 0.06 0 0.03 2e-05 3e-06 0 0 0.0002 0 0 0 0 0 0 0 0 0 
0 0 0 0 0 0 
##$DATE= 1738240858
##$DBL= (0..7)
120 120 120 11 120 120 24 19 
##$DBP= (0..7)
150 150 150 150 150 150 150 150 
##$DBP07= 0
##$DBPNAM0= <>
##$DBPNAM1= <>
$$ [...]
##$SUBNAM3= <"">
##$SUBNAM4= <"">
##$SUBNAM5= <"">
##$SUBNAM6= <"">
##$SUBNAM7= <"">
##$SUBNAM8= <"">
##$SUBNAM9= <"">
##$SW= 400.765351723535
##$SWIBOX= (0..15)
0 1 3 0 0 0 0 0 0 0 0 0 0 0 0 0 
##$SW_h= 32467.5324675325
##$TD= 32768
##$TD0= 1
##$TE= 0
##$TE2= 300
##$TE3= 300
##$TEG= 300
##$TL= (0..7)
0 120 53 12 22 120 120 120 
##$TP= (0..7)
150 150 150 150 150 150 150 150 
##$TP07= 0
##$TPNAME0= <>
##$TPNAME1= <>
##$TPNAME2= <>
##$TPNAME3= <>
##$TPNAME4= <>
##$TPNAME5= <>
##$TPNAME6= <>
##$TPNAME7= <>
##$TPOAL= (0..7)
0.5 0.5 0.5 0.5 0.5 0.5 0.5 0.5 
##$TPOFFS= (0..7)
0 0 0 0 0 0 0 0 
##$TUNHIN= 0
##$TUNHOUT= 0
##$TUNXOUT= 0
##$USERA1= <user>
##$USERA2= <user>
##$USERA3= <user>
##$USERA4= <user>
##$USERA5= <user>
##$V9= 5
##$VALIST= <valist>
##$VCLIST= <CCCCCCCCCCCCCCC>
##$VD= 0
##$VDLIST= <DDDDDDDDDDDDDDD>
##$VPLIST= <PPPPPPPPPPPPPPP>
##$VTLIST= <TTTTTTTTTTTTTTT>
##$WBST= 1024
##$WBSW= 4
##$XGAIN= (0..3)
0 0 0 0 
##$XL= 0
##$YL= 0
##$YMAX_a= 9141
##$YMIN_a= -8371
##$ZGOPTNS= <>
##$ZL1= 120
##$ZL2= 120
##$ZL3= 120
##$ZL4= 120
##$ABSF1= 198.0616
##$ABSF2= -202.7028
##$ABSG= 5
##$ABSL= 3
##$ALPHA= 0
##$AQORDER= 0
##$ASSFAC= 0
##$ASSFACI= 0
##$ASSFACX= 0
##$ASSWID= 0
##$AUNMP= <proc_1d>
##$AZFE= 0.1
##$AZFW= 0.5
##$BCFW= 0
##$BC_mod= 2
##$BYTORDP= 0
##$COROFFS= 0
##$CY= -3
##$DATMOD= 1
##$DC= 0
##$DFILT= <>
##$DTYPP= 0
##$F1P= 0
##$F2P= 0
##$FCOR= 1
##$FTSIZE= 65536
##$FT_mod= 6
##$GAMMA= 0
##$GB= 0
##$INTBC= 1
##$INTSCL= 9.790993e-09
##$ISEN= 30
##$LB= 1.5
##$LEV0= 0
##$LPBIN= 0
##$MAXI= 10000
##$MC2= 0
##$MEAN= 0
##$ME_mod= 0
##$MI= 50
##$NCOEF= 0
##$NC_proc= -9
##$NLEV= 6
##$NOISF1= 182.463
##$NOISF2= 159.3651
##$NSP= 0
##$NTH_PI= 0
##$NZP= 0
##$OFFSET= 198.0616
##$PC= 4
##$PHC0= 1591.381
##$PHC1= 460.2905
##$PH_mod= 1
##$PKNL= yes
##$PPARMOD= 0
##$PSCAL= 0
##$PSIGN= 0
##$REVERSE= no
##$SF= 81.0140089999434
##$SI= 65536
##$SIGF1= 159.3651
##$SIGF2= -187.1042
##$SINO= 113.3802
##$SIOLD= 16384
##$SREGLST= <1H.CDCl3>
##$SSB= 0
##$STSI= 65536
##$STSR= 0
##$SW_p= 32467.5324675325
##$SYMM= 0
##$S_DEV= 0
##$TDeff= 32768
##$TDoff= 0
##$TI= <>
##$TILT= no
##$TM1= 0
##$TM2= 0
##$TOPLEV= 0
##$USERP1= <user>
##$USERP2= <user>
##$USERP3= <user>
##$USERP4= <user>
##$USERP5= <user>
##$WDW= 1
##$XDIM= 65536
##$YMAX_p= 228431009
##$YMIN_p= -392128336
$$ End of Bruker specific parameters
$$ ---------------------------------
##NTUPLES= NMR SPECTRUM
##VAR_NAME=  FREQUENCY,     SPECTRUM/REAL,   SPECTRUM/IMAG
##SYMBOL=    X,             R,               I
##VAR_TYPE=  INDEPENDENT,   DEPENDENT,       DEPENDENT
##VAR_FORM=  AFFN,          ASDF,            ASDF
##VAR_DIM=   65536,         65536,           65536
##UNITS=     HZ,            ARBITRARY UNITS, ARBITRARY UNITS
##FACTOR=    0.49542278885378, 1,            1
##FIRST=     16045.7642231865, 0,            0
##LAST=      -16421.768244346, 0,            0
##MIN=       -16421.768244346, -392128336,   0
##MAX=       16045.7642231865, 228431009,    0
$$ Real data points
##PAGE= N=1
##DATA TABLE= (X++(R..R)), XYDATA
$$ [...]
##PAGE= N=2
##DATA TABLE= (X++(I..I)), XYDATA
7350D280592m739685l030508p55076L76410j043383n147679r204333q787279k475388
$$ 4280592 -459093 -3489601 -4244677 -3868267 -4911650 -10059329 -19263662 -28050941 -30526329
7341c0526329N532383R369306P752061M669093L809157M018159J459592m425533
$$ -30526329 -24993946 -15624640 -7872579 -3203486 605671 4623830 6083422 1657889
7333A657889q928898p144747j60751N722971O164307L120556J141056J657521
$$ 1657889 -7271009 -14415756 -14576507 -8853536 -2689229 431327 1572383 3229904
7325C229904K868183L133345J671330k354968p808953r776608m190414N668554
$$ 3229904 6098087 9231432 10902762 8547794 738841 -9037767 -13228181 -7559627
7317g559627J1539523R762357M484614O00190j765978m035309n406064n252579
$$ -7559627 3979896 13742253 18226867 18827057 17061079 13025770 7619706 2367127
7309B367127m997583m354530j35181P119508R929895L124292p105785j0110828
$$ 2367127 -2630456 -6984986 -7120167 -659 9929236 13053528 5947743 -4163085
7301d163085m625579J400873L488711M813953O968868N440703j671454p577530
$$ -4163085 -8788664 -7387791 -3899080 914873 7883741 13324444 11652990 4075460
7293D075460n458569J242267L468708r06339n222953m104147o039J372159j656042
$$ 4075460 -1383109 -140842 3327866 2421527 -2801426 -6905573 -6911612 -5539453 -7195495
7284g195495n981265p934827o425962k740734J258561M312777N577026M355963
$$ -7195495 -13176760 -21111587 -27537549 -30278283 -29019722 -24706945 -19129919 -14773956
7276a4773956J198126j247823m40394K616121M145401K601289P55380J486625
$$ -14773956 -13575830 -14823653 -15264047 -12647926 -8502525 -5901236 -5145856 -3659231
7268c659231L642219M048338J915454r76465l153843m281888m253238l621863
$$ -3659231 -17012 4031326 5946780 4970315 1816472 -2465416 -6718654 -10340517
7260a0340517l800167m628847l262354J694612O467196O225470J892988j456088
$$ -10340517 -14140684 -18769531 -22031885 -20337273 -13870077 -7644607 -5751619 -7207707
7252g207707k349826l670920n281264k637396M257283P113249M11715q410866
$$ -7207707 -9557533 -13228453 -18509717 -21147113 -16889830 -9776581 -9364866 -17775732
7244a7775732p275474M089377J3601932J2630996M991657j318105m164022n522216
$$ -17775732 -25051206 -20961829 -7359897 5271099 10262756 8944651 4780629 -741587
7236g41587n631282l900647j855497n75461J746190N488102O319769J446972l926774
$$ -741587 -6372869 -10273516 -12129013 -12704474 -10958284 -5470182 849587 2296559 -1630215
7227a630215k782419K972967N031002J289385j727518k314K259948Q83212j590371
$$ -1630215 -4412634 -1439667 3591335 4880720 3153202 3150888 5410836 6294048 4703677
7218D703677j901799k408282n570695p216627k468676M710874N553529q25837
$$ 4703677 2801878 393596 -5177099 -12393726 -14862402 -10151528 -4597999 -5423836
7210e423836n884612l657957J764991K955821j221548n551924n306656o50015
$$ -5423836 -11308448 -14966405 -13201414 -10245593 -11467141 -17019065 -22325721 -22975736
7202b2975736M412522N953766L698943J112196J268172L270016M053091K628995
$$ -22975736 -18563214 -12609448 -8910505 -7798309 -6530137 -3260121 792970 3421965
7194C421965M64376j288274k279364j518735J408037L977890K898262j040566
$$ 3421965 3886341 2598067 318703 -1200032 208005 4185895 7084157 6043591
7186F043591l336861j654039J372016J935447p11648m477215o700574n701813
$$ 6043591 2706730 1052691 2424707 4360154 3648506 -828709 -7529283 -13231096
7178a3231096k047585J434536K558653K240913K274451K182960J223727J528813
$$ -13231096 -15278681 -13844145 -11285492 -9044579 -6770128 -4587168 -3363441 -1834628
7170a834628M672861O662551K511380m464003n207525J593083O214078J855468
$$ -1834628 2838233 9500784 12012164 7548161 2340636 3933719 10147797 12003265
7162A2003265n228923n397307L40579L432230J312313n33583Q18689R71907l992436
$$ 12003265 6774342 1377035 1717614 5149844 6462157 5928574 6747263 7719170 3726734
7153C726734j0610218j2123312o684982Q90923M406962K222830j545257j749014
$$ 3726734 -6883484 -19006796 -25691778 -24800855 -20393893 -18171063 -19716320 -21465334
7145b1465334J787546M437116L395669J342037J666105L146263K570473J36420
$$ -21465334 -19677788 -15240672 -11845003 -10502966 -8836861 -5690598 -3120125 -2983705
7137b983705j643815k534599l857860m560904k507261R91662K367273J303511
$$ -2983705 -4627520 -7162119 -11019979 -15580883 -18088144 -17096482 -14729209 -13425698
7129a3425698Q46244K088497L028312K884529L097246L419500J485862k596671
$$ -13425698 -12579454 -10490957 -7462645 -4578116 -1480870 1938630 3424492 827821
7121H27821n451652n565287n063864m817892k185586L883666R334866R613091
$$ 827821 -4623831 -10189118 -15252982 -20070874 -22256460 -18372794 -9037928 575163
7113E75163N032508q06275n100937o149533k887314K912204O655594N909171K789917
$$ 575163 5607671 4801396 -299541 -6449074 -9336388 -6424184 231410 6140581 8930498
7104H930498p49431n922157j1761605j1433586l86381J4128940J8866792J0079246
$$ 8930498 8181067 2258910 -9502695 -20936281 -21322662 -7193722 11673070 21752316
7096B1752316k733848r162426q136003m513979j559828o4182k84992q79035Q69634
$$ 21752316 19018468 9856042 1720039 -2793940 -4353768 -4417950 -4702942 -5581977 -4712343
7087d712343M455724N041059M87512l917902k433894K215040K609966k199638
$$ -4712343 -256619 4784440 5271952 1354050 -1079844 1135196 3745162 1545524
7079A545524n684123m054702j020536n91865j114236L13918K446146K971300L006132
$$ 1545524 -4138599 -8193301 -9213837 -9805702 -10919938 -10606020 -8159874 -5188574 -2182442
7070b182442L977935L322869j495572o978467p187340k146934K724863M735968
$$ -2182442 1795493 5118362 3622790 -3355677 -10543017 -12689951 -9965088 -5229120
7062e229120N695030N898278L017292j744193l067165R2231J596299k461342o862150
$$ -5229120 465910 6364188 9381480 7637287 4570122 4662353 6258652 3797310 -3064840
7053c064840m880881J478519M685364K237874j823431m085433m742659m429578
$$ -3064840 -7945721 -6467202 -1781838 456036 -1367395 -5452828 -10195487 -14625065
7045a4625065l377549l182969m601813m386315N00021O313237O284557J007307
$$ -14625065 -18002614 -21185583 -25787396 -30173711 -29673690 -23360453 -17075896 -16068589
7037a6068589j657386J628251N002623L401035L54422J003291L145422J732616
$$ -16068589 -17725975 -16097724 -11095101 -7694066 -7339644 -6336353 -3190931 -1458315
7029a458315j627814j038700L465850N323051J512593l116638l466787q78149
$$ -1458315 -3086129 -4124829 -658979 4664072 6176665 3060027 -406760 -1284909
7021a284909P04517J056691K222052L357519J556002k748196n167195l084045
$$ -1284909 -580392 476299 2698351 6055870 7611872 4863676 -303519 -3387564
7013c387564Q11953K180470K69531k142493k542102n22345K955523N764117M886931
$$ -3387564 -2575611 -395141 -125610 -2268103 -4810205 -5332550 -2377027 3387090 8274021
7004H274021m16625n599519m454980K868808Q665269O736978j29710m724025m901693
$$ 8274021 7857396 2257877 -2197103 671705 9336974 16073952 15944242 11220217 6318524
6995F318524m347155n262355n284271k316238J738222L792849L331650J820194
$$ 6318524 1971369 -3290986 -8575257 -10891495 -9153273 -5360424 -2028774 -208580
6987b08580O42378R68027L468680O456697N992455j30726q964920j4156240j1315490
$$ -208580 433798 1401825 4870505 11327202 17319657 17188931 8224011 -5932229 -17247719
6978a7247719j967046P270455J0144124O526808K020084R37817J609144N76565
$$ -17247719 -19214765 -11944310 -1800186 4726622 6746706 7684523 9293667 9870232
6970I870232j340896j256316m03229k335253n326819l187276M540610R469499
$$ 9870232 8529336 7273020 6869791 4534538 -792281 -3979557 561053 10030552
6962A0030552N197690l579911p374852l869990J323628L626733L922854M291326
$$ 10030552 15228242 11648331 4273479 403489 1727117 5353850 9276704 13568030
6954A3568030L795484K52377n674291r822613q510511l190186K92976j376363
$$ 13568030 17363514 17615891 11941600 2118987 -6391524 -9581710 -9288734 -10665097
6946a0665097m670442m816529l289287m249361n285202k2421R230319J1286530
$$ -10665097 -15335539 -20152068 -23441355 -27690716 -32975918 -32998339 -23768020 -12481490
6938a2481490K742490m789358j280511O468091O032331r72709k736673K962283
$$ -12481490 -9739000 -14528358 -15808869 -9340778 -3308447 -4281156 -7017829 -4055546
6930d055546O237297K080899l116876m410512n492527q341147o703446K904935
$$ -4055546 2181751 4262650 1145774 -3264738 -8757265 -17098412 -23801858 -20896923
6922b0896923J2324815J2271154N653723K046180L397499L940800J541191J37686
$$ -20896923 -8572108 3699046 9352769 11398949 14796448 18737248 20278439 20416125
6914B0416125J214573R26764k608719n553103m598205k284075k809318n513859
$$ 20416125 21630698 22557462 19948743 14395640 9797435 7513360 4704042 -809817
6906h09817n870715j772411L712830N768629K614688l180411p204916o702536
$$ -809817 -6680532 -8452943 -4740113 1028516 3643204 462793 -6742123 -13444659
6898a3444659k323100K602097M529203K727602M66333J687830N429965N858771
$$ -13444659 -15767759 -13165662 -8636459 -5908857 -5442524 -3754694 1675271 7534042
6890G534042L59705m998818k825319M196939N860095p16172o180865k781923L644300
$$ 7534042 7893747 2894929 69610 4266549 10126644 9410472 3229607 447684 4091984
6881D091984K321481o198167j0827291n833295K183724M565226J057370k830996
$$ 4091984 6413465 215298 -10611993 -16445288 -14261564 -9696338 -8638968 -11469964
6873a1469964l606050j267121L157460P628245R028127O492458L183053K078689
$$ -11469964 -15076014 -16343135 -13185675 -5557430 3470697 9963155 13146208 15224897
6865A5224897J890122m2052k917541m133552l999506m411037l934164L98566O134390
$$ 15224897 17115019 17072967 14155426 10021874 6022368 1611331 -2322833 -1924267 4210123
6856D210123O322081l02875n825495l965774P44839N80443k689786r76116N931148
$$ 4210123 10532204 10229329 4403834 438060 1182899 1763342 -926444 -1902560 4028588
6847D028588R004456M514407L55772K983034O507495K655756m720313n294918
$$ 4028588 13033044 17547451 17903223 20886257 27393752 30049508 25329195 20034277
6839B0034277O02859J765679o165188j3294275j0007732n64231M147514J785207
$$ 20034277 20637136 22402815 16237627 2943352 -7064380 -7628611 -3481097 -1695890
6831a695890p55452R95767L872108L566638P76415j023419p08156q7182m90595
$$ -1695890 -2451342 -1455575 2416533 5983171 6759586 5736167 5028011 4940829 4450234
6822D450234p33500P23059K331545L94897n225502q786613n535863O03634J236720
$$ 4450234 3716734 4439793 6771338 7166235 1940733 -6845880 -12381743 -11778109 -10541389
6813a0541389m553124q212795l547568N087444R761911Q994276O219680K715124
$$ -10541389 -15094513 -23307308 -26854876 -21767432 -12005521 -3011245 3208435 5923559
6805E923559j952654n306147m353430j574650k526921p428013j0365795p462594
$$ 5923559 3970905 -1335242 -5688672 -7263322 -9790243 -17218256 -27584051 -35046645
6797c5046645j188076M262345P542336Q920926Q415866O806765N457519L831261
$$ -35046645 -36234721 -31972376 -24430040 -15509114 -7093248 -286483 5171036 9002297
6789I002297P4710m728526n991880j360472N042306O272462L0360q229046r666815
$$ 9002297 9077007 4348481 -1643399 -3003871 2038435 8310897 8341257 112211 -9554604
6780i554604p58041J1383962J4684861N613562n586042p154801p06020K176251
$$ -9554604 -10312645 1071317 15756178 21369740 15783698 8628897 7922877 10099128
6772A0099128l194965q987004p333830o13794M308250N413087M276188J120704
$$ 10099128 6904163 -2082841 -9416671 -10030465 -5722215 -309128 3967060 5087764
6764E087764l014669l439758K422295R155297R367185L732212p62414j038136
$$ 5087764 2073095 -1366663 1055632 10210929 19578114 23310326 22547912 21509776
6756B1509776l39845j340281l148971n304276q537420j0498832o678183K221619
$$ 21509776 21169931 19829650 16680679 11376403 2838983 -7659849 -14338032 -12116413
6748a2116413Q821632P617791J049746n132524q382831q614362n250168R24256
$$ -12116413 -3294781 4323010 5372756 240232 -8142599 -16756961 -22007129 -21082873
6740b1082873N682149N209252Q73648k560286k275608Q62015L928712L496248
$$ -21082873 -15400724 -10191472 -9317824 -11878110 -14153718 -13291703 -9362991 -5866743
6732e866743j735267p528658o560770K330833J0452916R174194R20852m857136
$$ -5866743 -7602010 -15130668 -21691438 -19360605 -8907689 266505 1187357 -3669779
6724c669779m452846k254306j463184j04808K439258K396782j355416l293010
$$ -3669779 -8122625 -10376931 -11840115 -11944923 -9505665 -7108883 -8464299 -11757309
6716a1757309R36770P186068Q486629M785793J603556J198726P28432j666518
$$ -11757309 -10820539 -3634471 4852158 9637951 11241507 12440233 13168665 11502147
6708A1502147m275580n559274n954088n264522k302956J748756L213739P88029
$$ 11502147 7226567 1667293 -4286795 -9551317 -11854273 -10105517 -6891778 -6103749
6700f103749k242921k315290L9763J679069J059927m36522m97656J384351K514050
$$ -6103749 -8346670 -10661960 -10622197 -8943128 -7883201 -8319723 -8817379 -7433028 -4918978
6691d918978q81831q242674j2418273o378099P307346J7219513J5049798M275864
$$ -4918978 -5800809 -14043483 -26461756 -32839855 -25532509 -8312996 6736802 11012666
6683A1012666m752215n953787j642164K442356L289124K013368J013115P20855
$$ 11012666 6260451 306664 -1335500 1106856 4395980 6409348 7422463 8143318
6675H143318l17247k074013j709964K203385N822311M185275j400820m666659
$$ 8143318 7826071 5752058 4042094 6245479 12067790 16253065 14852245 10185586
6667A0185586l408590k102881l988954n960170m445176j545474j020628j859621
$$ 10185586 6776996 4674115 685161 -5275009 -9720185 -11265659 -12286287 -14145908
6659a4145908o10477K418833L857951K505133L5319j974695k573381j033646J120180
$$ -14145908 -14756385 -12337552 -8479601 -5974468 -5939149 -7913844 -10487225 -11520871 -10400691
6650a0400691M15247l146208m578791j530091J255005K19298K93770O271958J1847558
$$ -10400691 -9985444 -13131652 -17710443 -19240534 -17985529 -17766231 -17472461 -11200503 647055
6641F47055P709243k180965m555835K783045P235662J196937o586061n528915
$$ 647055 8356298 6175333 1619498 4402543 11638205 12835142 6249081 720166
6633G20166J290100M177417J432656j723376k960991l148242j306504K785765
$$ 720166 2010266 6187683 7620339 5896963 2935972 -212270 -1518774 1266991
6625A266991M627157J143743k726480j228751J999785m27075o528294p187726
$$ 1266991 5894148 7037891 4311411 3082660 5082445 4655370 -1872924 -9060650
6617i060650n97900N216730N017029K335672J051763k08479k129363j311644K667854
$$ -9060650 -9658550 -4441820 575209 2910881 3962644 3754165 1624802 313158 2981012
6608B981012L685511j930188q071044o462579J798563P882630O492629Q27169
$$ 2981012 6666523 4736335 -3334709 -9797288 -7998725 -116095 6376534 7203703
6600G203703k784950j627179J754158K620190p19432m306065l292363O09041N66265
$$ 7203703 4418753 2791574 4545732 7165922 6446490 2140425 -1151938 -542897 23368
6591B3368n045655q888593m829847K673700M602155k33155m650342l472004J210216
$$ 23368 -5022287 -13910880 -18740727 -16067027 -11464872 -11698027 -16348369 -19820373 -18610157
6582a8610157M777234M895590J272125m556245q211467n642897J161093N350331
$$ -18610157 -13832923 -8937333 -7665208 -12221453 -20432920 -26075817 -24914724 -19564393
6574a9564393L687359L14106K28183K607879L413421J735644O1240j84263J5874
$$ -19564393 -15877034 -15562928 -15334745 -12726866 -9313445 -7577801 -7516561 -7700824 -7684950
6565g684950j16871J28228J463935L427372M630710L396163q26922n625575o869775
$$ -7684950 -7801821 -7673593 -6209658 -2782286 1848424 5244587 4417665 -1207910 -8077685
6556h077685l618301p3589j88587k097185j388665J519618K145221l8194r8687
$$ -8077685 -11695986 -11769575 -11958162 -14055347 -15444012 -13924394 -11779173 -11817367 -11916054
6547a1916054L915318O718951L911639n48625p68241P66279l055309j0927065
$$ -11916054 -8000736 -1281785 2629854 2081229 1312988 2079267 -976042 -11903107
6539a1903107j2400746k710766Q851247J0285540J848298n916455o194885j993578
$$ -11903107 -24303853 -27014619 -18163372 -7877832 -6029534 -11945989 -18140874 -20134452
6531b0134452Q98832J407915K288993N315237R098153J0168985N897057k153242
$$ -20134452 -19235620 -17827705 -15538712 -10223475 -1125322 9043663 14940720 12787478
6523A2787478q169694p505855j997654K182712J711800j132888k663111j954997
$$ 12787478 4617784 -2888071 -4885725 -2703013 -991213 -2124101 -4787212 -6742209
6515f742209l25922R29238J317015J226143J668031K695766K572105L36938j784339
$$ -6742209 -7068131 -6138893 -4821878 -3595735 -1927704 768062 3340167 3677105 1892766
6506A892766j345100j17767j694511m990937n003980r09040J949598M73282j091221
$$ 1892766 547666 429899 -1264612 -6255549 -11259529 -12168569 -10218971 -9745689 -10836910
6497a0836910J655619N607750M991543N99288j836314o65457N60335M64011J894194
$$ -10836910 -9181291 -3573541 1418002 2017290 180976 -484481 75854 539865 2434059
6488B434059N475717P019573L989972j46441j364732j167337l201700o244030
$$ 2434059 7909776 14929349 18919321 18772880 17408148 16240811 13039111 6795081
6480F795081n199152J214963P570939P684202J421865n628686q302916o589580
$$ 6795081 1595929 2810892 10381831 18066033 19487898 13859212 5556296 -1033284
6472a033284m266117l612371k780922P03555N101846N753253J568172k682704
$$ -1033284 -5299401 -8911772 -11692694 -10989139 -5887293 -134040 1434132 -1248572
6464a248572k523159K5906m65001m493112o188904j325447O232789Q621442L262900
$$ -1248572 -3771731 -3745825 -4210826 -8703938 -14892842 -16218289 -9985500 -1364058 1898842
6455A898842m503457q048511o469158l966728l697580m064193j309641N141826
$$ 1898842 -2604615 -10653126 -17122284 -21089012 -24786592 -28850785 -30160426 -25018600
6447b5018600J0728599R716297J603618o949763q153113j515221N427932N893798
$$ -25018600 -14290001 -4573704 -2970086 -9919849 -18072962 -19588183 -14160251 -8266453
6439h266453J366704j787941j116688M13625Q13088J845752M176701M757152K053783
$$ -8266453 -6899749 -8687690 -9804378 -9390753 -8577665 -6731913 -2555212 2201940 4255723
6430D255723l32349O15422J541740j969839o707737n123816K849750P956123L722966
$$ 4255723 3923374 4538796 6080536 4110697 -2597040 -7720856 -4871106 3085017 6807983
6421F807983m840532p875813k397276N833068R611031O512209m28641n741896
$$ 6807983 1967451 -5908362 -8305638 -2472570 7138461 13650670 13222029 7480133
6413G480133o301908m470870m962675p922708q041895k117778N776490R293918
$$ 7480133 1178225 -3292645 -8255320 -16178028 -24219923 -26337701 -20561211 -11267293
6405a1267293P218681K907932j100363m308901n896647m923562k172211Q99073
$$ -11267293 -4048612 -1140680 -2241043 -6549944 -12446591 -17370153 -19542364 -18643291
6397a8643291L871671N829676M505414K16513j949426J666810O924738O782492
$$ -18643291 -14771620 -8941944 -4436530 -4220017 -6169443 -4502633 2422105 9204597
6389I204597J100989m011610n568258n927767n782279k328938L725607O403113
$$ 9204597 10305586 6293976 725718 -5202049 -10984328 -13313266 -9587659 -3184546
6381c184546L125259p70972j39017K661259L013554J668894J666101J538919k241429
$$ -3184546 -59287 -830259 -969276 1691983 4705537 6374431 8040532 9579451 7338022
6372G338022q253940j1177184q672177k852696L422405P471556O297408K74914
$$ 7338022 -915918 -12093102 -20765279 -23617975 -20195570 -12724014 -6426606 -6151692
6364f151692m579690l453006L0217m43736k817423N34945Q962841J1702903L122527
$$ -6151692 -10731382 -14184388 -14154171 -14597907 -17415330 -16880385 -7917544 3785359 6907886
6355F907886q020361r774966j846456O379256Q566886O226625L161864R63568
$$ 6907886 -1112475 -10887441 -12733897 -6354641 2212245 8438870 11600734 12564302
6347A2564302j99666m18632k42949j24744q8283q18810l085081n007775l164180
$$ 12564302 12364636 11946004 11703055 11578311 11490028 10671218 7586137 2578362 -585818
6338e85818J541014L095249j049423m643212j034508O239354P762444J641928
$$ -585818 955196 4050445 3001022 -1642190 -2676698 3562656 11325100 12967028
6330A2967028m378820m352657q08006J549700K245130K117645j84810m393456
$$ 12967028 8588208 4235551 3427545 4977245 7222375 9340020 9155210 4761754
6322D761754n746091j110685M874907M998702q54632o208055p155403n744641
$$ 4761754 -984337 -2095022 2779885 7778587 6923955 715900 -6439503 -12184144
6314a2184144m124332r40695M256763P562914N381174J05894k486792m75447K668263
$$ -12184144 -16308476 -17249171 -12992408 -5429494 -48320 57574 -2429218 -2904665 -236402
6305b36402L359243J851646N90424R31621K203240K378462o57348o647777j1389371
$$ -236402 3122841 4974487 5564911 6496532 8699772 11078234 10420886 3773109 -7616262
6296g616262r958725k603978M776814P360475O157858M342450K125008j167474
$$ -7616262 -17574987 -20178965 -15402151 -8041676 -1883818 2458632 4583640 3416166
6288C416166k835688k20439K778643p33689r406236j2725412m936167N873276
$$ 3416166 580478 360039 3138682 2404993 -7001243 -19726655 -24662822 -18789546
6280a8789546Q134105K181989j589048J886125O351188M749397p89093l065419
$$ -18789546 -10655441 -8473452 -10062500 -8176375 -1825187 2924210 2135117 -930302
6272i30302P1110L991372M202293J387587q43784j013687j012175k468519l483260
$$ -930302 -859192 3132180 7334473 8722060 7878276 6864589 5852414 3383895 -99365
6263i9365r56846L948135N663668J359790m442700n606329k831530k172359n756015
$$ -99365 -1056211 2891924 8555592 9915382 5472682 -133647 -2965177 -5137536 -10893551
6254a0893551q616296n772499J295195O841384O787869J271303o068297j0130473
$$ -10893551 -19509847 -25282346 -23987151 -17145767 -10357898 -9086595 -15154892 -25285365
6246b5285365q178040k794625J083573K338555L789808N987595N545616J466243
$$ -25285365 -33463405 -36258030 -35174457 -32835902 -29046094 -23058499 -17512883 -16046640
6238a6046640j668415j86822K954962K998652N80884n61796k95156r43172j154867
$$ -16046640 -17715055 -17901877 -14946915 -11948263 -11367379 -11929175 -12224331 -13167503 -14322370
6229a4322370K762454R208628J1019397M790534m148049q558819p391005m257515
$$ -14322370 -11559916 -2351288 8668109 13458643 9310594 751775 -6639230 -10896745
6221a0896745j115249K478194N264114L884808k164959p733077o514045J706177
$$ -10896745 -12011994 -9533800 -4269686 -384878 -2549837 -10282914 -16796959 -15090782
6213a5090782R781194J0229787L139267m188429n589202k387049m14225k300344
$$ -15090782 -5309588 4920199 8059466 3871037 -1718165 -4105214 -4519439 -6819783
6205f819783m837842l636995J506126O360820O545060J980523k640781k604608
$$ -6819783 -11657625 -15294620 -13788494 -7427674 -882614 1097909 -1542872 -4147480
6197d147480J144967K608672j658449p251290o754862Q56979Q488327R007579
$$ -4147480 -3002513 -393841 -2052290 -9303580 -16058442 -15201463 -6713136 2294443
6189B294443K909377l000010l214915J167217M384417K719211j453583l381162
$$ 2294443 5203820 2203810 -1011105 156112 4540529 7259740 5806157 2424995
6181B424995k858479m223435q535808j0008133l809315N786187J0178855P769022
$$ 2424995 -433484 -4656919 -13192727 -23200860 -27010175 -21223988 -11045133 -3276111
6173c276111M851793N432144O117578K728644l217833p390905q179401o584923
$$ -3276111 1575682 7007826 13125404 15854048 12636215 5245310 -2934091 -9519014
6165i519014l652278o15632R50594J424073L228673O781342R040440P974824N418658
$$ -9519014 -13171292 -13786924 -12836330 -11412257 -8183584 -1402242 7638198 15613022 21031680
6156B1031680L346068Q11192k618199m169177k466557j358454m281865p537029
$$ 21031680 24377748 25188940 22570741 18401564 15935007 14576553 10294688 2757659
6148B757659m896742K557709P159515N032676K32247k096870j640105p49205p73443
$$ 2757659 -2139083 418626 7578141 12610817 12843064 10746194 9106089 8356884 7583441
6139G583441k096060m196224m597788j423081K349026J675009k447215l062615
$$ 7583441 5487381 1291157 -3306631 -4729712 -2380686 -705677 -3152892 -6215507
6131f215507K194085O324045K892303m191114o415278k670333R08836J109926
$$ -6215507 -4021422 2302623 5194926 1003812 -5411466 -8081799 -7172963 -6063037
6123f063037P37217J605445J132251k057080m374314k264209K393778M875297
$$ -6063037 -5325820 -3720375 -2588124 -4645204 -9019518 -11283727 -8889949 -4014652
6115d014652L519029O76954p08369L88129K741681L691271J538818j968252l267091
$$ -4014652 -495623 181331 -527038 -138909 2602772 6294043 7832861 5864609 2597518
6106B597518j962972j803033n040151q276841o553691N5402O710421R551318Q426862
$$ 2597518 634546 -1168487 -6208638 -14485479 -21039170 -20983768 -14273347 -4722029 3704833
6097C704833M854861N38562k192213j689409N40056J237740n9054n27301R40230
$$ 3704833 8559694 9098256 6906043 5216634 5756690 6994430 6935376 6408075 7348305
6088G348305J293778j962374o095190o392168k996034j017573l336818o217636
$$ 7348305 8642083 6679709 584519 -5807649 -8803683 -9821256 -13158074 -19375710
6080a9375710m004922L244748R180197Q439707K762777j474455r40487J453487
$$ -19375710 -23380632 -20135884 -10955687 -2515980 246797 -1227658 -2168145 -714658
6072g14658J343657j314042l003418j757838Q75999K428009J664160j560897n871801
$$ -714658 628999 -685043 -3688461 -5446299 -4570300 -2142291 -478131 -2039028 -7910829
6063g910829p690079m256517J708138L804977K64608k973434l17685N537879P722893
$$ -7910829 -15600908 -19857425 -18149287 -14344310 -14079702 -17053136 -17370821 -11832942 -4110049
6054d110049M772939J119331o38607k127740l536607j586600M337561Q803220
$$ -4110049 662890 1782221 1143614 -984126 -4520733 -6107333 -1769772 7033448
6046G033448O697346j10947n765790p373356n560423r22138N344866Q827904N440818
$$ 7033448 13730794 13619847 7854057 480701 -5079722 -6001860 -656994 8170910 13611728
6037A3611728j938515n252476j413088L416229K299368l103500n458192k192870
$$ 13611728 11673213 6420737 5007649 8423878 10723246 7619746 2161554 -31316
6029c1316J470555L69527l388020l430412K119325P541899O071781j595282p259610
$$ -31316 1439239 1808766 -1579254 -5009666 -2890341 4651558 10723339 9128057 1868447
6020A868447m613914K749151N248047q00438q482401r215301l181918K682060
$$ 1868447 -2745467 3684 5251731 4451293 -4031108 -13246409 -16428327 -13746267
6012a3746267M690764N039512N016150K127791l646136o616719l022030K289512
$$ -13746267 -9055503 -4015991 1000159 3127950 -518186 -7134905 -10156935 -7867423
6004g867423K406906j324702k018506J262340K218399j724068m585578j138231
$$ -7867423 -5460517 -6785219 -8803725 -7541385 -5322986 -7047054 -11632632 -12770863
5996a2770863M974465O944718M255378J372111L30j840530m241625m107821p8643
$$ -12770863 -7796398 -851680 3403698 4775809 4776139 2935609 -1306016 -5413837 -5492480
5987e492480M823196O700859M999761K269039N93692r45613m517975q907918q949261
$$ -5492480 -669284 6031575 11031336 13300375 13894067 12948454 8430479 -477439 -9426700
5978i426700k637311L401319J368742n424336n613730L188956R666429N844900
$$ -9426700 -12064011 -8662692 -7293950 -12718286 -18332016 -15143060 -5476631 368269
5970C68269p64099l27232K849439r53397p928998n533448N711200J0897304L517865
$$ 368269 -395830 -723062 2126377 1172980 -6756018 -12289466 -6578266 4319038 7836903
5961G836903m979121l754014K241516L412114J015124J765696M758574M090434
$$ 7836903 2857782 -896232 1345284 4757398 5772522 7538218 12296792 16387226
5953A6387226j64178k820364k539015k200104k520268j912673r11878j210130
$$ 16387226 16223048 13402684 10863669 8663565 6143297 4230624 3318746 2108616
5945B108616k102664k261374k383219k288264N56038N386870O315294J625676
$$ 2108616 5952 -2255422 -4638641 -6926905 -6370867 -983997 5331297 6956973
5937F956973j097607L470160P577767R13222j2103308j6604997p465216N217457
$$ 6956973 5859366 9329526 16907293 17820515 5717207 -10887790 -18353006 -13135549
5929a3135549J0783909Q416629K180233m675370q231011n114909J837861N595022
$$ -13135549 -2351640 6064989 8245222 3569852 -4661159 -9776068 -7938207 -2343185
5921b343185M300539K392306J897602K90429k008581o60777L753689M485017n28032
$$ -2343185 1957354 4349660 6247262 6537691 4529110 3868333 7622022 12107039 11579007
5912A1579007m716477l586455j229451j576529j326244K473554N294543K782209
$$ 11579007 6862530 3276075 2046624 470095 -856149 1617405 6911948 9694157
5904I694157o56428J141729N262071M277016j448017m496372k354489q02756m385325
$$ 9694157 9037729 10179458 15441529 19718545 18270528 13774156 11419667 10616911 6231586
5895F231586r561007r770271l974862K173752K863726j143279l137764J209659
$$ 6231586 -3329421 -13099692 -17074554 -14900802 -12037076 -13180355 -16318119 -15108460
5887a5108460P716338Q997188M637854J182662K199275M248148L706208J394039
$$ -15108460 -7392122 1605066 6242920 7425582 9624857 13873005 17579213 18973252
5879A8973252j371154n029330p889623o511671k368985j091660k589376k98580
$$ 18973252 17602098 12572768 4683145 -1828526 -4197511 -5289171 -7878547 -8177127
5871h177127O332467Q445143K278216l291222j318426J505592k271780o225645
$$ -8177127 -1844660 6600483 8878699 5587477 4269051 5774643 3502863 -2722782
5863b722782j198140O931157N699804k894681n750660n58876J795250l133726
$$ -2722782 -3920922 3010235 8710039 5815358 64698 -494178 1301072 -1832654
5855a832654o860360l598547J642164M190112O130225P531389L664889m014789
$$ -1832654 -8693014 -12291561 -10649397 -6459285 -329060 7202329 10867218 6852429
5847F852429n949250M94057N135884Q52584n170552l908705J252073J748244k283702
$$ 6852429 903179 1397236 6533120 7385704 2215152 -1693553 -441480 1306764 -976938
5838i76938m571836l367289j059786K067250N964313O967598K941381j603280
$$ -976938 -5548774 -8916063 -9975849 -7908599 -1944286 5023312 7964693 6361413
5830F361413j766995N73848J600363K400092M638851M904318O80459l213147j999246
$$ 6361413 4594418 5168266 6768629 9168721 13807572 18711890 19392349 16179202 14179956
5821A4179956K40693k385172o575615n445683r47399j29517k231996j062904J700698
$$ 14179956 14420649 12035477 5459862 14179 -933220 -1062737 -3294733 -4357637 -2656939
5812b656939j746803j0023040j1883021l711283M295480M183634J517331L922982
$$ -2656939 -4403742 -14426782 -26309803 -30021086 -25725606 -21541972 -20024641 -16101659
5804a6101659P833926N472965j447095m456132j368776K039390K212999K083849
$$ -16101659 -8267733 -2794768 -4241863 -8697995 -10066771 -8027381 -5814382 -3730533
5796c730533M302872O074715L209441l769825r799237j0483689o087143p78868
$$ -3730533 572339 6647054 9856495 6086670 -3712567 -14196256 -20283399 -21062267
5788b1062267J528467L96729j837703k789978j246982K747068P053945Q016539
$$ -21062267 -19533800 -19137071 -20974774 -23764752 -25011734 -22264666 -15210721 -7194182
5780g194182M514527L57875m97538R3851k318930o157060m328808M717666J2072461
$$ -7194182 -2679655 -2321780 -2819318 -2725467 -5044397 -11201457 -15530265 -10812599 1259862
5771A259862Q859871j697265p699727k997719O115996R159745L259380m922366
$$ 1259862 10119733 8422468 722741 -2274978 3841018 13000763 16260143 11337777
5763A1337777p519181l718407O47161L87646l890830p826633q246638m931557
$$ 11337777 3818596 100189 747350 1134996 -2755834 -10582467 -18829105 -23760662
5755b3760662L96207M804834N610206L496138K660199N340042Q001550O116112
$$ -23760662 -23364455 -18559621 -12949415 -9453277 -6793078 -1453036 6548514 12664626
5747A2664626Q73237k820002l466692l435550l389320j656802R98080J555546
$$ 12664626 13537863 10717861 7251169 3815619 426299 -1230503 -232423 1323123
5739A323123K75153N80682K503644J997628j702659m030165k624728q31768o82587
$$ 1323123 1598276 2178958 4682602 6680230 4977571 947406 -1677322 -2509090 -3191677
5730c191677J277706O786034J0350292O653861r89295n507553n796206n544631
$$ -3191677 -1913971 4872063 15222355 21876216 20886921 15379368 9583162 4038531
5722D038531n469228l389646k00286Q23202k5619M88332K300566K000976r23836
$$ 4038531 -1430697 -4820343 -5020629 -4197427 -4223046 -3734714 -1434148 566828 -357008
5713c57008l115319l052648k711113k774370j134696K395906M260373K008001
$$ -357008 -3472327 -6524975 -9236088 -12010458 -13145154 -10749248 -6488875 -4480874
5705d480874k307790n109626m830289j520369L903176Q817359J0271692Q470749
$$ -4480874 -6788664 -11898290 -16728579 -18248948 -14345772 -5528413 4743279 13214028
5697A3214028O306668M769352K087532j625470k883646l41409J605579j819101
$$ 13214028 19520696 24290048 26377580 24752110 21868464 21527055 23132634 21313533
5689B1313533q659173j1856977p542885P60245O268400N528542N49942m330684
$$ 21313533 12654360 797383 -6745502 -5985257 283143 5811685 6361627 2030943
5681B030943o528023o040692l514125M40938L817800L932021J324635J99091K123810
$$ 2030943 -4497080 -10537772 -14051897 -13610959 -9793159 -5861138 -4536503 -4337412 -2213602
5672b213602K173534m087825j1879835j1722564k624319N826192O311533K416061
$$ -2213602 -40068 -4127893 -16007728 -27730292 -30354611 -24528419 -18216886 -15800825
5664a5800825J046655K018360O09460l237108m499789p85714M561683P208690
$$ -15800825 -14754170 -12735810 -12126350 -15363458 -19863247 -20648961 -16087278 -8878588
5656h878588O172186L213505N39261p10225j348371l029289n140585m586606m26624
$$ -8878588 -2706402 507103 1046364 336139 -1012232 -4041521 -9182106 -13768712 -14195336
5647a4195336L697017M488837L797051M730003N414843J842395m337208o968651
$$ -14195336 -10498319 -6009482 -2212431 2517572 7932415 9774810 5437602 -1531049
5639a531049m692817k843849m153855l782459K352370R306589Q992081J720455
$$ -1531049 -6223866 -9067715 -13221570 -17004029 -14651659 -5345070 3647011 5367466
5631E367466m201086l863376j052785r52026k560204j593737K136514M398071
$$ 5367466 1166380 -2696996 -3749781 -4701807 -7262011 -8855748 -6719234 -2321163
5623b321163K921045M74738N08595K284002K475235L20959j520225j354744r73110
$$ -2321163 599882 1074620 1583215 3867217 6342452 6663411 5143186 3788442 2815332
5614B815332k333559l941369l119626o47158J10594j415544j960196J99192K182779
$$ 2815332 481773 -3459596 -6579222 -7226380 -7115786 -8531330 -10491526 -10292334 -8109555
5605h109555J010859j634945k260498j198371j598288l612939l656559J9417M520767
$$ -8109555 -7098696 -8733641 -10994139 -12192510 -13790798 -17403737 -21060296 -21040879 -16520112
5596a6520112O294582N101932K770955P33067K71435K323473M940152L759445
$$ -16520112 -10225530 -5123598 -2352643 -1619576 -1348141 975332 5915484 9674929
5588I674929k171539p538168p139335k925877m50650j41938K198301O472294O533925
$$ 9674929 7503390 -34778 -7174113 -10099990 -10550640 -10692578 -8494277 -2021983 4511942
5579D511942j92571p082333o744018j231976J366389j588559m698213l147711
$$ 4511942 4319371 -2762962 -9506980 -10738956 -9372567 -10961126 -15659339 -18807050
5571a8807050J041123K833624R18935j336022o6467N063564J0050777R752470
$$ -18807050 -17765927 -14932303 -14013368 -15349390 -15415857 -10352293 -301516 9450954
5563I450954L356818l622110m918846j088750J111853k303707o992372n862767
$$ 9450954 12807772 9185662 4266816 3178066 4289919 1986212 -5006160 -10868927
5555a0868927J442091P504356N810599j578548o503791m268118J167684K669150
$$ -10868927 -9426836 -1922480 3888119 2309571 -4194220 -8462338 -7294654 -4625504
5547d625504q86590l763745j795401J965366K179122j216068l892155l653332
$$ -4625504 -5512094 -9275839 -11071240 -9105874 -6926752 -8142820 -12034975 -15688307
5539a5688307j959690Q1703K782476M928709M236029J626579R38748L055050M244204
$$ -15688307 -17647997 -17566294 -14783818 -9855109 -5619080 -3992501 -3053753 1297 4245501
5530D245501J985661j492298l537983m868490o227639n208234l02922M874527
$$ 4245501 6231162 4738864 1200881 -3667609 -9895248 -15103482 -15406404 -10531877
5522a0531877N656690K550438m77703j905408k702580k426890j77108J692716
$$ -10531877 -4875187 -2324749 -2802452 -4707860 -7410440 -9837330 -10014438 -8321722
5514h321722P0178k958536k067307K699907M812750Q02496m135776l522118J290632
$$ -8321722 -8251544 -11210080 -13277387 -10577480 -5764730 -4962234 -9098010 -12620128 -11329496
5505a1329496L657493R59656l084079m496371l151282m35628L339586P393430
$$ -11329496 -7672003 -6712347 -9796426 -14292797 -17444079 -17879707 -14540121 -7146691
5497g146691R038019O454824J776258j097742j360358j398514j909930l13031
$$ -7146691 1891328 8346152 10122410 9024668 7664310 6265796 4355866 4042835
5489D042835M064415O419844K052069o038686r787253o300185q50272J204634
$$ 4042835 8107250 14527094 16579163 10540477 753224 -5546961 -6397233 -5192599
5481e192599N72838O6485n24744k035456k528747o20520J099083M93330N79751
$$ -5192599 -4619761 -4553276 -5078020 -7113476 -9642223 -10262743 -9163660 -8670330 -8090579
5472h090579M496444Q424325N827659k545606r110355r326012n201169M27158
$$ -8090579 -3594135 4830190 10657849 8112243 -998112 -10324124 -15525293 -15098135
5464a5098135O306703R230771N592122j567453l979069N06173M319082J308193
$$ -15098135 -8791432 439339 6031461 4464008 484939 991112 5310194 6618387
5456F618387m679649o676253m457231k276293j285422n043Q77592j52358j458418
$$ 6618387 1938738 -4737515 -9194746 -11471039 -12756461 -12761504 -11883912 -12036270 -13494688
5447a3494688o53652P19163m92034l409046m022878q29669L770542O655571O081802
$$ -13494688 -14148340 -13429177 -13921211 -17330257 -21353135 -22182804 -18412262 -11756691 -5674889
5438e674889K460392q19883j54431K611664J440538m285831p125621k988222J448141
$$ -5674889 -3214497 -4034380 -4188811 -1577147 -136609 -4422440 -11548061 -14536283 -13088142
5429a3088142l34176k948918J766465Q969462O809953l756403q896513l030334
$$ -13088142 -13422318 -16371236 -14604771 -5635309 1174644 -2581759 -11478272 -14508606
5421a4508606L473877K028235j417155J473925P177168P486589L181134P91770
$$ -14508606 -11034729 -9006494 -10423649 -8949724 -1772556 5714033 8895167 9686937
5413I686937J080319J07129j900283j524528M83224P13563j24432O54558R91953
$$ 9686937 10767256 10874385 8974102 7449574 7932798 8646361 8521929 9176487 10168440
5404A0168440k611769o797270m931534J524827M035168J86542k851523l19338
$$ 10168440 7556671 759401 -4172133 -2647306 1387862 1574404 -1277119 -1596457
5396a596457L060443J954079r59509o87341J305764L11618l053753l770551n90239
$$ -1596457 1463986 3418065 2458556 1771215 3076979 3388597 334844 -3435707 -4025946
5387d025946K079706P45181k620514l743857j541072Q90404J84858l216099n657389
$$ -4025946 -1946240 -1201059 -3821573 -7565430 -9106502 -8216098 -8031240 -11247339 -16904728
5378a6904728n087156l517851l093324k027536J874015N324597K706516m713044
$$ -16904728 -21991884 -25509735 -28603059 -30630595 -28756580 -23431983 -20725467 -25438511
5370b5438511q798994n707722j038262m60388j058192K627429Q515446R754290
$$ -25438511 -34237505 -39945227 -40983489 -41443877 -42502069 -39874640 -31359194 -21604904
5362b1604904N212442N31793m68105N65431J313297J572575Q39305j554259l104661
$$ -21604904 -16392462 -15860669 -16328774 -15763343 -14450046 -12877471 -12038166 -13592425 -16697086
5353a6697086k05404N259947O811422K796641n63615J425882M687606K859746
$$ -16697086 -16902490 -11642543 -4831121 -2034480 -2598095 -1172213 3515393 6375139
5345F375139l114082p039935o310616l354765m3602L775111O613860N555424J101120
$$ 6375139 3261057 -3778878 -10089494 -13444259 -13487861 -9712750 -3098890 2456534 3557654
5336C557654k289273j779265Q49875K642208K845766K074920J301703K554093
$$ 3557654 1268381 -510884 338991 2981199 5826965 7901885 9203588 11757681
5328A1757681O997027J0930628P893474k419023j1150678j0400687l663159j115896
$$ 11757681 18754708 29685336 37578810 35159787 24009109 13608422 9945263 8829367
5320H829367n895253j0822755r203329l034439K017118M758098P187370Q406517
$$ 8829367 2934114 -7888641 -17091970 -20126409 -18109291 -13351193 -6163823 2242694
5312B242694N506145j92932l189629j379657P28961j292204n338374o257912l284224
$$ 2242694 7748839 7555907 4366278 2986621 3715582 2423378 -2914996 -9172908 -12457132
5303a2457132J01039K408191N424519Q878007Q770088L459026k531119m409099
$$ -12457132 -12356093 -9947902 -4523383 4354624 13124712 16583738 14052619 9643520
5295I643520l964967o009119r758203r375846l291760K723443L869896K574855
$$ 9643520 5678553 -330566 -10088769 -19464615 -22756375 -20032932 -16163036 -13588181
5287a3588181K848608K857197j317492p023808o787979J042107R220749J0951654
$$ -13588181 -10739573 -7882376 -9199868 -16223676 -23011655 -21969548 -12748799 -1797145
5279a797145P467036L672990O58638l345776p496304q775699p044111n332507
$$ -1797145 5669891 9342881 10001519 6655743 -840561 -9616260 -16660371 -21992878
5271b1992878m831271l198643J137462N846982P358817M860806M99710k936259
$$ -21992878 -26824149 -30022792 -28885330 -23038348 -15679531 -10818725 -10319015 -13255274
5263a3255274l539984q99284L435208O601033O421019K934045j562734l509975
$$ -13255274 -16795258 -17694542 -14259334 -7658301 -1237282 1696763 134029 -3375946
5255c375946m12855N996548R830378O873397M6408l811241k488839j02947K19521
$$ -3375946 -3788801 2207747 12038125 18911522 18957930 15146689 12657850 12554903 12774424
5246A2774424O63044L436112N691856L827016l15088k220154j569651j467531
$$ 12774424 13437468 16873580 22565436 26392452 26077364 23857210 22287559 20820028
5238B0820028k263783j473263O01302O60593j512033j943269J009435L634022
$$ 20820028 18556245 17082982 17684284 18344877 16832844 14889575 15899010 19533032
5230A9533032K421878j332375m609846o559866p056480n219326k201352j904814
$$ 19533032 21954910 20622535 16012689 9452823 2396343 -2822983 -5024335 -6929149
5222f929149n636175r058086p766908l072406J136988M268654P723794J0362481
$$ -6929149 -12565324 -21623410 -29390318 -32462724 -31325736 -27057082 -19333288 -8970807
5214h970807R882822O988491L918381N75072l503335n340722k091786K845555
$$ -8970807 912015 7900506 11818887 12393959 8890624 3549902 1458116 4303671
5206D303671L179121j090597l699574j690376J089952J292490P43116J279301
$$ 4303671 7482792 6392195 2692621 1002245 2092197 3384687 4127803 5407104
5198E407104M27947l950352q634347q656151l651787K337057N553771M954918
$$ 5407104 5835051 1884699 -6749648 -15405799 -19057586 -16720529 -11166758 -6211840
5190f211840J938033o41442r29401k43824m88744J38462M451502R124796O555476
$$ -6211840 -4273807 -4915249 -5844650 -6088474 -6577218 -6438756 -1987254 7137542 13693018
5181A3693018l652941j1449925r005189j074832K891529K073182K444331M916767
$$ 13693018 10040077 -1409848 -10415037 -11489869 -8598340 -6525158 -4080827 835940
5173H35940L958328k025788o544913l513864N047056J1921103J1998376N561557
$$ 835940 4794268 2768480 -3776433 -7290297 -2243241 9677862 21676238 27237795
5165B7237795k639511o763042n073315k158863l319836p104863p113975j394884
$$ 27237795 24598284 17835242 12761927 10603064 7283228 178365 -6935610 -8330494
5157h330494M324063M354755K03681k543187j741131N7792N80809Q41189K531821
$$ -8330494 -4006431 348324 552005 -1991182 -3732313 -3674521 -3093712 -2252523 279298
5148B79298M454080L554391m03516l243380j455109K261812J856256l407675p097147
$$ 279298 4733378 8287769 7884253 4640873 3185764 5447576 7303832 3896157 -3200990
5139c200990m334965J317492K995050r3656k295598P29381P118032J1113082Q340800
$$ -3200990 -7535955 -6218463 -3223413 -3317069 -5612667 -4883286 2234746 13347828 21688628
5130B1688628K0413o811799n685115J277555N143409J789082k993774l054354
$$ 21688628 21709041 14897242 9212127 10489682 15633091 17422173 14428399 11374045
5122A1374045q93848k057508n816736p969286q359241q274874m758169L769556
$$ 11374045 10480197 8422689 2605953 -5363333 -13722574 -21997448 -26755617 -22986061
5114b2986061R974819O000329k840487l848844M252321R804079O347449N57403
$$ -22986061 -13011242 -7010913 -9851400 -13700244 -9447923 356156 6703605 7261008
5106G261008n00435J293712K485730M180365N961848L582068j912605k362790
$$ 7261008 6760573 8054285 10540015 14720380 20682228 24264296 22351691 19988901
5098A9988901M136506P470040K06660j0655922j4400478j0865444n727097L44014
$$ 19988901 24125407 31595447 31802107 21146185 6745707 -4119737 -9846834 -9502820
5090i502820P906461J1031822M612950n004710p305429k437884R45889j84922
$$ -9502820 -1596359 9435463 14048413 9043703 1738274 -699610 246279 61357
5082F1357j245723l66736q53654l514424m951611l849544k203174o99151J062686
$$ 61357 -1184366 -1551102 -2404756 -5919180 -10870791 -14720335 -16923509 -17622660 -16559974
5073a6559974J152521j644756l332007J01567N131964N354801J429107r82252
$$ -16559974 -15407453 -17052209 -20384216 -20282649 -15150685 -9795884 -8366777 -9349029
5065i349029p15632m79857P59012N566044R897504P021643r30843m987529k839432
$$ -9349029 -10064661 -10544518 -9785506 -4219462 5678042 12699685 11768842 6781313 3941881
5056C941881n51617n56842J400052N645691N677366n79025o119362n787224l605980
$$ 3941881 3390264 2833422 4233474 9879165 15556531 14977506 8858144 3070920 -535060
5047e35060m771263p696432q488345o831580l390388K396552Q088984P997609
$$ -535060 -5306323 -13002755 -21491100 -28322680 -31713068 -29316516 -21227532 -13229923
5039a3229923J262259n313668o183235l497204j344884P11705M373846P875397
$$ -13229923 -11967664 -17281332 -23464567 -26961771 -28306655 -27594950 -23221104 -15345707
5031a5345707Q631809O973216M464988J971755O98857Q62710j021524p755569
$$ -15345707 -6713898 259318 4724306 6696061 7394918 8257628 7236104 -519465
5023e19465j4080197j0969431J370874J2371972J4659162J0771099M760712l208501
$$ -519465 -14599662 -25569093 -24198219 -11826247 2832915 13604014 18364726 15156225
5015A5156225j0524245j0592990l222626K352385Q05502j441844J804189N391458
$$ 15156225 4631980 -5961010 -9183636 -6831251 -6025749 -7467593 -5663404 -271946
5007b71946J961291m945211o061798P4957O742990Q495968M663111k616944q394841
$$ -271946 1689345 -3255866 -9317664 -9242707 -2499717 5996251 10659362 8042418 -352423
4998c52423p419213j336357K012934M44500J006204O792083R662474L674237l693157
$$ -352423 -7771636 -9107993 -7095059 -6650559 -5644355 1147728 10810202 14484439 10791282
4989A0791282l484126J53552j373487n444395m010617Q70465R14934k982807k808022
$$ 10791282 7307156 7460708 6087221 642826 -3367791 -2497326 -1582392 -4565199 -7373221
4980g373221J720107L610470K115004K492336L316802k108233j1065662j1985960
$$ -7373221 -5653114 -2042644 72360 2564696 5881498 3773265 -7292397 -19278357
4972a9278357k305253O793961P072826L195294J889185K061287R93590P82399
$$ -19278357 -21583610 -14789649 -7716823 -4521529 -2632344 -571057 422533 1204932
4964A204932K559807K188865k339889n830987l813908J21554L21174k295423k771636
$$ 1204932 3764739 5953604 3613715 -2217272 -6031180 -5909626 -5588452 -7883875 -10655511
4955a0655511J64576L419414M326779K926125J075469R84154K967143M268267
$$ -10655511 -10490935 -7071521 -2744742 181383 1256852 2241006 5208149 9476416
4947I476416K260730j735921m612241o134345p740080q219650n312634o51293
$$ 9476416 11737146 10001225 5388984 -745361 -8485441 -16705091 -22017725 -22669018
4939b2669018J684607R21252l73129q04013m31202J563971M767888N447926J850696
$$ -22669018 -20984411 -20063159 -20436288 -21240301 -21671503 -20107532 -15339644 -9891718 -8041022
4930h041022j134243J343848N519313M046240k525351o474421l773816K113642
$$ -8041022 -9175265 -7831417 -2312104 1734136 -791215 -7265636 -11039452 -8925810
4922h925810N801512L989092l276156j0147925q227919J980686Q900680N884137
$$ -8925810 -3124298 864794 -2411362 -12559287 -20787206 -18806520 -9905840 -4021703
4914d021703J338989L888878P038339J404037o789764n414552K428804M499920
$$ -4021703 -2682714 1206164 8244503 9648540 2858776 -2555776 -126972 4372948
4906D372948J034633J499406M206175n13987r518517j0405391m521562m679696
$$ 4372948 5407581 6906987 11113162 10599175 1080658 -9324733 -13846295 -18525991
4898a8525991j0388940q341029J571708M847766o80478j379035N113176N239933
$$ -18525991 -28914931 -37255960 -35684252 -30836486 -31516964 -32895999 -27782823 -22542890
4890b2542890k912548m113462N230550R661328L285400j630025j088345m371372
$$ -22542890 -25455438 -29568900 -24338350 -14677022 -11391622 -13021647 -14109992 -18481364
4882a8481364p205349M695016J9260272Q359283j6426797j1589386J8598500J7481975
$$ -18481364 -25686713 -20991697 -1731425 6627858 -9798939 -21388325 -2789825 14692150
4874A4692150j4936033J2011476J35478853K31196702J54210579m8054354j78236782
$$ 14692150 -243883 11767593 147246446 378443148 532653727 484599373 306362591
4867C06362591j41038188m0455835m664450k5539500k7426372l050802J830426
$$ 306362591 165324403 124868568 120204118 94664618 67238246 64187444 66017870
4860F6017870j5309846j6292669L221564J0641400k245467j0558410m642793q42319
$$ 66017870 50708024 34415355 37636919 48278319 46032852 35474442 30831649 29989330
4852B9989330n274795n909100q62085j257747n949126k873955N193355L646487
$$ 29989330 24714535 18805435 17943350 16685603 10736477 7862522 13055877 16702364
4844A6702364o273080q813963j827314J402179k200715k411266J608158n51397
$$ 16702364 10429284 1615321 -211993 1190186 -1010529 -3421795 -1813637 -2365034
4836b365034q162631p878598K535839R911509Q145776N269304N128474J382581
$$ -2365034 -10527665 -18406263 -15870424 -5958915 2186861 7456165 12584639 13967220
4828A3967220o477666r525407n982929m227082n642701j895115O805816Q764839
$$ 13967220 7489554 -2035853 -8018782 -12245864 -17888565 -19783680 -12977864 -4213025
4820d213025J493808k378178L243253P412832J850661m687320k136370M252600
$$ -4213025 -2719217 -5097395 -1854142 5558690 7409351 2722031 585661 4838261
4812D838261M273189r93281m229811m611565n293603m972445j208321K958001
$$ 4838261 9111450 8118169 3888358 -723207 -6016810 -10989255 -12197576 -9239575
4804i239575L427422J927249K443239M660296N695376M652778K068751j329482
$$ -9239575 -5812153 -3884904 -1441665 3218631 8914007 13566785 15635536 14306054
4796A4306054l343813k307976j129930l680101p195175n485811M49162L710506
$$ 14306054 10962241 8654265 7524335 3844234 -3350941 -8836752 -8387590 -4677084
4788d677084L474936N363145Q869980O397929k176108o507063k379088J080360
$$ -4677084 -1202148 4160997 13030977 19428906 17252798 10745735 8366647 9447007
4780I447007k424973n143183O06182P910101O129241j898612n419248k806149
$$ 9447007 7022034 1878851 2485033 10395134 16524375 14625763 9206515 6400366
4772F400366j300896l223140l594278m07964K069410O61764k719889m690273l555859
$$ 6400366 5099470 1876330 -1717948 -2125912 -56502 605262 -2114627 -6804900 -10360759
4763a0360759N1547K376764q43909p594565r551662l031330M859439O168760L036864
$$ -10360759 -10309212 -7932448 -8776357 -16370922 -25922584 -28953914 -24094475 -17925715 -14888851
4754a4888851K263803L837529K778808j020932l077075k318555r69990J880379
$$ -14888851 -12625048 -8787519 -6008711 -7029643 -10106718 -12425273 -13395263 -11514884
4746a1514884Q360076J4100480J1055278m56052r802031q849923j236225L974815
$$ -11514884 -3154808 10945672 22000950 21544898 11742867 2892944 1656719 5631534
4738E631534L427006Q57435J09648M43439j152237m828114o749684m146094j61584
$$ 5631534 9058540 9915975 10025623 10469062 9316825 4488711 -2260973 -6407067 -6568651
4729f568651m56055m923004p039469k899725L663910P429517Q409959Q457267
$$ -6568651 -7024706 -11947710 -18987179 -21886904 -18222994 -10793477 -2383518 6073749
4721F073749O031708l22863o656586p521242l384455O48537J840663J241834L7219
$$ 6073749 12105457 11782594 5126008 -2395234 -5779689 -5131152 -3290489 -2048655 -2011436
4712b011436j066807m91788J946242L079610N93708k895097l913700l642755m742351
$$ -2011436 -3078243 -3570031 -1623789 1455821 2049529 -845568 -4759268 -8402023 -13144374
4703a3144374n393831k034615L871146P361066O952119M997732K583663p06865
$$ -13144374 -18538205 -20572820 -16701674 -9340608 -2388489 2609243 5192906 4486041
4695D486041l334481l336749k037780j437009n462L599195N486551K034311k046074
$$ 4486041 1151560 -2185189 -4222969 -5659978 -5665440 -2066245 3420306 5454617 3408543
4686C408543O44126P727025R151402K069981n205917n752154k295927l81548o54329
$$ 3408543 4052669 11779694 20931096 23001077 17795160 12043006 9747079 9365531 8711202
4677H711202j056160n51328J853776O031232P201512L84275r929079j2608613
$$ 8711202 7655042 7103714 8957490 14988722 22190234 22574509 12645430 36817
4669C6817n329115J267128q16235n643335l846871L097854O775016M409584k98947
$$ 36817 -5292298 -4025170 -4841405 -10484740 -14331611 -11233757 -4458741 -49157 -348104
4660c48104m733973q084394p633908j792831N021611O929382M436688K323928
$$ -348104 -5082077 -13166471 -20800379 -22593210 -17571599 -10642217 -6205529 -3881601
4652c881601J950771J371712Q34723K007986L417306K545713Q51027R76363J028431
$$ -3881601 -1930830 -559118 275605 2283591 5700897 8246610 9097637 10074000 11102431
4643A1102431k054770n582663m819560j945284l160025p595652p979170k851520
$$ 11102431 9047661 3464998 -1354562 -3299846 -6459871 -14055523 -22034693 -24886213
4635b4886213J119692Q46604J327772M985091N982646Q73244l496824l14685N482238
$$ -24886213 -23766521 -22919917 -21592145 -16607054 -10624408 -9751164 -13247988 -13562673 -8080435
4626h080435M565713j944873m161628J715645Q508819Q308262J138862p344666
$$ -8080435 -3514722 -5459595 -9621223 -7905578 603241 8911503 10050365 2705699
4618B705699j1658841r411543k877564J913361J356456r22894P01182N239403
$$ 2705699 -8953142 -18364685 -21242249 -19328888 -17972432 -18895326 -18194144 -12954741
4610a2954741O976367M835205L139429K909310J00696n400998o908746j422591
$$ -12954741 -5978374 -1143169 1996260 4905570 5006266 -394732 -7303478 -8726069
4602h726069L855056J573199m458392n139256K92735M290656L111525J103646
$$ -8726069 -4871013 -3297814 -7756206 -12895462 -12602727 -8312071 -5200546 -4096900
4594d096900K301649M563400M270641J749418o01839j919650k350034j814451
$$ -4096900 -1795251 2768149 7038790 8788208 8186369 6266719 3916685 2102234
4586B102234j160032k090217m499662o071872n388004l048499N41280N107528
$$ 2102234 942202 -1148015 -5647677 -11719549 -17107553 -20156052 -19614772 -14507244
4578a4507244P758158M836183j601299l788572J891581Q808907Q017032m18729
$$ -14507244 -6749086 -1912903 -3514202 -7302774 -5411193 3397714 11414746 10996017
4570A0996017q476107j0687620q790148o482901m265453o70555M351127Q735393
$$ 10996017 2519910 -8167710 -16957858 -23440759 -27706212 -28376767 -24025640 -15290247
4562a5290247R824479O406206J57020n435026q252596q457052o004408k92022
$$ -15290247 -5465768 940438 1097458 -4337568 -12590164 -21047216 -27051624 -27343646
4554b7343646O256413Q239029M229288L6840O17195K310977q89242o388502o262709
$$ -27343646 -21087233 -12848204 -8618916 -8582076 -7964881 -5653904 -6543146 -12931648 -19194357
4545a9194357l40504K996486L37218j512550K635964P664787O909789K625063
$$ -19194357 -19534861 -16538375 -16201157 -17713707 -15077743 -7412956 -503167 2121896
4537B121896P36188P19050j203419k842134O77938O192313M789775m264265j0888537
$$ 2121896 2858084 3577134 2373715 -468419 209519 6401832 11191607 6927342 -3961195
4528c961195q398764k363756n56480j029302K654672Q654097Q028407j585069
$$ -3961195 -12359959 -14723715 -15280195 -16309497 -13654825 -5000728 3027679 1442610
4520A442610j1059926j1193869l795151K390853L259666J966564J417807j73180
$$ 1442610 -9617316 -20811185 -24606336 -22215483 -18955817 -16989253 -15571446 -15744626
4512a5744626m402955p693102n366525R09876M253913J673876j876003n31277
$$ -15744626 -20147581 -27840683 -33207208 -32297332 -28043419 -26369543 -28245546 -28776823
4504b8776823M512679P254596N314340K396723K641198N870827R085133R842469
$$ -28776823 -24264144 -17009548 -11695208 -9298485 -6657287 -786460 8298673 18141142
4496A8141142P052234R56348n844138r105625o844021j882777R55025k73900l492025
$$ 18141142 25193376 26149724 20305586 11199961 4355940 2473163 3428188 3154288 -337737
4487c37737n438537m462646j331068J407972J528923j91241l37254K570044N050686
$$ -337737 -5776274 -10238920 -11569988 -10162016 -8633093 -8824334 -9161588 -6591544 -1540858
4478a540858K677502l441632p140570m549710J736371O586770P657999N660527
$$ -1540858 1136644 -2304988 -9445558 -13995268 -12258897 -5672127 1985872 7646399
4470G646399K369722L99492K093283N836881N956083k99309p787171r519887n934596
$$ 7646399 10016121 10415613 12508896 18345777 24301860 24002551 16215380 6695493 760897
4461G60897l262029l781612l670904q33394J671776K004662K955193N528741N197567
$$ 760897 -2501132 -6282744 -9953648 -10787042 -9115266 -7110604 -4155411 1373330 6570897
4452F570897l91078n254503l201915J792339J025109n286885q015002k583828
$$ 6570897 6179819 925316 -2276599 -484260 540849 -4746036 -12761038 -15344866
4444a5344866N452280R492631R114600N985197j16721p289081r826232n613088
$$ -15344866 -9892586 -399955 8714645 14699842 14583121 7294040 -2532192 -8145280
4436h145280l66655O46856O53219N046958J0786997R836026J895208m161484k794367
$$ -8145280 -8511935 -7865079 -7211860 -2164902 8622095 18458121 20353329 16191845 13397478
4427A3397478J004428l6495n244982q250735o290199k696704j173674j631329
$$ 13397478 14401906 14365411 9120429 869694 -5420505 -8117209 -9290883 -10922212
4419a0922212k274438k718932l216839k551979O97109M870516N779840K090067
$$ -10922212 -13196650 -15915582 -19132421 -21684400 -20987291 -16116775 -10336935 -8246868
4411h246868j609774L23170P206717J2232471J0273618K936671m629705q994640
$$ -8246868 -9856642 -9533472 -2326755 9905716 20179334 23116005 18486300 9491660
4403I491660r351189o307973k033399O53037J446989K676813M472773L021696
$$ 9491660 140471 -6167502 -8200901 -7547864 -6100875 -3424062 1048711 4070407
4395D070407l271643r111745q435765l079536J0287r01323q28647K749343N449840
$$ 4070407 798764 -8312981 -16748746 -19828282 -19817995 -20719318 -21547965 -18798622 -13348782
4386a3348782L160298j433007l066733j134245J047641J850008K490800L693379
$$ -13348782 -10188484 -11621491 -14688224 -15822469 -14774828 -12924820 -10434020 -6740641
4378f740641M241620K684989j121756n515345p212749l825607K403959N559924
$$ -6740641 -2499021 185968 -935788 -6451133 -13663882 -17489489 -15085530 -9525606
4370i525606K828470j740771k700893k40821J565689J656812K670265N308558
$$ -9525606 -6697136 -8437907 -11138800 -11379621 -9813932 -8157120 -5486855 -178297
4362a78297O770016N635801M005122L077622O42255m315427p919799o099058q81298
$$ -178297 6591719 12227520 16232642 19310264 19952519 15637092 7717293 1618235 736937
4353G36937K033982J004831k47325J089011L350453L961121K846158O10160l282006
$$ 736937 2770919 3775750 3528425 4617436 7967889 11929010 14775168 15385328 12103322
4344A2103322p876929r132048m635683J609434L103491p80048m133846k663920
$$ 12103322 4226393 -4905655 -9541338 -7931904 -4828413 -5608461 -9742307 -12406227
4336a2406227J304768L379193K991550K063810P04446j917979l905107k231160
$$ -12406227 -11101459 -7722266 -4730716 -2666906 -1962460 -3880439 -7785546 -10016706
4328a0016706J734733K432147k307109p047346n172921K160615P020149M507070
$$ -10016706 -8281973 -5849826 -8156935 -15204281 -20377202 -18216587 -11196438 -6689368
4320f689368j764996n117528l754813q76087R91640K225943L311118L562560L292620
$$ -6689368 -8454364 -13571892 -17326705 -18202792 -17211152 -14985209 -11674091 -8111531 -4818911
4311d818911L821822M121599J103629m605286p050741k697180L586537N043307
$$ -4818911 -997089 3124510 4228139 -377147 -7427888 -10125068 -6538531 -1495224
4303a495224K759817K820026N458987M529762j801015p482982p999364o274388
$$ -1495224 1264593 4084619 9543606 14073368 12272353 4789371 -3209993 -9484381
4295i484381n748893m374172k86059K731625J409302o53587O38964K023875r37273
$$ -9484381 -15233274 -19607446 -19893505 -17161880 -15752578 -16406165 -15767201 -13743326 -14680599
4286a4680599m057450j63567P926703J0072678M023003j853893k044310m62808
$$ -14680599 -18738049 -18901616 -10974913 -902235 3120768 1266875 -777435 -1240243
4278a240243j173137j834525l13649M42954j173751j519922R10934J354676k525608
$$ -1240243 -2413380 -4247905 -4561554 -4118600 -5292351 -6812273 -5901339 -4546663 -7072271
4269g072271m953701j470668K877143K391124J169570N371458J0503506P538005
$$ -7072271 -12025972 -13496640 -10619497 -8228373 -7058803 -1687345 8816161 16354166
4261A6354166j499461n846048k852333o11505k866438l407999R67859L308640
$$ 16354166 14854705 9008657 6156324 5544819 2678381 -729618 238241 3546881
4253C546881j557709p315605o017453m01275J928847J074603K581677O155284
$$ 3546881 1989172 -5326433 -11343886 -11745161 -9816314 -8741711 -6160034 -4750
4245d750O006623J375288j884889q89202N41313o23846j972652j118364j91072
$$ -4750 6001873 7377161 5492272 4603070 5144383 4520537 2547885 1429521 1238449
4236A238449j401789k638988j502129k15213j938330m497600k871495K715659
$$ 1238449 -163340 -2802328 -4304457 -4519670 -6458000 -10955600 -13827095 -11111436
4228a1111436O088349L503480j291913k523056N7958K058414J241517m2338O39526
$$ -11111436 -5023087 -1519607 -2811520 -5334576 -5276618 -3218204 -1976687 -2019025 -1379499
4219a379499J834566M25534l540325o163412m065562J451633N336769M033222
$$ -1379499 455067 880601 -2659724 -8823136 -12888698 -11437065 -6100296 -2067074
4211b067074o96648m049994m073342l415219m333312m534451r61979M031452M912887
$$ -2067074 -2763722 -6813716 -10887058 -14302277 -18635589 -23170040 -24132019 -20100567 -15187680
4202a5187680J413752m35401K421644M947704J974602l174813l705489k63366
$$ -15187680 -13773928 -14209329 -11787685 -6839981 -4865379 -8040192 -11745681 -12009047
4194a2009047n8294n408556r663896o401935K177174Q595802Q600430M195427
$$ -12009047 -12067341 -17475897 -27139793 -33541728 -31364554 -22768752 -14168322 -9972895
4186i972895N58236J413353N591252P696480M304315j050911k346695K80991J156844
$$ -9972895 -9414659 -8001306 -2410054 5286426 9590741 8539830 6193135 6474126 7630970
4177G630970j746491m176160l421397k425928l462328l911515k029272r98966
$$ 7630970 5884479 1708319 -1713078 -4139006 -7601334 -11512849 -13542121 -14541087
4169a4541087k762708l515507n32205K169584J069244L85798M615505Q930965
$$ -14541087 -17303795 -20819302 -21351507 -19181923 -18112679 -17726881 -13111376 -4180411
4161d180411N957582j660848n123860l242894k189622l166434j244295L533679
$$ -4180411 1777171 116323 -5007537 -8250431 -10440053 -13606487 -14850782 -11317103
4153a1317103M688511K32792m687277o930377p183308k825412Q577936J7820712
$$ -11317103 -6628592 -6395800 -11083077 -18013454 -25196762 -28022174 -19444238 -1623526
4145a623526J1083301p977283j9041372j3729912o212609p474198r535558q732692
$$ -1623526 9459775 1482492 -17558880 -31288792 -37501401 -44975599 -54511157 -63243849
4137f3243849k1449792n2324683o5901371k5178926M7944752Q7614029O4433005
$$ -63243849 -84693641 -137018324 -202919695 -228098621 -180153869 -92539840 -28106835
4130b8106835J8006406j922947M919358Q534895M60390l400460K275069M883230
$$ -28106835 -10100429 -12023376 -7104018 1430877 1891267 -1509193 765876 5649106
4122E649106j019913n776158m120446l248250p007825p908284j038473O290262
$$ 5649106 4629193 -1146965 -5267411 -8515661 -15523486 -23431770 -24470243 -18179981
4114a8179981N624760o01295m179176k050195K761625O559303P573228O217617
$$ -18179981 -12555221 -13156516 -17335692 -19385887 -16624262 -10064959 -2491731 3725886
4106C725886M585803L263323n99506q064439j3094724q759476J904664Q207585
$$ 3725886 8311689 11575012 10975506 2911067 -10183657 -18943133 -17038469 -8830884
4098h830884N490889k67019k449632j393565j39042O81344R38758l47496j814798
$$ -8830884 -3339995 -3607014 -6056646 -7450211 -7589253 -6907909 -5969151 -6316647 -8131445
4089h131445k50805L603238M915934K334516R0247M21911m3690l484460o478632
$$ -8131445 -8382250 -4779012 136922 2471438 2561685 2983596 2939906 -544554 -7023186
4080g023186n978348m113583l162619j076762L650634P533415P100780M126530
$$ -7023186 -13001534 -17115117 -20277736 -21354498 -17703864 -10170449 -3069669 1056861
4072A056861J633833r80601m504762o094178l769894p21038l43842r76247k31887
$$ 1056861 2690694 1710093 -2794669 -8888847 -12658741 -13379779 -13723621 -14699868 -14931755
4063a4931755L2902j549593j150510L582481O816966K521824m478652m454792
$$ -14931755 -14898853 -16448446 -17598956 -14016475 -7199509 -4677685 -9156337 -13611129
4055a3611129K426400O740847M505063J477957J788723J855330j314609m138333
$$ -13611129 -11184729 -4443882 61181 1539138 3327861 5183191 3868582 -269751
4047b69751l231888j512041k518093l772554j100046L933870N964413L324618
$$ -269751 -3501639 -5013680 -7531773 -11304327 -12404373 -8470503 -2506090 818528
4039H18528m31282j531019L45756K760999L075812R63184q55812L68029L350279
$$ 818528 387246 -1143773 -798017 1962982 5038794 6001978 5146166 5514195 8864474
4030H864474L735062l22350n694190q106037o324958j925663K799526N717205
$$ 8864474 12599536 12277186 6582996 -1523041 -7847999 -9773662 -6974136 -1256931
4022a256931N592356L058759j41421k860140m411498l908993j807158o79594j643564
$$ -1256931 4335425 7394184 7252763 4392623 -18875 -3927868 -5735026 -6414620 -8058184
4013h058184j621779K148634O490743N943478J069677k231792j317026R92835
$$ -8058184 -9679963 -7531329 -1040586 4902892 5972569 3740777 2423751 3416586
4005C416586K611998M074572L797321r74883o711319n219538L755161R525021
$$ 3416586 6028584 10103156 13900477 12925594 6214275 994737 4749898 14274919
3997A4274919N090762k790232m676319k492844l939206q253198p743934j046703
$$ 14274919 19365681 16575449 11899130 9406286 5467080 -2786118 -10530052 -11576755
3989a1576755N022288O401644N658216M420315O12742m758352o033294j680711
$$ -11576755 -6554467 -152823 5505393 9925708 10538450 5780098 -253196 -1933907
3981a933907J729375j408124p504587q982023m196691K068344N633789O427227
$$ -1933907 -204532 -1612656 -9117243 -18099266 -22295957 -20227613 -14593824 -8166597
3973h166597O087711N363591L934897J197396k593108n419718m848822r43719
$$ -8166597 -2078886 3284705 7219602 8416998 5823890 404172 -4444650 -5388369
3965e388369L354895N331611M792065L020026J066641l82879r27071q90872q92712
$$ -5388369 -2033474 3298137 8090202 11110228 12176869 11793990 10866919 9976047 9083335
3956I083335r74215j182107k268550m122314m588050k413918l40245j719295m576588
$$ 9083335 8109120 6927013 4658463 536149 -4051901 -6465819 -6806064 -8525359 -13101947
3947a3101947l425316K513157P636980P964504N831847L985863K42152p168892
$$ -13101947 -16527263 -14014106 -6377126 1587378 7419225 11405088 11647240 4478348
3939D478348j2940532r939749J79072P851138P584828L614486K042533K504438
$$ 4478348 -8462184 -18401933 -18222861 -10371723 -2786895 827591 2870124 5374562
3931E374562J052732k294848l513020q85772K753738M432884M358738L593072
$$ 5374562 6427294 4132446 619426 -266346 2487392 6920276 11279014 14872086
3923A4872086J246803l501022q159290q920576n974010l826257n088129o589375
$$ 14872086 16118889 12617867 4458577 -4461999 -10436009 -14262266 -19350395 -25939770
3915b5939770m006800J658796N544480N847071N243726N100618K839114k569688
$$ -25939770 -29946570 -28287774 -22743294 -16896223 -11652497 -6551879 -3712765 -6282453
3907f282453o459149m108684J620860L390850j23988k143664K015094P465483
$$ -6282453 -12741602 -16850286 -15229426 -11838576 -11962564 -14106228 -12091134 -4625651
3899d625651O506780k52533m970464l994063k317293m840190q451525p029287
$$ -4625651 1881129 1628596 -3341868 -7335931 -9653224 -14493414 -22944939 -29974226
3891b9974226r24366L958235N076707N380095O313481M965837O03307j768333
$$ -29974226 -30898592 -26940357 -21863650 -16483555 -10170074 -5204237 -4600930 -6369263
3883f369263J098868M111829Q27005n656017n916555J988772R090650P851617
$$ -6369263 -5270395 -1158566 -331561 -5987578 -11904133 -9915361 -824711 7026906
3875G026906J722509j398277m13271m77126l742992o256324m203403Q52353M333014
$$ 7026906 8749415 7351138 6937867 6460741 2717749 -3538575 -7741978 -6889625 -2556611
3866b556611L969654J447412k76377m03194q83708l222432n151490k563265M318487
$$ -2556611 1413043 2860455 2584078 2180884 1297176 -1925256 -7076746 -9640011 -5321524
3857e321524R162384O509415q88020m896397j871929L505950M882275J583549
$$ -5321524 3840860 10350275 9462255 4565858 2693929 6199879 11082154 12665703
3849A2665703k408957m287335m308875l024289p8803L419841M085687Q0101n375552
$$ 12665703 10256746 5969411 1660536 -1363753 -1442556 1977285 6062972 6143073 767521
3840G67521o762983k616042K933062N375995M346905J852892j303874m595294
$$ 767521 -5995462 -8611504 -5678442 -302447 4044458 5897350 4593476 -1818
3832a818n212189o76988N904579P397176J287713o314215p877751l489073K67697
$$ -1818 -5214007 -5890995 13584 7410760 8698473 2384258 -5493493 -8982566 -8714869
3823h714869p87126l973438m414325j354890J744784K202460J350242K221848
$$ -8714869 -9501995 -13475433 -17889758 -19244648 -17499864 -15297404 -13947162 -11725314
3815a1725314M919235N998880L278132l90548m31530L059332N184698K842139
$$ -11725314 -6806079 -807199 2470933 2080385 1648855 4708187 9892885 12735024
3807A2735024j619569m402092m735628l474501l85667M094402O670809M377550
$$ 12735024 11115455 6713363 1977735 -1496766 -1882433 2211969 8882778 13260328
3799A3260328j055461m989784n214558l034642m21134J009739k41833l133976
$$ 13260328 12204867 7215083 2000525 -1034117 -1455251 -445512 -687345 -3821321
3791c821321k796784L728235J1066823J0156433O8969r980010j2044512p744075
$$ -3821321 -6618105 -2889870 8176953 18333386 18402355 8422345 -3622167 -11366242
3783a1366242k795041J080838M284905M208270j283667p360676o324498J427644
$$ -11366242 -14161283 -13080445 -8795540 -4587270 -5870937 -13231613 -19556111 -18128467
3775a8128467O795720M221448j018845j186364K866944M235577R67665j735399
$$ -18128467 -11332747 -7111299 -8130144 -9316508 -6449564 -2213987 -1246322 -2981721
3767b981721m32444J479284J32864k238243j389522J612185K601741K079294M334172
$$ -2981721 -3414165 -1934881 -1802017 -4040260 -5429782 -3817597 -1215856 863438 5197610
3758E197610Q641654Q358554J448142m654963l479368O76215j27462m654893m941106
$$ 5197610 13839264 22197818 23645960 18990997 15511629 16187844 16060382 11405489 6464383
3749F464383L61676L933487J652211j854341j840645o8848O66338J731186L837639
$$ 6464383 6826059 10759546 12411757 10557416 8716771 8647923 9314261 11045447 14883086
3740A4883086L226012j758446n474012k720971K442666K506767j908702l665439
$$ 14883086 18109098 16350652 10876640 8155669 10598335 13105102 11196400 7530961
3732G530961o93894J462307j266721o299653r123692p865311k565811M980607
$$ 7530961 6837067 8299374 7032653 733000 -8390692 -16256003 -18821814 -13841207
3724a3841207J0004628Q433552K750869m45206O26524J413483q67793l288854
$$ -13841207 -3836579 4596973 7347842 6902636 7529160 8942643 8074850 4785996
3716D785996l022549j528089n20562J070217L290332L171788k48151l333904l469695
$$ 4785996 1763447 235358 -285204 785013 4075345 7247133 6998982 3665078 195383
3707A95383k861789l409114k590888J270169M210870K278299j781982l017526
$$ 195383 -2666406 -6075520 -8666408 -7396239 -3185369 -907070 -2689052 -5706578
3699e706578k255574l630322o553120o450133k250338K619852N832559P423169
$$ -5706578 -7962152 -11592474 -18145594 -24595727 -26846065 -24226213 -18393654 -10970485
3691a0970485O540104K602482j059356o62270J297765r46940o497734p690522
$$ -10970485 -4430381 -1827899 -2887255 -3549525 -2251760 -3198700 -9696434 -17386956
3683a7386956j537289N175725N083427o97962n819069o658519l892756L26132
$$ -17386956 -18924245 -13748520 -8665093 -9363055 -15182124 -21840643 -25733399 -25407267
3675b5407267L692138M687665M158993L841720L048146K21350k593563k003051
$$ -25407267 -21715129 -17027464 -12868471 -9026751 -5978605 -5757255 -8350818 -10353869
3667a0353869q170j718504n260602k349805P810367J4225279R535680J183934
$$ -10353869 -10362039 -12080543 -17341145 -19690950 -11880583 2344696 11880376 13064310
3659A3064310q80428K46511m055930j0826961r227737Q88417P678400N559540
$$ 13064310 12183882 12430393 8374463 -2452498 -11680235 -10791818 -3113418 2446122
3651B446122K037813L092219L770886q49804n614092l841531J804509M810887
$$ 2446122 4483935 7576154 11347040 10497236 4883144 1041613 2846122 7657009
3643G657009M915166M903069K981364k856422p192407l529244M170151N819112
$$ 7657009 12572175 17475244 20456608 17600186 10407779 6878535 11048686 16867798
3635A6867798j2220n118818n345544n103396o416444m061394L481241P624613
$$ 16867798 16855578 11736760 6391216 1287820 -5128624 -9190018 -5708777 1915836
3627A915836J824038o732271o600295R79995M379004o39467n350941k126653M538977
$$ 1915836 3739874 -2992397 -9592692 -8612697 -4233693 -4873160 -10224101 -12350754 -7811777
3618g811777N692042P26725l349930k521280J09632M48166p72713K20893M698051
$$ -7811777 -2119735 -1393010 -4742940 -7264220 -7154588 -6706422 -7479135 -7258242 -2560191
3609b560191R166820Q651632K208712n263751p956137n687671l354008l616062
$$ -2560191 6606629 15258261 17466973 12203222 4247085 -1440586 -4794594 -8410656
3601h410656l535969k98546L421150L568564J488762J683158M193695M714274
$$ -8410656 -11946625 -12245171 -8824021 -5255457 -3766695 -2083537 2110158 6824432
3593F824432K123983M4527k17284k118413o490297p619398j498564O452005P726523
$$ 6824432 8948415 8992942 8775658 6657245 166948 -7452450 -8951014 -2499009 5227514
3584E227514K026656l650669n332157n169633m936799l115586M23658K768956
$$ 5227514 7254170 3603501 -1728656 -6898289 -11835088 -14950674 -14527016 -11758060
3576a1758060L114611M427884P308359P010959M76247p269195q338274j950796
$$ -11758060 -8643449 -4215565 3092794 10103753 10580000 3310805 -5027469 -6978265
3568f978265M626646M465326k280145r317398j0052899l488657M368188O541260
$$ -6978265 -2351619 2113707 -166438 -9483836 -19536735 -23025392 -18657204 -12115944
3560a2115944L386114J871585N071882O977563J798732n911692p050927j634867
$$ -12115944 -8729830 -6858245 -1786363 5191200 6989932 1078240 -5972687 -7607554
3552g607554J139531l145349p772013n195601K696197Q689353R655050P212300
$$ -7607554 -6468023 -9613372 -17385385 -22580986 -19884789 -11195436 -1540386 5671914
3544E671914K842673k387826n505704m017758L80267M119319O178980O692709
$$ 5671914 8514587 6126761 621057 -3396701 -3016434 1102885 7281865 13974574
3536A3974574L830123k736214p434508m603891J935876K556384m010254q113298
$$ 13974574 17804697 15068483 7633975 3030084 4965960 7522344 3512090 -4601208
3528d601208l663680K886682L385563N85905K019439O342504N505408j274616
$$ -4601208 -8264888 -5378206 -1992643 -1406738 612701 6955205 12460613 11185997
3520A1185997n453819k153179L197586L943922R32632j558423k839425m194826
$$ 11185997 5732178 3578999 6776585 10720507 11653139 10094716 7255291 3060465
3512C060465m432740j829086J901240L454857K211913L5026j419965j160632J204060
$$ 3060465 -1372275 -3201361 -1300121 2154736 4366649 4401675 2981710 1821078 3025138
3503C025138M157811N223810M419178L639550J904458l714086j0632475j0827478
$$ 3025138 7182949 12406759 16825937 20465487 22369945 18655859 8023384 -2804094
3495b804094k537114M615678K336414m289164n120308l68671J704500q15905j959277
$$ -2804094 -5341208 -725530 1610884 -2678280 -7798588 -8167259 -6462759 -7278664 -9237941
3486i237941L39102J467047r9466k30052J892256J805861q17781m98317K976301
$$ -9237941 -8898839 -7431792 -7531258 -7761310 -5869054 -4063193 -4880974 -5379291 -2402990
3477b402990J890623n901251j0624314m786981M746594P157091L112071Q37338
$$ -2402990 -512367 -6413618 -17037932 -21824913 -17078319 -9921228 -6809157 -5971819
3469e971819K467372L903234M129096M904914L815742k816610j1292261j3511425
$$ -5971819 -3504447 398787 4527883 9432797 13248539 10431929 -860332 -14371757
3461a4371757q140293j116581M129842Q764480J1198958O708564l599636j0930576
$$ -14371757 -22512050 -23628631 -19498789 -10734309 464649 7173213 3573577 -7356999
3453g356999q862351r1222Q370761J1584473P466094k779197j3027187j5980599
$$ -7356999 -16219350 -16310572 -7939811 3644662 11110756 8331559 -4695628 -20676227
3445b0676227j0454304j437577O780142J2697353J3909004Q409087J39426l912198
$$ -20676227 -31130531 -32568108 -25787966 -13090613 818391 9227478 9366904 5454706
3437E454706l409843m303813p488763o295329J609131Q317010O748253N78179
$$ 5454706 2044863 -2258950 -9747713 -16043042 -14433911 -6116901 631352 1209531
3429A209531k492560j319080O72697K587883M773096M685319L88762m783328o260557
$$ 1209531 -1283029 -2602109 -1929412 658471 5431567 10116886 10505648 5722320 -538237
3420e38237m119527q97466K561614M891470K687184l581152o964302l188903K376595
$$ -538237 -4657764 -5555230 -2993616 1897854 4585038 1003886 -5960416 -9149319 -6772724
3411f772724L184872J563489K602002L434927j387974p712579o436900J178177
$$ -6772724 -3587852 -2024363 577639 4012566 2624592 -5087987 -11524887 -10346710
3403a0346710M530691M26897k687053N33085M382949L027683m31069j246638j090748
$$ -10346710 -5816019 -5389122 -8076175 -7543090 -3160141 -132458 -563527 -1810165 -2900913
3394b900913k654752l020336R91883O021127O869366L943322P47055j989412m523506
$$ -2900913 -5555665 -8576001 -7584118 -1562991 5306375 9249697 9996752 8007340 3483834
3385C483834m517004q14755K654095K226858M49675J028697J316555l224078r335212
$$ 3483834 -1033170 -1847925 806170 3033028 3482703 4511400 5827955 2603877 -6731335
3376f731335q547406N19239R306562J0220561N010158M28755j50060J402745J536768
$$ -6731335 -15278741 -14759502 -5452940 4767621 9777779 10206534 10056474 11459219 12995987
3367A2995987j450202n854814p897242n876885k361566m37490O99622L397849
$$ 12995987 11545785 5690971 -2206271 -8083156 -10444722 -10882212 -10182590 -6784741
3359f784741O245104N352956P28872k880344k298599M07780J423614o93685m994237
$$ -6784741 -539637 4813319 5542191 2661847 363248 771028 2194642 1500957 -3493280
3350c493280r116217r623384m587695L107773P741938O756243K373411k399609
$$ -3493280 -12609497 -22232881 -26820576 -23712803 -15970865 -9214622 -6841211 -9240820
3342i240820n741167n410627m24902M743407L528081k776782m473244L122756
$$ -9240820 -14981987 -20392614 -20817516 -16074109 -12546028 -15322810 -19796054 -16673298
3334a6673298J1528489J0281396J599524l691549j992978J05886j623595k742645
$$ -16673298 -5144809 5136587 6736111 3044562 1051584 1157470 -466125 -3208770
3326c208770O15183L932739J345305m379432n405708l94113L654086J551382l134223
$$ -3208770 -2593587 1339152 2684457 -1694975 -7100683 -7494796 -3840710 -2289328 -5423551
3317e423551l740403L4284K086553j136488n268394l781034K884516P539145N655230
$$ -5423551 -9163954 -9129670 -7043117 -8179605 -13447999 -17229033 -14344517 -6805372 -1150142
3308a150142O72965j860919j652207j659688j898836l96437J373890P1491k650610
$$ -1150142 -477177 -2338096 -3990303 -5649991 -7548827 -7945264 -6571374 -6499883 -9150493
3299i150493j357751L729632N301787K26777m275494j159178N024791M519296
$$ -9150493 -10508244 -6778612 -1476825 -1250048 -5525542 -6684720 -1659929 2859367
3291B859367k861543p466256l906882K248744L639808N17529k258585k797237
$$ 2859367 -2176 -7468432 -11375314 -9126570 -5486762 -4969233 -7227818 -10025055
3283a0025055k644686k576249j953329j112014j217126j879094j089460J974118
$$ -10025055 -12669741 -15245990 -17199319 -18311333 -19528459 -21407553 -22497013 -20522895
3275b0522895N084460M685256j2391m826022m200477J856631O531710M389608
$$ -20522895 -15438435 -10753179 -10765570 -15591592 -19792069 -17935438 -11403728 -7014120
3267g014120j097045j973100L351580Q311318P265703J529728m531457q392221
$$ -7014120 -8111165 -10084265 -6732685 1578633 8844336 10374064 5842607 -2549614
3259b549614q578586m128922K167392M497699J578061n26041K940104P849151
$$ -2549614 -11128200 -15257122 -13089730 -8592031 -7013970 -7540011 -4599907 3249244
3251C249244P069573O33452n333802p269174o081921k631107K177413M037682
$$ 3249244 10318817 10952269 5618467 -1650707 -7732628 -10363735 -8186322 -4148640
3243d148640p23215p412104o579260K690491R891896O858351j546880n148494
$$ -4148640 -4871855 -12283959 -18863219 -16172728 -6280832 577519 -969361 -6117855
3235f117855k167186O44637j022323m109916m237774j696543M68426J571042L945364
$$ -6117855 -8285041 -7640404 -8662727 -12772643 -17010417 -18706960 -18238534 -16667492 -12722128
3226a2722128Q700050J2416961R848392O44463q290586r528688l514647K470696
$$ -12722128 -4022078 8394883 18243275 18887738 10597152 1068464 -2446183 24513
3218B4513L267143L20422k739310m550179m689732k304955J431742L175619K277414
$$ 24513 3291656 3612078 872768 -3677411 -8367143 -10672098 -9240356 -6064737 -3787323
3209c787323K088698L768083L341278j194633m707516k472350J459018N89584
$$ -3787323 -1698625 2069458 5410736 4216103 -491413 -2963763 -1504745 -915161
3201i15161k761455j330071L850984M358617j010452l596511n7486J024631n745849
$$ -915161 -3676616 -5006687 -1155703 3202914 2192462 -1404049 -1461535 -436904 -6182753
3192f182753j0970929l869055R851230J5111062Q497517L42941k562009m053534
$$ -6182753 -17153682 -21022737 -11171507 3939555 12437072 12780013 10218004 6164470
3184F164470p279268q221088m560830r81060m05405J224871N538668N791756j907828
$$ 6164470 -1114798 -9335886 -13896716 -14877776 -15283181 -14058310 -8519642 -2727886 -4635714
3175d635714r109426o434495J344631K602590k646683l734779K428699O781834
$$ -4635714 -13745140 -20179635 -18835004 -16232414 -18879097 -22613876 -20185177 -13403343
3167a3403343L643018r81419r56285M17031j522342l697210j483114K623354L948523
$$ -13403343 -9760325 -10741744 -11698029 -11280998 -12803340 -16500550 -17983664 -15360310 -11411787
3158a1411787L885772N629005O265419J460098n089694n479915N63897N640681
$$ -11411787 -7526015 -1897010 4368409 5828507 738813 -4741102 -4177205 1463476
3150A463476N835588M256529L342108J374867j916989l316240k033915j699666
$$ 1463476 7299064 11555593 14897701 16272568 14355579 11039339 9005424 7305758
3142G305758l871312m953960k471015M81613L41385j481775j728465n75845m59730
$$ 7305758 3434446 -1519514 -3990529 -3508916 -3167531 -4649306 -6377771 -6953616 -7413346
3133g413346j975140l582952l506070m40679N086966R091432P412094J946130
$$ -7413346 -9388486 -12971438 -16477508 -16918187 -11831221 -2739789 4672305 6618435
3125F618435o18086J907796M180671K387429O26502L329055O349061K547949o612882
$$ 6618435 6000349 7908145 12088816 14476245 15102747 18431802 24780863 27328812 20715930
3116B0715930j2460540j1165752p379757n378839l370778J043150N224157N012354
$$ 20715930 8255390 -2910362 -10290119 -15668958 -19039736 -17996586 -12772429 -7760075
3108g760075P45515l423787m341673j666670L348122Q353877J0114964O689649
$$ -7760075 -7014560 -10438347 -14780020 -16446690 -13098568 -4744691 5370273 12059922
3100A2059922j52670n839868o967718m320321j749262j799374k705502p06225
$$ 12059922 11907252 6067384 -900334 -5220655 -6969917 -8769291 -11474793 -12181018
3092a2181018M578003Q741183P582600K023283l372433n392478m004940p65609
$$ -12181018 -7603015 1138168 8720768 10744051 7371618 1979140 -2025800 -2791409
3084b791409K018680J463457l410169q976251r308715k366315P260196J2340257
$$ -2791409 -772729 690728 -2719441 -11695692 -21004407 -23370722 -16110526 -3770269
3076c770269R167959K09206q133119j0566223o884864j102027L293092N855199
$$ -3770269 5397690 5606896 -2526223 -13092446 -19977310 -21079337 -17786245 -11931046
3068a1931046O807888N132029J106325j999198k048800j691792l949245o089867
$$ -11931046 -5123158 8871 1115196 -884002 -2932802 -4624594 -8573839 -14663706
3060a4663706l118214L413599O081748J955138l530178n075919m193196m032641
$$ -14663706 -17781920 -14368321 -8286573 -6331435 -9861613 -14937532 -19130728 -23163369
3052b3163369k957960J483435N969793N080509j3773k520284L69261M189199M465433
$$ -23163369 -26121329 -24637894 -18668101 -13587592 -13601365 -16121649 -15752388 -11563189 -7097756
3043g097756K392155J153955O52877q37039k319645j132240K385747M487203K870123
$$ -7097756 -4705601 -3551646 -2898769 -3735808 -6055453 -7187693 -4801946 -314743 2555380
3034B555380k08729q94356J261804K723584N35337l578251m758572p01363N254210
$$ 2555380 2346651 1452295 2714099 5437683 5973020 2394769 -2363803 -3065166 2189044
3025B189044P520061M153192j605393n249895n177943l010307j293532j531334
$$ 2189044 9709105 13862297 12256904 7007009 1829066 -1181241 -2474773 -4006107
3017d006107l336839m600779l197279O35658M051809M314256J393913k237550
$$ -4006107 -7342946 -11943725 -15141004 -14505346 -10453537 -6139281 -4745368 -6982918
3009f982918l535459p73762M515240P092043K574872n645315p606521J073971
$$ -6982918 -10518377 -11292139 -6776899 315144 2890016 -2755299 -10361820 -9287849
3001i287849J1200964J0304674l79103p022932k392462M826150M136749j762177
$$ -9287849 1913115 12217789 11838686 4815754 2423292 7249442 11386191 9624014
2993I624014l673740j075643n82966k930158k518203R75630J562364j390358j347186
$$ 9624014 5950274 4874631 4291665 1361507 -1156696 -181066 1381298 -9060 -1356246
2984a356246K726158K904289l475720o855502l32310P861424O480869j479907
$$ -1356246 1369912 4274201 798481 -6057021 -6389331 1472093 7952962 6473055
2976F473055m703142j377056Q84713k62890N1266J938711m30744o188918n938369
$$ 6473055 1769913 392857 1277570 1014680 1065946 3004657 2573913 -3615005 -9553374
2967i553374L135745J0593476P090749k704686p917118n726445j310116J386194
$$ -9553374 -6417629 4175847 11266596 8561910 644792 -5081653 -6391769 -5005575
2959e005575K132103R77299j744074l884113m088657l786849l686966j776469
$$ -5005575 -2873472 -1896173 -3640247 -7524360 -11613017 -15399866 -19086832 -20863301
2951b0863301K024108L659497J559162O61972M335614O943236J788253o835459
$$ -20863301 -18839193 -15179696 -13620534 -12958562 -8622948 -1679712 108541 -6726918
2943f726918q171425n92603N918821L962368k359580n298920l566833p05324J520149
$$ -6726918 -14898343 -15490946 -9572125 -5609757 -7969337 -13268257 -16835090 -17540414 -16020265
2934a6020265L413167M121840K550918J81920j94789K057515N034517O319776
$$ -16020265 -12607098 -8485258 -5934340 -5752420 -5947209 -3889694 1144823 7464599
2926G464599M190961j350898p117558q333476l936827J417318L036345K000515
$$ 7464599 11655560 10304662 3187104 -5146372 -9083199 -7665881 -4629536 -2629021
2918b629021K077147K619626l67872n852162o355554J745410J0950270J0966537
$$ -2629021 -551874 2067752 1699880 -4152282 -10507836 -8762426 2187844 13154381
2910A3154381K114518n481623n617685k510747k062235l175073j892972J016302
$$ 13154381 15268899 9787276 4169591 1658844 -403391 -3578464 -5471436 -4455134
2902d455134K320524K651466M295982N058540J287050m199064m848349j220552
$$ -4455134 -2134610 516856 4812838 9871378 11158428 6959364 2111015 890463
2894H90463q78129n499244o688359Q09217R325002Q521873Q8790n477215l586409
$$ 890463 12334 -5486910 -12175269 -11366052 -2041050 6480823 6569613 1092398 -2494011
2885b494011O17136J726048O8948k004156l578075l618786q70798L149570M847343
$$ -2494011 -1876875 -150827 -81879 -2086035 -5664110 -9282896 -10153694 -7004124 -2156781
2876b156781L443951J869606J883928J738308J165j445576k04785K858517M461115
$$ -2156781 1287170 3156776 5040704 6779012 6780177 5334601 5129816 7988333 12449448
2867A2449448K624012j355815m114826l304447L720K402647J989561j7649j768596
$$ 12449448 15073460 13717645 9602819 6298372 6302092 8704739 10694300 10676651 8908055
2858H908055k708514k392415n60132L18266l154571q496834p622413J647016R863903
$$ 8908055 6199541 3807126 3246994 3565260 410689 -8086145 -15708558 -14061542 -4197639
2849d197639Q376829K314580K082377N975359L371147n736657q363727P68889
$$ -4197639 4179190 6493770 8576147 14551506 17922653 12185996 3822269 4591158
2841D591158R369644N705330m371638q079849m666600k395940k799219o69082
$$ 4591158 13960802 19666132 15294494 7214645 2548045 152105 -2647114 -3316196
2833c316196L121722J707632m444190o000441O14631P029340N641066J49425j924955
$$ -3316196 -194474 1513158 -2931032 -8931473 -8316842 -1287502 4353564 4502989 2578034
2824B578034k89417Q65851J374844L688782N933967L457748l261937p936572o399771
$$ 2578034 2288617 3154468 4529312 8218094 14152061 17609809 14347872 6411300 11529
2815A1529j222942K451510K719600J615995J931450M022965N068457K174985l051113
$$ 11529 -1211413 1240097 3959697 5575692 7507142 11530107 16598564 18773549 15722436
2806A5722436n132502j852921J790935J99442m453801n287226j047449K430409
$$ 15722436 10589934 8737013 10527948 10727390 6273589 986363 -61086 2369323
2798B369323J519486o49695r53285j305716l082455k351493L398618Q111997M210114
$$ 2369323 3888809 3239114 2285829 980113 -2102342 -4453835 -1055217 7056780 11266894
2789A1266894n230532r060862k898551N673958Q043240M175416r64262m462149
$$ 11266894 6036362 -3024500 -5923051 -249093 7794147 11969563 11005301 6543152
2781F543152n407461k884493J702287L930189J863014q57507p80050J27601j032172
$$ 6543152 1135691 -1748802 -46515 3883674 5746688 4889181 4109131 4236732 3204560
2772C204560k191652j34108K767634J694102k354234l582435k87110L054504L017174
$$ 3204560 1012908 878800 3646434 5340536 2986302 -596133 -883243 2171261 5188435
2763E188435J250293K02835l43722p61754K92184L024864M742696K965525j558485
$$ 5188435 6438728 6641563 6297841 5536087 5828271 8853135 13595831 16561356 15002871
2754A5002871n958214p686116n800614j960115J38873j199279k819893q57591
$$ 15002871 9044657 1358541 -4442073 -6402188 -6263315 -7462594 -10282487 -11140078
2746a1140078L289176N015697L652851K640984K794613J154007k436528l594437
$$ -11140078 -7850902 -2835205 817646 3458630 6253243 7407250 4970722 1376285
2738A376285o41615J794084l42157m550404o100882m410397j668820J230979L799531
$$ 1376285 734670 2528754 2186597 -2363807 -8464689 -12875086 -14543906 -13312927 -9513396
2729i513396M304097K561535J263220J259878p57814n999279r103224n247949
$$ -9513396 -5209299 -2647764 -1384544 -124666 -882480 -6881759 -15984983 -21232932
2721b1232932J501841L144738q90425l675598j304759K772271M378515L889080
$$ -21232932 -19731091 -16586353 -17476778 -21152376 -22457135 -19684864 -15306349 -11417269
2713a1417269L396395L144279K643896K036368R74573j098175k842224k097555
$$ -11417269 -8020874 -4876595 -2232699 -196331 778242 -319933 -3162157 -5259712
2705e259712M07831J512385L35873o95875j55111N92584Q11984J745667K961284
$$ -5259712 -4851881 -3339496 -3003623 -3699498 -3854609 -3262025 -2450041 -704374 2256910
2696B256910J359712l575814p088348n117316k39264K123259J270687O50638J067188
$$ 2256910 3616622 40808 -7047540 -12164856 -12404120 -10280861 -9010174 -8359536 -7292348
2687g292348l60458m016992n567332k188999K671396L846235J272843j014868
$$ -7292348 -7652806 -11669798 -17237130 -19426129 -16754733 -12908498 -11635655 -12650523
2679a2650523j022781l42555m20864r86363k111707m178361n359617k956291J760096
$$ -12650523 -13673304 -14015859 -14436723 -15423086 -17534793 -21713154 -27072771 -30029062 -28268966
2670b8268966M080770K891770K792210O541544R997580Q604632M587252K352450
$$ -28268966 -24188196 -21296426 -18504216 -11962672 -1965092 6639540 11226792 13579242
2662A3579242O16693m029772q579003o972446j090504M42742m545709q261211
$$ 13579242 14195935 10166163 1587160 -5385286 -6475790 -6033048 -10578757 -18839968
2654a8839968m963116J513895N495562O920779O913890L669787j768539k898658
$$ -18839968 -23803084 -22289189 -16793627 -9872848 -2958958 710829 -1057710 -3956368
2646c956368K374930N801585N02842p095161o108278K366377P657985N757359
$$ -3956368 -1581438 4220147 4722989 -2372172 -8480450 -6114073 1543912 7301271
2638G301271K618805J877754o9023m846471p443773m556263l23230L84678j230488
$$ 7301271 9920076 11797830 11728807 6882336 -561437 -5117700 -5440930 -5056252 -6286740
2629f286740j668184r63811q66045q72940L16653K108188L566920N187995O778792
$$ -6286740 -7954924 -8918735 -9784780 -10657720 -10341067 -8232879 -4665959 522036 7300828
2620G300828O080356J974670k828772m496687k250703J415318L385930K095639
$$ 7300828 13381184 15355854 12527082 8030395 5779692 7195010 10580940 12676579
2612A2676579j348283l683850k754673m58180o34939m010313p278061p259871
$$ 12676579 11328296 7644446 4889773 4431593 3796654 -213659 -7491720 -14751591
2604a4751591l968179L91291L479617M094197L212780L252583M712483M956076
$$ -14751591 -18719770 -18328479 -14848862 -10754665 -7541885 -4289302 423181 5379257
2596E379257K357493m36770l26792J291488J018901j000891j951917j001713Q01066
$$ 5379257 7736750 7299980 6973188 8264676 9283577 8282686 6330769 5329056 6130122
2587F130122L087570M508679J647017n073981p947001j518033P472413Q108252
$$ 6130122 9217692 13726371 15373388 10299407 2352406 834373 8306786 16415038
2579A6415038R36190m114603l960953n027294r033237q604656q82528N809868
$$ 16415038 17351228 13236625 9275672 4248378 -4784859 -13389515 -14272043 -8462175
2571h462175M554511m29698k494049k167064j914894J46794M462102N853811K225522
$$ -8462175 -3907664 -4337362 -6831411 -8998475 -10913369 -10766575 -6304473 -450662 1774860
2562A774860j02778L047005N652790J900328l472763m365119m551769q678062
$$ 1774860 1672082 4719087 10371877 12272205 8799442 4434323 -117446 -8795508
2554h795508r871876j63259J2296667J2108985M99529n607136P47398P333935
$$ -8795508 -18667384 -18830643 -6533976 5575009 6074538 467402 1214800 8548735
2546H548735L316319m925704n848489M2218L786921K033325o57027j5742L447287
$$ 8548735 11865054 6939350 1090861 1133079 4920000 6953325 6296298 6280556 9727843
2537I727843O208017M548324k094753q647377q493787j729233M289777M085299
$$ 9727843 15935860 20484184 18389431 9742054 1248267 -480966 3808811 7894110
2529G894110k85505m048930n376372m061987N33296O734082R376024N153000k723699
$$ 7894110 7608605 3559675 -1816697 -5878684 -5345388 1388694 10764718 15917718 13194019
2520A3194019p658334o083453K19309O052487O398596O32490o212372q625116
$$ 13194019 5535685 -547768 -328459 5724028 12122624 12755114 6542742 -2082374
2512b082374o642193l747065k75610N723168J1341709R484031p01550r877567
$$ -2082374 -8724567 -12471632 -12747242 -7024074 4317635 13801666 13100116 3222549
2504C222549r288879j781333K335222j480288o864869m823238M944218J2555509
$$ 3222549 -6066330 -7847663 -5512441 -6992729 -13857598 -18680836 -13736618 -1181109
2496a181109R072931j612473o337283o188O752474K924709o149501p295733o39342
$$ -1181109 7891822 6279349 -57934 -64122 6688352 9613061 3463560 -3832173 -4471515
2487d471515J183513n117194p348150J627888J1167667R507216J749460j42716
$$ -4471515 -3288002 -8405196 -15753346 -14125458 -2957791 6549425 8298885 8156169
2479H156169L223452K293530l593618n667455j486903J442958r68467l456779
$$ 8156169 11379621 13673151 10079533 4412078 2925175 4368133 3399666 -57113
2471e7113j942563o97932m162732q511203p101288l36036N014376M502075L02660
$$ -57113 -1999676 -2697608 -6860340 -15371543 -22472831 -22808867 -17794491 -13292416 -12989756
2462a2989756k425049r86842K986298N787339N327504K595058k03842j695689
$$ -12989756 -15414805 -16401647 -13415349 -7628010 -2300506 294552 90710 -1604979
2454a604979j206920J450061M772591N953492M072865J303492m39917j952315
$$ -1604979 -2811899 -1361838 3410753 9364245 13437110 14740602 14300685 12348370
2446A2348370m105605n086892k658683K425667P101294Q486722M851375k920032
$$ 12348370 8242765 3155873 497190 2922857 10024151 18510873 23362248 20442216
2438B0442216r609790r398315l414134P36028n56526k131186O71600M022276K550460
$$ 20442216 10832426 1434111 -1980023 -1243995 -1800521 -3931707 -3260107 762169 3312629
2429C312629j222532j682740j9445j156796m047682l841053j587665k504494n517058
$$ 3312629 2090097 407357 387912 -768884 -4816566 -8657619 -10245284 -12749778 -18266836
2420a8266836m024239K599245P464001P227801N795840N452623L424692l54324
$$ -18266836 -22291075 -19691830 -12227829 -5000028 795812 6248435 9673127 9318803
2412I318803j246750J040883M72630m232097n761936o92435L397768J51774m736155
$$ 9318803 8072053 9112936 9585566 5353469 -408467 -1100902 2296866 2448640 -2287515
2403b287515l318126J324291J357778j901463j093128L617437M851842O29571
$$ -2287515 -5605641 -4281350 -2923572 -4825035 -5918163 -2300726 2551116 3180687
2395C180687l210038l278048k485639k772194j978871N62932K358542L133432
$$ 3180687 -29351 -3307399 -5793038 -8565232 -10544103 -9981171 -7622629 -4489197
2387d489197N318492P786617N884715k50633m010016j755813J981299J876778
$$ -4489197 829295 8615912 14500627 14249994 10239978 8484165 10465464 12342242
2379A2342242j079750l228089l844713l382018r34144K383282K013114l363882
$$ 12342242 11262492 8034403 4189690 807672 -126472 2256810 4269924 906042
2371I06042p677566n235669O51047K552981j23629j505383O71596K191259K29241
$$ 906042 -6771524 -12007193 -11356146 -8803165 -8926794 -10432177 -9760581 -7569322 -7340081
$$ [...]
##END NTUPLES=NMR SPECTRUM
##END=
