##TITLE=31Pdec_DE-74rm_1h
 , 64 sc
 8.11.2024
##JCAMPDX= 6.0         $$ Bruker NMR JCAMP-DX V2.0
##DATA TYPE= NMR SPECTRUM
##DATA CLASS= NTUPLES
##ORIGIN= UXNMR, Bruker Analytische Messtechnik GmbH
##OWNER= root
$$ XWIN-NMR		Version 3.5
$$ Fri Nov  8 13:54:47 2024 Russian Standard Time (UT+4h)  she@DPX200
##.OBSERVE FREQUENCY= 81.013821
##.OBSERVE NUCLEUS= ^31P
##.ACQUISITION MODE= SIMULTANEOUS
##.ACQUISITION SCHEME= undefined
##.AVERAGES= 64
##.DIGITISER RES= 17
##SPECTROMETER/DATA SYSTEM= spect
##.PULSE SEQUENCE= zgpg30
##.SOLVENT NAME= CDCl3
##.SHIFT REFERENCE= (INTERNAL, CDCl3, 0, 198.062)
##AUDIT TRAIL= $$ (NUMBER, WHEN, WHO, WHERE, WHAT)
$$ ##TITLE= Audit trail, XWIN-NMR		Version 3.5
$$ ##JCAMPDX= 5.01
$$ ##ORIGIN= Bruker BioSpin GmbH
$$ ##OWNER= she
$$ F:/spectra/data/she/nmr/P31/2/pdata/1/auditp.txt
$$ ##AUDIT TRAIL=  $$ (NUMBER, WHEN, WHO, WHERE, WHAT)
(   1,<2024-11-08 13:53:36.84 +0400>,<she>,<DPX200>,
      <created by zg, POWCHK disabled, PULCHK disabled
       configuration hash MD5:
       00 E9 B6 7A A2 85 ED C7 34 08 36 98 17 FE 4E 26
       data hash MD5: 32K
       51 5F 8E 16 38 D9 27 76 08 E0 89 9E CB FA 93 46>)
(   2,<2024-11-08 13:53:39.42 +0400>,<she>,<DPX200>,
      <Start of raw data processing
       efp BC_mod = 2 LB = 1.5 FT_mod = 6 PKNL = 1 PHC0 = 2297.163 PHC1 = 4.488159 SI = 64K 
       data hash MD5: 64K
       5A 29 02 A0 3E 53 56 41 E8 1C E8 C3 B8 87 80 18>)
(   3,<2024-11-08 13:54:02.40 +0400>,<she>,<DPX200>,
      <pk PHC0 = -11.32147 PHC1 = 86.80006 
       data hash MD5: 64K
       D4 BE 92 A3 09 A7 DF D4 70 48 81 50 D4 79 6A 46>)
(   4,<2024-11-08 13:54:06.15 +0400>,<she>,<DPX200>,
      <abs ABSG = 5 
       data hash MD5: 64K
       6C E3 8D 67 A9 7C 08 DB 76 45 86 E6 F9 C0 3C F4>)
$$ ##END=
$$ 
$$ hash MD5
$$ 21 27 0B B1 DB 66 3B DD 22 8D 44 80 7A A9 D7 BD
##$RELAX= 
##$RELAX= 
##$RELAX= 
##$RELAX= 
##$RELAX= 
##$RELAX= 
##$RELAX= 
##$RELAX= 
$$ Bruker specific parameters
$$ --------------------------
##$DU= <F:/spectra>
##$EXPNO= 2
##$NAME= <P31>
##$PROCNO= 1
##$TYPE= <nmr>
##$USER= <she>
##$AMP= (0..31)
100 100 100 100 100 100 100 100 100 100 100 100 100 100 100 100 100 100 
100 100 100 100 100 100 100 100 100 100 100 100 100 100 
##$AQSEQ= 0
##$AQ_mod= 1
##$AUNM= <au_zg>
##$AUTOPOS= <>
##$BF1= 81.014009
##$BF2= 200.13
##$BF3= 200.13
##$BF4= 200.13
##$BF5= 200.13
##$BF6= 200.13
##$BF7= 200.13
##$BF8= 200.13
##$BYTORDA= 1
##$CFDGTYP= 0
##$CFRGTYP= 5
##$CHEMSTR= <none>
##$CNST= (0..31)
1 1 145 1 1 1 1 1 1 1 1 1 1 1 1 1 1 1 1 1 1 1 1 1 1 1 1 1 1 1 1 1 
##$CPDPRG= <waltz16>
##$CPDPRG1= <>
##$CPDPRG2= <waltz16>
##$CPDPRG3= <>
##$CPDPRG4= <mlev>
##$CPDPRG5= <mlev>
##$CPDPRG6= <mlev>
##$CPDPRG7= <mlev>
##$CPDPRG8= <mlev>
##$CPDPRGB= <>
##$CPDPRGT= <>
##$D= (0..31)
0 1 0 0 0 0 0 0 0 0.06 0 0.03 2e-05 3e-06 0 0 0.0002 0 0 0 0 0 0 0 0 0 
0 0 0 0 0 0 
##$DATE= 1731059616
##$DBL= (0..7)
120 120 120 11 120 120 24 19 
##$DBP= (0..7)
150 150 150 150 150 150 150 150 
##$DBP07= 0
##$DBPNAM0= <>
##$DBPNAM1= <>
$$ [...]
##$SUBNAM3= <"">
##$SUBNAM4= <"">
##$SUBNAM5= <"">
##$SUBNAM6= <"">
##$SUBNAM7= <"">
##$SUBNAM8= <"">
##$SUBNAM9= <"">
##$SW= 400.765351723535
##$SWIBOX= (0..15)
0 1 3 0 0 0 0 0 0 0 0 0 0 0 0 0 
##$SW_h= 32467.5324675325
##$TD= 32768
##$TD0= 1
##$TE= 0
##$TE2= 300
##$TE3= 300
##$TEG= 300
##$TL= (0..7)
0 120 53 12 22 120 120 120 
##$TP= (0..7)
150 150 150 150 150 150 150 150 
##$TP07= 0
##$TPNAME0= <>
##$TPNAME1= <>
##$TPNAME2= <>
##$TPNAME3= <>
##$TPNAME4= <>
##$TPNAME5= <>
##$TPNAME6= <>
##$TPNAME7= <>
##$TPOAL= (0..7)
0.5 0.5 0.5 0.5 0.5 0.5 0.5 0.5 
##$TPOFFS= (0..7)
0 0 0 0 0 0 0 0 
##$TUNHIN= 0
##$TUNHOUT= 0
##$TUNXOUT= 0
##$USERA1= <user>
##$USERA2= <user>
##$USERA3= <user>
##$USERA4= <user>
##$USERA5= <user>
##$V9= 5
##$VALIST= <valist>
##$VCLIST= <CCCCCCCCCCCCCCC>
##$VD= 0
##$VDLIST= <DDDDDDDDDDDDDDD>
##$VPLIST= <PPPPPPPPPPPPPPP>
##$VTLIST= <TTTTTTTTTTTTTTT>
##$WBST= 1024
##$WBSW= 4
##$XGAIN= (0..3)
0 0 0 0 
##$XL= 0
##$YL= 0
##$YMAX_a= 84877
##$YMIN_a= -109870
##$ZGOPTNS= <>
##$ZL1= 120
##$ZL2= 120
##$ZL3= 120
##$ZL4= 120
##$ABSF1= 198.0616
##$ABSF2= -202.7028
##$ABSG= 5
##$ABSL= 3
##$ALPHA= 0
##$AQORDER= 0
##$ASSFAC= 0
##$ASSFACI= 0
##$ASSFACX= 0
##$ASSWID= 0
##$AUNMP= <proc_1d>
##$AZFE= 0.1
##$AZFW= 0.5
##$BCFW= 0
##$BC_mod= 2
##$BYTORDP= 0
##$COROFFS= 0
##$CY= -3
##$DATMOD= 1
##$DC= 0
##$DFILT= <>
##$DTYPP= 0
##$F1P= 0
##$F2P= 0
##$FCOR= 1
##$FTSIZE= 65536
##$FT_mod= 6
##$GAMMA= 0
##$GB= 0
##$INTBC= 1
##$INTSCL= 9.790993e-09
##$ISEN= 30
##$LB= 1.5
##$LEV0= 0
##$LPBIN= 0
##$MAXI= 10000
##$MC2= 0
##$MEAN= 0
##$ME_mod= 0
##$MI= 50
##$NCOEF= 0
##$NC_proc= -3
##$NLEV= 6
##$NOISF1= 182.463
##$NOISF2= 159.3651
##$NSP= 0
##$NTH_PI= 0
##$NZP= 0
##$OFFSET= 198.0616
##$PC= 4
##$PHC0= 2285.842
##$PHC1= 91.28822
##$PH_mod= 1
##$PKNL= yes
##$PPARMOD= 0
##$PSCAL= 0
##$PSIGN= 0
##$REVERSE= no
##$SF= 81.0140089999434
##$SI= 65536
##$SIGF1= 159.3651
##$SIGF2= -187.1042
##$SINO= 113.3802
##$SIOLD= 16384
##$SREGLST= <1H.CDCl3>
##$SSB= 0
##$STSI= 65536
##$STSR= 0
##$SW_p= 32467.5324675325
##$SYMM= 0
##$S_DEV= 0
##$TDeff= 32768
##$TDoff= 0
##$TI= <>
##$TILT= no
##$TM1= 0
##$TM2= 0
##$TOPLEV= 0
##$USERP1= <user>
##$USERP2= <user>
##$USERP3= <user>
##$USERP4= <user>
##$USERP5= <user>
##$WDW= 1
##$XDIM= 65536
##$YMAX_p= 338066036
##$YMIN_p= -10103306
$$ End of Bruker specific parameters
$$ ---------------------------------
##NTUPLES= NMR SPECTRUM
##VAR_NAME=  FREQUENCY,     SPECTRUM/REAL,   SPECTRUM/IMAG
##SYMBOL=    X,             R,               I
##VAR_TYPE=  INDEPENDENT,   DEPENDENT,       DEPENDENT
##VAR_FORM=  AFFN,          ASDF,            ASDF
##VAR_DIM=   65536,         65536,           65536
##UNITS=     HZ,            ARBITRARY UNITS, ARBITRARY UNITS
##FACTOR=    0.49542278885378, 1,            1
##FIRST=     16045.7642231865, 0,            0
##LAST=      -16421.768244346, 0,            0
##MIN=       -16421.768244346, -10103306,    0
##MAX=       16045.7642231865, 338066036,    0
$$ Real data points
##PAGE= N=1
##DATA TABLE= (X++(R..R)), XYDATA
$$ [...]
37642A12566M1864J35084J46241R5434K8501k0756l2151r372K478m7368j41497
$$ 112566 154430 289514 435755 531189 559690 538934 506783 497411 499889 452521 311024
37631C11024j93687j50423o1222j2937j9138j7078L6763J09785J36495R1922J4034
$$ 311024 117337 -33086 -94308 -107245 -126383 -143461 -106698 3087 139582 231504 245538
37620B45538l5206k8020Q466L3403M1721M8513L8790j6800r2646j16219o9136
$$ 245538 210332 182312 190778 224181 265902 314415 353205 336405 243759 127540 58404
37609E8404j8867j2992o620M8716J04511Q2170r32n8673o4972o6272p6161n1482
$$ 58404 39537 26545 19925 68641 173152 255322 254390 195717 130745 64473 -11688 -63170
37597f3170J4283N8246L7872j0453l0748j3309K1550N6813P4999O5288M8528M9122
$$ -63170 -48887 9359 47231 36778 6030 -7279 14271 71084 146083 211371 259899 309021
37585C09021L7638l3480j23710j18286O800J13021O7878p0281j27186m5022N8205
$$ 309021 346659 313179 189469 71183 77983 191004 258882 188601 61415 16393 74598
37574G4598O6698J0518r072L2256P1661O1913K0000j9432m5152n6191m9504l2884
$$ 74598 141296 151814 142742 174998 246659 308572 328572 309140 263988 207797 158293 125409
37562A25409j6887J1081O1763Q8947K7301q6482j14581q387Q4167J4363j25528
$$ 125409 108522 119603 181366 270313 297614 211132 96551 88164 172331 186694 61166
37551F1166j12265P3203K01436J25846k1830o1757k8491n8092j34915j28444k0489
$$ 61166 -51099 22104 223540 349386 327556 265799 237308 179216 44301 -84143 -104632
37540a04632P2323P8496L2947k2032o6031n0610M7118J35287J04327K61l6367
$$ -104632 -32309 46187 79134 57102 -8929 -59539 -12421 122866 227193 227454 191087
37529A91087R439K3179k5612l8821J7681N2667K6798J8572N1817L3185n5391p9634
$$ 191087 200526 223705 198093 159272 176953 229620 256418 274990 326807 359992 304601 224967
37517B24967K0287R5998K4213q0599n4554M4949M8164m3236q3891l8326o732k2115
$$ 224967 245254 341252 365465 284866 230312 275261 323425 280189 196298 157972 151240 129125
37505A29125j0400M4170O2402J8232k0519j7242k146K5004R0152J31802M3870
$$ 129125 118725 162895 225297 243529 223010 205768 203622 228626 318778 450580 494450
37494D94450j32837k09132r7384O4344J06445L2771m3351o5816n0887j3611L3359
$$ 494450 361613 152481 55097 119441 225886 258657 215306 149490 98603 84992 118351
37483A18351N7651M9239L9617L4842q867r4714j40127q3889K0753Q0615P3503
$$ 118351 176002 225241 264858 299700 290833 196119 55992 -27897 -7144 73471 146974
37472A46974K7061m6586j20756j20429j2132J10289J22176K9077n3241o3224m9079
$$ 146974 174035 127449 6693 -113736 -125868 -15579 106597 135674 82433 19209 -29870
37461b9870n9810o7669k5514N7640J26867J34225P2652j2771n1867k3625P720
$$ -29870 -89680 -157349 -182863 -125223 1644 135869 208521 195750 143883 120258 127978
37450A27978k3548p9133n9810M4462J23097R2824R909j9235P574l210q7592j52673
$$ 127978 104430 25297 -34513 9949 133046 225870 235779 216544 224118 220908 133316 -19357
37438a9357r3610N7314J52728J04847p877m3361K1828P1632J7313q1225j05971
$$ -19357 -112967 -55653 97075 201922 194045 150684 172512 244144 261457 180232 74261
37427G4261m4632O403j4474o3336p3778m2005J566M8874R5976J08134N7787k1603
$$ 74261 29629 36032 21558 -41778 -115556 -157561 -155995 -107121 -11145 96989 154776 133173
37415A33173o8958p2617o7389o2348k7547L7782Q0391O6629L6145L9877N7772
$$ 133173 64215 -8402 -75791 -138139 -165686 -127904 -47513 19116 55261 95138 152910
37404A52910L2621l1399o7610n0130l4831o6594r8344n5452M7098J11465P8159
$$ 152910 185531 154132 86522 36392 1561 -65033 -163377 -218829 -171731 -60266 17893
37393A7893q617o4415n2358K687M8015L6077l6601j02398p6332L2401J07000O8241
$$ 17893 9276 -55139 -107497 -104810 -56795 -20718 -57319 -159717 -236049 -203648 -96648 -28407
37381b8407r275L139R9424J43200O4521n0504j03921j15875j34140j08194K0358
$$ -28407 -37682 -34543 64881 208081 272602 222098 118177 2302 -131838 -240032 -219674
37370b19674J54427J25892m8948j52477o0756Q3264Q8343j1103m0069L4658P8434
$$ -219674 -65247 60645 11697 -140780 -201536 -118272 -29929 -41032 -81101 -46443 31991
37359C1991K8469j3454L0399Q1046M2488l7126n0990q893r786o8113q1164J3375
$$ 31991 60460 47006 77405 158451 200939 163813 112823 103930 94144 26031 -55133 -41758
37347d1758J32001J43248L0985q6853j00205l2948K591l4397n9225l501N7106
$$ -41758 90243 233491 264476 177623 77418 44470 47061 12664 -46561 -50062 7044
37336G044J1412r0122q3477N2770J41002O5209o0875r1583p5274j25264j74980
$$ 7044 18456 -71666 -155143 -102373 38629 103838 42963 -48620 -123894 -249158 -424138
37325d24138o9367J44761K39625J35516O754l11K9970l5573j45410j49846k9223
$$ -424138 -493505 -348744 -109119 26397 33151 32840 62810 27237 -118173 -268019 -297242
37314b97242R7440J43203J22357P8016L3022J083j9052m8386q3954p9949j4042
$$ -297242 -199802 -56599 65758 143774 176796 177879 158827 110441 26487 -53462 -67504
37303f7504O5277J00395R1634O0658l94q9045j51986j46078r8794n3401l040O1649
$$ -67504 -2227 98168 189802 250460 250066 161021 9035 -137043 -235837 -289238 -292278 -230629
37291b30629R5724O4898J7700J5034L5689L2945K9866N9835O6543j3974j09039
$$ -230629 -134905 -70007 -52307 -37273 -1584 31361 61227 121062 187605 173631 64592
37280F4592q7254L0875Q5494J3977o8968o3380j6023j11O800M0108N3206O667
$$ 64592 -22662 8213 93707 107684 38716 -24664 -40687 -40798 -33998 6110 59316 65983
37268F5983l2782Q466P5185O0358k1173n1082J1995P7808O5947J2114n635J5299
$$ 65983 33201 41667 116852 177210 156037 104955 116950 194758 260705 272819 267184 282483
37256B82483J0524m8665j06169q5630J2230R8761R4640K0037l9411m3254k9603
$$ 282483 293007 244342 138173 52543 64773 163534 258174 278211 238800 195546 165943
37245A65943l9277n9724o2268m8455l3562k1061j5186k3081k8512n237L0768L4760
$$ 165943 126666 66942 4674 -43781 -77343 -98404 -113590 -136671 -165183 -170420 -139652 -104892
37233a04892J2279J6961M6218K4168o3838j10126l6757O9108P2900j1707n8710
$$ -104892 -92613 -75652 -29434 -5266 -69104 -179230 -215987 -146879 -73979 -85686 -144396
37222a44396k4337J7983K6285M7874J07151J43543J02640J1117p3489j20986j12510
$$ -144396 -168733 -150750 -124465 -76591 30560 174103 276743 287860 214371 93385 -19125
37211a9125l8521N6201R2169N2202j396l0157o5501j16363j14294j5363J06457
$$ -19125 -57646 -1445 90724 142926 141530 111373 45872 -70491 -184785 -200148 -93691
37200i3691J42810Q6743J5000l1396p1745j06709r4291j9552O7659J09622J02277
$$ -93691 49119 135862 150862 119466 47721 -58988 -153279 -172831 -105172 4450 106727
37189A06727P7995N0071L457o0733j00137p8356k8749k6234p7556r1284l966J10686
$$ 106727 184722 234793 238250 177517 77380 -976 -29725 -55959 -133515 -224799 -228765 -118079
37177a18079J30451M9068l5930p5764j00550j02320k3228J03979J38508K7473
$$ -118079 12372 61440 25510 -50254 -150804 -253124 -276352 -172373 -33865 -6392
37167f392r5571r6521k2124P540p325J2705O2214O7036K5225K108Q466K439p978
$$ -6392 -101963 -198484 -220608 -213068 -220393 -207688 -145474 -78438 -53213 -51105 -42639 -40200 -48178
37154d8178J8997N9166N5740L3961N9147R5660M2638r1375j85371j82463j32898
$$ -48178 -29181 29985 85725 119686 178833 274493 317131 225756 40385 -142078 -274976
37143b74976n9061O4169J76057J53463J8884m6222L3071J14085P5876m892k9898
$$ -274976 -334037 -269868 -93811 59652 78536 32314 65385 179470 255346 250454 220556
37132B20556n5993j45179j93956r5149N3339R6479P7726J36877K29331J78535
$$ 220556 164563 19384 -174572 -269721 -216382 -119903 -42177 94700 324031 502566
37122E02566k0076j70515j59191p0410m965K7995J6801o3567j30596n2084J21346
$$ 502566 482490 311975 152784 82374 77409 105404 122205 58638 -71958 -124042 -2696
37111b696J69797K2661j23830j03896j2601q834n6320l0174M4264M6369k0175
$$ -2696 167101 189762 65932 -37964 -50565 -59399 -115719 -145893 -101629 -55260 -75435
37100g5435l9101K2836Q2921Q8050O6391M3835J6029o088j1321k6807o0239m4964
$$ -75435 -114536 -91700 -8779 79271 145662 189497 205526 199438 188117 161310 101071 56107
37088E6107O0736J64022J42552K7051m4929l6501l8458r0644j16538o5021O064
$$ 56107 116843 280865 423417 450468 405539 369038 330580 239936 123398 58377 64441
37077F4441L3132L2109L4965K9204N017j3666k1920m4965o9859m6930J3359L4343
$$ 64441 97573 129682 164647 193851 198868 185202 163282 118317 48458 1528 14887 49230
37065D9230k724k4393L315J4577k4387l2855M5373J16830O7100n2126q6875M778
$$ 49230 46506 22113 25428 40005 15618 -17237 28136 144966 212066 159940 73065 77843
37053G7843J13745J35142O4996m0142j06968o6097P5373J93522J75203P5182M3842
$$ 77843 191588 326730 391726 351584 244616 178519 253892 447414 622617 697799 741641
37042G41641J08044J47419J01179O0022R9546J51565J31588R3886J44996K61553
$$ 741641 849685 997104 1098283 1158305 1257851 1409416 1541004 1634890 1779886 2041439
37032B041439L10488K31626J04343L1438L0223M8723L9346R601K8251J63742L83109
$$ 2041439 2351927 2583553 2687896 2719334 2749557 2798280 2837626 2847227 2875478 3039220 3422329
37021C422329N46519N58382M95133N09487O16890O54637M69470Q8450l14892n79422
$$ 3422329 3968848 4527230 5022363 5531850 6148740 6803377 7272847 7361297 7046405 6466983
37011F466983o67929o61808o62958o82316o35630m74135k81996j84579j91772
$$ 6466983 5799054 5137246 4474288 3791972 3156342 2682207 2400211 2215632 2023860
37002B023860k13985k10522k16890k28856j85650r9174p2213j26826j36018j6032
$$ 2023860 1809875 1599353 1382463 1153607 967957 868783 796570 669744 533726 517694
36992E17694J20091J15389p146r9300j04443q5034p4439m3504k978n466l9149
$$ 517694 637785 753174 746028 646728 542285 457251 382812 339308 336330 330864 291715
36981B91715l8591q603j8152o1283n2801J3870M0332j838q838P1996J29620O2517
$$ 291715 253124 244521 226369 165086 112285 126155 166487 164649 155811 227807 357427 419944
36969D19944m6371n3792K3054M6206k4879q8266o6141k835K1630p374m7924n5984
$$ 419944 373573 319781 342835 389041 364162 275896 209755 206920 228550 221176 173252 117268
36957A17268j6975L8257N1574P597l1876r359L4807J3600p0704j12198m0537Q0013
$$ 117268 100293 138550 190124 197721 165845 156486 191293 204893 134189 21991 -18546 61467
36945F1467J23388M7502o1353q8182j9994M0383M558q1285r4424n897P8221O6193
$$ 61467 184855 232357 171004 82822 62828 103211 107769 26484 -67940 -73837 4384 70577
36933G0577l280l8929k3933m246k927j1501k5877l2378r27N2895N5674p272l0216
$$ 70577 67297 28368 4435 189 -2738 -14239 -40116 -72494 -73421 -20526 35148 27876 -2340
36920b340O5663J84139J70279L4953o6998o4830m0498o1454q3731o2589l9022
$$ -2340 63323 247462 417741 452694 385696 320866 280368 218914 135183 72594 33572
36909C3572n2789o2254k0452L5752L7773j7632p4226q7870n8958k0550j1539l3749
$$ 33572 -19217 -81471 -101923 -66171 -28398 -46030 -120256 -208126 -267084 -287634 -299173 -332922
36897c32922l6098K0351R4439J17159R4399Q2937P7473J8844p8087j11828m3849
$$ -332922 -369020 -348669 -254230 -137071 -42672 40265 117738 136582 58495 -53333 -97182
36886i7182L5454L9902M100R287N9404R2752P2530J5750l8823o2933o4052p9983
$$ -97182 -61728 -21826 -17726 -8439 50965 143717 216247 231997 193174 130241 66189 -13794
36874a3794j13155r7465R91Q7006N0535m4987l3789Q5898J26097N53j30863j06638
$$ -13794 -126949 -224414 -223423 -136417 -85882 -130869 -164658 -78760 47337 47890 -82973 -189611
36862a89611q39J4388p3127j37618j14680m4006L0679Q7128R5522O0114M0849
$$ -189611 -190450 -176062 -249189 -386807 -501487 -545493 -514814 -427686 -332164 -272050 -231201
36851b31201N7527M6493r495j2064Q5186J52178O7977o7797p6312K5563P4469
$$ -231201 -173674 -127181 -136676 -148740 -63554 88624 156601 88804 12492 38055 112524
36840A12524K8769n354J4195K2095P313K9855O7221K6972o7254q2414Q98N2155
$$ 112524 141293 135939 150134 172229 179542 209397 276618 303590 236336 153922 154820 206975
36828B06975J9593R879P4861J02504J6157p9654o5332J6865O3916O8641O2388
$$ 206975 226568 236447 311308 413812 429969 350315 284983 301848 365764 434405 496793
36817D96793J5797q0736j37187r1437l0168n2507r2060k2038J15588J44322Q666
$$ 496793 512590 431854 294667 203230 173062 120555 28495 6457 122045 266367 275033
36806B75033j41435j45224j2005J20729J41458N3457m5526n8626J2316P3345N8182
$$ 275033 133598 -11626 -23631 97098 238556 292013 246487 187861 200177 273522 331704
36795C31704O194q276J9988L9378K2170j5199m6913n5196l8904k9463o0392j02820
$$ 331704 337898 329622 349610 388988 411158 395959 349046 293850 254946 225483 165091 62271
36783F2271q8072j6856K9151K0049L0251R7740J28627L8417r0521j10685j8514
$$ 62271 -25801 -42657 -13506 6543 36794 134534 263161 301578 211057 100372 81858
36772H1858N8365N3590K2359J7709J8802l340l7103o4883q0965p1275l4209j0970
$$ 81858 140223 193813 216172 233881 252683 249343 212240 147357 66392 -4883 -39092 -50062
36760e0062l1626n0538r781N5055O0360J0697q696K7129N1886K9061K096Q5r222
$$ -50062 -81688 -132226 -142007 -86952 -26592 -15895 -24591 2538 54424 83485 85581 85666 76444
36747G6444l8233m2036l661K5078J0304j5441l3266p8376j42633j26275K6754
$$ 76444 38211 -3825 -7486 17592 27896 12455 -20811 -99187 -241820 -368095 -341341
36736c41341K10172K66557J77024N3268k4195o4014p9490n1868M921K8790o473
$$ -341341 -131169 135388 312412 365680 341485 277471 197981 146113 151034 179824 173351
36725A73351n1313n5044k9306p646Q411K6283K9989J3905Q836K4428O631p6852
$$ 173351 122038 66994 37688 30042 38453 64736 94725 108630 117466 141894 148525 71673
36713G1673j39797o5271J06785J90740R8396l4786m8554J1167j1999j16625j36325
$$ 71673 -68124 -133395 -26610 164130 262526 227740 179186 190353 178354 61729 -74596
36702g4596o764J23609J12960K1983o788L4392M0909k3706q8922r9591p8631o5680
$$ -74596 -81360 42249 155209 177192 170404 204796 245705 221999 133077 33486 -45145 -110825
36690a10825o3373m7660J2315J26604K37323K40469J11954l2255p1009k7303k764
$$ -110825 -174198 -221858 -209543 -82939 154384 394853 506807 474552 403543 376240 373476
36679C73476j4632n827J9189j178n1619m2719L1094N9249j8188j19259j47512
$$ 373476 358844 353017 372206 371028 319409 276690 307784 367033 348845 229586 82074
36668H2074j16900r0065o9998j8005P2015J63858K03107J36720k6837j68078j56387
$$ 82074 -34826 -124891 -194889 -212894 -140879 22979 226086 362806 335969 167891 11504
36657A1504k2031O9913M6349R744M7966R7384Q3648O6989J19912J68761J10368
$$ 11504 -10527 59386 105735 115479 163445 260829 344477 411466 531378 700139 810507
36646H10507P609J451P9837J11165Q1112J04190J87689J81721K7067j25363j43027
$$ 810507 818116 819567 899404 1010569 1091681 1195871 1383560 1565281 1592348 1466985 1323958
36635A323958j08744j58407k41867k09861p2717J226o3661j55722j59453r8764
$$ 1323958 1215214 1056807 814940 605079 532362 533588 469927 314205 154752 55988
36625E5988l9830L2685J47175K29265J72763N917j19406j19255o9363p0207j00671
$$ 55988 16158 48843 196018 425283 598046 603963 484557 365302 295939 225732 125061
36614A25061p3616J4530P6442O2978J8895k592j0031k7471l5886p394L8138N8097
$$ 125061 51445 65975 142417 205395 224290 221698 211667 184196 148310 140916 179054 237151
36602B37151M7808L3848K0848j2785o7383j04268q3201k123R8550J61543J56454
$$ 237151 284959 318807 339655 326870 259487 155219 72018 69895 168445 329988 486442
36591D86442J13997J00425J38317J71768J36772M6996k7234n4141p0128j09462
$$ 486442 600439 700864 839181 1010949 1147721 1194717 1167483 1113342 1043214 933752
36581I33752j47410j38170q4363l6500k6150k7013J646M7591N4045M709l6069
$$ 933752 786342 648172 563809 527309 501159 474146 475792 523383 577428 582137 546068
36570E46068o311N3950M5697m5094j12666o8762M2502J10739R4444L6125k2622
$$ 546068 539757 593707 639404 594310 481644 412882 455384 566123 660567 696692 674070
36559F74070p5430j12207j06304m9491L4803J12213J46401J07366J1680o3042
$$ 674070 598640 486433 380129 330638 365441 477654 624055 731421 743101 680059
36549F80059n4110L956K3852j3607m0538q720M4863O0611L4492M018p084M31J9870
$$ 680059 625949 629905 653757 640150 599612 590892 635755 696366 730858 734876 727792 728223 748093
36536G48093L9499M0999J9166o029r588J3472M6096O1341L9126j3713o3145q1176
$$ 748093 787592 828591 847757 841728 832140 845612 891708 953049 992175 978462 915317 834141
36524H34141o9400l6971J7974P6059P9993L124q9092j12220q3415q9375j34774
$$ 834141 764741 727770 745744 821803 901796 904920 815828 703608 620193 530818 396044
36513C96044j19547O41J24195J35149N3657j7115l8200m6321n6622m5851k1518
$$ 396044 276497 277138 401333 536482 590139 573024 534824 488503 431881 386030 364512
36502C64512k2905m3830k5714N1471J26890J31768O2991l4395j16356j49321j12415
$$ 364512 341607 297777 272063 323534 450424 582192 645183 610788 494432 345111 232696
36491B32696k7237L8140L2740j4927k4436M4098J40287J71358R5910l0967j07104
$$ 232696 205459 243599 276339 261412 236976 281074 421361 592719 688629 657662 550558
36480E50558q0311O231O5935N4271n239o1128p6464m3075J3836M5201K4089j2364
$$ 550558 470247 476478 542413 596684 591445 530317 453853 410778 424614 469815 493904 481540
36468D81540j688N1751O5894o240r2148q3979J0382O9203K0818o3496q0862m0432
$$ 481540 479852 531603 597497 591257 499109 415130 425512 494715 515533 452037 371175 330743
36456C30743k4034l9274j0248P6112J14937L2589q1477p7547N2695J64494J43869
$$ 330743 306709 267435 257187 333299 448236 480825 399348 321801 374496 538990 682859
36445F82859K2777r8782j64949j66216j01536L958Q4221R1520N2381K7281L5680
$$ 682859 705636 606854 441905 275689 174153 178111 262332 353852 406233 433514 469194
36434D69194N3873O0218M4523n82n4326o0981O9O1230M5947j6453l1598O868p20
$$ 469194 523067 583285 627808 627226 572900 511919 511988 573218 619165 602712 571114 577982 577262
36421E77262r1057j43154l4059J63034K39474J11271p1460j15790k2313M0636
$$ 577262 486205 343051 308992 472026 711500 822771 751311 635521 613208 653844
36411F53844k4972j21646j02493K3912J11503P8133j986k9660j6818k7259m8884
$$ 653844 628872 507226 404733 428645 540148 618281 616295 586635 569817 542558 493674
36400D93674k2898K9546K0664n3902q2002P329J37349J89912J50490Q5682L4811
$$ 493674 470776 500322 520986 467084 385082 392411 529760 719672 870162 955844 990655
36389I90655m500k7937l7569o9041j30352j47314n8348O2448Q3521J2462m363
$$ 990655 986155 958218 920649 851608 721256 573942 515594 578042 661563 674025 669662
36378F69662R4826J84617J38129J4289l5252K0959P9380O4150J791n6442r0980
$$ 669662 764488 949105 1087234 1101523 1066271 1087230 1166610 1230760 1232551 1176109 1085129
36367A085129q3465j7042O4011O7270l1237j32641j21643L975J44559K08382J75249
$$ 1085129 1001664 984622 1048633 1115903 1084666 952025 830382 834357 978916 1187298 1362547
36356A362547Q2164n996k7599K2447O9741L5651n6777r8422l6759M4964L8179
$$ 1362547 1444711 1438715 1411116 1433563 1503304 1538955 1482178 1383756 1346997 1391961 1430140
36345A430140l4269m4151N6860J56787J32773K0245m2167o610L4859N17p0180
$$ 1430140 1395871 1351720 1408580 1565367 1698140 1718385 1676218 1669608 1704467 1704984 1634804
36334A634804r4662o5462l3457k3044k7558n4850j09261j46068j10805k2305L9263
$$ 1634804 1540142 1474680 1441223 1418179 1390621 1335771 1226510 1080442 969637 947332 986595
36323I86595L0847j1664k7836J4234J09582K07777K19098R4126r2443j96819j62693
$$ 986595 1017442 1005778 977942 992176 1101758 1309535 1528633 1622759 1530316 1333497 1170804
36312A170804p2171k7515m0508o2898o8311o3992n9511n7915n2103j4695P2034
$$ 1170804 1098633 1071118 1030610 967712 899401 835409 775898 717983 665880 651185 723219
36301G23219J64827J85075J12116L597q7650j54882j81053j23126N722J13028
$$ 723219 888046 1073121 1185237 1188834 1101184 946302 765249 642123 647845 760873
36291G60873J38311J19685R9347M6574n0413j00506k5827R5496J20058L8000l5791
$$ 760873 899184 1018869 1118216 1164790 1114377 1013871 988044 1083540 1203598 1241598 1205807
36280A205807m6302m8188p0913o2404n29M6482K2100l3732n0365j9323J7798K8730
$$ 1205807 1159505 1111317 1040404 978000 977471 1023953 1046053 1012321 961956 942633 960431 989161
36268I89161R413j9544k3031N527J7193k7704q3693p4885r330M1063N8356P7520
$$ 989161 998574 979030 955999 961526 978719 951015 867322 792437 783107 824170 882526 960046
36256I60046P7943j229j22766j58972p6849J0353K6447L4757Q8026J13897N1978
$$ 960046 1037989 1036760 913994 755022 678173 688526 714973 749730 837756 951653 1003631
36245A003631j8518j0739J7685j9971o9829l8744J7128j5533q1370k1628J47698
$$ 1003631 985113 974374 992059 972088 902259 863515 880643 865110 783740 762112 909810
36234I09810K23206J09454n3506j12621q9911p5702p9413p6816q3928q9412k1330
$$ 909810 1133016 1242470 1188964 1076343 986432 910730 831317 754501 670573 581161 559831
36223E59831J20253J97909J14353l0036p3727j4088L3844L2795L1995K1587o0119
$$ 559831 680084 877993 992346 962310 888583 874495 908339 941134 973129 994716 934597
36212I34597j73688j88040p8405J9123N214m7867k9463M2341P5405N1772K7981
$$ 934597 760909 572869 494464 513587 518801 470934 441471 483812 559217 610989 638970
36201F38970L4749O0228R6104J21968Q0183m7802j66859j62351n5693K7380L7302
$$ 638970 673719 733947 830051 952019 1032202 984400 817541 655190 599497 626877 664179
36190F64179M4765R3366J23309Q6554L4214K1907J5130l0215o7029l2062L3939
$$ 664179 708944 802310 925619 1012173 1046387 1068294 1083424 1053209 986180 954118 988057
36179I88057M5134J2131J5420N7012N3136j9975q0097o1788O414P1731J13699
$$ 988057 1033191 1045322 1060742 1117754 1170890 1150915 1070818 1009030 1015444 1087175 1200874
36168A200874J01709o293j69227k51776j77473l2350M8342M2207K2161K6797K8072
$$ 1200874 1302583 1296290 1127063 875287 697814 665464 713806 756013 778174 804971 833043
36157H33043M419k4266l0201j066O0127J25743J52483J27393Q1247L7245j3439
$$ 833043 837462 813196 782995 781929 842056 967799 1120282 1247675 1328922 1366167 1352728
36146A352728o2615o6300j1302N3684R2567J25732J55815J27848L0654m1480j8590
$$ 1352728 1290113 1223813 1212511 1266195 1358762 1484494 1640309 1768157 1798811 1757331 1738741
36135A738741K5319r794p7237o0939J7948K2110q3836j83116j88918j40291r1303
$$ 1738741 1764060 1754266 1677029 1616090 1634038 1656148 1572312 1389196 1200278 1059987 968684
36124I68684l9570m607m2066j20068j09806K0613J20175O2223o3130q4273k634
$$ 968684 929114 924507 882441 762373 652567 673180 793355 855578 792448 708175 705541
36113G05541K3697p8681j99763j98861o5138R4335J65667J13446J533o1201k5572
$$ 705541 729238 650557 450794 251933 186795 281130 446797 560243 561776 500575 475003
36102D75003N0985Q4318O5095M2107L2607Q910l3297n4802l5282r060j3626l3231
$$ 475003 525988 610306 675401 717508 750115 759025 725728 670926 635644 626584 612958 579727
36090E79727k4824J2239K6258j4245o2475m5339K7714N9647r70p4647o0036J2757
$$ 579727 554903 567142 593400 579155 516680 471341 499055 558702 557732 483085 423049 435806
36078D35806K7307l6138o9081n795P7950Q7018M0786J7463L0162L2091J892m1781
$$ 435806 463113 426975 357894 352099 430049 517067 557853 575316 605478 637569 639461 597680
36066E97680p9081r0531n4177J3399N3319M4416L6756N9261N9106o69n1418j8536
$$ 597680 518599 428068 373891 387290 440609 485025 521781 581042 640148 639479 588061 569525
36054E69525M3737K6235o0566j03583o5193k2041j6792M491O6449Q8448P279j02980
$$ 569525 613262 639497 578931 475348 410155 388114 371322 375813 442262 530710 537989 435009
36042D35009j18362k9621N8676P4392N0414M4206M7680J7055l7920n2417n595
$$ 435009 316647 287026 345702 420094 470508 514714 562394 579449 541529 489112 483517
36031D83517L3419O358l0727J1046Q7661N7706q8647j70116o6869Q9503J06352
$$ 483517 516936 523294 492567 503613 591274 648980 560333 390217 323348 412851 519203
36020E19203R885l3794q907n0604j64517j74700j7093J22628Q6093j2809J9889
$$ 519203 529088 495294 486387 435783 271266 96566 79473 202101 288194 275385 295274
36009B95274J47438J73546N5013n4098n8614l8678p3658j06939o2835J6131M3638
$$ 295274 442712 616258 671271 617173 558559 519881 446223 339284 276449 292580 336218
35998C36218L0769N7900J38118J90757J47569K9006q7779j36179r5192K055Q2433
$$ 336218 366987 424887 563005 753762 901331 930337 842558 706379 611187 613242 695675
35987F95675Q4647J6609m9756n1819Q19L9979R687p6651j44482j28974m5722K2443
$$ 695675 780322 796931 747175 695356 696175 736154 745841 669190 524708 395734 350012 372455
35975C72455K7255K1956Q2204J71021J57210j803j70834j98186j08419m1505l9773
$$ 372455 399710 421666 503870 674891 832101 830298 659464 461278 352859 311354 271581
35964B71581j8904N2220Q3429K2055m8149m7760l1509p1990j07696m2372O8045
$$ 271581 252677 304897 388326 410381 362232 314472 282963 210973 103277 60905 128950
35953A28950Q2926N655j4922P6977J58630J28108N0473K9607M8585L4611j844
$$ 128950 211876 217531 202609 279586 438216 566324 616797 646404 694989 729600 727756
35942G27756k472J4306k5913j21577j77532j33300m2690Q43k1263m3390j0186
$$ 727756 725284 739590 713677 592100 414568 281268 238578 239421 218158 174768 164582
35931A64582M4589L4884n8984j43382j21599k6108K1424k3509p5994n1743K6522
$$ 164582 209171 244055 185071 41689 -79910 -106018 -84594 -108103 -184097 -235840 -209318
35920b09318Q8697J12605J06683N8581k8925r0997o5134J4780N5517K8999j802
$$ -209318 -120621 -8016 98667 157248 128323 37326 -27808 -13028 42489 71488 69686
35909F9686J4765N0437N4583L6265M6643R1555J03677K4876j03493j73384j38896
$$ 69686 84451 134888 189471 225736 272379 363934 467611 492487 388994 215610 76714
35898G6714o5424k4292M913O7255J19301Q1013j8684o1371j7236R675m6740j07766
$$ 76714 11290 -13002 -8089 59166 178467 259480 240796 179425 162189 171864 125124 17358
35886A7358q0543N60M8595O2250R0474J13750O6603m5167j39051j56065r7700
$$ 17358 -63185 -62625 -14030 48220 138694 252444 319047 273880 134829 -21236 -118936
35875a18936J4154J39173J99440J40795J5102o3990n0540Q4K0201j436l4501m0705
$$ -118936 -104782 34391 233831 374626 389728 325738 275198 275282 295483 294047 259546 218841
35863B18841J957O6276Q2602K2891m6104m6754k16J4179j3665j9325J6929K9190
$$ 218841 220798 287074 369676 392567 346463 299709 299493 313672 300007 280682 297611 326801
35851C26801l2484j21547j48013p7528M0919J22105J13521L7990l3067n8263n7955
$$ 326801 294317 172770 24757 -52771 -11852 110253 223774 261764 228697 170434 112479
35840A12479n7997m4845m226M1200O7467P5631N4078j6288q1604l6647J03719
$$ 112479 54482 9637 5411 46611 114078 189709 243787 227499 145895 109248 212967
35829B12967J63154M1101j14329j13305o723K1550l0976p383R8063J05143l4544
$$ 212967 376121 417222 302893 189588 182865 204415 173439 166056 264119 369262 334718
35818C34718j26510l4754J14932J53979J08892P8757M0156n7005j29904q2835
$$ 334718 208208 173454 288386 442365 551257 630014 670170 613165 483261 400426
35808D00426N512n280q5743r6970l4270k2317q0097p7031M4226J60442J46981
$$ 400426 405938 400658 314915 217945 183675 161358 81261 4230 48456 208898 355879
35797C55879M6104j8365j4157j2268o4847j31996j29236k9292Q8358J07887J0444
$$ 355879 401983 383618 369461 357193 292346 160350 31114 1822 90180 198067 208511
35786B08511r3578r1974M676R8260J20163O9731j9308r5525j09608p0242m2922
$$ 208511 114933 22959 27635 125895 246058 315789 296481 200956 91348 21106 -21816
35775b1816m8091j9122P6226J43742Q7063l1907o9952m712N8776O3327N3847N3753
$$ -21816 -69907 -89029 -12803 130939 218002 186095 116143 111431 170207 233534 287381 341134
35763C41134J7031o0686r2984k2285Q5081J16763M2124p0438j27724q8448N34
$$ 341134 358165 297479 204495 182210 267291 384054 426178 355740 228016 139568 140102
35752A40102M5100J3497j7981K4599R7225J06559N4782J8387J1044j7083n5222
$$ 140102 185202 198699 180718 205317 302542 409101 463883 482270 493314 476231 421009
35741D21009l4560L4807N5607k038n8020o6032p6758j14506j16794n7584j1248
$$ 421009 386449 421256 476863 474825 416805 350773 274015 159509 42715 -14869 -26117
35730b6117k1647k1529L4841O9422J1311o6175n1567L6847J00053J12465J16535
$$ -26117 -47764 -69293 -34452 34970 46281 -19894 -71461 -34614 65439 177904 294439
35719B94439J14471P5709J7834j6895l5168n9828o5609l2472j3178n2461q9090
$$ 294439 408910 484619 502453 485558 450390 390562 324953 292481 279303 226842 137752
35708A37752m4692L6819N6776K8373M3040R5894R0402J6606k2518J2108L1515
$$ 137752 93060 129879 186655 215028 258068 353962 444364 460970 438452 450560 482075
35697D82075k2291p8615o4374k2762k8927o7488p1906k8576K7739P8517J19710
$$ 482075 459784 381169 316795 294033 265106 197618 125712 97136 124875 203392 323102
35686C23102J27791Q2547P485m7790n3306j3871L6541M8689j84p1527j03886q2334
$$ 323102 450893 533440 540925 493135 439829 425958 462499 511188 511004 439477 335591 253257
35674B53257l3771K5848Q1500Q1962M6q0324m3356P9651J24579K3721r4619r6788
$$ 253257 219486 245334 326834 408796 408842 328518 285162 364813 489392 513113 418494 321706
35662C21706k5504m253m8867p8562n5783j2125K9339O5588P0926K3384m0649o2658
$$ 321706 296202 291949 243082 164520 108737 96612 125951 191539 262465 285849 245200 182542
35650A82542l6376M341M0901O1914M1969j0841l1545Q741L5114k4407j12273j19611
$$ 182542 146166 150507 191408 253322 295291 284450 252905 261646 296760 272353 160080 40469
35638D0469n3311j3121k3232q581N7669J01371O7301r546q1064j39543j62539
$$ 40469 -12842 -25963 -49195 -57776 -107 101264 168565 159019 77955 -61588 -224127
35627b24127j01322K6956J18633J09596N3772K7378K5014P371j4521j2530q802
$$ -224127 -325449 -298493 -179860 -70264 -16492 10886 35900 43271 28750 16220 7418
35616G418l7411p1844n8570k016M5074O2968P8949J00757Q6248k241j35082k22867
$$ 7418 -29993 -101837 -160407 -162423 -117349 -54381 24568 125325 211573 209332 74250 -148617
35604a48617j93332o9637L8894N1322J2715L6246J48202K44470K19778R1367l3749
$$ -148617 -341949 -411586 -372692 -321370 -308655 -272409 -124207 120263 340041 431408 397659
35593C97659p6252m2804K69j0271p0678j01454l8289P0885J14669O4179j148k2928
$$ 397659 321407 278603 278872 268601 197923 96469 58180 129065 243734 307913 306765 283837
35581B83837l1758n7785o6705l5177n295n916p52K5235J7401l8402n5204J1226
$$ 283837 252079 194294 127589 92412 87117 81201 80449 105684 123085 84683 29479 40705
35569D0705N7329p425q5870l3203R4463J09466j7072j15716p8744J0206M0910
$$ 40705 98034 90609 4739 -28464 65999 175465 158393 42677 -36067 -25861 15049
35558A5049J8131j1475m0317n3494j8939L0036J9963j7206L8618J79191K21919
$$ 15049 33180 21705 -18612 -72106 -91045 -61009 -41046 -58252 -19634 159557 381476
35547C81476P0131j21651j56688m9375N3138R0389Q9858M6432m1102q3456j2057
$$ 381476 451607 329956 173268 123893 177031 267420 357278 403710 362608 279152 267095
35536B67095P4498L6918p2739p9994L0897R2523K7181m2426j1274M7100K5937
$$ 267095 341593 378511 305772 225778 256675 349198 376379 333953 322679 369779 395716
35525C95716m4088p2753n5755l8692j5964L3282P1077N9077L9221O2295Q2897
$$ 395716 351628 278875 223120 184428 168464 201746 272823 331900 371121 433416 516313
35514E16313K7851o4450q5370k6603M741m1338p9326l0729M6450M8384j3191l3666
$$ 516313 544164 479714 394344 367741 372482 331144 251818 221089 267539 315923 302732 269066
35502B69066J9902O1047J9876n2871o8000k8086m747j4966n441L5893M1909k0459
$$ 269066 288968 350015 369891 317020 249020 220934 216187 201221 195780 231673 273582 253123
35490B53123p5450m4274K9332M2726j0762m5771l1415k7784n8635n5819J5620
$$ 253123 177673 133399 162731 205457 194695 148924 117509 89725 31090 -24729 -9109
35479i109P1225L1110l7559j0584R1555J12777j1209j45366j36507k2378L1641
$$ -9109 62116 93226 55667 45083 136638 249415 238206 92840 -43667 -66045 -34404
35468c4404l2085r5203m2826Q0871J48658J17826M8915o137m8701p3578n2952
$$ -34404 -66489 -161692 -204518 -123647 25011 142837 191752 185615 136914 63336 10384
35457A0384k056J6228j2536k4871R345K1195m4167j16611r5683r653K5689j5341
$$ 10384 8328 24556 12020 -12851 -3506 17689 -26478 -143089 -238772 -248425 -222736 -238077
35445b38077m1815K034O4433Q5140P1825M7485P217l6485m1804q253J0173o596
$$ -238077 -279892 -277858 -213425 -128285 -56460 -8975 -1758 -38243 -80047 -88300 -78127 -84723
35433h4723j7889j3408m1927j04861j16501l5232N4768P0074N0484O4674P7733
$$ -84723 -102612 -116020 -157947 -262808 -379309 -414541 -359773 -289699 -239215 -174541 -96808
35422i6808K7016l9213l2702J1154j4209r0856q5852L1225J27420J06103L6635
$$ -96808 -69792 -109005 -141707 -130553 -144762 -235618 -321470 -290245 -162825 -56722 -20087
35411b0087J8679K8395j2033q9974j22039p7204l449M6140N6795L9898K1268K5828
$$ -20087 -1408 26987 14954 -75020 -197059 -274263 -277712 -231572 -174777 -134879 -113611 -87783
35399h7783M3641L3162j7318o0811n0685l9M2015M5074J0965l1734l2189L6280
$$ -87783 -44142 -10980 -28298 -89109 -139794 -139833 -97818 -52744 -41779 -73513 -105702 -69422
35387f9422J15942J10629K1315l4570J1834P0681K3986r6434j59461j22283n8982
$$ -69422 46520 157149 178464 143894 155728 226409 250395 153961 -5500 -127783 -186765
35376a86765k1627J0245L6287J2252m3605l1631P8754J71666J38544L6430l435
$$ -186765 -208392 -198147 -161860 -149608 -193213 -224844 -146090 25576 164120 200550 197115
35365A97115K7442K3078n2277j10818r5168p2621j12265j52806q6378O6557J64910
$$ 197115 224557 247635 195358 84540 -10628 -83249 -195514 -348320 -434698 -368141 -203231
35354b03231J29536L3501j4312l690M779j1551k0841n543J4521K5814L7012M7063
$$ -203231 -73695 -40194 -54506 -58196 -53417 -64968 -85809 -91352 -76831 -51017 -14005 33058
35342C3058M2881L5923N4232Q5297P6655J6079l8869m3923l0318l9168m6480k2044
$$ 33058 75939 111862 166094 251391 328046 344125 305256 261333 231015 191847 145367 123323
35330A23323j8983j05301k17000j93909Q41J95784K15859R9726K1112L8699L9177
$$ 123323 104340 -961 -217961 -411870 -411029 -215245 614 100340 121452 160151 199328
35319A99328o4363j86451j81326l8319J08208J43692Q4225J9157j402Q111K2663
$$ 199328 134965 -51486 -232812 -271131 -162923 -19231 64994 84151 82749 90860 113523
35308A13523L9845N7577N4771J8339k4834k9920J0205N1929N0373N188n0477q7032
$$ 113523 153368 210945 265716 284055 259221 229301 239506 291435 341808 346996 296519 209487
35296B09487q9752n3773M453M0133J7922l7194n4630R7P6787R4378L5255l6531
$$ 209487 119735 65962 70415 110548 128470 91276 36646 36743 113530 207908 243163 206632
35284B06632n4563k6795j3625l8512n4875k0881K4750J0533n2527o8285Q341R6021
$$ 206632 152069 125274 111649 73137 18262 -2619 22131 32664 -19863 -88148 -79807 16214
35272A6214R9614M4575K2473L9633K1604l7678m6179L2364J00270O6704j9500
$$ 16214 115828 160403 182876 222509 244113 206435 160256 192620 292890 359594 340094
35261C40094n9663n5981p1825r4380n6614K4196N2631R069j7253J9889M5451r495
$$ 340094 280431 224450 152625 58245 1631 25827 78458 87527 70274 90163 135614 126119
35249A26119r2458j12796p2840l8351k5098N473O1970J05540J08068P4898K0211
$$ 126119 33661 -79135 -151975 -190326 -215424 -209951 -147981 -42441 65627 140525 160736
35238A60736l3547m6064J075O3446P8480M2975K216k5956o2610j06794j21745
$$ 160736 127189 81125 82200 145646 224126 267101 269317 243361 180751 73957 -47788
35227d7788r4614o0434m6990l7017q505K2642K9314J8984K3062N1232Q0512Q8741
$$ -47788 -142402 -202836 -249826 -286843 -295348 -272706 -243392 -224408 -201346 -150114 -69602 19139
35215A9139Q3178Q8860J10618J15402O8160j1313n2241j5667M4551L6641n6523
$$ 19139 102317 191177 301795 417197 485357 474044 421803 406136 450687 487328 430805
35204D30805j51000j55569p1817Q515j905r4349j64109j15149K8396J38066J23594
$$ 430805 279805 124236 52419 60934 59029 -35320 -199429 -314578 -286182 -148116 -24522
35193b4522L1341k4827J300O1039Q9473N9985j9115j04421j26817o2617J3723
$$ -24522 6819 -18008 -16708 44331 133804 193789 174674 70253 -56564 -119181 -105458
35182a05458J5753k5582p332O5351N9656p2045j71861p4760J41346K33320J03389
$$ -105458 -89705 -115287 -122619 -57268 2388 -69657 -241518 -316278 -174932 58388 161777
35171A61777r1817j63903j10878n0676k4656K7606J22041J65322P7054q3209j71845
$$ 161777 69960 -93943 -204821 -255497 -280153 -252547 -130506 34816 111870 28661 -143184
35160a43184j26973k3677M1181O4600J03394J62573J76774J04077q986p7724p0332
$$ -143184 -270157 -293834 -252653 -188053 -84659 77914 254688 358765 349779 272055 201723
35149B01723l0206k0427n8856j02526r2725j9419O5963J08978J05648Q0164L4960
$$ 201723 171517 151090 92234 -10292 -103017 -122436 -56473 52505 158153 238317 273277
35138B73277l8995j17068j52697j33145q4466k6331L3907P0155N7942K7106L2615
$$ 273277 234282 117214 -35483 -168628 -253094 -279425 -245518 -175363 -117421 -90315 -57700
35127e7700O6993P1127M3710N4542J15904J32446M2250p1111r0331k7631J7659
$$ -57700 9293 80420 124130 178672 294576 427022 469272 398161 307830 280199 297858
35116B97858K0362M0456Q8789R1762J1066q6721j17218p9587l7311l3760n2580
$$ 297858 318220 358676 447465 539227 550293 463572 346354 266767 229456 195696 143116
35105A43116m3864J8040R1516R8322J9461o8035q6960n8121m9167o0142l5998
$$ 143116 99252 117292 208808 307130 326591 258556 171596 113475 64308 4166 -31832
35094c1832K4880N9822M0550L849k2383m4509m6545L598P0760O7698j0823o0459
$$ -31832 -6952 52870 93420 97269 74886 30377 -16168 -12570 58190 125888 115065 54606
35082E4606k2508K5649L614l6158K69Q7398J20518P8405L4189K0401m095m4821
$$ 54606 32098 57747 61361 25203 25472 112870 233388 311793 345982 366383 362288 317467
35070C17467l8629L3143Q8371N7115j3186k8545J6916M2877K662n9185p7561n2585
$$ 317467 278838 311981 400352 457467 444281 415736 432652 475529 478191 419006 341445 288860
35058B88860m0547p4752j19583j13003m6767J7129K3750K98K0400R4356J36944
$$ 288860 248313 173561 53978 -59025 -105792 -88663 -64913 -64615 -44215 50141 187085
35047A87085P1568n9229j28667p2789L1157N4299l1802j20812r5976L1990J34421
$$ 187085 258653 199424 70757 -2032 29125 83424 51622 -69190 -165166 -133176 1245
35036A245J11062K477o2046j7568O5353P5426L901m3632J3197J14681J27254J5519
$$ 1245 112307 114784 52738 35170 100523 175949 179850 136218 149415 264096 391350 406869
35024D06869j05356j12834k6566L4598J6858j7066m103K4648N259n3914q5514
$$ 406869 301513 188679 162113 196711 213569 196503 192400 217048 222307 168393 82879
35013H2879n9631j2590J7009L3636N5915P8333Q0216N3077N324m6487q0228p3153
$$ 82879 23248 10658 27667 61303 117218 195551 275767 328844 334168 287681 207453 134300
35001A34300j8162O2030J18971J05833J9827p7105j04944n3174L65j3324o1905
$$ 134300 116138 178168 297139 402972 422799 345694 240750 187576 187941 174617 112712
34990A12712o1380j615M2478L1728K1687O4144J14061R7474K8320j9128l1248
$$ 112712 51332 49717 92195 123923 145610 209754 323815 421289 449609 430481 399233
34979C99233o1569j13777j09756j2128R5146J08106L5964l0801n0884n6772o1926
$$ 399233 337664 223887 114131 102003 197149 305255 341219 310418 259534 202762 140836
34968A40836k4750O9635J50943J34773L1098n8256n4171J1851M2963L937l1351
$$ 140836 116086 185721 336664 471437 502535 444279 390108 401959 444922 448859 417508
34957D17508J2436Q9728Q9415R588k2187N2076J06663J5110j39045j77295j00873
$$ 417508 429944 519672 609087 618675 596488 648564 755227 770337 631292 453997 353124
34946C53124p4024j37050j35817K453J18052O6701m3415k9522P0840Q0906r738
$$ 353124 279100 142050 6233 8686 126738 193439 150024 120502 191342 272248 262510
34935B62510l7567M7188R6558J6326p8792m8999O6749J31939J02361L6189j9480
$$ 262510 224943 272131 368689 385015 306223 257224 323973 455912 558273 594462 574982
34924E74982n9792p9103p2159n5851l9982m471N3284Q3621M4068l1815o6474k4201
$$ 574982 515190 436087 363928 308077 268095 263624 316908 400529 444597 412782 346308 322107
34912C22107N9514J14580Q7526j5657j23748j63841j33663p9991k1213N0117J01154
$$ 322107 381621 496201 583727 568070 444322 280481 146818 66827 45614 95731 196885
34901A96885Q0591J5291n802L2336M5383m161l6160J5110R2512J10395P2954K2931
$$ 196885 277476 292767 286965 319301 364684 360523 324363 339473 431985 542380 615334 638265
34889F38265m3966j24811j48407p2511K0274L0617p451M495N9273O8161K3948
$$ 638265 594299 469488 321081 248570 268844 299461 292010 296505 355778 423939 447887
34878D47887P663L8210M1333j5161o4598m8214Q726N3625O7182M9069P595k4828
$$ 447887 455550 493760 535093 519932 455334 407120 415846 469471 536653 585722 593317 568489
34866E68489k3186j5165l6963o0540l6466J1196J8369p827p040J7612P264l1063
$$ 568489 545303 530138 493175 432635 396169 407365 425734 417907 410867 428479 435743 404680
34854D04680k4193L5416P0627N0097K5417J7703j4491o6666p2443l2021k5309
$$ 404680 380487 415903 486530 536627 562044 579747 565256 498590 426147 394126 368817
34843C68817n2229o494J22352J76896O9299n2644j7224J10860J44130N9338n886
$$ 368817 316588 310094 432446 609342 678641 625997 608773 719633 863763 923101 917215
34832I17215O400J6396j8990l4591J7307R5995J54064J90487K06739K00628K08175
$$ 917215 923615 940011 921021 886430 903737 999732 1153796 1344283 1551022 1751650 1959825
34821A959825K60042L02228K66594K15764K88353M78514O02992N33765L37081
$$ 1959825 2219867 2522095 2788689 3004453 3292806 3771320 4374312 4908077 5245158
34812E245158J20387j23113m11546o30102o40822m89153l60414l38406l29440
$$ 5245158 5365545 5242432 4830886 4200784 3559962 3070809 2710395 2371989 2042549
34803B042549k41025j21961p3367j00973j24755r6274m5237k2136m1340q2559
$$ 2042549 1801524 1679563 1606196 1505223 1380468 1284194 1238957 1216821 1175481 1092922
34793A092922j15185j11906o2339R213N0358K6228l6302o5856k3289M6895O4710
$$ 1092922 977737 865831 803492 812705 863063 889291 852989 787133 763844 810739 875449
34782H75449J6078k3094J5464R4597J10191K3366q8442j28186q8612l3476k3K9129
$$ 875449 891527 868433 883897 978494 1088685 1112051 1023609 895423 806811 773335 773312 802441
34770H02441O5289Q1370N8257K1490M684N568M328N67O339K4725N8112J10304
$$ 802441 867730 949100 1007357 1028847 1033531 1039099 1043427 1043994 1050333 1075058 1133170 1243474
34758A243474J56536J48935Q9359N7697J14995K12031K58164K53265K72007L30732
$$ 1243474 1400010 1548945 1638304 1696001 1810996 2023027 2281191 2534456 2806463 3137195
34748C137195L59974L19199K53078K07289J62114Q1336l6966j84833l50893m74220
$$ 3137195 3497169 3816368 4069446 4276735 4438849 4520185 4483219 4298386 3947493 3473273
34738C473273m70966l53383k48263k39765k62378k16879j27271r5737j42800j81558
$$ 3473273 3002307 2648924 2400661 2160896 1898518 1681639 1554368 1458631 1315831 1134273
34728A134273j36110j5807J17297J98089J90435J22762P7813J03327J54556J65599
$$ 1134273 998163 982356 1099653 1297742 1488177 1610939 1688752 1792079 1946635 2112234
34718B112234J41968J31161J40525J49594J73714K44610L43364M10661M05233
$$ 2112234 2254202 2385363 2525888 2675482 2849196 3093806 3437170 3847831 4253064
34709D253064L06200J00153j67735l73179m27066l81694l46447l37714l03006
$$ 4253064 4559264 4659417 4491682 4118503 3691437 3309743 2963296 2625582 2322576
34700B322576k46733k12186j70850o9286K6532r667j45088j91752p8166M3965
$$ 2322576 2075843 1863657 1692807 1623521 1650053 1640386 1495298 1303546 1225380 1269345
34690A269345M2380m539K4242P2783J4134j19118j82374j43982r1673m1952P1497
$$ 1269345 1311725 1307186 1331428 1404211 1418345 1299227 1116853 972871 881198 839246 910743
34679I10743K02143J75258m6635k37709j79217M5077J72580J21536N6096R3936
$$ 910743 1112886 1288144 1241509 1003800 824583 869660 1042240 1163776 1219872 1313808
34669A313808J32210M6181q5670r8811k306M6082l11j9510M4360O4678n0575j68148
$$ 1313808 1446018 1492199 1406529 1307718 1305412 1351494 1351183 1331673 1376033 1440711 1390136 1221988
34657A221988j04821R2024K02011J33582J1225l5583j8630M353L4577P9739R8902
$$ 1221988 1117167 1209191 1411202 1544784 1556009 1520426 1501796 1506149 1540726 1620465 1719367
34646A719367O8627L1805K3948J4979k2780m8969j4624N8383J09279J16424J05361
$$ 1719367 1787994 1819799 1843747 1858726 1835946 1786977 1772353 1830736 1940015 2056439 2161800
34635B161800J10284J54563K35523L10159L35855L36597L77251M58737M96820
$$ 2161800 2272084 2426647 2662170 2972329 3308184 3644781 4022032 4480769 4977589
34626D977589M22820K48978K6926j84832l02789k65769j37314o7244j01315j18422
$$ 4977589 5400409 5649387 5676313 5491481 5188692 4922923 4785609 4718365 4617050 4498628
34616D498628j4965J39655K04902J42526N503j66048l36628m24991l75340k51479
$$ 4498628 4483663 4623318 4828220 4970746 4976249 4810201 4473573 4048582 3673242 3421763
34606C421763j68852j55685j58758j54167j64069j82314j68795j17363o7520n1625
$$ 3421763 3252911 3097226 2938468 2784301 2620232 2437918 2269123 2151760 2084240 2032615
34596B032615p1884j11321j34828j14553q1482r3335j21038n7770J02016K01616
$$ 2032615 1960731 1849410 1714582 1600029 1518547 1425212 1304174 1246404 1348420 1550036
34586A550036J35732K0106J9684J00863J13560M8116K4362O1851N9341M415P888
$$ 1550036 1685768 1705874 1725558 1826421 1939981 1988097 2012459 2074310 2133651 2138066 2145954
34575B145954R5483J48926J12045Q5068J37082J81889J34773N2172R451l1722
$$ 2145954 2241437 2390363 2502408 2587476 2724558 2906447 3041220 3093392 3102843 3071121
34565C071121j13110j51990o6268N5087N4823o8903j77213j93692j61708j21494
$$ 3071121 2958011 2806021 2739753 2794840 2849663 2780760 2603547 2409855 2248147 2126653
34555B126653o3953p327N641L464O0970J50730J39816q476j39338j01440M4800
$$ 2126653 2062700 2055373 2061014 2064478 2125448 2276178 2415994 2407518 2268180 2166740 2211540
34544B211540J22413Q8970O2885J06797J23686K4182j11556j35709l5345P1053
$$ 2211540 2333953 2422923 2485808 2592605 2716291 2740473 2628917 2493208 2457863 2528916
34534B528916J09165J11268J05986O2300j9321n8630J92J05751J76529J94428
$$ 2528916 2638081 2749349 2855335 2917635 2898314 2839684 2839876 2945627 3122156 3316584
34524C316584J66631P2187p2847j65185j30009m1869k7213p8806p6848K0251J18349
$$ 3316584 3483215 3555402 3482555 3317370 3187361 3145492 3118279 3039473 2962625 2982876 3101225
34513C101225J30043P8616L8638M7285R1082J22426Q9747P181k7520M2685J23966
$$ 3101225 3231268 3309884 3348522 3395807 3486889 3609315 3699062 3706243 3678723 3721408 3845374
34502C845374Q6009l5720p5005K3703J26584J04237j1013j06347j25453p4241
$$ 3845374 3931383 3895663 3820658 3844361 3970945 4075182 4064169 3957822 3832369 3758128
34492C758128J8549R0077O9211l2046j12749j05635m4259J6269O9555J18620J43820
$$ 3758128 3776677 3866754 3935965 3903919 3791170 3685535 3641276 3657545 3727100 3845720 3989540
34481C989540J45452J48617J41356Q7035J9676L1738J31365K09063J95014J56824
$$ 3989540 4134992 4283609 4424965 4512000 4531676 4563414 4694779 4903842 5098856 5255680
34471E255680J81409K41419K46023J65650N2619j7210M698R6121J62473J38785
$$ 5255680 5437089 5678508 5924531 6090181 6142800 6125590 6130288 6226409 6388882 6527667
34461F527667Q2347Q5909J32756J54987J95094L40413N12601N30455M11262L89484
$$ 6527667 6610014 6695923 6828679 6983666 7178760 7519173 8031774 8562229 8973491 9362975
34451I362975N66828P63029Q15287Q10968Q89184J011486J091057J177665J344341
$$ 9362975 9929803 10692832 11508119 12319087 13208271 14219757 15310814 16488479 17832820
34442A7832820J534204J677720J830645K060409K339392K671693L152176L774683
$$ 17832820 19367024 21044744 22875389 24935798 27275190 29946883 33099059 36873742
34434C6873742M385759M968603N739171O803673P999019R268904J0869177J2923530
$$ 36873742 41259501 46228104 51967275 58770948 66769967 76038871 86908048 99831578
34426I9831578J5112966J7154652J9273702K1851689K4977650K8618733L2360224
$$ 99831578 114944544 132099196 151372898 173224587 198202237 226820970 259181194
34419B59181194L4019063K9387201J5478578n206582k4943510l6489044l8331059
$$ 259181194 293200257 322587458 338066036 332859454 307915944 271426900 233095841
34412B33095841l4168600k8424802k3306662j9264962j6307170j4224919j2508693
$$ 233095841 198927241 170502439 147195777 127930815 111623645 97398726 84890033
34405H4890033j0791581r148108p743375o525503n438198m596769m052215l638848
$$ 84890033 74098452 64950344 57206969 50681466 45243268 40646499 36594284 32955436
34397C2955436l212759k817572k498856k181571j842608j587968j449870j309333
$$ 32955436 29742677 26925105 24426249 22244678 20402070 18814102 17364232 16054899
34389A6054899j117822r90739r77004r40526p93234o55511o45103o71913n92480
$$ 16054899 14937077 13946338 12969334 12028808 11235574 10580063 9934960 9263047 8670567
34380H670567m33658l14696k54523j97578j49139j55534k04262k43731k57561
$$ 8670567 8236909 7922213 7667690 7470112 7320973 7165439 6961177 6717446 6459885
34371F459885k52029k28192k19068k77002l68683l71817k43840j05014p5645j15712
$$ 6459885 6207856 5979664 5760596 5483594 5114911 4743094 4499254 4394240 4318595 4202883
34361D202883j16864p8192q2878j46722j96520j83992j36344r4322o4345m0114
$$ 4202883 4086019 4007827 3924949 3778227 3581707 3397715 3261371 3167049 3102704 3062590
34351C062590k8441l9403o6440q3571p0516m7448n8765r7352q7683J10O3405j6630
$$ 3062590 3034149 2994746 2928306 2844735 2774219 2726771 2668006 2570654 2482971 2483081 2546486 2529856
34339B529856j93982k94533k32501r0158K3317Q3343R9849O8802J8011O833L4137
$$ 2529856 2335874 2041341 1808840 1718682 1741999 1825342 1925191 1993993 2012004 2018837 2052974
34328B052974K9606k6030o1931l9248j7400m5380p7133n8183j7768j0383l3171
$$ 2052974 2082580 2056550 1994619 1955371 1937971 1892591 1815458 1757275 1739507 1729124 1695953
34317A695953n8264q2336r4688o4642o143J8256k020o607J4549j2205r8727j35510
$$ 1695953 1637689 1555353 1460665 1396023 1389880 1408136 1406116 1399509 1414058 1401853 1303126 1167616
34305A167616o3439J0618j9315p9892l9651P4422J27194Q4445K5328j2658n1761
$$ 1167616 1104177 1114795 1095480 1015588 975937 1050359 1177553 1261998 1287326 1274668 1222907
34294A222907o1332J7747J31219J38653J1825j14368j23043m2206M1574R3144
$$ 1222907 1161575 1179322 1310541 1449194 1461019 1346651 1223608 1181402 1222976 1316120
34284A316120J09107Q1440L5506L1683P8202J04634O8233K3840L3624O4007M2401
$$ 1316120 1425227 1506667 1542173 1573856 1652058 1756692 1824925 1848765 1882389 1946396 1988797
34273A988797j7750k5731N3160J36557J24767K6110n7951o6583n1922q8357j47021
$$ 1988797 1971047 1945316 1998476 2135033 2259800 2285910 2227959 2161376 2109454 2021097 1874076
34262A874076j28314j8371O6785L1274p3311j29810j13662r6758j24821j65841
$$ 1874076 1745762 1727391 1794176 1825450 1752139 1622329 1508667 1411909 1287088 1121247
34252A121247j68687j11533m639R9275J18550L1754o5606o5441Q631M2651M213
$$ 1121247 952560 841027 836388 935663 1054213 1085967 1020361 954920 963551 1006202 1010415
34241A010415k8064j4030j7461p8454j22822p3073K4460O9168N3614N0781P9904
$$ 1010415 982351 968321 950860 872406 749584 676511 700971 770139 823753 874534 954438
34230I54438P9939K1854l7896m7233l5262n1283p5077n1899O231K7310o131k0763
$$ 954438 1034377 1056231 1018335 971102 935840 884557 809480 757581 763812 791122 784991 764228
34218G64228L4711J01110R0997J7243l1695k1173L476J2769L1267O7276Q2795
$$ 764228 798939 900049 991046 1008289 976594 955421 958897 971666 1002933 1070209 1153004
34207A153004O0038L2547K6954L6886O8541J33730J80770J29809J1785l3368N0195
$$ 1153004 1213042 1245589 1272543 1309429 1377970 1511700 1692470 1822279 1834064 1800696 1850891
34196A850891J50106J60004J24804J30186J65483J98168K59187L24671K43504
$$ 1850891 2000997 2161001 2285805 2415991 2581474 2779642 3038829 3363500 3607004
34187C607004m3473l24567l65904k52443k43507l49795l36969j50113k8873j15704
$$ 3607004 3563531 3238964 2873060 2620617 2377110 2027315 1690346 1540233 1511360 1395656
34177A395656k28143j67072k0180K2731k6027l2791N047r114o9390q2786l8430
$$ 1395656 1167513 1000441 980261 1002992 976965 944174 949221 940107 870717 787931 749501
34166G49501o630o705q336k3897p3252r7640l4931N4577O1782j568k9372O371
$$ 749501 742871 736166 727830 703933 630681 533041 498110 552687 614469 612901 583529 589900
34154E89900L2611J2460j1122o743J2130M0549P6247P5261R027n3501k3832O3368
$$ 589900 622511 634971 623849 617106 629236 669785 746032 821293 830320 776819 752987 816355
34142H16355R4012M5179m639k3908n5996r3301n9837N0158J39072J50331J35040
$$ 816355 910367 955546 950907 926999 871003 777702 717865 768023 907095 1057426 1192466
34131A192466J37695J29963J04595J20385J92673K45005K37096K38001K93371
$$ 1192466 1330161 1460124 1564719 1685104 1877777 2122782 2359878 2597879 2891250
34122B891250L18796K23193N8405n9596j15621j71063k22233k04172j23036p5269
$$ 2891250 3210046 3433239 3491644 3432048 3316427 3145364 2923131 2718959 2595923 2520654
34112B520654j18499k00953k37865k01760j24402n5566l2046n5379r4042j22976
$$ 2520654 2402155 2201202 1963337 1761577 1637175 1581609 1549563 1494184 1400142 1277166
34102A277166j44545j53611j20295m4729J1760M354k0491P869P0838R0875N8991
$$ 1277166 1132621 979010 858715 813986 825746 830100 809609 817478 888316 979191 1038182
34091A038182M4771P4909R0839N3821J0286O795R641k6509n8575k852J29357K14175
$$ 1038182 1082953 1157862 1248701 1302522 1312808 1319603 1329244 1302735 1244160 1241308 1370665 1584840
34079A584840J53751m901j14156p9342M3244J05670K8970j07439j62139j08910
$$ 1584840 1738591 1733690 1619534 1540192 1583436 1689106 1718076 1610637 1448498 1339588
34069A339588o4491j18804k00517j74524l3094R7233J31006J10430R2832M9435
$$ 1339588 1275097 1156293 955776 781252 748158 845391 976397 1086827 1179659 1229094
34059A229094n6539j62968j74319j00784l8632k3811j132N0806O4048m910q7110
$$ 1229094 1172555 1009587 835268 734484 695852 672041 670909 721715 785763 780853 693743
34048F93743r3004l7450j133k571J4061P3357J22509J06359M0270j4728k2985
$$ 693743 600739 563289 562156 559585 573646 647003 769512 875871 916141 901413 878428
34037H78428o29J8617K8243M7294O8834L7955p4436j89912j88225p1523J9072
$$ 878428 877799 896416 924659 971953 1040787 1078742 1004306 814394 626169 554646 573718
34026E73718n892o3558m2229J8054N01q9743j36265r7053l9432J0297J01211K07888
$$ 573718 567826 504268 462039 480093 480594 390851 254586 157533 118101 128398 229609 437497
34014D37497J99635L9397j13672j07022m093K6979l7562p1797q993P6606J01831
$$ 437497 637132 676529 562857 455835 451742 478721 441159 369362 360369 436975 538806
34003E38806P8974O0409N9922O2938N8536L3423k1086p3998o8830L55N9761L4545
$$ 538806 617780 678189 738111 801049 859585 893008 871922 797924 729094 729449 789210 823755
33991H23755n7914j19448p7021L4262J01356M9302p8548j65736j40122k8592R1833
$$ 823755 765841 646393 569372 603634 704990 754292 675744 510008 369886 341294 433127
33980D33127J60150J52039Q3963J2383j1810k848j4056m7206m8329r740J85n1598
$$ 433127 593277 745316 829279 841662 829852 827004 812948 765742 717413 707673 707858 656260
33968F56260r7392p2129j3307J0349N321R653M868l4443n5439J460Q2803Q5520
$$ 656260 558868 486739 473432 483781 489102 498755 503623 469180 413741 415201 498004 583524
33956E83524J4692l5023l4742l5754m1598l035N1194K2721q3889j35026o5711
$$ 583524 598216 563193 528451 492697 451099 448064 499258 521979 438090 303064 237353
33945B37353K7363N4066O2094J14845J59101J24326N8837N0086Q2315Q7534P5695
$$ 237353 264716 318782 380876 495721 654822 779148 837985 888071 970386 1057920 1133615
33934A133615R8046J32931J27337J12261J54935K21828K10129J05109n693o8786
$$ 1133615 1231661 1364592 1491929 1604190 1759125 1980953 2191082 2296191 2290498 2221712
33924B221712j06668j29331j19380j11255j67002k52979k56682j58923p5550q1873
$$ 2221712 2115044 1985713 1866333 1755078 1588076 1335097 1078415 919492 843942 762069
33914G62069j07234o8766p241m329m5140n7307l0736q659k259m35k9015j09428
$$ 762069 654835 586069 578828 574499 529359 472052 441316 432657 430398 429963 400948 291520
33902B91520j78982j44248j4012J00785J27945J02175P7778M6756j7922r0420
$$ 291520 112538 -31710 -45722 55063 183008 285183 362961 409717 391795 301375
33892C01375j12827o6034J4117P8130R6715O7947J6937j6522j2167O877L86l5459
$$ 301375 188548 122514 136631 214761 311476 379423 396360 379838 367671 374548 374934 339475
33880C39475n8185l5595K508k567n2843p7266k3237O6726J09354R0305O6479O6295
$$ 339475 281290 245695 248203 245636 192793 115527 92290 159016 268370 358675 425154 491449
33868D91449N2145k447o0303p8742o9164n8919m1139j1507j0738o5611j16898
$$ 491449 543594 541147 480844 402102 332938 274019 232880 221373 210635 145024 28126
33857B8126p9021L7903J33786J46458J09233P4904N0977L2019L1605M3187J9015
$$ 28126 -50895 -12992 120794 267252 376485 451389 502366 534385 565990 609177 628192
33846F28192o4508j52134j65930r8949j6121K5091K2037M465k608P777K7399M4318
$$ 628192 563684 411550 245620 146671 130550 155641 177678 182143 179535 187312 214711 259029
33834B59029N5146N7753L4738k7149r2110q9889o220P5087O6386r672n4791l3161
$$ 259029 314175 371928 406666 379517 287407 197518 191298 266385 332771 323099 268308 235147
33822B35147r848m0152q6797q4774l8380j660O747J2235K3031J9155K929M193
$$ 235147 225299 185147 98350 13576 -24804 -26464 -19717 -7482 15549 34704 37633 41826
33810D1826K1621J1345m0389p9779n5835J0092O4398R3286J04014O9791l2358
$$ 41826 63447 74792 34403 -45376 -101211 -91119 -26721 66565 170579 240370 208012
33799B08012j40122j44662l0664Q9252J10565N2447M310Q838M0319N7223L2495
$$ 208012 67890 -76772 -107436 -18184 92381 144828 149138 157976 198295 255518 288013
33788B88013l3114q8224o1132M2512J16300Q2794J814k1892L161j3986p7485q1911
$$ 288013 254899 166675 105543 148055 264355 347149 348963 327071 330232 316246 238761 156850
33776A56850J6828J10215P6373n4229j37943r2430K0015P5122K2469o3849o8547
$$ 156850 173678 283893 360266 306037 168094 75664 95679 170801 193270 129421 60874
33765F0874K7940J20411J10849K9963k6362m0985o9362j12673j07316m8949j5310
$$ 60874 88814 209225 320074 350037 323675 282690 213328 100655 -6661 -55610 -70920
33754g0920l5624m3715j503L7817M0035N0638Q0199M8832o4677j36381p7181R589
$$ -70920 -106544 -150259 -151762 -113945 -73910 -23272 56927 105759 41082 -95299 -172480 -162891
33742a62891o114n4396J7353J65545J94720O8713k8811J7578R3149N6226n0960
$$ -162891 -169005 -223401 -206048 -40503 154217 222930 194119 211697 304846 361072 310112
33731C10112r8336o4804k9770l4158m3223j5467N1006J18429J31311P4232J1357
$$ 310112 211776 146972 117202 83044 39821 24354 75360 193789 325100 399332 410689
33720D10689J2283M3629J3858p5724j24374q7227k8446Q79J9552K3251l1272j03965
$$ 410689 422972 466601 480459 404735 280361 193134 164688 165567 185119 208370 177098 73133
33708G3133p9828L3160O9996l2091j01859L034J52520J39280l849q3080n2602
$$ 73133 -6695 26465 96461 64370 -37489 -34455 118065 257345 253496 170416 117814
33697A17814k7380m1513k1882J3784l6271j31346r4220R5121K19188J31239l5875
$$ 117814 90434 48921 27039 40823 4552 -126794 -221014 -125893 93295 224534 188659
33686A88659q4191j9745K6039J8384J3424J6211q487l2978l879M6218L6730k8521
$$ 188659 104468 84723 110762 129146 142570 158781 150294 117316 113437 159655 196385 167864
33674A67864o6209m2864j0740j1618k0008L575N4908R5392R0787M1549r648j9075
$$ 167864 101655 58791 48051 36433 16425 20000 74908 170300 261087 302636 292988 273913
33662B73913k055j4734o1348p7272l5433j262k8467o7404m9526k148J0666R970
$$ 273913 271858 257124 195776 118504 83071 81809 53342 -14062 -63588 -65736 -55070 -45100
33650d5100N4603J03619N4140p7691j38515m1415J14228J83676J53965J08130
$$ -45100 9503 113122 167262 89571 -48944 -90359 23869 207545 361510 469640
33640D69640P6335J5254q3031j45108j02575J6260J07257R5071P856n4045k4692
$$ 469640 545975 561229 478198 333090 230515 246775 354032 449103 456959 402914 378222
33629C78222O0387J14287J01630O4802N6433Q4340J27160J61740J58758R2675
$$ 378222 438609 552896 654526 719328 775761 860101 987261 1149001 1307759 1400434
33619A400434j4744r4037j06030r4565j24218j88925k27900k14740j74240j16253
$$ 1400434 1385690 1291653 1185623 1091058 966840 777915 550015 335275 161035 44782
33609D4782k1820Q5297J22818N5364l5383n1298j4529k4191r1333j13888l8847
$$ 44782 22962 108259 231077 286441 251058 199760 185231 161040 69707 -44181 -83028
33598h3028M4840L5177l2827m8413Q650N7174N3723M4903O5148O9696J3217o4107
$$ -83028 -38188 -3011 -35838 -84251 -75601 -18427 35296 80199 145347 215043 228260 164153
33586A64153q0734j4175P8800J20651P0637m6001j43199j39801m7023L8224N1974
$$ 164153 83419 69244 148044 268695 339332 293331 150132 10331 -36692 1532 53506
33575E3506L9370P5955J47552J65974R5158L920k4862K023Q448m0721q6503n0451
$$ 53506 92876 168831 316383 482357 577515 581435 556573 558596 567044 526323 439820 389369
33563C89369N7793J43996J44920J01080R0935J32154J91501K59125L48740M35886
$$ 389369 447162 591158 736078 837158 928093 1060247 1251748 1510873 1859613 2295499
33553B295499M61554M01454K79367J17196o7776k25078l07477l44545l94303m20227
$$ 2295499 2757053 3158507 3437874 3555070 3487294 3262216 2954739 2610194 2215891 1795664
33543A795664l26675j41247l5254r7557k02113j89855q3650j5230k0790l4587
$$ 1795664 1468989 1327742 1292488 1194931 992818 802963 719313 704083 683293 648706
33533F48706l1606m8066q5178j05149j08091j16181j02249l1335M8681O0265K2427
$$ 648706 617100 569034 483856 378707 270616 154435 52186 20851 69532 129797 152224
33522A52224J9138N6319O1570K1183K010K8190M5911K6870L904j2397n0084r1098
$$ 152224 171362 227681 289251 310434 312444 340634 386545 413415 417319 404922 354838 263740
33510B63740p3598j715M7133M5367M3665N9364N0709K5358M8043J02796Q0889
$$ 263740 190142 188427 235560 280927 324592 383956 434665 460023 508066 610862 691751
33499F91751l8648j28862j03957l8131j7579j1379J1094k2408j35508j77187k0275
$$ 691751 653103 524241 420284 382153 364574 353195 364289 341881 206373 29186 8911
33488H911K02169K43954P9645q8541j30529j10050r9535n7421M9630J42802J32030
$$ 8911 211080 455034 534679 446138 315609 205559 106024 48603 98233 241035 373065
33477C73065L6247n7622r3330o5278j500M2424K8114o418J1498P8033J10611P0037
$$ 373065 409312 351690 258360 193082 191582 234006 262120 255702 267200 345233 455844 525881
33465E25881R775k0691m5651r7732j47249j42331p3503L4018J43103J91676J19669
$$ 525881 535656 514965 469314 371582 224333 82002 8499 42517 185620 377296 496965
33454D96965m1219j55215j20524R914R9284R2760N2885M3458M8752K7541r555
$$ 496965 455746 300531 180007 189921 289205 381965 434850 478308 527060 554601 545046
33443E45046k3081j8007l7589q0677q2549j3318N1347K2184o5221q7350j2299
$$ 545046 521965 503958 466369 385692 303143 289825 341172 363356 298135 210785 198486
33432A98486N0644J6893m8694m0320K9673O8824N2016L5298M8535O3457N6663
$$ 198486 249130 266023 217329 177009 206682 275506 327522 362820 411355 474812 531475
33421E31475K8928k2762q1190q4034p427N3819p356j39340j82111q9739J7186
$$ 531475 560403 537641 456451 372417 364990 418809 411453 272113 90002 263 17449
33410A7449L9660J7965K1803L9990L9265L2356K1427l5654j31461j65580p5812
$$ 17449 57109 75074 96877 136867 176132 208488 229915 194261 62800 -102780 -178592
33399a78592N6382J11690Q3251M2275J3980k1298m8431l3652L750J6163M783L745
$$ -178592 -122210 -10520 72731 115006 128986 107688 59257 25605 29355 45518 50301 54046
33387E4046J3010J5739L2562Q2178J16412Q1552K4061L6621J01706R5121k8472
$$ 54046 67056 82795 115357 197535 313947 395499 419560 456181 557887 653008 624536
33376F24536j51351j48267n3786m170n2364j13802r2076j211O0305L1598m3266
$$ 624536 473185 324918 271132 266962 214598 100796 8720 7509 67814 99412 56146
33365E6146p2659k3278N0568P8500M7615n700n0868q2744r5750o8002J2689J09270
$$ 56146 -16513 -39791 10777 89277 136892 131192 80324 -2420 -98170 -166172 -153483 -44213
33353d4213J40259N6984p2829j03426J9657J62682J48873j3945j39554j04953
$$ -44213 96046 153030 80201 -23225 -3568 159114 307987 294042 154488 49535
33343D9535J2872P6041O1217K9973Q171j6655l2146k2048j3886l0620l0667K8765
$$ 49535 62407 138448 199665 229638 237809 221154 189008 166960 153074 122454 91787 120552
33331A20552J02724J11392N3860p449m8109q7186j16264j07241p3982m7574j2931
$$ 120552 223276 334668 388528 381079 332970 245784 129520 22279 -51703 -99277 -112208
33320a12208M6686P3759J0958o9816l8470Q7998J40791L3687j15586j50649o2608
$$ -112208 -65522 8237 19195 -50621 -89091 -1093 139698 173385 57799 -92850 -155458
33309a55458M9203J13985J17688O5821q083m3993k4050m38j3261l1289j8426k180
$$ -155458 -106255 7730 125418 191239 183156 139163 115113 114675 101414 70125 51699 49519
33297D9519j8638l7548o982N9133R8696Q7072N4260L0313J7204R024P640J5646
$$ 49519 30881 -6667 -13649 45484 144180 231252 285512 315825 333029 342053 349693 365339
33285C65339K4349R000m7780j08107r0138J8308R3636J5583j43976j88036o2384
$$ 365339 389688 398688 350908 242801 152663 170971 264607 280190 136214 -51822 -114206
33274a14206P3995Q8910M8350O4360J02122O6575j1279k2568L2421M5225k7421
$$ -114206 -40211 48699 97049 161409 263531 330106 318827 296259 328680 373905 346484
33263C46484j08223j16305m7928N1075J12260O6283p3524j73465j23129L797L7261
$$ 346484 238261 121956 74028 125103 237363 303646 230122 56657 -66472 -62675 -25414
33252b5414n5772j40225j12829j4301P1206J12435J01508L7942k4985j8818K6805
$$ -25414 -81186 -221411 -334240 -348541 -277335 -164900 -63392 -25450 -50435 -69253 -42448
33241d2448J5720m2419j9107J20493K24868J64440J9668m5290n318M2512M2002
$$ -42448 -26728 -69147 -88254 32239 257107 421547 441215 395925 390607 433119 475121
33230D75121M023o8521j56493j74271p5543K8012l429j10926r9828O1205J75335
$$ 475121 479144 410623 254130 79859 4316 32328 28899 -82027 -181855 -120650 54685
33219E4685J06677k6399m5909L0300O0333J1825k9839l8322p0888j18769q7209
$$ 54685 161362 134963 89054 119354 179687 191512 161673 123351 52463 -66306 -153515
33208a53515L2154J00196J9279j12290j26790m493J28428J73943J36223N1054
$$ -153515 -121361 -21165 -1886 -114176 -240966 -245459 -117031 56912 193135 244189
33198B44189m9583j03700n7735L6802O0491o476n0418o687K9562l7194j24468
$$ 244189 194606 90906 33171 69973 130464 123988 73570 66883 96445 59251 -65217
33187f5217q1640P0044J51353P9434k6171k9852M1634P4366L7955m000j2846k2950
$$ -65217 -146857 -76813 74540 153974 127803 97951 139585 213951 251906 247906 235060 212110
33175B12110p0716j26074j15876j0692J17978J51099N7939m9235m6720L7653O8085
$$ 212110 141394 15320 -100556 -111248 6730 157829 215768 166533 119813 157466 225551
33164B25551r40o6385m0229K5767L2477k8684r5483j27836j12386l2504Q7238
$$ 225551 224611 158226 117997 143764 176241 147557 52074 -75762 -188148 -220652 -133414
33153a33414J50789Q8516l9461j09284p9331m471O3215J07095J00760K1349q7166
$$ -133414 17375 105891 66430 -42854 -122185 -126656 -63441 43654 144414 165763 78597
33142G8597j39423j09862n1207r773J8710M6215O4681O9515O3619L9881M964K755
$$ 78597 -60826 -170688 -221895 -231668 -212958 -166743 -102062 -32547 31072 70953 75917 78672
33130G8672N3143Q8190K9822p8759j11650l6570M2929M2466j792k3212k5101l8529
$$ 78672 131815 220005 249827 171068 59418 22848 65777 108243 106451 83239 58138 19609
33118A9609n5452n9447o0131m9909N761Q6272J01543K4841l5858J7715J23088
$$ 19609 -35843 -95290 -155421 -205330 -199569 -113297 -11754 13087 -22771 -5056 118032
33107A18032J46872P5889J0953n24j0867n1982p5697l9997K5663P1770Q5778P5328
$$ 118032 264904 340793 351746 351222 340355 288373 212676 172679 198342 270112 355890 431218
33095D31218M8324K9694M8560R0104J05754Q5545P1041P8243O0618j9056j21004
$$ 431218 479542 509236 557796 647900 753654 839199 910240 988483 1049101 1030045 909041
33084I09041j69641j38186o4271j162K3481J6926R361K1556L4969J0263n6740
$$ 909041 739400 601214 536943 535781 559262 576188 585549 607105 642074 652337 595597
33073E95597j18363j27419r0640n6423n7590p4837n6169K3446J20568J58761J14232
$$ 595597 477234 349815 259175 202752 145162 70325 14156 37602 158170 316931 431163
33062D31163L9483j4880o0522j14667j29513n3036O0449Q9639P310p8780p4048
$$ 431163 470646 455766 395244 280577 151064 98028 158477 248116 255426 176646 102598
33051A02598j3242J3305j2688l9006l1313n948M758j6568n6592o6222n190Q8080
$$ 102598 89356 102661 89973 50967 19654 13706 18464 1896 -54696 -120918 -126108 -38028
33039c8028J18758N8230r097m601L5386L0172j6015l4098o603K1618L3513N3828
$$ -38028 80730 138960 129863 125262 160648 190820 174805 140707 134104 155722 189235 243063
33027B43063P2772M0470m3938j10078j09568p2226m4281k6435k447K0876L4288
$$ 243063 315835 356305 312367 202289 92721 20495 -23786 -50221 -52668 -31792 2496
33016B496M5667N3026L9596J7870K8890O8877P1938Q610n2023l7421J4706J0544
$$ 2496 48163 101189 140785 158655 187545 256422 328360 336970 284947 247526 262232 272776
33004B72776n5930r1898l9527M8190Q3171M2422k7388o5345l9558K8118O6294
$$ 272776 216846 124948 85421 133611 216782 259204 231816 166471 126913 155031 221325
32993B21325K2397n6636n9729L9883J20086N3394j12890j98278j18460O367J9941
$$ 221325 243722 187086 127357 167240 287326 340720 227830 29552 -88908 -82541 -62600
32982f2600n5288n8789O8590J87803J47729r456j11429q7027l5906o0890j25557
$$ -62600 -117888 -176677 -108087 79716 227445 217989 106560 19533 -16373 -77263 -202820
32971b02820j26080l8156P0471J34010J34217Q0085L593m1181l2970k3966o6285
$$ -202820 -328900 -367056 -296585 -162575 -28358 51727 55320 14139 -18831 -42797 -109082
32960a09082j13078o8332O3818J61827J41897N5762j195r493o169q298j5278l9514
$$ -109082 -222160 -290492 -226674 -64847 77050 132812 131617 122124 115955 107657 92379 52865
32948E2865p3683o6678O021Q2079Q5052K6002l0519o4852q9718p5590J0688J06493
$$ 52865 -20818 -87496 -81475 604 85656 111658 81139 16287 -73431 -149021 -138333 -31840
32936c1840J02814M978o0770k8032K5501J8286j1339R995O4083Q1544N1721J3185
$$ -31840 70974 75952 15182 -12850 12651 30937 19598 29593 93676 175220 226941 240126
32924B40126k2766o4350q7912o4315j4739J5295J3684p901l9726m8276J2333J04349
$$ 240126 217360 153010 65098 783 -13956 1339 15023 7122 -32604 -80880 -68547 35802
32912C5802J00060l9162j55091q6492Q9995J60046P3722k1075l4795l5191n8255
$$ 35802 135862 96700 -58391 -144883 -54888 105158 178880 157805 123010 87819 29564
32901B9564j8477J03364J56808L6216j33049j65708p3303k369L792J8558N3511
$$ 29564 11087 114451 271259 307475 174426 8718 -64585 -66954 -63162 -44604 8907
32890H907L5062m0872p6654k3191N0018O6626L5628L754q594J22J9592J2051m9585
$$ 8907 43969 3097 -73557 -96748 -46730 19896 55524 59278 50684 50806 70398 82449 32864
32877C2864j21155j28900p4109k4549J649N7607J52708K03834J47432L3536m4194
$$ 32864 -88291 -217191 -291300 -315849 -314200 -256593 -103885 99949 247381 280917 236723
32866B36723o4208p1584q9390q7485l5843M0646P3520K5056n2358o6566j1501
$$ 236723 172515 100931 11541 -75944 -111787 -71141 2379 27435 -24923 -91489 -102990
32855a02990J2339n3629j23359q9618J1862P0725Q4441J30567J80835J13563o4427
$$ -102990 -90651 -144280 -267639 -357257 -345395 -274670 -190229 -59662 121173 234736 170309
32844A70309j77109j23362j2571K2092M601J3270K9984J1268k500K5353L1876
$$ 170309 -6800 -130162 -142733 -120641 -116040 -102770 -72786 -61518 -64018 -38665 -6789
32833f789k4698n0928K7913J01021L6398p3816m2973Q8395R9328m6935j34115
$$ -6789 -31487 -82415 -54502 46519 82917 9101 -33872 54523 153851 106916 -27199
32822b7199m2463P1079M9113k0674J1490R6480R1103Q946k4550O20j4125o9011
$$ -27199 -69662 1417 50530 29856 41346 137826 228929 237875 213325 213945 199820 130809
32810A30809m9659O3142J28272M7684q4949j14835k6167O3735O2813j0391p6559
$$ 130809 81150 144292 272564 320248 235299 120464 94297 158032 220845 210454 133895
32799A33895p7948j8604M3039M6456m893m2434j8818K3773Q374o3041j01701n4575
$$ 133895 55947 37343 80382 126838 121945 79511 60693 84466 92840 29799 -71902 -126477
32787a26477J5839K0158k5351k6773L4783O7283J6850l3666J1603J02458J08083
$$ -126477 -110638 -90480 -115831 -142604 -107821 -40538 -23688 -57354 -45751 56707 164790
32776A64790J2820o3685m7224l482j7798p1838r4741o9302k8545L732J5825n792
$$ 164790 177610 113925 66701 63219 45421 -26417 -121158 -190460 -219005 -215273 -199448 -205240
32764b05240m3637m2641J4683O5310M8799m255k1585P092L4018L1274M137m5728
$$ -205240 -248877 -291518 -276835 -211525 -162726 -166981 -188566 -181474 -147456 -116182 -112045 -157773
32752a57773j04216j14768l9454N9822P7930Q055m6109j2979O1481R4849P1641
$$ -157773 -261989 -376757 -416211 -356389 -278459 -270404 -316513 -329492 -268011 -173162 -101521
32741a01521L0551R32m307K9914R7249J44413J11384k77j20767j75731j48999
$$ -101521 -70970 -70038 -74345 -44431 52818 197231 308615 308338 187571 11840 -137159
32730a37159q7285n0143n3929o4967m6827M80N5431J03465J27179R5622O216p7601
$$ -137159 -224444 -274587 -328516 -393483 -440310 -439830 -384399 -280934 -153755 -58133 -51917 -129518
32718a29518q2108j6191M1420N1820N5242Q2325Q8511K4166p2020j10754o9981
$$ -129518 -211626 -227817 -186397 -134577 -79335 2990 91501 115667 43647 -67107 -137088
32707a37088j9083j7958l7791j0859O2999R8669K8473r7067j44978m9317R9801
$$ -137088 -156171 -174129 -211920 -222779 -159780 -61111 -32638 -129705 -274683 -324000 -224199
32696b24199J47611M7673q9920j28360n0428M2946N8559P406k5937P373O1970
$$ -224199 -76588 -28915 -118835 -247195 -297623 -254677 -196118 -188712 -214649 -207276 -145306
32685a45306O0746N38m3556k7940k488k1809m3557Q533J02848J18703K3167o5305
$$ -145306 -84560 -84022 -127578 -155518 -158006 -179815 -223372 -214839 -111991 6712 29879 -35426
32673c5426l9120N0623Q0006L0295o069K9409R5625J28540J08546M2275n4306
$$ -35426 -74546 -23923 56083 86378 80309 109718 205343 333883 442429 484704 430398
32662D30398j33697j38487p6651k6626l3829m7886l563P8989J29432J28528J05584
$$ 430398 296701 158214 81563 54937 21108 -26778 -30341 48648 178080 306608 412192
32651D12192N5543n2016j69963j77816m6521P8709M9459q0172j28603m9283J3226
$$ 412192 467735 415719 245756 67940 21419 100128 149587 69415 -59188 -108471 -95245
32640i5245l9169r8366k0369J42288K07616J17352j0267p0875q4173q9634o0516
$$ -95245 -134414 -232780 -253149 -110861 96755 214107 203840 132965 48792 -40842 -101358
32629a01358J2034M7955j6923j11573j04423K5165J58559J71876N3136r9585j60695
$$ -101358 -89324 -41369 -58292 -169865 -274288 -249123 -90564 81312 134448 34863 -125832
32618a25832q0483N9125J18384N9345j0373O741N6742K3234q3687j27736l6984
$$ -125832 -206315 -147190 -28806 30539 20166 26907 83649 106883 23196 -104540 -141524
32607a41524R2298J11280j2845j66334j99561o9950J00168J33876O084j05217
$$ -141524 -49226 62054 49209 -117125 -316686 -386636 -286468 -152592 -146508 -251725
32597b51725m0516J21423J73790P5518j4377l140Q107o5915j18872k0558J50827
$$ -251725 -292241 -170818 2972 78490 64113 60973 69080 3165 -115707 -136265 14562
32586A4562K04176J05967j747l0297l5271o6080p2874j7836L5483J6788m5197
$$ 14562 218738 324705 322958 292661 257390 191310 118436 100600 136083 152871 107674
32575A07674p9094p3740o3558o0393n6633n2656k9744N3571J76004K18640J05330
$$ 107674 28580 -45160 -108718 -169111 -225744 -278400 -308144 -254573 -78569 140071 245401
32564B45401n4882p1987P8034K15381J91464N9892m2004q6582j33927j78451j44658
$$ 245401 190519 118532 196566 411947 603411 663303 621299 534717 400790 222339 77681
32553G7681l3743M2250J2453n6274p2334n4923p5377j11777o4798Q3372K17339
$$ 77681 43938 86188 98641 42367 -29967 -84890 -160267 -272044 -336842 -253470 -36131
32542c6131K24903J20539q70p7881j06004r2366m6255J150J8358J6076L5288R0651
$$ -36131 188772 309311 308441 230560 124556 32190 -14065 -12915 5443 21519 56807 147458
32530A47458J47240J52309P8447n0147j58216j68924q0881K0931N7707L8504J9085
$$ 147458 294698 447007 525454 475307 317091 148167 67286 88217 145924 184428 203513
32519B03513J2044p978l2427k4227O210N514k5318j3744O7971J40726J31410R0328
$$ 203513 215557 207579 175152 150925 157135 162649 137331 123587 191558 332284 463694 554022
32507E54022J18065K07988K50072J92017J16526J29635K27238L08995K91549J74773
$$ 554022 672087 880075 1130147 1322164 1438690 1568325 1795563 2104558 2396107 2570880
32497B570880J6957j22687k19425k79180l06718k88838k25306j62635j56040j90658
$$ 2570880 2587837 2465150 2245725 1966545 1659827 1370989 1145683 983048 827008 636350
32487F36350j85554j02754j2479o009p0266j04811n5449K8814Q1297R7631R7629
$$ 636350 450796 348042 335563 329554 259288 154477 99028 127842 209139 306770 404399
32476D04399O3621k1431j02441r0663K0998J36926J66511J05069l492j20437j92833
$$ 404399 468020 446589 344148 253485 274483 411409 577920 682989 679497 559060 366227
32465C66227j47906J6525J68517J57365l633j44829j47399o9616l1589m7093m0044
$$ 366227 218321 234846 403363 560728 557095 412266 264867 195251 163662 116569 76525
32454G6525J4238N1553K4982k2114j9640L3134P0266M2444k9301q1550p4855k9154
$$ 76525 90763 142316 167298 145184 125544 158678 228944 271388 242087 160537 85682 56528
32442E6528j02k4907q9790j43411j36871n9472M8098J15431R6202J1496o6829
$$ 56528 56426 31519 -58271 -201682 -338553 -398025 -349927 -234496 -138294 -126798 -193627
32431a93627p8798j7949P7384J52584J64555J12771M4782L683k4134p0667j07653
$$ -193627 -272425 -290374 -212990 -60406 104149 216920 261702 265385 241251 170584 62931
32420F2931p2594J8163O3889K3932j4207K6961Q7299O9710M068o572L3434J9593
$$ 62931 -9663 8500 72389 96321 82114 109075 196374 266084 270152 263580 297014 316607
32408C16607o6920j17743p5767l0114o9153j40515j38729n7786K7459P7287J02660
$$ 316607 249687 131944 56177 26063 -43090 -183605 -322334 -380120 -352661 -275374 -172714
32397a72714J04620P7712N0665N5120O9609N0641O45m6593q3500j15865j18023
$$ -172714 -68094 9618 60283 115403 185012 235653 236298 189705 106205 -9660 -127683
32386a27683o5407N098L3290K4661L6138P6967R0597M3109k9439p3912p0224k1677
$$ -127683 -193090 -187992 -154702 -130041 -93903 -16936 73661 116770 87331 13419 -56805 -78482
32374g8482N1940J01998Q6124L0148K493J2385l824o6773r4346j8430Q7984Q4989
$$ -78482 -26542 75456 161580 191728 194221 206606 202782 136009 41663 23233 111217 196206
32362A96206m2168j48483j14413J720N5016J4559j5982K1305M2821l0547j20592
$$ 196206 154038 5555 -108858 -107138 -52122 -37563 -53545 -32240 10581 -19966 -140558
32351a40558j00903j1801j4869j25308j56616k348J82142K02608J04403O7050
$$ -140558 -241461 -253262 -268131 -393439 -550055 -552403 -370261 -167653 -63250 3800
32341C800J11929J08458K8041j5635J3914J6607m2217o1302n769N074q2536j21799
$$ 3800 115729 224187 252228 236593 250507 267114 224897 163595 157826 162900 80364 -41435
32329d1435N171J65393J55923M487r5282q0555n7462p3475m8652M7934J25625
$$ -41435 -36264 129129 285052 289539 194257 113702 56240 -17235 -65887 -17953 107672
32318A07672J22602Q8668O7360K3221n2779q3454k8989K7120J690n6451m9587
$$ 107672 230274 318942 386302 409523 356744 273290 244301 271421 273111 216660 167073
32307A67073J3233L9814K25m2913m0326j6450j7149n1093r3595j14078r5617n1279
$$ 167073 180306 220120 220345 177432 137106 120656 103507 52414 -41181 -155259 -250876 -302155
32295c02155j6880r118m927J8306M5407N3735N3926O2265N7748J8138j7318J3732
$$ -302155 -319035 -328153 -333080 -314774 -269367 -215632 -161706 -99441 -41693 -23555 -40873 -27141
32283b7141R0578J08930J7390j00135j26803o0519K44q4j5212O778L5654J2984
$$ -27141 63437 172367 189757 89622 -37181 -97700 -97456 -97540 -112752 -105974 -70320 -57336
32271e7336m7064p0126k4345M1085O4918L9519k145k7816k1410Q322K1498j3773
$$ -57336 -104400 -174526 -198871 -157786 -92868 -53349 -55494 -83310 -104720 -96398 -74900 -88673
32259h8673o1330m1578N6255J33419R6546k4832j24532j46622j05465j5659J08993
$$ -88673 -150003 -191581 -135326 -1907 94639 69807 -54725 -201347 -306812 -322471 -213478
32248b13478J95354J53043J0660p6130j3345R6517Q4659n6075j64010j30169l7542
$$ -213478 -18124 134919 145579 69449 56104 152621 237280 181205 17195 -112974 -150516
32237a50516l2208j16691j52771o0279P1183J08877N3743J7366N0246Q4711O1779
$$ -150516 -182724 -299415 -452186 -512465 -441282 -332405 -278662 -261296 -211050 -126339 -64560
32226f4560K4230L4197P0702P7956O0879N2706L0724m1190j12064r3870j1887
$$ -64560 -40330 -6133 64569 142525 203404 256110 286834 245644 133580 39710 27823
32215B7823O729p7983j46840r1388L5035J07662R9457P4092N9976K8975j5853
$$ 27823 34552 -43431 -190271 -281659 -246624 -138962 -39505 34587 94563 123538 107685
32204A07685k4112J5496M2595R091n0458o5765k0708L6532O0682N4094L9867J9350
$$ 107685 83573 99069 141664 150755 100297 34532 13824 50356 111038 165132 204999 224349
32192B24349j9155o4326r0026r7778j07290r6931j6410J06594J44647L0636j15237
$$ 224349 205194 140868 50842 -46936 -154226 -251157 -267567 -160973 -16326 14310 -100927
32181a00927j19654J3279J18901J06535M8342K1604L347k8933k5769K5818L8656
$$ -100927 -220581 -207302 -88401 18134 66476 88080 91427 62494 36725 62543 101199
32170A01199l4976j01022o5584J1834K2029k0335l5783l7395q0180j10815l6063
$$ 101199 66223 -34799 -100383 -88549 -66520 -86855 -122638 -160033 -240213 -351028 -387091
32159c87091Q7656J08343K0410k4492K8273N3545k2931q6510k7772P0985P1176
$$ -387091 -299435 -191092 -170682 -195174 -166901 -113356 -136287 -222797 -250569 -179584 -108408
32148a08408q658n2682m5552o6701j23732j27365l5386Q2374J40546J27612Q6100
$$ -108408 -117066 -169748 -215300 -282001 -405733 -533098 -568484 -486110 -345564 -217952 -131852
32137a31852N8353N9185O1596J4955q4180j56722j25329j9896N5739N5748L3465
$$ -131852 -73499 -14314 47282 62237 -21943 -178665 -303994 -323890 -268151 -212403 -178938
32126a78938M5090O7919M1710l9407j06938q9491M871Q8492Q8898L0888q150j1338
$$ -178938 -133848 -65929 -24219 -63626 -170564 -260055 -255184 -166692 -77794 -46906 -55056 -66394
32114f6394k7976o1259l9470N4494J14092N5611l5331j6829R0248J26206L0671
$$ -66394 -94370 -155629 -195099 -140605 -26513 29098 -6233 -23062 67186 193392 224063
32103B24063p6268q2625l2749k4155n4266n4684j4200J8700K1485J2800L888n472
$$ 224063 147795 65170 32421 8266 -46000 -100684 -114884 -96184 -74699 -61899 -58011 -63483
32091f3483j483K0113K4397j6397o4440n7870J924N6291P0880N8511L2514l622
$$ -63483 -64966 -44853 -20456 -36853 -101293 -159163 -157239 -100948 -30068 28443 60957 57335
32079E7335k6543j7322j4381o9656j42704j22996P509J16232Q5374l0045q6675
$$ 57335 30792 13470 -911 -70567 -213271 -336267 -328758 -212526 -127152 -157197 -243872
32068b43872m6936L511Q120P200M2438Q4490R1895P3283M6924o359r7154j72183
$$ -243872 -290808 -287297 -279177 -271977 -229539 -145049 -53154 20129 67053 60694 -36460 -208643
32056b08643j60128n7506O8121J43223J29510L4087p7501j09025l3537N1166L1641
$$ -208643 -368771 -426277 -358156 -214933 -85423 -51336 -128837 -237862 -271399 -220233 -188592
32045a88592o2650q4684K9505J61091J56889K3134r3567r2369j6658L5747L8349
$$ -188592 -251242 -335926 -306421 -145330 11559 34693 -58874 -151243 -167901 -132154 -93805
32034i3805L6676N5937N8943Q382o0150o6064R897Q2382N6373n0827j23460q3940
$$ -93805 -57129 -1192 57751 66133 5983 -60081 -50184 32198 88571 37744 -85716 -169656
32022a69656K5304J08773J25076R8923O0041J4372l3603o7641p4066n0924p025
$$ -169656 -144352 -35579 89497 188420 248461 262833 229230 161589 87523 36599 29574
32011B9574L2032L0977j3738m9644k3131M0490N4880j1931q1375o1923K3660O3445
$$ 29574 61606 92583 78845 29201 6070 46560 101440 89509 8134 -53789 -30129 33316
31999C3316Q747n7302l5907M7905Q2355K9587k4473k765M8071L1986m9972j02015
$$ 33316 42063 -15239 -51146 -3241 79114 108701 84228 81463 129534 161520 111548 9533
31987I533p0554m161L3904M3136M7093L8157M796l1272n0581p0545r9235r5712
$$ 9533 -61021 -65182 -31278 11858 58951 97108 101904 70632 20051 -50494 -149729 -245441
31975b45441l4512K8182K6613l508K3366Q9166P8859l2349j07863l5525J00119
$$ -245441 -279953 -251771 -225158 -228666 -205300 -116134 -37275 -69624 -177487 -213012 -112893
31964a12893J28288K4034p7652q0236k6596J1367L5629O4294N8388j4801r6469
$$ -112893 15395 39429 -38223 -118459 -145055 -133688 -98059 -33765 24623 9822 -86647
31953h6647r7582k2548M4342O4609P7548J00356Q2103l252q7003r0594l9293k4712
$$ -86647 -184229 -206777 -162435 -97826 -20278 80078 162181 158929 71926 -18668 -57961 -82673
31941h2673p2403j11497p8506L118O3609O8675M0395J9661K3759L0452L355n3553
$$ -82673 -155076 -266573 -345079 -341961 -278352 -209677 -169282 -149621 -125862 -95410 -92055 -145608
31929a45608p8800k1344Q0345J27547P7426o873l6899J979M9767M4860j8120q3209
$$ -145608 -224408 -245752 -165407 -37860 39566 32693 -4206 -2227 47540 92400 74280 -8929
31917h929p8710O433Q9576P5405k2741q9422n1715L5699P8643N9980K1329j9313
$$ -8929 -87639 -81206 8370 83775 61034 -28388 -80103 -44404 34239 94219 115548 96235
31905I6235o5655r2555o9388j9653O114P253K3020N5460O5523M1087N024l8861
$$ 96235 30580 -61975 -131363 -151016 -144902 -137649 -114629 -59169 6354 47441 52465 13604
31893A3604r5683j18315m6058P8016J23594M8414l2799j4138N2423N6812O147
$$ 13604 -82079 -200394 -246452 -168436 -44842 3572 -29227 -43365 9058 65870 72017
31882G2017j0608J1363q413p2818p0932N1694J86186J93140Q0085k5639m5986
$$ 72017 61409 72772 64359 -8459 -79391 -27697 158489 351629 431714 406075 360089
31871C60089k4219l7011r2035j27040q3808K5749J18450J13278J7843p2997p9305
$$ 360089 335870 298859 206824 79784 -4024 21725 140175 253453 271296 198299 118994
31860A18994j8216L4203L7356R439k3381n4316p3429o1410j9417K4288M8852N7941
$$ 118994 100778 134981 172337 181776 158395 104079 30650 -30760 -50177 -25889 22963 80904
31848H0904N7056M4335L4086N6033J11911J60824J69186J50478J34536J25080
$$ 80904 137960 182295 216381 272414 384325 545149 714335 864813 999349 1124429
31838A124429J14094J10666J22458J33734J40033J80376K86855M20772N17181
$$ 1124429 1238523 1349189 1471647 1605381 1745414 1925790 2212645 2633417 3150598
31829C150598N85284O97111Q66193J008405J057824J058315J076704J056575Q33790
$$ 3150598 3735882 4432993 5299186 6307591 7365415 8423730 9500434 10557009 11390799
31820A1390799L17946l74769r91897j341248j412206j316883j146592r22815o76499
$$ 11390799 11708745 11333976 10342079 9000831 7588625 6271742 5125150 4202335 3525836
31811C525836m95421m32022m13836l35495k20362j86161k44566k58981j51986
$$ 3525836 3030415 2598393 2184557 1849062 1628700 1442539 1197973 938992 787006
31802G87006l5233m0045j15958j22530n5551l2857p8760q1923L969O2816o922
$$ 787006 751773 711728 595770 473240 417689 384832 306072 224149 228118 290934 284012
31791B84012j25020j36879k6339P5834P0716o030o0617n3070j0858K7431M8001
$$ 284012 158992 22113 -4226 71608 142324 136294 75677 22607 11749 39180 87181
31780H7181M8975J7964n4609j36457j55959p5328M9635J19591J01112N1817L5958
$$ 87181 136156 154120 99511 -36946 -192905 -268233 -218598 -99007 2105 53922 89880
31769H9880N4930O9763N2673R50o4679r8125n8595L4392J03068Q9570J3933n5762
$$ 89880 144810 214573 267246 268196 203517 105392 46797 81189 184257 273827 287760 231998
31757B31998o9053k5470K8604L1830k8715q5754o8169p978n787p5668j06332k2830
$$ 231998 162945 137475 166079 197909 169194 83440 15271 7293 1506 -74162 -180494 -203324
31745b03324R0731J06580L5034m657L2054O4224K6129l6219m9139k1886j4628
$$ -203324 -112593 -6013 29021 24364 56418 120642 146771 110552 61413 39527 24899
31734B4899l4068k4249M1896J10904J10054L7721l4060m5250j1271J2335O941
$$ 24899 -9169 -33418 8478 119382 229436 267157 233097 187847 176576 188911 195852
31723A95852K141J8093L5175L0111Q460j5904m5143q0644j05071j02008p6316
$$ 195852 197993 216086 251261 281372 289832 273928 228785 148141 43070 -58938 -135254
31712a35254m2193j2996j0247m7217q8827p3106j623L9299n806o7075l5373Q1612
$$ -135254 -177447 -190443 -200690 -247907 -336734 -409840 -411463 -372164 -377970 -445045 -480418 -398806
31700c98806J63970J39455O5612K9863L1635J2285l5106m9217K984O4697O0001
$$ -398806 -234836 -95381 -29769 94 31729 44014 8908 -40309 -37325 27372 87373
31689H7373J855k3006J7088M5945k308o7585m6691L7917N7917k6271j04653r1416
$$ 87373 89228 66222 83310 129255 126947 59362 12671 50588 108505 82234 -22419 -113835
31677a13835m5764m5203m3385L3457J24308J04582j4152r1268o1896r868j5652
$$ -113835 -159599 -204802 -248187 -214730 -90422 14160 8 -91260 -153156 -163024 -178676
31666a78676m4356k7675L1916Q8412J17583J11590O2860p380m7760l5788m513
$$ -178676 -223032 -250707 -218791 -130379 -12796 98794 161654 154274 106514 70726 66213
31655F6213P244k728j3815j958M8422J06417Q9594l3517j56123j42705k0236N0271
$$ 66213 73457 70729 56914 54956 103378 209795 299389 265872 109749 -32956 -53192 -2921
31643b921M030n1494k7218J5720k513l9634k1998K3233L6205L9359O6890N8220
$$ -2921 1109 -50385 -77603 -61883 -64396 -104030 -126028 -102795 -66590 -27231 39659 97879
31631I7879m0659j30693p3494P7306J25435K0187p0285k0425O9849M2983p9854
$$ 97879 57220 -73473 -146967 -69661 55774 75961 5676 -14749 55100 98083 18229
31620A8229j46151r4521j5625l787l8991l9582J9687P8849P2971J5784j8952K044
$$ 18229 -127922 -222443 -238068 -241855 -280846 -320428 -300741 -221892 -148921 -133137 -152089 -150045
31608a50045K7594M769l3920j9315M4361Q6229P6027N1142L3136l358n7243p3773
$$ -150045 -122451 -117682 -151602 -170917 -126556 -40327 35700 86842 119978 116620 59377 -14396
31596a4396k9816J8623J9319k407j716P453q637k9073r191M0712P0106O3717M4906
$$ -14396 -44212 -25589 -6270 -8677 -10393 -2940 -11577 -40650 -49841 -9129 60977 124694 169600
31583A69600K0497j7099m4747l2064p268k7613p3510n2168N4620J21303L1887
$$ 169600 190097 172998 128251 96187 88919 61306 -12204 -64372 -9752 111551 143438
31572A43438j39863j96793o7156R9297J21727O567q9813p4493p622J6309j2554
$$ 143438 3575 -193218 -260374 -161077 -39350 -32783 -122596 -197089 -204711 -188402 -200956
31561b00956m9813p0359n9368P674J08427J49166Q0601j982K3356J11394R9589
$$ -200956 -250769 -321128 -380496 -372822 -264395 -115229 -34628 -36610 -13254 98140 197729
31550A97729m0243j39891p8146M4677O9547Q324j4542K3763L4122r715l0193R024
$$ 197729 157486 17595 -60551 -15874 53673 61997 47455 71218 105340 95625 65432 74456
31538G4456M1287J4920k7364l1499j3430r133p751J5765M6995N1509J6022m8907
$$ 74456 115743 130663 103299 71800 58370 49237 41486 57251 104246 155755 171777 122870
31526A22870j09211j06594j6553Q4753Q5458j0674q0085n6029j3449k4806l4581
$$ 122870 13659 -92935 -109488 -24735 60723 50049 -30036 -86065 -99514 -124320 -158901
31515a58901L1981J19805J20608M6183L412K3643L7724J3083n225m265l8121j14930
$$ -158901 -126920 -7115 113493 159676 163088 186731 224455 237538 232313 228048 189927 74997
31503G4997j49232q4628J1259L7376p241m0376j3303M2076O5407K8963m4222j00233
$$ 74997 -74235 -158863 -147604 -110228 -117469 -157845 -171148 -129072 -63665 -34702 -78924 -179157
31491a79157r9606n1798L408L9874N0439K9133j1870k6114J2692N4447L5481j3675
$$ -179157 -278763 -330561 -327153 -287279 -236840 -207707 -219577 -245691 -232999 -178552 -143071 -156746
31479a56746n087N9642P5854k150q0970o4129J1252M1690J671m9368o2401l6668
$$ -156746 -161833 -102191 -26337 -28487 -109457 -173586 -162334 -120644 -118973 -168341 -230742 -267410
31467b67410Q839M9007O0501N2408O0395Q6246Q7291M9313J2047o206l8924q8877
$$ -267410 -258571 -209564 -149063 -96655 -36260 49986 137277 186590 198637 192431 153507 64630
31455F4630r5751l7928J6001J7237Q973J9910q722r4016j20866j2827J05162P6441
$$ 64630 -31121 -69049 -53048 -35811 -26838 -6928 -15650 -109666 -230532 -243359 -138197 -61756
31443f1756l2876l4564P8671J35480P1753j238k7527q1058j56081j08743Q5340
$$ -61756 -94632 -129196 -50525 84955 156708 155470 127943 46885 -109196 -217939 -132599
31432a32599K15024J21678n7074r7421j5710K794q1782j22707m0436O2235P0692
$$ -132599 82425 204103 147029 49608 33898 36692 -45090 -167797 -208233 -145998 -75306
31421g5306J0330k5887j3001J850j5300m5303n1315k7838k529J0036L1248O9159
$$ -75306 -64976 -90863 -103864 -102014 -117314 -162617 -213932 -241770 -244299 -234263 -203015 -133856
31409a33856P7029J6817n9427o9301k7944k0876n1296l1072N4128R6429L1248
$$ -133856 -56827 -40010 -99437 -168738 -196682 -217558 -268854 -299926 -245798 -149369 -118121
31398a18121o6145j09019j09384r4329l3523O6401J12152O2706P923J6435K7669
$$ -118121 -184266 -293285 -402669 -496998 -530521 -464120 -351968 -289262 -281339 -264904 -237235
31387b37235k815O314R2696J21203j096j19703n3850R4895J00133j2544k4344
$$ -237235 -240050 -233736 -141040 -19837 -20933 -140636 -194486 -99591 542 -12002 -36346
31376c6346Q6258J11786j2703j03926o1034k2209q5022j27218m8262L6065P065
$$ -36346 49912 161698 148995 45069 -15965 -38174 -123196 -250414 -298676 -262611 -255546
31365b55546m1012J9982J16447J06644K3681l633K7580L4390K5742N7780P8886
$$ -255546 -296558 -276576 -160129 -53485 -29804 -33437 -5857 28533 54275 112055 190941
31354A90941L622j04979j08684k1870J2380l6354m7776K9730R5006P7475N1455
$$ 190941 194563 89584 -19100 -40970 -28590 -64944 -112720 -82990 12016 89491 140946
31343A40946R2423J40842J01522l576p3309p0928n0381n9753q2705q1157n7547
$$ 140946 233369 374211 475733 472157 398848 327920 277539 217786 135081 53924 -3623
31332c623n2804q5956j15047q4282o366M5127L8100K2600L9519N0929J4914k9073
$$ -3623 -56427 -142383 -257430 -341712 -348078 -302951 -264851 -242251 -202732 -151803 -136889 -165962
31320a65962k3459O294k7k4855o765L6967L2493r578O012R5285J47837R4327J5074
$$ -165962 -189421 -183127 -183154 -208009 -214774 -177807 -145314 -154892 -148880 -53595 94242 188569 203643
31307B03643M890J9161l9652j38565j42739k1830Q9647P5010j3421m8863q412
$$ 203643 208533 227694 188042 49477 -93262 -115092 -25445 49565 36144 -12719 -21131
31296b1131K8042J9021j323k5643r9825k02664k05502m3376J49036J88836Q6431
$$ -21131 6911 25932 24609 -1034 -100859 -303523 -509025 -552401 -403365 -214529 -128098
31285a28098N398P013o838q0153j07058k5443N0314J2155m9132J2058J41299J47410
$$ -128098 -122700 -115687 -122525 -202678 -309736 -335179 -284865 -272710 -321842 -309784 -168485 -21075
31273b1075n107j31898p9834Q7554J99520J77559P5488j5783n4546o4191q2726
$$ -21075 -26182 -158080 -237914 -150360 49160 226719 302207 286424 231878 167687 84961
31262H4961r4775m5755N3686R9883L4421n2038m5091J7208R182p6187j20570p3398
$$ 84961 -9814 -55569 -1883 98000 132421 80383 35292 52500 61682 -14505 -135075 -208473
31250b08473j2358Q812L5978R2823J10260M8477j2357J4291Q9751J09164M1133
$$ -208473 -220831 -212019 -176041 -83218 27042 75519 63162 77453 167204 276368 317501
31239C17501n3220r9378o3591K7213Q5347L3864r1426j68556j42743q1957n1729
$$ 317501 264281 164903 101312 128525 213872 247736 156310 -12246 -154989 -236946 -288675
31228b88675k5106L1542P4978O2445L6041M6529N8112J7938l6356l5589j738j0419
$$ -288675 -313781 -282239 -207261 -144816 -108775 -62246 -4134 13804 -22552 -58141 -59879 -70298
31216g0298n8991p2884k8618K7130P6051J46101K16853K00737N9189j24967k30543
$$ -70298 -129289 -202173 -230791 -203661 -127610 18491 235344 436081 495270 370303 139760
31205A39760k15074j27188m2336j0247l3177o7985o3906j3132M3891O5540N1498
$$ 139760 -75314 -202502 -244838 -255085 -288262 -356247 -420153 -433285 -389394 -323854 -272356
31194b72356L9348O2135J00157Q2821k5206j37637j07956Q5689K73504K74351
$$ -272356 -233008 -170873 -70716 12105 -13101 -150738 -258694 -173005 100499 374850
31184C74850J06787m7856o8603n566K5400j8028q8899j19547q2021j0406K9047
$$ 374850 481637 433781 365178 359612 385012 366984 278085 158538 76517 66111 95158
31173I5158J2090j1398R557M7755M2778J842j4585J008q468n9204q9533n8096
$$ 95158 107248 95850 105407 153162 195940 197782 183197 184205 175737 116533 27000 -31096
$$ [...]
##END NTUPLES=NMR SPECTRUM
##END=
