##TITLE=31Pdec_DE-74_oil
 D2O, 64 sc
 8.11.2024
##JCAMPDX= 6.0         $$ Bruker NMR JCAMP-DX V2.0
##DATA TYPE= NMR SPECTRUM
##DATA CLASS= NTUPLES
##ORIGIN= UXNMR, Bruker Analytische Messtechnik GmbH
##OWNER= root
$$ XWIN-NMR		Version 3.5
$$ Fri Nov  8 16:19:43 2024 Russian Standard Time (UT+4h)  she@DPX200
##.OBSERVE FREQUENCY= 81.013821
##.OBSERVE NUCLEUS= ^31P
##.ACQUISITION MODE= SIMULTANEOUS
##.ACQUISITION SCHEME= undefined
##.AVERAGES= 64
##.DIGITISER RES= 17
##SPECTROMETER/DATA SYSTEM= spect
##.PULSE SEQUENCE= zgpg30
##.SOLVENT NAME= CDCl3
##.SHIFT REFERENCE= (INTERNAL, CDCl3, 0, 198.062)
##AUDIT TRAIL= $$ (NUMBER, WHEN, WHO, WHERE, WHAT)
$$ ##TITLE= Audit trail, XWIN-NMR		Version 3.5
$$ ##JCAMPDX= 5.01
$$ ##ORIGIN= Bruker BioSpin GmbH
$$ ##OWNER= she
$$ F:/spectra/data/she/nmr/P31/2/pdata/1/auditp.txt
$$ ##AUDIT TRAIL=  $$ (NUMBER, WHEN, WHO, WHERE, WHAT)
(   1,<2024-11-08 16:18:45.29 +0400>,<she>,<DPX200>,
      <created by zg, POWCHK disabled, PULCHK disabled
       configuration hash MD5:
       00 E9 B6 7A A2 85 ED C7 34 08 36 98 17 FE 4E 26
       data hash MD5: 32K
       B6 55 4E A1 A9 14 69 2E BD EC CF 39 C4 9E E5 2E>)
(   2,<2024-11-08 16:18:47.35 +0400>,<she>,<DPX200>,
      <Start of raw data processing
       efp BC_mod = 2 LB = 1.5 FT_mod = 6 PKNL = 1 PHC0 = 2285.842 PHC1 = 91.28822 SI = 64K 
       data hash MD5: 64K
       4D F5 73 2E 39 D8 71 FE 00 AA A2 0C 0F 75 EA E4>)
(   3,<2024-11-08 16:19:11.14 +0400>,<she>,<DPX200>,
      <pk PHC0 = -26.14539 PHC1 = -7.800008 
       data hash MD5: 64K
       0F 7E 75 FE 26 55 73 74 94 0F 40 C5 27 8F DA 10>)
$$ ##END=
$$ 
$$ hash MD5
$$ 28 F9 BA 2E 16 E8 52 1F 55 6E FD CC 02 99 E5 2A
##$RELAX= 
##$RELAX= 
##$RELAX= 
##$RELAX= 
##$RELAX= 
##$RELAX= 
##$RELAX= 
##$RELAX= 
$$ Bruker specific parameters
$$ --------------------------
##$DU= <F:/spectra>
##$EXPNO= 2
##$NAME= <P31>
##$PROCNO= 1
##$TYPE= <nmr>
##$USER= <she>
##$AMP= (0..31)
100 100 100 100 100 100 100 100 100 100 100 100 100 100 100 100 100 100 
100 100 100 100 100 100 100 100 100 100 100 100 100 100 
##$AQSEQ= 0
##$AQ_mod= 1
##$AUNM= <au_zg>
##$AUTOPOS= <>
##$BF1= 81.014009
##$BF2= 200.13
##$BF3= 200.13
##$BF4= 200.13
##$BF5= 200.13
##$BF6= 200.13
##$BF7= 200.13
##$BF8= 200.13
##$BYTORDA= 1
##$CFDGTYP= 0
##$CFRGTYP= 5
##$CHEMSTR= <none>
##$CNST= (0..31)
1 1 145 1 1 1 1 1 1 1 1 1 1 1 1 1 1 1 1 1 1 1 1 1 1 1 1 1 1 1 1 1 
##$CPDPRG= <waltz16>
##$CPDPRG1= <>
##$CPDPRG2= <waltz16>
##$CPDPRG3= <>
##$CPDPRG4= <mlev>
##$CPDPRG5= <mlev>
##$CPDPRG6= <mlev>
##$CPDPRG7= <mlev>
##$CPDPRG8= <mlev>
##$CPDPRGB= <>
##$CPDPRGT= <>
##$D= (0..31)
0 1 0 0 0 0 0 0 0 0.06 0 0.03 2e-05 3e-06 0 0 0.0002 0 0 0 0 0 0 0 0 0 
0 0 0 0 0 0 
##$DATE= 1731068324
##$DBL= (0..7)
120 120 120 11 120 120 24 19 
##$DBP= (0..7)
150 150 150 150 150 150 150 150 
##$DBP07= 0
##$DBPNAM0= <>
##$DBPNAM1= <>
##$DBPNAM2= <>
##$DBPNAM3= <>
##$DBPNAM4= <>
##$DBPNAM5= <>
##$DBPNAM6= <>
##$DBPNAM7= <>
##$DBPOAL= (0..7)
0.5 0.5 0.5 0.5 0.5 0.5 0.5 0.5 
##$DBPOFFS= (0..7)
$$ [...]
##$SUBNAM3= <"">
##$SUBNAM4= <"">
##$SUBNAM5= <"">
##$SUBNAM6= <"">
##$SUBNAM7= <"">
##$SUBNAM8= <"">
##$SUBNAM9= <"">
##$SW= 400.765351723535
##$SWIBOX= (0..15)
0 1 3 0 0 0 0 0 0 0 0 0 0 0 0 0 
##$SW_h= 32467.5324675325
##$TD= 32768
##$TD0= 1
##$TE= 0
##$TE2= 300
##$TE3= 300
##$TEG= 300
##$TL= (0..7)
0 120 53 12 22 120 120 120 
##$TP= (0..7)
150 150 150 150 150 150 150 150 
##$TP07= 0
##$TPNAME0= <>
##$TPNAME1= <>
##$TPNAME2= <>
##$TPNAME3= <>
##$TPNAME4= <>
##$TPNAME5= <>
##$TPNAME6= <>
##$TPNAME7= <>
##$TPOAL= (0..7)
0.5 0.5 0.5 0.5 0.5 0.5 0.5 0.5 
##$TPOFFS= (0..7)
0 0 0 0 0 0 0 0 
##$TUNHIN= 0
##$TUNHOUT= 0
##$TUNXOUT= 0
##$USERA1= <user>
##$USERA2= <user>
##$USERA3= <user>
##$USERA4= <user>
##$USERA5= <user>
##$V9= 5
##$VALIST= <valist>
##$VCLIST= <CCCCCCCCCCCCCCC>
##$VD= 0
##$VDLIST= <DDDDDDDDDDDDDDD>
##$VPLIST= <PPPPPPPPPPPPPPP>
##$VTLIST= <TTTTTTTTTTTTTTT>
##$WBST= 1024
##$WBSW= 4
##$XGAIN= (0..3)
0 0 0 0 
##$XL= 0
##$YL= 0
##$YMAX_a= 19114
##$YMIN_a= -13541
##$ZGOPTNS= <>
##$ZL1= 120
##$ZL2= 120
##$ZL3= 120
##$ZL4= 120
##$ABSF1= 0
##$ABSF2= 0
##$ABSG= 0
##$ABSL= 0
##$ALPHA= 0
##$AQORDER= 0
##$ASSFAC= 0
##$ASSFACI= 0
##$ASSFACX= 0
##$ASSWID= 0
##$AUNMP= <proc_1d>
##$AZFE= 0.1
##$AZFW= 0.5
##$BCFW= 0
##$BC_mod= 2
##$BYTORDP= 0
##$COROFFS= 0
##$CY= -3
##$DATMOD= 1
##$DC= 0
##$DFILT= <>
##$DTYPP= 0
##$F1P= 0
##$F2P= 0
##$FCOR= 1
##$FTSIZE= 65536
##$FT_mod= 6
##$GAMMA= 0
##$GB= 0
##$INTBC= 1
##$INTSCL= 9.790993e-09
##$ISEN= 30
##$LB= 1.5
##$LEV0= 0
##$LPBIN= 0
##$MAXI= 10000
##$MC2= 0
##$MEAN= 0
##$ME_mod= 0
##$MI= 50
##$NCOEF= 0
##$NC_proc= -7
##$NLEV= 6
##$NOISF1= 182.463
##$NOISF2= 159.3651
##$NSP= 0
##$NTH_PI= 0
##$NZP= 0
##$OFFSET= 198.0616
##$PC= 4
##$PHC0= 2259.697
##$PHC1= 83.48821
##$PH_mod= 1
##$PKNL= yes
##$PPARMOD= 0
##$PSCAL= 0
##$PSIGN= 0
##$REVERSE= no
##$SF= 81.0140089999434
##$SI= 65536
##$SIGF1= 159.3651
##$SIGF2= -187.1042
##$SINO= 113.3802
##$SIOLD= 16384
##$SREGLST= <1H.CDCl3>
##$SSB= 0
##$STSI= 65536
##$STSR= 0
##$SW_p= 32467.5324675325
##$SYMM= 0
##$S_DEV= 0
##$TDeff= 32768
##$TDoff= 0
##$TI= <>
##$TILT= no
##$TM1= 0
##$TM2= 0
##$TOPLEV= 0
##$USERP1= <user>
##$USERP2= <user>
##$USERP3= <user>
##$USERP4= <user>
##$USERP5= <user>
##$WDW= 1
##$XDIM= 65536
##$YMAX_p= 335738039
##$YMIN_p= -15379564
$$ End of Bruker specific parameters
$$ ---------------------------------
##NTUPLES= NMR SPECTRUM
##VAR_NAME=  FREQUENCY,     SPECTRUM/REAL,   SPECTRUM/IMAG
##SYMBOL=    X,             R,               I
##VAR_TYPE=  INDEPENDENT,   DEPENDENT,       DEPENDENT
##VAR_FORM=  AFFN,          ASDF,            ASDF
##VAR_DIM=   65536,         65536,           65536
##UNITS=     HZ,            ARBITRARY UNITS, ARBITRARY UNITS
##FACTOR=    0.49542278885378, 1,            1
##FIRST=     16045.7642231865, 0,            0
##LAST=      -16421.768244346, 0,            0
##MIN=       -16421.768244346, -15379564,    0
##MAX=       16045.7642231865, 335738039,    0
$$ Real data points
##PAGE= N=1
##DATA TABLE= (X++(R..R)), XYDATA
$$ [...]
$$ plain form
38749 1063053 1786522 5436375 10570075 13795891 12744205 8452131 4323705 2524676
38741 2524676 2339664 2445399 3099145 4690147 5782608 4972077 3753929 4837865 7931649
38732 7931649 10016963 9913048 9481257 9542595 7905682 3369261 -1029249 -1501459 1353258
38723 1353258 3613015 3335039 2131028 1696169 1331605 -379481 -3140255 -5167976 -5091682
38714 -5091682 -3053277 -298852 2088098 4121106 6302940 8067501 7839571 5360370
38706 5360370 2918967 2954765 5020887 6522180 6095550 4756663 3858161 3603787 3874395
38697 3874395 4875605 6156799 6231805 4227270 1214782 -926254 -1426185 -740088 579310
38688 579310 2170732 3420181 3816364 3823293 4511278 5965392 6716464 5361494 2471613
$$ packed form
38749A063053P23469L649853N133700L225816j051686m292074m128426j799029
38741B524676j85012J05735O53746J591002J092461q10531j218148J083936L093784
38732G931649K085314j03915m31791O1338j636913m536421m398510m72210K854717
38723A353258K259757k77976j204011m34859l64564j711086k760774k027721P6294
38714e091682K038405K754425K386950K033008K181834J764561k27930k479201
38706E360370k441403L5798K066122J501293m26630j338887q98502k54374K70608
38697C874395J001210J281194P5006k004535l012488k141036m99931O86097J319398
38688E79310J591422J249449L96183O929O87985J454114P51072j354970k889881
$$ plain form
38679 2471613 202547 -105743 684238 970161 708927 1262520 2979108 4201362 3493868
38670 3493868 1992505 2304431 5322257 9247456 11761215 12112094 10965369 9385214
38662 9385214 8464936 8944976 10394631 11344364 10842220 9375825 7799583 6089165 3877529
38653 3877529 1537842 -218690 -1325524 -1879888 -1047814 2217638 7219031 11439639
38645 11439639 12913682 11925637 10023597 8198462 6616563 5400134 4715062 4237778
38637 4237778 3273176 1583843 -200314 -1101395 -648088 702528 1926634 2353463 2258213
38628 2258213 2358766 2794166 3005726 2676832 2265138 2353002 2954281 3818754 4926502
38619 4926502 6102059 6476711 5115036 2282820 -418570 -1407622 -427130 1479193 2985376
$$ packed form
38679B471613k269066l08290P89981K85923k61234N53593J716588J222254p07494
38670C493868j501363L11926L017826L925199K513759L50879j146725j580155
38662I385214r20278M80040J449655R49733n02144j466395j576242j710418k211636
38653C877529k339687j756532j106834n54364Q32074L265452N001393M220608
38645A1439639J474043r88045j902040j825135j581899j216429o85072m77284
38637D237778r64602j689333j784157r01081M53307J350616J224106M26829r5250
38628B258213J00553M35400K11560l28894m11694Q7864O01279Q64473J107748
38619D926502J175557L74652j361675k832216k701390r89052R80492J906323J506183
$$ plain form
38610 2985376 3420311 2962128 2094257 932734 -734055 -2668105 -3855363 -3496478 -2252464
38601 -2252464 -1878336 -3306187 -5483941 -6556704 -5971662 -4790977 -3860717 -2518747 75801
38592 75801 2774842 2967591 -210855 -4261442 -5901955 -4582467 -2283918 -426989 1341814
38583 1341814 3339168 4725927 4887577 4378834 3598319 2027672 5389 -257666 2675876
38574 2675876 6747777 8460558 7300278 5981858 6226051 6549170 5108743 2877928
38566 2877928 2439837 4494524 6983613 7522990 5765670 3263324 1639771 1385499 2409789
38557 2409789 5034320 9289642 13134958 13082076 8023793 1406008 -2238416 -2354186 -2019245
38548 -2019245 -3027997 -3938055 -3338750 -2223351 -1722123 -807033 1737440 4654409 5679202
$$ packed form
38610B985376M34935m58183q67871j161523j666789j934050j187258L58885J244014
38601b252464L74128j427851k177754j072763N85042J180685R30260J341970K594548
38592G5801K699041J92749l178446m050587j640513J319488K298549J856929J768803
38583A341814J997354J386759J61650n08743p80515j570647k022283k63055K933542
38574B675876M071901J712781j160280j318420K44193L23119j440427k230815
38566B877928m38091K054687K489089N39377j757320k502346j623553k54272J024290
38557B409789K624531M255322L845316n2882n058283o617785l644424j15770L34941
38548b019245j008752r10058N99305J115399N01228R15090K544473K916969J024793
$$ plain form
38539 5679202 4676105 3288320 2147633 500656 -1663814 -3160253 -3544809 -3817050
38531 -3817050 -4564518 -4621635 -2386535 2092873 6871700 9688760 9630147 7521184 4909993
38522 4909993 2796442 1503922 1359441 2483744 3783382 3414645 994338 -1610620
38514 -1610620 -2487185 -1691537 -184894 1997554 4986133 7392266 7382875 5335473 3679318
38505 3679318 3794553 4488046 4033027 2525349 1414075 1319182 1114552 -723577 -4040076
38496 -4040076 -6591003 -6233097 -3486282 -1067623 -693825 -1487173 -1976775 -2114634 -2209015
38487 -2209015 -1395860 1083745 4146868 6258191 7683446 9390868 10551010 9537770
38479 9537770 6992795 5279018 4829473 3673851 1060833 -1114160 -1529903 -1661090 -3191267
$$ packed form
38539E679202j003097j387785j140687j646977k164470j496439l84556k72241
38531c817050p47468n7117K235100M479408M778827K817060n8613k108963k611191
38522D909993k113551j292520j44481J124303J299638l68737k420307k604958
38514a610620q76565P95648J506643K182448K988579K406133r391k047402j656155
38505C679318J15235O93493m55019j507678j111274r4893k04630j838129l316499
38496d040076k550927L57906K746815K418659L73798p93348m89602j37859r4381
38487b209015Q13155K479605L063123K111323J425255J707422J160142j013240
38479I537770k544975j713777m49545j155622k613018k174993m15743j31187j530177
$$ plain form
38470 -3191267 -5036261 -4787245 -2073822 1026089 2281222 982208 -1949671 -4604860
38462 -4604860 -5447116 -4698535 -3759892 -3014164 -1384032 1432069 3735840 3892271 2530723
38453 2530723 1541168 1643482 1994970 1641841 489539 -732224 -912549 437596 2166883
38444 2166883 2202265 -224519 -3722292 -6324105 -7053640 -5943245 -3960030 -3169927 -5126509
38435 -5126509 -8324782 -9152795 -6571651 -3964047 -4612054 -7003943 -6935924 -3269869 900551
38426 900551 2565172 1954336 972514 334322 -727391 -2741718 -4849584 -5390440 -3563549
38417 -3563549 -410034 2250997 3804584 5050165 6498766 7592976 7786424 7048326
38409 7048326 5006819 1286031 -2701530 -4257911 -2786929 -795001 -235833 58974
$$ packed form
38470c191267j844994K49016K713423L099911J255133j299014k931879k655189
38462d604860q42256P48581R38643P45728J630132K816101K303771J56431j361548
38453B530723r89555J02314L51488l53129j152302j221763j80325J350145J729287
38444B166883L5382k426784l497773k601813p29535J110395J983215P90103j956582
38435e126509l198273q28013K581144K607604o48007k391889O8019L666055M170420
38426I00551J664621o10836r81822o38192j061713k014327k107866n40856J826891
38417c563549L153515K661031J553587J245581J448601J094210J93448p38098
38409G048326k041507l720788l987561j556381J470982J991928N59168K94807
$$ plain form
38401 58974 1612133 3263539 3428751 3484107 5748579 9260133 10829121 9708644 8069721
38392 8069721 7147488 6118598 4835853 4408256 4556469 3527328 1539661 1387588 4368905
38383 4368905 8208669 10403737 11211939 11802537 11818198 10730489 9624133 9399452 8674861
38374 8674861 5777577 1841176 -338165 -64156 677120 331753 -300825 325954 2174386
38365 2174386 3530037 2840332 404169 -1679975 -1373354 1395185 4773306 6671734
38357 6671734 6051387 3160888 -466201 -2639764 -2465200 -1475728 -1401021 -1187669 1624429
38348 1624429 6454803 9214814 7288270 2654651 -1306076 -3782489 -5399425 -5435357
38340 -5435357 -3155690 -663347 -1127633 -4211966 -6013104 -4075252 -269344 2056707
$$ packed form
38401E8974J553159J651406J65212N5356K264472L511554J568988j120477j638923
38392H069721r22233j028890j282745m27597J48213j029141j987667j52073K981317
38383D368905L839764K195068Q08202N90598J5661j087709j106356k24681p24591
38374H674861k897284l936401k179341K74009P41276l45367o32578O26779J848432
38365B174386J355651o89705k436163k084144L06621K768539L378121J898428
38357F671734o20347k890499l627089k173563J74564R89472P4707K13352K812098
38348A624429M830374K760011j926544m633619l960727k476413j616936l5932
38340e435357K279667K492343m64286l084333j801138J937852L805908K326051
$$ plain form
38332 2056707 1931636 738919 -255938 -1096508 -2485823 -4837859 -7703928 -9745829 -9677798
38323 -9677798 -7543464 -4666746 -2140119 141845 2688152 5206622 6704764 6539501
38315 6539501 4928905 2608396 533769 -74003 1794333 5680455 9245944 10166530
38307 10166530 8593362 6689189 5408849 3258029 -614545 -3621123 -2271784 3013758
38299 3013758 7957159 9397751 8056713 6039273 4061816 2228296 1302142 1435309
38291 1435309 1090492 -1074848 -4208701 -6395494 -6709728 -5053779 -1419350 3149162
38283 3149162 6227684 6560814 5978126 6928661 9002260 9887764 9056734 8304737 8915593
38274 8915593 10270002 11156713 10733122 8443024 4828296 2234982 2752011 5381945 7023458
$$ packed form
38332B056707j25071j192717r94857q40570j389315k352036k866069k041901O8031
38323i677798K134334K876718K526627K281964K546307K518470J498142j65263
38315F539501j610596k320509k074627o07772J868336L886122L565489R20586
38307A0166530j573168j904173j280340k150820l872574l006578J349339N285542
38299C013758M943401J440592j341038k017440j977457j833520r26154J33167
38291A435309l44817k165340l133853k186793l14234J655949L634429M568512
38283C149162L078522L33130n82688R50535K073599Q85504q31030p51997O10856
38274H915593J354409Q86711m23591k290098l614728k593314N17029K629934J641513
$$ plain form
38265 7023458 6215509 4052275 1560514 -1442469 -4525793 -6188832 -6263921 -6677055 -8472168
38256 -8472168 -9802213 -8462596 -5183014 -2738362 -2441983 -2953167 -2357006 -396886 1450423
38247 1450423 1691952 561106 -113295 873314 2489803 2945707 2243607 1849349 2168584
38238 2168584 2267191 2219989 3488204 6057952 7236766 4853830 380381 -2581955 -2045652
38229 -2045652 1211503 5199810 8178069 9401103 9645328 10448302 12025399 12767750 11515999
38220 11515999 9077341 6459998 3129917 -1269617 -4716689 -4602174 -1315196 1952309
38212 1952309 2922414 2146731 1402430 1852628 3699383 5918004 6266601 3324586 -1244916
38203 -1244916 -4237649 -5053402 -6319843 -9591654 -12467046 -11581727 -7150245 -2784795
$$ packed form
38265G023458q07949k163234k491761l002983l083324j663039p5089m13134j795113
38256h472168j330045J339617L279582K444652K96379n11184N96161J960120J847309
38247A450423K41529j130846o74401R86609J616489M55904p02100l94258L19235
38238B168584R8607m7202J268215K569748J178814k382936m473449k962336N36303
38229b045652L257155L988307K978259J223034K44225Q02974J577097P42351j251751
38220A1515999k438658k617343l330081m399534l447072J14515L286978L267505
38212A952309R70105p75683p44301M50198J846755K218621L48597k942015m569502
38203a244916k992733q15753j266441l271811k875392Q85319M431482M365450
$$ plain form
38195 -2784795 -1491078 -3330991 -6479575 -8951327 -9410696 -7877492 -6054835 -5845277
38187 -5845277 -7065495 -7496963 -5654769 -2643036 -570472 178364 1114632 3385130 6389342
38178 6389342 8797881 10010364 10078825 8926277 6592548 4074562 2923433 3554794 4454282
38169 4454282 3612377 693123 -2540901 -4037268 -3536616 -2662799 -2845853 -3446983 -2574192
38160 -2574192 143243 2519730 2311006 42310 -1791741 -1855647 -780575 954243 3873403
38151 3873403 7532767 9669819 8864318 6759715 5975370 6756989 7436318 7373490 7276352
38142 7276352 6893025 4711854 431184 -4073377 -6813844 -7256911 -5573888 -2182033
38134 -2182033 1378915 3089260 2994567 3318230 4924042 5685981 3986129 1716840 1369638
$$ packed form
38195b784795J293717j839913l148584k471752m59369J533204J822657K09558
38187e845277j220218m31468J842194L011733K072564P48836R36268K270498L004212
38178F389342K408539J212483O8461j152548k333729k517986j151129O31361Q99488
38169D454282q41905k919254l234024j496367N00652Q73817j83054o01130Q72791
38160b574192K717435K376487k08724k268696j834051o3906J075072J734818K919160
38151C873403L659364K137052q05501k104603p84345P81619O79329o2828r7138
38142G276352l83327k181171m280670m504561k740467m43067J683023L391855
38134b182033L560948J710345r4693L23663J605812P61939j699852k269289l47202
$$ plain form
38125 1369638 1855964 354407 -2685840 -3949410 -2518331 -1032947 -892872 -51500 2643128
38116 2643128 4350819 2384356 -993949 -1385277 1461085 3685575 3224498 2273256 3305806
38107 3305806 5514443 6495267 5561495 4078728 3666305 4929312 7076265 8385322 8028745
38098 8028745 7467563 8634365 10781599 11176273 9345336 8195103 9657776 11523496
38090 11523496 10642509 7597770 5761362 6621599 8443208 9261850 9031699 8560914 7976616
38081 7976616 6788488 4669153 2094521 591144 1564353 4090632 5045568 2824388
38073 2824388 -149704 -365434 2348322 5390229 7352362 8702073 9075610 7177414
38065 7177414 3807328 1902638 2475451 3142461 2004811 532245 911482 2624631 3585462
$$ packed form
38125A369638M86326j501557l040247j263570J431079J485384J40075Q41372K694628
38116B643128J707691j966463l378305l91328K846362K224490m61077r51242J032550
38107C305806K208637R80824r33772j482767m12423J263007K146953J309057l56577
38098H028745n61182J166802K147234L94674j830937j150233J462673J865720
38090A1523496q80987l044739j836408Q60237J821609Q18642k30151m70785n84298
38081G976616j188128k119335k574632j503377R73209K526279R54936k221180
38073B824388k974092k15730K713756L041907J962133J349711L73537j898196
38065G177414l370086j904690N72813O67010j137650j472566L79237J713149R60831
$$ plain form
38056 3585462 3067848 1674638 -195502 -2013594 -2490904 -1186631 169722 -293945 -2006717
38047 -2006717 -2947041 -2406561 -1222127 -77611 795790 932259 263098 -151906 517855
38038 517855 1499935 1877574 2507752 4662814 7494350 8826814 7996672 6038839 3617425
38029 3617425 828739 -1436521 -2233601 -2397241 -3242671 -3588524 -831209 4594046 8565164
38020 8565164 8102583 4617726 1378461 -5814 608473 3200148 6727991 8655500
38012 8655500 7452762 4675517 2934381 2646166 2250308 719638 -1749127 -4754748
38004 -4754748 -7594666 -8539784 -6051470 -996638 3624560 5603650 5504174 5561678 7128163
37995 7128163 9328722 10042130 8295492 5601667 4393772 5262142 6751326 7898507
$$ packed form
38056C585462n17614j393210j870140j818092m77310J304273J356353m63667j712772
38047b006717r40324N40480J184434J144516Q73401J36469o69161m15004O69761
38038E17855R82080L77639O30178K155062K831536J332464q30142j957833k421414
38029C617425k788686k265260p97080j63640q45430l45853K757315N425255L971118
38020H565164m62581l484857l239265j384275O14287K591675L527843J927509
38012H655500j202738k777245j741136k88215l95858j530670k468765l005621
38004d754748k839918r45118K488314N054832M621198J979090r9476N7504J566485
37995G128163K200559P13408j746638k693825j207895Q68370J489184J147181
$$ plain form
37987 7898507 9341624 11218656 11792021 9793229 6889871 5815088 6671173 7147067 6257217
37978 6257217 5758080 7296273 9854322 11115225 10468392 9625740 10441134 12649955 13884653
37969 13884653 12036803 7678153 3708064 2296898 2832161 3466487 3812048 4931036
37961 4931036 7263954 10020451 12348375 13591633 12534545 8230217 2005462 -3029162
37953 -3029162 -5196581 -5569159 -5435652 -4259950 -1507527 1125874 1449186 16837 -492549
37944 -492549 988058 2767739 3227843 2849740 2642091 2326576 1538711 1647901 4484331
37935 4484331 9444027 13442570 14138427 12190761 9926673 8639064 7792091 6321530
37927 6321530 4044798 1931230 1277767 2381522 3882134 3920174 2290234 901481 1556530
$$ packed form
37987G898507J443117J877032N73365j998792k903358j074783Q56085M75894q89850
37978F257217m99137J538193K558049J260903o46833q42652Q15394K208821J234698
37969A3884653j847850m358650l970089j411166N35263O34326L45561J118988
37961D931036K332918K756497K327924J243258j057088m304328o224755n034624
37953c029162k167419l72578J33507J175702K752423K633401L23312j432349n09386
37944d92549J480607J779681M60104l78103k07649l15515p87865J09190K836430
37935D484331M959696L998543O95857j947666k264088j287609q46973j470561
37927F321530k276732k113568o53463J103755J500612L8040j629940j388753O55049
$$ plain form
37918 1556530 3772854 5582080 6167169 6735118 8693126 11744676 14030971 13653626 10064722
37909 10064722 4689615 353173 -677818 1435908 4493080 6529777 7134924 6639288
37901 6639288 5263103 3689107 3343980 4872139 6807569 6977399 5200378 3647242
37893 3647242 4418966 7538292 11421930 14429791 15492060 13988860 10057434 5192253
37885 5192253 1900412 2049376 5282382 9271131 11816967 12621196 12741320 12571998 11093412
37876 11093412 7369939 2239940 -1985862 -3399325 -1945651 692531 2493228 2694752
37868 2694752 2213480 2356743 3343892 4601226 6162298 8589931 11264743 12035143 9485433
37859 9485433 4855683 903627 -650290 -14530 1531340 2542289 2087840 465504
$$ packed form
37918A556530K216324J809226N85089N67949J958008L051550K286295l77345l588904
37909A0064722n375107m336442j030991K113726L057172K036697O05147m95636
37901F639288j376185j573996l45127J528159J935430J69830j777021j553136
37893C647242P71724L119326L883638L007861J062269j503200l931426m865181
37885E192253l291841J48964L233006L988749K545836Q04229J20124j69322j478586
37876A1093412l723473n129999m225802j413463J453674K638182J800697K01524
37868B694752m81272J43263R87149J257334J561072K427633K674812P70400k549710
37859I485433m629750l952056j553917O35760J545870J010949m54449j622336
$$ plain form
37851 465504 -1063656 -1727204 -1763891 -1119759 1041921 4465735 6782198 6037801 3357707
37842 3357707 1378015 892991 1020845 1799391 3982524 6545579 7216457 5767721 4077964
37833 4077964 2524961 -569515 -4901615 -6980004 -4987107 -1874041 -945640 -989555 806422
37824 806422 3202295 2514891 -885692 -2168470 1235352 6294403 9026688 9203594 8666459
37815 8666459 7821463 6185343 4396232 3220207 1932462 -52637 -1163051 268804
37807 268804 2824346 3580573 2495047 2351160 4069664 5034392 3277593 735966 326662
37798 326662 1667661 2278454 2021676 3353105 6837693 9106602 6871649 1485199 -2419100
37789 -2419100 -2442367 -895860 -1407565 -4355348 -6712468 -5919607 -2684783 331178 1543971
$$ packed form
37851D65504j529160o63548l6687O44132K161680L423814K316463p44397k680094
37842C357707j979692m85024J27854P78546K183133K563055O70878j448736j689757
37833D077964j553003l094476m332100k078389J992897L113066R28401m3915J795977
37824H06422K395873o87404l400583j282778L403822N059051K732285J76906n37135
37815H666459q44996j636120j789111j176025j287745j985099j110414J431855
37807B68804K555542P56227j085526j43887J718504R64728j756799k541627m09304
37798C26662J340999O10793k56778J331429L484588K268909k234953n386450l904299
37789b419100k3267J546507n11705k947783k357120P92861L234824L015961J212793
$$ plain form
37780 1543971 1203483 -245381 -2971448 -6529628 -9210977 -9708634 -8606107 -7062695
37772 -7062695 -4852718 -1406288 1673661 1479371 -2179547 -5652406 -5625049 -2903124 -569999
37763 -569999 234630 692726 1314370 953474 -987531 -3175039 -3694045 -1660424 2570514
37754 2570514 7445037 10313548 9041361 4166465 -1509174 -5699525 -7956301 -8433170
37746 -8433170 -7238590 -5448104 -4725052 -4943686 -4041994 -1462691 202745 -1199636 -3854598
37737 -3854598 -4356230 -2460871 -902505 -1103398 -1788052 -1856114 -1977202 -2682039 -3072781
37728 -3072781 -2352889 -913405 858659 3070801 4728391 3567942 -995457 -6132161
37720 -6132161 -8426276 -7495706 -5346200 -3100597 -231250 3329056 6139455 6681873
$$ packed form
37780A543971l40488j448864k726067l558180k681349m97657J102527J543412
37772g062695K209977L446430L079949j94290l658918l472859K7357K721925K333125
37763e69999Q04629M58096O21644l60896j941005k187508n19006K033621M230938
37754B570514M874523K868511j272187m874896n675639m190351k256776m76869
37746h433170J194580J790486P23052k18634R01692K579303J665436j402381k654962
37737c854598n01632J895359J558366k00893o84654o8062j21088p04837l90742
37728c072781P19892J439484J772064K212142J657590j160449m563399n136704
37720f132161k294115R30570K149506K245603K869347L560306K810399N42418
$$ plain form
37712 6681873 4874902 2066135 149572 279057 1526536 1302464 -1663394 -5136349
37704 -5136349 -5635253 -2689362 872596 2967759 4485422 6635601 8204326 7368207
37696 7368207 5024388 4058886 5511657 7342132 7204998 4892997 1693446 -1139176
37688 -1139176 -2602240 -2059092 -235150 833162 -46455 -1742389 -2376431 -1611974 -301443
37679 -301443 1237477 2971360 3788337 2507583 373759 416765 3542807 7033246 7937017
37670 7937017 6325312 3977988 1566107 -1041275 -3061271 -3701299 -3994581 -5308559
37662 -5308559 -6386420 -4521067 30482 3395195 2801609 -193481 -2345409 -2572019
37654 -2572019 -1637943 180541 2961498 5673756 6963738 7054190 7184504 7418226 6570811
$$ packed form
37712F681873j806971k808767j916563J29485J247479k24072k965858l472955
37704e136349m98904K945891L561958K095163J517663K150179J568725q36119
37696G368207k343819r65502J452771J830475j37134k312001l199551k832622
37688a139176j463064N43148J823942J068312q79617j695934o34042P64457J310531
37679c01443J538920J733883Q16977j280754k133824M3006L126042L490439R03771
37670G937017j611705k347324k411881k607382k019996o40028k93282j313978
37662e308559j077861J865353M551549L364713n93586k995090k151928k26610
37654b572019R34076J818484K780957K712258J289982R0452J30314K33722q47415
$$ plain form
37645 6570811 4256178 1624466 -44195 -472003 -203706 -156025 -923252 -1560617 108048
37636 108048 4377266 7667834 6075327 883942 -2126471 315666 5154111 7612239
37628 7612239 7312972 7497182 9628716 11577891 10963365 8027803 4799815 2973911 2981880
37619 2981880 3850774 3614875 1036249 -2678339 -4894962 -4639562 -3622416 -3740035 -4672968
37610 -4672968 -4744678 -3278450 -1107401 762559 2047634 2892346 3337607 3055849 1419179
37601 1419179 -1685453 -4823117 -5711995 -3862330 -1745710 -1971135 -3729648 -3788650 -1130551
37592 -1130551 1392812 981946 -1297563 -2314955 -1319794 -438452 -1141393 -2526556 -3518346
37583 -3518346 -4607634 -6254999 -7253190 -6314061 -4253712 -2888181 -2337219 -1173436 899294
$$ packed form
37645F570811k314633k631712j668661m27808K68297M7681p67227o37365J668665
37636A08048M269218L290568j592507n191385l010413K442137M838445K458128
37628G612239k99267J84210K131534J949175o14526k935562l227988j825904P969
37619B981880Q68894k35899k578626l714588k216623K55400J017146j17619r32933
37610d672968p1710J466228K171049J869960J285075Q44712M45261k81758j636670
37601A419179l104632l137664q88878J849665K116620k25425j758513n9002K658099
37592a130551K523363m10866k279509j017392R95161Q81342p02941j385163r91790
37583c518346j089288j647365r98191R39129K060349J365531N50962J163783K072730
$$ plain form
37574 899294 2236490 1483792 -707065 -2698172 -3585061 -3424198 -2630466 -1684532 -862885
37565 -862885 -13598 843404 869997 -553777 -2217941 -2044874 -55095 1265383 370230
37556 370230 -1151920 -927383 1087434 3151584 3965072 2791646 -1043350 -6478707 -9718169
37547 -9718169 -7731099 -2349199 1837347 3438081 5071384 8058802 9979791 8969434
37539 8969434 7101809 6983767 7473925 5777654 2134914 -740631 -1946312 -2928432 -4070216
37530 -4070216 -3975539 -2669181 -2605733 -5219911 -8607854 -10074855 -9395279 -8132014 -7080935
37521 -7080935 -6061497 -5412006 -5948472 -7536087 -8929234 -9131590 -8145331 -6459116 -4584720
37512 -4584720 -3120211 -2533682 -2656957 -2843239 -2790105 -2882542 -3617585 -4938496 -6161950
$$ packed form
37574H99294J337196p52698k190857j991107q86889J60863P93732R45934Q21647
37565h62885Q49287Q57002K6593j423774j664164J73067J989779J320478q95153
37556C70230j522150K24537K014817K064150Q13488j173426l834996n435357l239462
37547i718169J987070N381900M186546J600734J633303K987418J920989j010357
37539H969434j867625j18042M90158j696271l642740k875545j205681r82120j141784
37530d070216R4677J306358O3448k614178l387943j467001O79576J263265J051079
37521g080935J019438O49491n36466j587615j393147k02356R86259J686215J874396
37512d584720J464509N86529j23275j86282N3134r2437p35043j320911j223454
$$ plain form
37503 -6161950 -6323855 -4702711 -1493259 1926711 3971065 4521464 5183546 7181834 9316306
37494 9316306 9128964 6267543 3320192 2425097 2358385 669072 -2167966 -3138735 -1243702
37485 -1243702 1015679 1718294 2514212 5473047 8871120 8932091 4966924 89483 -3017794
37476 -3017794 -4538750 -5474710 -5611617 -4537174 -3019720 -2305145 -2922160 -4549426 -6118226
37467 -6118226 -6143522 -4311751 -2515544 -2516268 -2811119 -266857 4901944 8624425 8300992
37458 8300992 5721186 3335630 848423 -2165416 -3339118 -727462 3063751 3754955
37450 3754955 1252484 -1026940 -1753969 -2416468 -2640868 456848 6776638 11190286 9645326
37441 9645326 4550145 1256235 1088684 816140 -2013979 -6149662 -8971744 -9363455 -7673052
$$ packed form
37503f161950j61905J621144L209452L419970K044354N50399O62082J998288K134472
37494I316306j87342k861421k947351q95095o6712j689313k837038r70769J895033
37485a243702K259381P02615P95918K958835L398073O0971l965167m877441l107277
37476c017794j520956r35960j36907J074443J517454P14575o17015j627266j568800
37467f118226k5296J831771J796207p24k94851K544262N168801L722481l23433
37458H300992k579806k385556k487207l013839j173702K611656L791213O91204
37450C754955k502471k279424p27029o62499k24400L097716O319790M413648j544960
37441I645326n095181l293910j67551k72544k830119m135683k822082l91711J690403
$$ plain form
37432 -7673052 -4568398 -995385 1579980 2040392 868421 -15615 846078 2756818 3621364
37423 3621364 2559217 965475 417791 544720 173642 -284593 564463 2450331 3470683
37414 3470683 3015619 2621669 3221442 3454445 1871072 -664846 -2076540 -1565732 59450
37405 59450 1646760 2363620 1963270 1227214 1334244 2151013 2122840 472770 -1600330
37396 -1600330 -2538917 -2052514 -627997 1071709 1752431 342382 -1819787 -1807503 708629
37387 708629 2609159 2320069 2669340 5988191 9276013 8333345 4657187 3258222 4498245
37378 4498245 3542374 -1557065 -6616722 -7956100 -7350038 -7434867 -6453222 -1758538 4295385
37369 4295385 6718663 5027836 3728243 5624927 8292398 8090159 4920485 1661223
$$ packed form
37432g673052L104654L573013K575365M60412j171971q84036Q61693J910740Q64546
37423C621364j062147j593742n47684J26929l71078m58235Q49056J885868J020352
37414C470683m55064l93950N99773K33003j583373k535918j411694N10808J625182
37405E9450J587310P16860m00350p36056J07030Q16769k8173j650070k073100
37396a600330r38587M86403J424517J699706O80722j410049k162169J2284K516132
37387G08629J900530k89090L49271L318851L287822r42668l676158j398965J240023
37378D498245r55871n099439n059657j339378O06062q4829R81645M694684O053923
37369D295385K423278j690827j299593J896684K667471k02239l169674l259262
$$ plain form
37361 1661223 699487 2330337 5374698 8061055 8780906 7036383 3897847 1285530
37353 1285530 480192 909255 383741 -2746852 -7296402 -9839963 -8256027 -4082914 -729564
37344 -729564 -55918 -1492420 -3641149 -5376627 -5776838 -4530405 -2720685 -2121061 -3188030
37335 -3188030 -4339606 -3645575 -953992 1944669 3254994 3175402 3648532 5784547 8015771
37326 8015771 7809128 5017820 2120850 947829 879105 941671 1695776 3605737 5330105
37317 5330105 5693252 6021785 8105726 10722445 10898066 8350053 5945219 5479334 5604471
37308 5604471 4651733 3085453 1977215 1030750 -481868 -2283763 -3799188 -5005304
37300 -5005304 -5547276 -4384252 -1495143 1309005 2454493 2314206 1788736 658616 -1172542
$$ packed form
37361A661223r61736J630850L044361K686357P19851j744523l138536k612317
37353A285530q05338M29063n25514l130593m549550k543561J583936M173113L353350
37344g29564O73646j436502k148729j735478m00211J246433J809720N99624j066969
37335c188030j151576O94031K691583K898661J310325p9592M73130K136015K231224
37326H015771k06643k791308k896970j173021o8724O2566P54105J909961J724368
37317E330105L63147L28533K083941K616719J75621k548013k404834m65885J25137
37308E604471r52738j566280j108238r46465j512618j801895j515425j206116
37300e005304n41972J163024K889109K804148J145488j40287n25470j130120j831158
$$ plain form
37291 -1172542 -2222569 -1196294 724681 1375542 760996 680393 1626290 2255176 1973275
37282 1973275 1901852 2796047 3881251 4466878 5039407 5797387 5551758 3364115 340283
37273 340283 -1501878 -1666736 -1369640 -1507809 -1438480 28063 2956879 5867244 6897340
37264 6897340 5420553 2553837 24798 -1287247 -1477940 -723063 967565 3123425
37256 3123425 4747416 5159734 4378924 2581103 -69425 -2834155 -4551961 -4923958 -4863368
37247 -4863368 -4857305 -3760424 -340377 4381176 7685199 8264816 7671443 8144962 9916444
37238 9916444 11449643 11606279 10348226 7609736 3150656 -1805257 -4271905 -2461116
37230 -2461116 1541957 3871452 3696476 4019897 6978752 10392210 10740796 8155451 6027972
$$ packed form
37291a172542j050027J026275J920975O50861o14546q0603R45897O28886k81901
37282A973275p1423Q94195J085204N85627N72529P57980k45629k187643l023832
37273C40283j842161j64858K97096j38169O9329J466543K928816K910365J030096
37264F897340j476787k866716k529039j312045j90693P54877J690628K155860
37256C123425J623991M12318p80810j797821k650528k764730j717806l71997O0590
37247d863368O063J096881L420047M721553L304023N79617n93373M73519J771482
37238I916444J533199J56636j258053k738490m459080m955913k466648J810789
37230b461116M003073K329495j74976L23421K958855L413458L48586k585345k127479
$$ plain form
37221 6027972 6168577 6911703 6330069 4841605 3541752 2078657 -78847 -1764837 -1587983
37212 -1587983 -492443 -752397 -2569187 -3571549 -2032140 953593 3037114 3155578
37204 3155578 1957099 799650 991978 3017387 5639897 6576013 5035260 3002200
37196 3002200 2956014 4792943 6226658 5938905 4787878 3702934 2136776 -348091 -2339781
37187 -2339781 -2122809 -356229 589846 -47321 -504751 713259 2858826 4649077 6298945
37178 6298945 8304793 9404529 7793600 3982862 543108 -1020653 -1423580 -1508639 -924418
37169 -924418 425485 1357277 1022924 374195 820277 2238090 3338629 3307383 2193393
37160 2193393 438029 -1041623 -1073231 415371 1902457 2089207 1451173 954013 207368
$$ packed form
37221F027972J40605P43126n81634j488464j299853j463095k157504j685990J76854
37212a587983J095540k59954j816790j002362J539409K985733K083521J18464
37204C155578j198479j157449J92328K025409K622510R36116j540753k033060
37196C002200m6186J836929J433715k87753j151027j084944j566158k484867j991690
37187b339781K16972J766580R46075o37167m57430J218010K145567J790251J649868
37178F298945K005848J099736j610929l810738l439754j563761m02927q5059N84221
37169i24418J349903R31792l34353o48729M46082J417813J100539l1246j113990
37160B193393j755364j479652l1608J488602J487086J86750o38034m97160p46645
$$ plain form
37151 207368 -1621613 -3856001 -5071227 -5353245 -5882453 -6453935 -5519944 -3005801 -1014450
37142 -1014450 -887328 -1273074 -245208 1963366 3581989 3762381 3196672 2748528 2487836
37133 2487836 2009359 1193801 679129 1503942 3782486 5909206 5998861 4125136 2092485
37124 2092485 997027 372758 -99787 201998 1257617 1780115 1281480 1171762 2431929
37115 2431929 3694694 3365263 2350257 2579725 3737692 3834448 2632593 2045989 2926838
37106 2926838 3712307 2943803 1274573 98580 -295596 -259258 244316 1178545 1924656
37097 1924656 2191674 2654015 3846504 5160788 5756872 5776809 5833325 6004780 6269810
37088 6269810 7202887 8940181 9871875 7970607 3740359 492311 802077 3426393 4693880
$$ packed form
37151B07368j828981k234388j215226k82018n29208n71482R33991K514143J991351
37142a014450J27122l85746J027866K208574J618623J80392n65709m48144k60692
37133B487836m78477q15558n14672Q24813K278544K126720Q9655j873725k032651
37124B092485j095458o24269m72545L01785J055619N22498m98635j09718J260167
37115B431929J262765l29431j015006K29468J157967R6756j201855n86604Q80849
37106B926838P85469p68504j669230j175993l94176L6338N03574R34229P46111
37097A924656K67018M62341J192489J314284N96084J9937N6516J71455K65030
37088F269810R33077J737294R31694j901268m230248l248048L09766K624316J267487
$$ plain form
37079 4693880 2611377 -1410334 -4856401 -6844062 -7801945 -7439427 -4707861 36462
37071 36462 4272783 5642031 4312170 2238544 752037 -132691 -549124 -223592 869672
37062 869672 2263030 3534058 4409952 4480114 3678352 2922936 3205976 3976435 3554584
37053 3554584 1447049 -806515 -1551930 -885369 -107394 -98340 -751384 -1400530 -1419772 -934762
37043 -934762 -1049329 -2592609 -4638836 -5421936 -4873641 -4745949 -5666492 -5818272 -3779215
37034 -3779215 -1139904 -454592 -1526453 -1846052 -518744 293928 -1556187 -5103414 -7183565
37025 -7183565 -5899295 -2499553 132233 534449 -123735 -103093 260150 -820933 -3443529
37016 -3443529 -5358285 -5231541 -4691928 -5625877 -7108237 -7126122 -6006473 -5462835 -5067716
$$ packed form
37079D693880k082503m021711l446067j987661r57883L62518K731566M744323
37071C6462M236321J369248j329861k073626j486507q84728m16433L25532J093264
37062H69672J393358J271028Q75894P0162q01762p55416K83040P70459m21851
37053C554584k107535k253564p45415O66561P77975R054o53044o49146j9242M85010
37043i34762j14567j543280k046227p83100N48295J27692r20543j51780K039057
37034c779215K639311O85312j071861l19599J327308Q12672j850115l547227k080151
37025g183565J284270L399742K631786M02216o58184K0642L63243j081083k622596
37016c443529j914756J26744N39613r33949j482360j7885J119649N43638L95119
$$ plain form
37007 -5067716 -2829009 749445 2500596 1366846 296407 1790394 4172799 4457166
36999 4457166 2905776 2153363 3002772 3727780 3174578 2289035 2386492 3538701 4930015
36990 4930015 5684300 5319503 4310493 3935154 4586406 4731532 2808972 -308554 -2281522
36981 -2281522 -2456058 -2286988 -2545828 -2017491 352228 3596902 5990350 7029816 7235286
36972 7235286 6928646 6195717 5368202 4665836 3932445 3434313 4138311 6207703 7918085
36963 7918085 7408354 5245401 3846012 4199018 4547141 3001577 326486 -1106156 -622647
36954 -622647 -52458 -1002588 -2694611 -3467268 -3429408 -4012985 -5171962 -4974247 -2622024
36945 -2622024 -84736 647711 506908 1609072 3551168 3919931 2324672 1290862 2483731
$$ packed form
37007e067716K238707L578454J751151j133750j070439J493987K382405K84367
36999D457166j551390p52413Q49409P25008n53202q85543R7457J152209J391314
36990D930015P54285l64797j009010l75339O51252J45126j922560l117526j972968
36981b281522j74536J69070k58840N28337K369719L244674K393448J039466K05470
36972G235286l06640p32929q27515p02366p33391m98132P03998K069392J710382
36963G918085n09731k162953j399389L53006L48123j545564k675091j432642M83509
36954f22647N70189r50130j692023p72657L7860n83577j158977J97715K352223
36945b622024K537288P32447j40803J102164J942096L68763j595259j033810J192869
$$ plain form
36936 2483731 4437299 5219508 5185881 5429616 5415310 4366697 3628003 5098499 8029279
36927 8029279 9914741 10307045 11172524 13217529 14406081 13042200 10251771 8193216
36919 8193216 7410409 7216810 7370414 7977021 8606810 8687362 8127888 6744010 3974732
36910 3974732 111776 -3124845 -4341433 -4031380 -3375548 -2393012 -505999 1921331 4059713
36901 4059713 5960309 7911914 9039320 8227333 6072112 4173105 2742066 835500
36893 835500 -1105110 -1207709 752413 2323342 1533415 -540532 -1572407 -1005127 49850
36884 49850 844423 1486928 2059512 2477937 2807091 2846701 2030260 587862 -12395 1124230
36874 1124230 2803440 3223436 2282054 1139498 257171 -481974 -283318 1851107 4864826
$$ packed form
36936B483731J953568P82209l3627K43735j4306j048613p38694J470496K930780
36927H029279J885462L92304Q65479K045005J188552j363881k790429k058555
36919H193216p82807j93599J53604O06607O29789Q0552n59474j383878k769278
36910C974732l862956l236621j216588L10053O55832R82536J887013K427330K138382
36901D059713J900596J951605J127406q11987k155221j899007j431039j906566
36893H35500j940610j02599J960122J570929p89927k073947j031875N67280J054977
36884D9850P94573O42505N72584M18425L29154L9610q16441j442398o00257J136625
36874A124230J679210M19996r41382j142556q82327p39145J98656K134425L013719
$$ plain form
36865 4864826 6097645 4579077 2271058 1345383 1661096 1752051 1001109 -159174 -1141829
36856 -1141829 -1310896 -141618 1737252 2596509 1801717 1056851 2165914 4354338 5363154
36847 5363154 4626252 3566219 2978826 2154920 908042 405639 986822 892686 -1283257
36838 -1283257 -4022716 -4539569 -2497062 -339421 48204 -632154 -814421 -330575 21634
36829 21634 209778 1031589 2739843 4618967 5941928 6499985 6020077 3965237 588903
36820 588903 -2345496 -2899762 -1154153 722751 1052853 647501 1409625 3330309 4129312
36811 4129312 2194470 -1253728 -3686447 -4053645 -3047075 -1410348 486309 1729075
36803 1729075 1316184 -158671 -886246 -480338 -632197 -2230557 -3514044 -2639778 -740792
$$ packed form
36865D864826J232819j518568k308019r25675L15713R0955p50942j160283r82655
36856a141829j69067J169278J878870Q59257p94792p44866J109063K188424J008816
36847E363154p36902j060033n87393q23906j246878n02403N81183r4136k175943
36838a283257k739459n16853K042507K157641L87625o80358j82267M83846L52209
36829B1634J88144Q21811J708254J879124J322961N58057m79908k054840l376334
36820E88903k934399n54266J745609J876904L30102m05352P62124J920684P99003
36811D129312j934842l448198k432719l67198J006570J636727J896657J242766
36803A729075m12891j474855p27575M05908j51859j598360j283487Q74266J898986
$$ plain form
36794 -740792 -373162 -1677039 -2330275 -1171943 321668 517555 -416809 -1720650 -3402896
36785 -3402896 -5358566 -6543864 -6221376 -5050050 -3979976 -3042234 -2179340 -2199544 -3646122
36776 -3646122 -5493469 -6256835 -5879626 -5358996 -4986597 -4198781 -2910177 -1840893 -1547483
36767 -1547483 -1936057 -2568403 -2785751 -1929591 -205623 1122759 1182826 570995 179083
36758 179083 -210116 -989721 -1305750 -228609 1266224 1410119 455183 283814 1080795
36749 1080795 579635 -2628156 -6808798 -9055672 -8210653 -5104987 -1292255 1613752
36741 1613752 2648976 2501567 2762357 3544065 3203747 1163731 -701148 -759126 -95095
36732 -95095 -577037 -1733220 -1548228 476750 3058448 5295249 7009227 7358537 5484140
$$ packed form
36794g40792L67630j303877o53236J158332J493611J95887r34364j303841j682246
36785c402896j955670j185298L22488J171326J070074R37742Q62894k0204j446578
36776c646122j847347p63366L77209N20630L72399P87816J288604J069284K93410
36767a547483l88574o32346k17348Q56160J723968J328382O0067o11831l91912
36758A79083l89199p79605l16029J077141J494833J43895r54936j71369P96981
36749A080795n01160l207791m180642k246874Q45019L105666L812732K906007
36741A613752J035224j47409K60790P81708l40318k040016j864879n7978O64031
36732i5095m81942j156183J84992K024978K581698K236801J713978L49310j874397
$$ plain form
36723 5484140 2701695 1763389 3272849 4825948 4621280 4024250 5172469 7623426 9257082
36714 9257082 9605866 10261539 12131683 14115498 14904198 14612761 13839350 12249351 9291400
36705 9291400 5792588 3568208 3369168 4204930 4946782 5604586 6441342 6805427 5975554
36696 5975554 4650947 4275202 4953704 5360944 4906651 4586484 5112251 5612403 5232699
36687 5232699 4784003 5253614 5496150 3385235 -716204 -3492054 -2458289 987440 3240634
36678 3240634 2480575 32395 -1844867 -2412738 -2402875 -2275780 -1432030 611752 2871852
36669 2871852 3590242 2433675 1233900 1905615 4039307 5338203 4375330 2180681 848513
36660 848513 1078134 1551671 673256 -1433290 -2971235 -2547064 -805114 409182 176076
$$ packed form
36723E484140k782445r38306J509460J553099k04668n97030J148219K450957J633656
36714I257082L48784O55673J870144J983815P88700k91437p73411j589999k957951
36705I291400l498812k224380j99040Q35762P41852O57804Q36756L64085q29873
36696E975554j324607l75745O78502M07240m54293l20167N25767N00152l79704
36687E232699m48696M69611K42536k110915m101439k775850J033765L445729K253194
36678C240634p60059k448180j877262n67871R863J27095Q43750K043782K260100
36669B871852P18390j156567j199775O71715K133692J298896r62873k194649j332168
36660H48513K29621M73537q78415k106546j537945M24171J741950J214296k33106
$$ plain form
36651 176076 -924103 -2110810 -3107427 -3347346 -1868350 1123134 3648212 4054315 2949633
36642 2949633 1886690 945205 -755223 -2617084 -2698034 -703309 884430 -279181 -3318867
36633 -3318867 -5045805 -3630903 -694437 245921 -2752767 -7960259 -11395061 -10694667
36625 -10694667 -7446784 -5220536 -5566378 -6785873 -6593581 -4944703 -3705658 -4081509
36617 -4081509 -4963120 -3938024 -57840 4443421 5921562 3356301 -182977 -1097346
36609 -1097346 472234 1419608 203914 -1420480 -1420286 -170917 819369 1250383 1777345
36600 1777345 2485253 2962465 3295030 3841254 4367402 4320084 3706496 2989540 2346480 1616963
36590 1616963 775891 29186 -339790 -5010 1123648 2514779 3462824 4034966 4871335
$$ packed form
36651A76076j100179j186707r96617k39919J478996K991484K525078M06103j104682
36642B949633j062943r41485j700428j861861q0950J994725J587739j163611l039686
36633c318867j726938J414902K936466R40358k998688n207492l434802P00394
36625a0694667L247883K226248l45842j219495J92292J648878J239045l75851
36617d081509q81611J025096L880184M501261J478141k565261l539278r14369
36609a097346J569580R47374j215694j624394J94J249369R90286M31014N26962
36600A777345P07908M77212L32565N46224N26148m7318o13588p16956o43060p29517
36590A616963q41072p46705l68976L34780J128658J391131R48045N72142Q36369
$$ plain form
36581 4871335 5976848 6687926 7030808 7897899 9412874 10409281 10221713 9654249 9258330
36572 9258330 8110695 5671219 3516681 3364304 4258939 3824375 1941006 1026177 2442201
36563 2442201 4545414 5015262 3743447 2599171 3216806 5645214 8536602 10218967
36555 10218967 10070488 9054955 8482929 8399882 7949441 7137347 7086294 8333139 9955487
36546 9955487 10808210 10690674 9844505 8316920 6577673 5882621 6875206 8144863 7297083
36537 7297083 3714415 -402867 -2139261 -732209 1968638 3746432 4236281 4651075
36529 4651075 5731464 6770852 6816042 6012065 5165680 4576264 4115479 4090212 5025331
36520 5025331 6563222 7437859 6816046 5141374 3512813 2711044 2891577 3634128 4036221
$$ packed form
36581D871335J105513P11078L42882Q67091J514975R96407j87568n67464l95919
36572I258330j147635k439476k154538j52377Q94635m34564j883369r14829J416024
36563B442201K103213M69848j271815j144276O17635K428408K891388J682365
36555A0218967j48479j015533n72026q3047m50441q12094n1053J246845J622348
36546I955487Q52723j17536q46169j527585j739247o95052R92585J269657q47780
36537G297083l582668m117282j736394J407052K700847J777794M89849M14794
36529D651075J080389J039388M5190q03977q46385n89416m60785k5267R35119
36520E025331J537891Q74637o21813j674672j628561q01769J80533P42551M02093
$$ plain form
36511 4036221 3187067 889857 -2118776 -4583119 -5271935 -3597400 -313501 2644401
36503 2644401 3760569 3388431 3039258 3371968 3651115 3147533 2129176 1198697 489718
36494 489718 -46802 -262769 -250364 -584925 -1508999 -2268550 -1927666 -655524 443705
36485 443705 790720 1011990 1894848 3120867 3593248 2937964 2060781 1942540 2441765
36476 2441765 2869508 3285721 4281163 5641839 6403019 6441301 6775291 7711113 7893044
36467 7893044 6138869 3235023 800841 -781591 -2009176 -2524944 -1321722 1484180
36459 1484180 4422340 6264459 6866071 6530042 5491629 3935159 1816419 -848517
36451 -848517 -2782755 -1645931 3027419 8041990 9801547 8821332 8615206 10291449 11046724
$$ packed form
36511D036221q49154k297210l008633k464343o88816J674535L283899K957902
36503B644401J116168l72138l49173L32710K79147n03582j018357r30479p08979
36494D89718n36520k15967J2405l34561r24074p59551L40884J272142J099229
36485D43705L47015K21270Q82858J226019M72381o55284q77183j18241M99225
36476B441765M27743M16213R95442J360676P61180L8282L33990R35822J81931
36467G893044j754175k903846k434182j582432j227585n15768J203222K805902
36459A484180K938160J842119O01612l36029j038413j556470k118740k664936
36451h48517j934238J136824M673350N014571J759557r80215k06126J676243P55275
$$ plain form
36442 11046724 8633047 4685874 2354164 2648992 4412169 6132382 6526324 4982373
36434 4982373 2782282 2435375 4560221 6843563 7167141 6050163 4753173 3019941
36426 3019941 564842 -1090390 -603655 827385 1491350 2154208 4246746 6234434 5220914
36417 5220914 1915098 534884 3096665 6766893 8006476 6799225 5299636 4430553
36409 4430553 3725711 3159578 3162609 3367432 2867850 1633716 673934 703300 1144594 577055
36399 577055 -1771355 -4809605 -6236463 -5001577 -2692792 -1552043 -1546974 -782227 1336735
36390 1336735 3059976 2851267 1463211 649219 949409 1602536 1795941 1284589 491414
36381 491414 454085 1749884 3020100 1766350 -2573256 -7431927 -9912297 -9645378 -7724874
$$ packed form
36442A1046724k413677l947173k331710K94828J763177J720213L93942j543951
36434D982373k200091l46907K124846K283342L23578j116978j296990j733232
36426C019941k455099j655232M86735J431040O63965O62858K092538J987688j013520
36417E220914l305816j380214K561781L670228J239583j207251j499589q69083
36409D430553p04842n66133L031K04823m99582j234134r59782K9366M41294n67539
36399E77055k348410l038250j426858J234886K308785J140749N069P64747K118962
36390A336735J723241k08709j388056q13992L00190O53127J93405n11352p93175
36381D91414l7329J295799J270216j253750m339606m858671k480370K66919J920504
$$ plain form
36372 -7724874 -4153691 1515897 7457690 9970278 7538441 2985747 350360 452745
36364 452745 840849 -268538 -1541027 -536163 2946862 6645233 8530856 8531632 7541008
36355 7541008 6011824 4098898 2116659 69012 -2291727 -4065642 -3140435 935288
36347 935288 5080402 5819575 3783780 2726092 4176015 5792097 5584532 4865418 5479014
36338 5479014 6640889 6795038 6701873 7890088 9079447 7144803 1742487 -3434425 -4745244
36329 -4745244 -2450921 86505 -29456 -2841387 -5835814 -6302289 -3877794 -645506
36321 -645506 1601340 3311502 5456210 6972088 5795262 2060159 -1671245 -3454568
36313 -3454568 -3548604 -2922565 -2068849 -1595455 -2009509 -2274280 -527149 2858464 4833385
$$ packed form
36372g724874L571183N669588N941793K512588k431837m552694k635387J02385
36364D52745L88104j109387j272489J004864L483025L698371J885623P76r90624
36355G541008j529184j912926j982239k047647k360739j773915R25207M075723
36347I35288M145114P39173k035795j057688J449923J616082k07565p19114O13596
36338E479014J161875J54149r3165J188215J189359j934644n402316n176912j310819
36329d745244K294323K537426j15961k811931k994427m66475K424495L232288
36321f45506K246846J710162K144708J515878j176826l735103l731404j783323
36313c454568r4036O26039Q53716M73394m14054k64771J747131L385613J974921
$$ plain form
36304 4833385 3503774 630812 -1107255 -1548246 -1893906 -1846155 -480579 1023522 405016
36295 405016 -2074615 -3677226 -3118510 -1966133 -1461786 -429774 2297547 5375206 6638943
36286 6638943 5975267 4786456 3613705 2083790 514572 -349471 -980757 -2629575 -5077305
36277 -5077305 -6446672 -5696896 -3900519 -2413707 -1102097 617693 2017797 1763643
36269 1763643 49331 -1326977 -1319258 -1062292 -2205159 -4297507 -4862881 -2394213 1518601
36260 1518601 3980865 4432993 5198874 7943455 10878502 10746784 6887808 1923412 -1235357
36251 -1235357 -1585760 459886 3763297 6234652 5911638 3402995 1800981 2960288
36243 2960288 5183506 5912944 5273883 5049383 5301189 4556399 3065654 3250055 6232476
$$ packed form
36304D833385j329611k872962j738067m40991l45660M7751J365576J504101o18506
36295D05016k479631j602611N58716J152377N04347J032012K727321L077659J263737
36286F638943o63676j188811j172751j529915j569218q64043o31286j648818k447730
36277e077305j369367P49776J796377J486812J311610J719790J400104k54154
36269A763643j714312j376308P719K56966j142867k092348n65374K468668L912814
36260A518601K462264M52128P65881K744581K935047j31718l858976m964396l158769
36251a235357l50403K045646L303411K471355l23014k508643j602014J159307
36243B960288K223218P29438o39061k24500K51806p44790j490745J84401K982421
$$ plain form
36234 6232476 9928039 11589813 10836283 9223267 8013766 7371149 6877071 5954582 4430567
36225 4430567 3253473 3794296 5835037 7308630 6913840 5926822 6200169 7281109 7170796
36216 7170796 5551800 4444472 5349603 7243511 8107099 7286288 5414214 2949896 216046
36207 216046 -1406226 15015 4502944 9240124 11214074 10348170 8906903 8172205 7326297
36198 7326297 5850229 5091227 6195741 7940575 8379138 7726339 7643715 8199598 7759867
36189 7759867 5902238 4196792 3587478 3101928 2070585 1763115 3582220 7037940 10631578
36180 10631578 13449181 14895533 14426116 12921071 12846621 15311538 18078870 18300064 16327658
36171 16327658 14954835 15572255 17046635 18050326 18611571 19387772 20956195 23781733
$$ packed form
36234F232476L695563J661774p53530j613016j209501o42617m94078r22489j524015
36225D430567j177094N40823K040741J473593l94790r87018K73347J080940j10313
36216G170796j618996j107328R05131J893908Q63588q20811j872074k464318k733850
36207B16046j622272J421241M487929M737180J973950q65904j441267p34698q45908
36198G326297j476068p59002J104514J744834M38563o52799q2624N55883m39731
36189G759867j857629j705446o09314m85550j031343l07470J819105L455720L593638
36180A0631578K817603J446352m69417j505045p4450K464917K767332K21194j972406
36171A6327658j372823O17420J474380J003691N61245P76201J568423K825538
$$ plain form
36163 23781733 27560015 30828240 32550173 33658328 35536818 37570322 38149939 37757990
36155 37757990 38752521 41890298 45295424 47497579 49526790 53184678 58965560 66555721
36147 66555721 75753739 85841850 95458299 104283470 113822382 125506929 138951380 153048498
36139 153048498 167990012 185204614 205662212 228747786 252455058 274631882 294546166
36132 294546166 312713537 328008388 335738039 330976707 314054405 290459735 264898003
36125 264898003 238123390 210452975 184899116 164165062 146919307 130219651 114290247
36118 114290247 101850750 93505236 86816441 79780609 72530360 65493272 58450141 52008115
36110 52008115 47820288 46389164 46089645 45019151 42648124 39322509 35427737 31497063
$$ packed form
36163B3781733L778282L268225J721933J108155J878490K033504N79617l91949
36155C7757990R94531L137777L405126K202155K029211L657888N780882P590161
36147F6555721R198018J0088111R616449Q825171R538912J1684547J3444451J4097118
36139A53048498J4941514J7214602K0457598K3085574K3707272K2176824J9914284
36132B94546166J8167371J5294851P729651m761332j6922302k3594670k5561732
36125B64898003k6774613k7670415k5553859k0734054j7245755j6699656j5929404
36118A14290247j2439497q345514o688795p035832p250249p037088p043131o442026
36110E2008115m187827j431124k99519j070494k371027l325615l894772l930674
$$ plain form
36102 31497063 28150790 25676319 24394903 24994227 27183014 28546749 26721700 22730576
36094 22730576 20122627 20429600 21482778 20856239 18909561 17333349 16512584 15785463 14970249
36085 14970249 14184695 13151547 11958973 11576526 12343243 12787192 11305978 8452914 6349835
36076 6349835 6278833 7839709 9869832 11078702 10371053 7870771 5350257 4463105 4736592
36067 4736592 4389618 2906000 1571499 1455218 2078908 2438629 2421066 2686155 3627415
36058 3627415 4823572 5375322 4813823 3845006 3865160 5353947 7176060 8076835 8410436
36049 8410436 9432576 11027987 11252306 8593587 4101669 732718 593440 2924289
36041 2924289 4874367 4487571 2839927 2655694 4793322 7134626 7467756 6277780 5544094
$$ packed form
36102C1497063l346273k474471j281416N99324K188787J363735j825049l991124
36094B2730576k607949L06973J053178o26539j946678j576212q20765p27121q15214
36085A4970249p85554j033148j192574l82447P66717M43949j481214k853064k103079
36076F349835p1002J560876K030123J208870p07649k500282k520514q87152K73487
36067D736592l46974j483618j334501j16281O23690L59721j7563K65089R41260
36058C627415J196157N51750n61499r68817K0154J488787J822113R00775L33601
36049H410436J022140J595411K24319k658719m491918l368951j39278K330849
36041B924289J950078l86796j647644j84233K137628K341304L33130j189976p33686
$$ plain form
36032 5544094 5773382 5908748 5682775 6071219 7167944 7385487 5528152 2418838 -259056
36023 -259056 -1690245 -1833543 -717957 1174854 2590663 2603606 1675213 919079 740891
36014 740891 833563 994236 1181580 1174424 972781 1249894 2604814 4498941 5657400 5516085
36004 5516085 4696510 4050376 3754270 3438721 2854143 2275873 2306474 3159275 4161261
35995 4161261 4346155 3573416 2461566 1077609 -1388829 -5045481 -8239775 -9111265 -7836478
35986 -7836478 -6414168 -6410470 -7670092 -8999478 -9298536 -8209936 -6486658 -5569849 -5962858
35977 -5962858 -6171608 -4202377 -128526 3685493 4958873 3356470 155019 -2920286
35969 -2920286 -4485730 -4195996 -3002696 -2109369 -1731445 -1569671 -1974590 -3269257 -4245044
$$ packed form
36032E544094K29288J35366k25973L88444J096725K17543j857335l109314k677894
36023b59056j431189j43298J115586J892811J415809J2943r28393p56134j78188
36014G40891R2672J60673J87344p156k01643K77113J354920J894127J158459j41315
36004E516085q19575o46134k96106l15549n84578n78270L0601Q52801J001986
35995D161261J84894p72739j111850j383957k466438l656652l194294q71490J274787
35986g836478J422310L698j259622j329386k99058J088600J723278R16809l93009
35977e962858k08750J969231M073851L814019J273380j602403l201451l075305
35969b920286j565444K89734J193300Q93327L77924J61774m04919j294667r75787
$$ plain form
35960 -4245044 -3169063 -429662 1746921 2587946 3590949 5287909 5734300 3890516
35952 3890516 2202061 3366503 6203279 7535074 7043879 7153896 8569561 9225976 8065497
35943 8065497 6816952 6919819 7155391 5797842 3295468 1397761 1003991 2008355 3889653
35934 3889653 5360203 4901944 2953126 2206673 4290821 7362330 8524841 7480946
35926 7480946 6037788 5033975 3917967 2856894 2966639 4244508 5151466 4749533 3811532
35917 3811532 3302090 3022317 2448500 2040767 2993918 5909541 9765729 12002407 10325784
35908 10325784 5412188 1244370 1294392 4560892 6975726 6709064 6108694 7796161 10863383
35899 10863383 12350379 11099990 8476745 6086578 4494295 3896547 4438870 5560692
$$ packed form
35960d245044J075981K739401K176583Q41025J003003J696960M46391j843784
35952C890516j688455J164442K836776J331795m91195J10017J415665O56415j160479
35943H065497j248545J02867K35572j357549k502374j897707l93770J004364J881298
35934C889653J470550m58259j948818p46453K084148L071509J162511j043895
35926G480946j443158j003813j116008j061073J09745J277869R06958m01933r38001
35917C811532n09442k79773n73817m07733R53151K915623L856188K236678j676623
35908A0325784m913596m167818N0022L266500K414834k66662o00370J687467L067222
35899A0863383J486996j250389k623245k390167j592283n97748N42323J121822
$$ plain form
35891 5560692 6092621 5411300 3925243 2326062 981100 136197 -10379 228080 21974
35882 21974 -1030173 -2166855 -2135760 -714703 689517 294493 -2085877 -4579005 -5102697
35873 -5102697 -3565963 -1791085 -1278116 -1688634 -1832947 -1492367 -1467442 -1971265 -1880171
35864 -1880171 -157511 2318281 3195619 1343396 -1470946 -2519588 -1563175 -1025772 -2265611
35855 -2265611 -3287378 -1648468 1618269 3306187 2790748 2735670 4591072 6244126 5629703
35846 5629703 4133774 4057000 4639223 3633589 1709351 1772107 3891010 4432319 1481710
35837 1481710 -1779393 -1200434 2755764 5892509 5673158 3425632 1531685 638661 133671
35828 133671 -269314 -407458 -338625 -252538 64259 1104952 2881992 4458047 4425592 2136610
$$ packed form
35891E560692N31929o81321j486057j599181j344962q44903j46576K38459k06106
35882B1974j052147j136682L1095J421057J404220l95024k380370k493128n23692
35873e102697J536734J774878N12969m10518j44313L40580K4925n03823R1094
35864a880171J722660K475792Q77338j852223k814342j048642R56413N37403j239839
35855b265611j021767J638910L266737J687918n15439n5078J855402J653054o14423
35846E629703j495929p6774N82223j005634j924238O2756K118903N41309k950609
35837A481710l261103N78959L956198L136745k19351k247526j893947q93024n04990
35828A33671m02985j38144O8833Q6087L16797J040693J777040J576055l2455k288982
$$ plain form
35818 2136610 -1402960 -4143371 -4811287 -4003534 -3260440 -3295727 -3507029 -3066496 -1991256
35809 -1991256 -998187 -593685 -561202 -372422 39475 219446 81711 460200 2122577
35800 2122577 4360082 5426106 4583417 2809409 1053046 -1096089 -4010440 -6240941
35792 -6240941 -5760728 -2838498 -97825 684090 529643 1314588 2962498 3711922 2717517
35783 2717517 1269630 1258429 3022752 5012497 5447435 4194073 2883332 3054385 4472672
35774 4472672 5762493 6403607 7121132 8176662 8461566 7008927 4509995 2385583 987826
35765 987826 -302271 -1775571 -3325216 -5148509 -7100282 -7649756 -5236252 -915237
35757 -915237 2071056 2070361 862812 833292 1855350 2400982 2387605 2849664 3438749 2605405
$$ packed form
35818B136610l539570k740411o67916Q07753P43094l5287k11302M40533J075240
35809a991256R93069M04502L2483J88780M11897J79971j37735L78489J662377
35800B122577K237505J066024q42689j774008j756363k149135k914351k230501
35792f240941M80213K922230K740673P81915j54447P84945J647910P49424r94405
35783B717517j447887j1201J764323J989745M34938j253362j310741J71053J418287
35774D472672J289821O41114P17525J055530K84904j452639k498932k124412j397757
35765I87826j290097j473300j549645j823293j951773n49474K413504M321015
35757i15237K986293o95j207549k9520J022058N45632j3377M62059N89085q33344
$$ plain form
35747 2605405 499927 -455759 1135703 3340463 3189670 330826 -2943206 -4758855
35739 -4758855 -5341247 -5627727 -5473791 -3905106 -648813 3173155 5846220 6339808 4851752
35730 4851752 2347858 -215214 -2213436 -3258552 -3233175 -2474043 -1574864 -860623 -303247
35721 -303247 -38666 -594510 -2307723 -4699702 -6723877 -7665266 -7755394 -7898058 -8590489
35712 -8590489 -8915193 -6979246 -2018550 4057161 8053750 8549653 6723054 4056955
35704 4056955 642937 -3410451 -6350060 -6374456 -4280043 -2607107 -2144061 -1137658 1598461
35695 1598461 4654208 6051225 5637727 4091211 1073177 -3504039 -7236352 -6883503
35687 -6883503 -2588476 1747818 3160433 2836423 3414736 4770591 4503992 1824779 -1239693
$$ packed form
35747B605405k105478r55686J591462K204760j50793k858844l274032j815649
35739d758855n82392k86480J53936J568685L256293L821968K673065M93588j488056
35730D851752k503894k563072j998222j045116K5377P59132Q99179P14241N57376
35721c03247K64581n55844j713213k391979k024175r41389r0128j42664o92431
35712h590489l24704J935947M960696O075711L996589M95903j826599k666099
35704D056955l414018m053388k939609k4396K094413J672936M63046J006403K736119
35695A598461L055747J397017m13498j546516l018034m577216l732313L52849
35687f883503M295027M336294J412615l24010N78313J355855k66599k679213l064472
$$ plain form
35678 -1239693 -2671118 -2777352 -3081334 -4066532 -4738800 -3778426 -731473 3347446 6252222
35669 6252222 6382773 4379315 2262221 906169 -512631 -2395142 -3630854 -3418902
35661 -3418902 -2681500 -2467871 -2313921 -1726465 -2019067 -4565260 -7994304 -9480712 -8607826
35652 -8607826 -7611165 -7651099 -7287342 -5343346 -3016385 -1970509 -2133771 -2587095 -3019232
35643 -3019232 -3073020 -1860823 419184 1839102 1290937 357021 955799 2418323 2871107
35634 2871107 2389531 2443715 2893221 2007057 -637784 -3491259 -5381600 -6559994 -7250075
35625 -7250075 -7120941 -6540726 -6493325 -6764826 -5921031 -3619157 -1345650 -339865 -342565
35616 -342565 -850062 -1856487 -2698491 -1994087 254375 2051884 1928289 619094 -718604
$$ packed form
35678a239693j431425j06234l03982r85198o72268R60374L046953M078919K904776
35669F252222J30551k003458k117094j356052j418800j882511j235712K11952
35661c418902P37402K13629J53950N87456k92602k546193l429044j486408Q72886
35652h607826R96661l9934L63757J943996K326961J045876j63262m53324m32137
35643c019232n3788J212197K280007J419918n48165r33916N98778J462524M52784
35634B871107m81576N4184M49506q86164k644841k853475j890341j178394o90081
35625g250075J29134N80215M7401k71501Q43795K301874K273507J005785k700
35616c42565n07497j006425q42004P04404K248462J797509j23595j309195j337698
$$ plain form
35607 -718604 -2299274 -4379563 -5694206 -5007801 -3251636 -2405862 -2833584 -3128597 -2096925
35598 -2096925 327071 3560608 6537633 7874479 7031573 5020301 3208529 2019096
35590 2019096 1448169 1836536 3149098 4533441 5664378 7334342 9449216 9853195 6943098
35581 6943098 2300409 -1233424 -3037691 -4153029 -4437893 -3064308 -1134791 -652406
35573 -652406 -940908 757541 4713388 7864109 8342112 7734222 7574744 6753126 4411647
35564 4411647 2565656 3088552 4179878 2901553 -83346 -1406978 -9647 1694075
35556 1694075 1631251 352184 -978526 -2462885 -4271663 -5313622 -4472611 -2317883 -529233
35547 -529233 641 -151296 61765 839987 1198043 27882 -2357428 -4133026 -3841712
$$ packed form
35607g18604j580670k080289j314643O86405J756165Q45774m27722k95013J031672
35598b096925K423996L233537K977025J336846q42906k011272j811772j189433
35590B019096n70927L88367J312562J384343J130937J669964K114874M03979k910097
35581F943098m642689l533833j804267j115338k84864J373585J929517M82385
35573f52406k88502J698449L955847L150721M78003o07890j59478q21618k341479
35564D411647j845991N22896J091326j278325k984899j323632J397331J703722
35556A694075o2824j279067j330710j484359j808778j041959Q41011K154728J788650
35547e29233N29874j51937K13061P78222L58056j170161k385310j775598K91314
$$ plain form
35538 -3841712 -1943585 47142 1384026 2165359 2135175 760646 -1463544 -3037065 -3190674
35529 -3190674 -2708525 -2609343 -2791570 -2505557 -1582092 -615750 -231933 -599500 -1482185 -2431114
35519 -2431114 -2955617 -2674400 -1421390 569515 2473205 3246057 2656307 1816495 2224709
35510 2224709 4165321 6181219 6060687 2468310 -3752486 -9557453 -11645190 -9165045
35502 -9165045 -4311513 46050 2751855 4115531 4474094 4113932 3751681 3654453 2844169
35493 2844169 728180 -953087 241311 3856115 6612158 6589789 5446726 5609686 7031908
35484 7031908 8018251 7835245 6937962 5542116 3544027 1394279 -245256 -1451473 -2667074
35475 -2667074 -3693571 -3915091 -3221378 -2047377 -940810 -585917 -1417911 -2512783 -1950393
$$ packed form
35538c841712J898127J990727J336884P81333l0184j374529k224190j573521j53609
35529c190674M82149R9182j82227K86013R23465R66342L83817l67567q82685r48929
35519b431114n24503K81217J253010J990905J903690P72852n89750q39812M08214
35510B224709J940612K015898j20532l592377o220796n804967k087737K480145
35502i165045M853532M357563K705805J363676L58563l60162l62251r7228q10284
35493B844169k115989j681267J194398L614804K756043k2369j143063J62960J422222
35484G031908R86343j83006q97283j395846j998089k149748j639535j206217j215601
35475b667074j026497k21520O93713J174001J106567L54893q31994j094872N62390
$$ plain form
35466 -1950393 612521 2772382 2151319 -609609 -3171256 -4785458 -6258571 -7470533
35458 -7470533 -7465829 -6766931 -6933930 -7604987 -6701839 -4224018 -3009167 -4458912 -6180348
35449 -6180348 -5653131 -3804164 -2714718 -2019304 -451511 773189 -399970 -2638810
35441 -2638810 -2205890 1700390 5729452 7018179 6128774 4598138 2599172 518911
35433 518911 100403 1821649 3164971 1870533 -562733 -1028463 665205 1982215 1682609
35424 1682609 947551 520368 -656936 -3276504 -6194343 -8032821 -8702749 -8566865 -7595665
35415 -7595665 -6249733 -5782407 -6526639 -6993477 -5800612 -3506624 -1408061 385333 2176027
35406 2176027 2931414 1342993 -1614891 -3250448 -2670776 -1909296 -2720997 -3880466 -3072463
$$ packed form
35466a950393K562914K159861o21063k760928k561647j614202j473113j211962
35458g470533M704O98898j66999o71057R03148K477821J214851j449745j721436
35449f180348N27217J848967J089446O95414J567793J224700j173159k238840
35441b638810M32920L906280M029062J288727q89405j530636j998966k080261
35433E18911m18508J721246J343322j294438k433266m65730J693668J317010k99606
35424A682609p35058m27183j177304k619568k917839j838478o69928J35884R71200
35415g595665J345932M67326p44232m66838J192865K293988K098563J793394J790694
35406B176027P55387j588421k957884j635557N79672P61480q11701j159469Q08003
$$ plain form
35397 -3072463 -402408 1727419 1959731 1556244 2272722 3935945 4927024 4338436 2770172
35388 2770172 1288613 410524 141567 342412 726948 819165 267537 -756040 -1504423
35379 -1504423 -1059013 908711 3472332 4803175 3785763 1319946 -546400 -867440
35371 -867440 -513858 -475762 -420212 404230 1725489 2807447 3832810 5345294 6619509
35362 6619509 6281115 4810605 4672865 7009331 9598608 9481120 6742437 4220328 3921498
35353 3921498 5218827 6522959 7290842 7927353 8650052 9012877 8186739 5658747 2106737
35344 2106737 -630607 -1198816 -197332 803176 1407529 2314144 3202389 2458464 -291671
35335 -291671 -2873637 -2934284 -597287 2335695 4808505 6745756 7673456 6841903 4585250
$$ packed form
35397c072463K670055K129827K32312m03487P16478J663223R91079n88588j568264
35388B770172j481559q78089k68957K00845L84536R2217n51628j023577p48383
35379a504423M45410J967724K563621J330843j017412k465817j866346l21040
35371h67440L53582L8096N5550Q24442J321259J081958J025363J512484J274215
35362F619509l38394j470510j37740K336466K589277j17488k738683k522109k98830
35353C921498J297329J304132P67883O36511P22699L62825q26138k527992l552010
35344B106737k737344n68209J001484J000508O04353R06615Q88245p43925k750135
35335b91671k581966o0647K336997K932982K472810J937251R27700q31553k256653
$$ plain form
35326 4585250 2174050 359843 -775154 -822559 582828 2473335 3306091 3239308 3948920
35317 3948920 5724814 6587434 5195180 2916905 1756421 1695909 1566860 1271556 1479118
35308 1479118 2138077 2906385 3979490 4760755 3109494 -1593750 -5799019 -5485984 -2112958
35299 -2112958 -1223403 -4715045 -8343279 -8188974 -5684226 -3869798 -2342777 491586
35291 491586 2894476 1928741 -1235337 -2465542 -690788 1254651 1885723 3079127 5881965
35282 5881965 8024416 7348198 4859657 2587531 809892 -818414 -1562426 -934317 54310
35273 54310 637341 1495864 2600336 1928625 -1527994 -5314225 -6514757 -5721005 -5418447
35264 -5418447 -5702766 -4533683 -1524408 1510067 3633055 5672923 7835185 8894898
$$ packed form
35326D585250k411200j814207j134997m7405J405387J890507Q32756o6783P09612
35317C948920J775894Q62620j392254k278275j160484o0512j29049k95304K07562
35308A479118O58959P68308J073105P81265j651261m703244m205269L13035L373026
35299b112958Q89555l491642l628234J54305K504748J814428J527021K834363
35291D91586K402890r65735l164078j230205J774754J945439O31072J193404K802838
35282E881965K142451o76218k488541k272126j777639j628306p44012O28109R88627
35273E4310N83031Q58523J104472o71711l456619l786231j200532P93752L02558
35264e418447k84319J169083L009275L034475K122988K039868K162262J059713
$$ plain form
35256 8894898 8238220 6641460 4587256 1727094 -1504696 -3529890 -3488487 -2101665 -408283
35247 -408283 1028108 1685764 1431835 1250568 1963702 2425766 959508 -1614518 -2748524
35238 -2748524 -1996402 -1416776 -1816808 -1557277 10519 951041 89542 -815955 -104976
35229 -104976 1087484 1240493 1200132 2162843 3086085 2797802 2739796 4528498 6341843
35220 6341843 5197455 1916130 254918 1370006 2611261 2115885 1286823 1778614 2895627
35211 2895627 3386017 3598130 4306601 4975799 4610545 3291064 1856766 925000 819656
35202 819656 1468112 1915707 1146437 -69675 555392 3913738 7924662 9693193 8396272
35193 8396272 5390319 2439788 693855 621256 1921040 3697940 5226138 6338670
$$ packed form
35256H894898o56678j596760k054204k860162l231790k025194M1403J386822J693382
35247d08283J436391O57656k53929j81267P13134M62064j466258k574026j134006
35238b748524P52122N79626m00032K59531J567796R40522q61499r05497P10979
35229a04976J192460J53009m0361R62711R23242k88283n8006J788702J813345
35220F341843j144388l281325j661212J115088J241255m95376q29062M91791J117013
35211B895627M90390K12113P08471O69198l65254j319481j434298r31766j05344
35202H19656O48456M47595p69270j216112O25067L358346M010924J768531j296921
35193H396272l005953k950531j745933p2599J299784J776900J528198J112532
$$ plain form
35185 6338670 7007572 7133941 6865970 6433330 5579874 3978658 2292545 1800100 2680497
35176 2680497 3682892 3907216 3940382 4731693 6263848 7898407 9152608 9474959 8095409
35167 8095409 5036791 1885317 710566 2074712 4282241 4673347 2079160 -1547002
35159 -1547002 -2443040 1161677 6926797 11004834 12143434 11785101 10799031 8499121 5124911
35150 5124911 2754769 2544106 2924315 1912970 -222051 -1816328 -1903076 -229718 3246255
35141 3246255 7250005 8954619 6863820 3131197 1151373 1421645 1544072 -194089
35133 -194089 -3131736 -5848265 -7517391 -7513070 -5480236 -2398599 -255729 41147 -415410
35124 -415410 -184544 692245 1061174 419684 -240415 560718 3038516 5647956 6665597
$$ packed form
35185F338670O68902J26369k67971m32640q53456j601216j686113m92445Q80397
35176B680497J002395K24324L3166P91311J532155J634559J254201L22351j379550
35167H095409l058618l151474j174751J364146K207529L91106k594187l626162
35159a547002q96038L604717N765120M078037J138600l58333r86070k299910l374210
35150E124911k370142k10663L80209j011345k135021j594277q6748J673358L475973
35141C246255M003750J704614k090799l732623j979824K70272J22427j738161
35133a94089k937647k716529j669126M321K032834L081637K142870K96876m56557
35124d15410K30866Q76789L68929o41490o60099Q01133K477798K609440J017641
$$ plain form
35115 6665597 6010568 4837027 3655960 2081223 316596 -857431 -1932152 -4400098
35107 -4400098 -7658756 -8484646 -5467265 -2014823 -2426332 -6275646 -9380469 -9455985 -7949668
35098 -7949668 -6734851 -6024698 -5758624 -6237980 -6724910 -5758835 -3525311 -1787993 -988271
35089 -988271 261880 2199858 3011347 1954749 833065 880678 629042 -1168148 -2657565
35080 -2657565 -1437043 1490950 2905562 1652011 -633875 -2481569 -3876161 -4816344
35072 -4816344 -4941330 -4866013 -5783160 -7112842 -6392926 -2519741 2267929 4771631 4240884
35063 4240884 2294220 280168 -1750451 -3634364 -4362886 -3576890 -2716064 -3399428 -5060875
35054 -5060875 -5575568 -4324180 -3155848 -3652090 -4824082 -4715675 -3176658 -1450269 247064
$$ packed form
35115F665597o55029j173541j181067j574737j764627j174027j074721k467946
35107d400098l258658q25890L017381L452442m11509l849314l104823p5516J506317
35098g949668J214817P10153K66074m79356m86930R66075K233524J737318P99722
35089i88271J250151J937978Q11489j056598j121684M7613k51636j797190j489417
35080b657565J220522K927993J414612j253551k285886j847694j394592r40183
35072d816344j24986P5317r17147j329682P19916L873185M787670K503702n30747
35063D240884j946664k014052k030619j883913p28522P85996Q60826o83364j661447
35054e060875n14693J251388J168332m96242j171992J08407J539017J726389J697333
$$ plain form
35045 247064 2822799 6145529 8567237 8816324 6985730 3698454 -95787 -2558208
35037 -2558208 -2251442 -462325 -289156 -2670376 -5105408 -5114148 -3113370 -868054 1002353
35028 1002353 2623096 3665275 4043553 4376252 4408099 2601288 -1137491 -4029710 -3675019
35019 -3675019 -1239947 664301 1728174 3019910 3689733 1839373 -1776696 -4105106
35011 -4105106 -4049198 -3517388 -3779460 -3675357 -2534601 -2244031 -4542085 -7929459 -9236387
35002 -9236387 -7496428 -4704228 -3029947 -2548468 -1989706 -1052437 -1213899 -3748084 -7276844
34993 -7276844 -8568224 -6273986 -2492056 359199 2558935 5253101 7353548 7157506
34985 7157506 6141482 7665386 11722800 14333583 13050899 9962559 7829993 6246454
$$ packed form
35045B47064K575735L322730K421708K49087j830594l287276l794241k462421
35037b558208L06766J789117J73169k381220k435032q740K000778K245316J870407
35028A002353J620743J042179L78278L32699L1847j806811l738779k892219L54691
35019c675019K435072J904248J063873J291736O69823j850360l616069k328410
35011d105106N5908N31810k62072J04103J140756K90570k298054l387374j306928
35002i236387J739959K792200J674281M81479N58762R37269j61462k534185l528760
34993g276844j291380K294238L781930K851255K199736K694166K100447j96042
34985G157506j016024J523904M057414K610783j282684l088340k132566j583539
$$ plain form
34977 6246454 3793968 1571698 1785758 4181072 6426078 7298781 7325290 6815937 5398134
34968 5398134 3436101 2197758 2401937 3669928 5282052 6478230 6305482 4304464
34960 4304464 1308209 -1229735 -2505469 -2389816 -844353 1666492 3643012 3637618 1885678
34951 1885678 55780 -587737 -198145 279665 175770 -365814 -646820 -436416 -579468
34942 -579468 -1744068 -2680856 -1237069 2476991 5669229 6508199 6316042 6668949 6253404
34933 6253404 3046379 -1538769 -3505874 -1170858 3018677 5617399 5231838 2502880
34925 2502880 -878466 -2856514 -2580606 -1681660 -2392255 -4311410 -4921069 -3397831 -1513313
34916 -1513313 -153117 2338108 6746708 10201265 9181507 4198617 -658389 -2313070
$$ packed form
34977F246454k452486k222270K14060K395314K245006Q72703K6509n09353j417803
34968E398134j962033j238343K04179J267991J612124J196178j72748k001018
34960D304464k996255k537944j275734J15653J545463K510845J976520n394j751940
34951A885678j829898o43517L89592M77810j03895n41584k81006K10404j43052
34942e79468j164600r36788J443787L714060L192238Q38970j92157L52907m15545
34933F253404l207025m585148j967105K335016M189535K598722l85561k728958
34925B502880l381346j978048K75908Q98946p10595j919155o09659J523238J884518
34916a513313J360196K491225M408600L454557j019758m982890m857006j654681
$$ plain form
34908 -2313070 -1135120 711966 1550087 835059 -890282 -2212108 -1890569 -49328 2050562
34899 2050562 3279963 3241061 2022521 159925 -1321256 -1574190 -683992 630151 1781327
34890 1781327 2302649 1562147 -598670 -3053142 -4095449 -3186322 -1498012 -584448 -849283
34881 -849283 -1366348 -956882 536133 1971601 2211759 1779772 2525759 5163615 7861365
34872 7861365 8138078 5708077 2546186 528900 35726 510000 1006477 147616 -2918441
34863 -2918441 -6853402 -8582375 -6324021 -1491105 3099257 6102499 7816940 8218532
34855 8218532 6298811 1560610 -4772929 -10447388 -13630651 -13639926 -11005632 -7357787 -4798866
34846 -4798866 -4533623 -5788789 -6415651 -4981879 -2263137 -338263 -208346 -893035 -1196995
$$ packed form
34908b313070J177950J847086Q38121p15028j725341j321826L21539J841241K099890
34899B050562J229401l8902j218540j862596j481181k52934Q90198J314143J151176
34890A781327N21322p40502k160817k454472j042307R09127J688310R13564k64835
34881h49283n17065M09466J493015J435468K40158m31987P45987K637856K697750
34872G861365K76713k430001l161891k017286m93174M74274M96477q58861l066057
34863b918441l934961j728973K258354M832916M590362L003242J714441M01592
34855H218532j919721m738201o333539n674459l183263r275K634294L647845K558921
34846d798866K65243j255166o26862J433772K718742J924874J29917o84689l03960
$$ plain form
34837 -1196995 -1563411 -3095991 -5079779 -4985211 -1442519 3927770 8316293 10305820 9906218
34828 9906218 7366534 3504705 390584 -179105 1243295 2688450 3480602 4301134 4885016
34819 4885016 4050699 2356842 2083257 3479355 3671193 1157090 -1096469 145861 2913091
34810 2913091 2307477 -2390129 -6489156 -6100521 -2369361 1320244 3261250 3027395 17195
34801 17195 -5084034 -9056863 -8943374 -5486860 -1969941 -247982 369445 889421 1220738
34792 1220738 980016 170571 -1148842 -2744130 -3645368 -2738239 -177568 2429903 3359916
34783 3359916 1992850 -848968 -3207915 -3208176 -833238 1859703 2984433 2756013 2512305
34774 2512305 2737033 3234473 4388570 6527989 8393148 8020178 5298978 2245163 627603
$$ packed form
34837a196995l66416j532580j983788R4568L542692N370289M388523J989527l99602
34828I906218k539684l861829l114121n69689J422400J445155P92152Q20532N83882
34819D885016q34317j693857k73585J396098J91838k514103k253559J242330K767230
34810B913091o05614m697606m099027L88635L731160L689605J941006k33855l010200
34801A7195n101229l972829J13489L456514L516919J721959O17427N19976L31317
34792A220738k40722q09445j319413j595288r01238R07129K560671K607471R30013
34783C359916j367066k841818k358947k61K374938K692941J124730k28420k43708
34774B512305K24728M97440J154097K139419J865159l72970k721200l053815j617560
$$ plain form
34765 627603 638608 1823676 3583057 4393061 2343680 -2509215 -7462918 -9792482 -9306983
34756 -9306983 -7663562 -6037901 -4339579 -2145821 470234 2918627 4463885 4694175
34748 4694175 3735000 1941529 -312645 -2299871 -3126882 -3004957 -3501180 -5297490 -6472580
34739 -6472580 -4727767 -840236 2072873 2449827 1195568 -1109809 -4917562 -8937498
34731 -8937498 -9910470 -7068720 -4261126 -5197415 -8495095 -10111115 -9219913 -8640844 -10089986
34722 -10089986 -12017375 -12334001 -10794146 -8129250 -4898452 -2065903 -1160816 -2756109
34714 -2756109 -5482979 -7225684 -7026047 -5719246 -4955155 -5348767 -5418206 -3151825 936973
34705 936973 3593570 2714079 190123 -606799 1010300 3181287 4532842 4644006 2480433
$$ packed form
34765F27603J1005J185068J759381Q10004k049381m852895m953703k329564M85499
34756i306983J643421J625661J698322K193758K616055K448393J545258K30290
34748D694175r59175j793471k254174j987226q27011J21925m96223j796310j175090
34739f472580J744813L887531K913109L76954j254259k305377l807753m019936
34731h937498r72972K841750K807594r36289l297680j616020Q91202N79069j449142
34722a0089986j927389l16626J539855K664896L230798K832549R05087j595293
34714b756109k726870j742705J99637J306801P64091l93612o9439K266381M088798
34705I36973K656597q79491k523956p96922J617099K170987J351555J11164k163573
$$ plain form
34696 2480433 -2441434 -7382257 -8155799 -4433595 -518115 238480 -829173 -796138 787933
34687 787933 2869374 5408364 8249239 9266799 6712127 2587302 843566 2469742
34679 2469742 4845110 5804420 5696583 5111511 3394903 718609 -629102 995747 3778367
34670 3778367 4343884 1973266 -734957 -1293931 56578 1372615 1331040 -41762 -1935420
34661 -1935420 -3180035 -2727465 -659530 1538683 2517057 2638998 3131726 3930498 3756163
34652 3756163 2583899 2413588 4523795 7199642 7686115 5624985 2908935 649647
34644 649647 -1693747 -4099961 -5066336 -3870847 -2192346 -2172973 -3755819 -5098671 -5064111
34635 -5064111 -4303488 -4205516 -5530669 -7836621 -9721110 -9884533 -8226627 -5514769 -2090624
$$ packed form
34696B480433m921867m940823p73542L722204L915480P56595j067653L3035J584071
34687G87933K081441K538990K840875J017560k554672m124825j743736J626176
34679B469742K375368R59310j07837n85072j716608k676294j347711J624849K782620
34670C778367N65517k370618k708223n58974J350509J316037m1575j372802j893658
34661a935420j244615M52570K067935K198213R78374J21941M92728P98772j74335
34652C756163j172264j70311K110207K675847M86473k061130k716050k259288
34644F49647k343394k406214r66375J195489J678501J9373j582846j342852L4560
34635e064111P60623R7972j325153k305952j884489j63423J657906K711858L424145
$$ plain form
34626 -2090624 1981083 5295654 5395042 1958733 -1533288 -1092571 3294425 7939291 9802084
34617 9802084 9050935 7581741 6793371 7104418 8090515 8496240 7302786 5296048 4424938
34608 4424938 5115860 5551971 4373030 2636247 1777857 896185 -1891771 -5807617 -7340879
34599 -7340879 -4402341 1099090 5743363 8348925 10026208 11516134 12167180 11309172
34591 11309172 9087808 5762061 1536340 -2572766 -5101602 -5985457 -6627484 -7251383
34583 -7251383 -5870404 -1617474 2318797 1763163 -2775209 -6276916 -5581875 -2981836
34575 -2981836 -2284228 -3759008 -5053102 -5322093 -5811667 -7119649 -8435959 -9438561 -10694351
34566 -10694351 -11796534 -11070723 -7937374 -4112493 -1587940 -516566 78119 465529
$$ packed form
34626b090624M071707L314571R9388l436309l492021M40717M386996M644866J862793
34617I802084p51149j469194p88370L11047R86097M05725j193454k006738q71110
34608D424938O90922M36111j178941j736783q58390q81672k787956l915846j533262
34599g340879K938538N501431M644273K605562J677283J489926O51046q58008
34591A1309172k221364l325747m225721m109106k528836q83855o42027o23899
34583g251383J380979M252930L936271n55634m538372l501707O95041K600039
34575b981836O97608j474780j294094k68991m89574j307982j316310j002602j255790
34566a0694351j102183P25811L133349L824881K524553J071374N94685L87410
$$ plain form
34558 465529 98469 -1183618 -2732731 -3754068 -3952859 -3688033 -3680689 -4274261 -4875007
34549 -4875007 -4515127 -3015029 -1089775 688992 2338818 3786266 4595186 4721850 4773575
34540 4773575 5046430 4960393 3937206 2236050 454527 -1120848 -2105831 -1754139 -50987
34531 -50987 1407474 716303 -2172162 -5366669 -7146212 -7486564 -7429739 -7604744 -7718037
34522 -7718037 -7241511 -6303075 -5682540 -5683926 -5262059 -3143711 -37545 1486389 308297
34513 308297 -1078219 648320 5152931 8701092 9078020 8176981 8718212 10246589 10184083
34504 10184083 7805278 5099397 3858614 3688039 3207148 1824383 -163241 -2098091
34496 -2098091 -3036445 -2278465 -462541 689338 379230 -251066 183704 1304898 1512625
$$ packed form
34558D65529l67060j282087j549113j021337j98791K64826P344n93572o00746
34549d875007L59880J500098J925254J778767J649826J447448Q08920J26664N1725
34540D773575K72855q6037j023187j701156j781523j575375r84983L51692J703152
34531e0987J458461o91171k888465l194507j779543l40352N6825j75005j13293
34522g718037M76526R38436O20535j386M21867K118348L106166J523934j178092
34513C08297j386516J726539M504611L548161L76928r01039N41231J528377o2506
34504A0184083k378805k705881j240783j70575m80891j382765j987624j934850
34496b098091r38354P57980J815924J151879l10108o30296M34770J121194K07727
$$ plain form
34487 1512625 -7071 -2696566 -5556262 -7651802 -8083879 -6707507 -4911829 -4527563
34479 -4527563 -5627474 -6309404 -5065794 -2649496 -1163530 -1845055 -4087269 -6159594
34471 -6159594 -6604896 -5373098 -3792952 -3034878 -2661195 -1422818 548969 1539425 752538
34462 752538 -141802 961861 3679245 5427552 4483891 1791113 -347213 -593633 643722
34453 643722 2194873 3379006 4203343 4579291 3964135 2309215 870028 954924 1918863
34444 1918863 1795771 316058 -320574 1281277 3217137 2840115 797004 242495 2196128
34435 2196128 3957787 2823451 -402052 -2715089 -2526203 -662347 1614883 4184981
34427 4184981 7366277 10400919 11441178 9432180 5793379 3458811 3833872 5337282
$$ packed form
34487A512625j519696k689495k859696k095540m32077J376372J795678L84266
34479d527563j099911o81930J243610K416298J485966o81525k242214k072325
34471f159594m45302J231798J580146P58074L73683J238377J971787R90456p86887
34462G52538q94340J103663K717384J748307r43661k692778k138326k46420J237355
34453F43722J551151J184133Q24337L75948o15156j654920j439187Q4896R63939
34444A918863j23092j479713o36632J601851J935860l77022k043111n54509J953633
34435B196128J761659j134336l225503k313037J88886J863856K277230K570098
34427D184981L181296L034642J040259k008998l638801k334568L75061J503410
$$ plain form
34419 5337282 5559164 4141695 2566988 1793788 1564270 1749324 2650360 3694905 3479612
34410 3479612 1879333 839313 2077248 4829113 6793362 6728298 5298122 3775743
34402 3775743 2701692 1730029 347063 -1281331 -2231401 -1920598 -1114602 -1167599 -2267125
34393 -2267125 -3149043 -2600046 -600216 1843148 3179713 2086948 -882869 -2781841
34385 -2781841 -1286438 1769484 2255138 -268145 -1190125 2815677 8570515 10201382
34377 10201382 6660391 2416799 1254222 2401543 3100491 2294260 656551 -1149793
34369 -1149793 -2820525 -3926226 -4103410 -3365336 -1887298 18207 1656118 2423129 2665737
34360 2665737 3353973 4747285 5974760 5978469 4373509 1592884 -1193749 -2691106 -2856754
$$ packed form
34419E337282K21882j417469j574707p73200k29518J85054R01036J044545k15293
34410C479612j600279j040020J237935K751865J964249o5064j430176j522379
34402C775743j074051r71663j382966j628394r50070L10803Q05996n2997j099526
34393b267125q81918N48997J999830K443364J336565j092765k969817j898972
34385b781841J495403L055922M85654k523283r21980M005802N754838J630867
34377A0201382l540991m243592j162577J147321O98948q06231j637709j806344
34369a149793j670732j105701j77184P38074J478038J905505J637911P67011K42608
34360B665737O88236J393312J227475L709j604960k780625k786633j497357j65648
$$ plain form
34351 -2856754 -3266871 -5104122 -7218651 -7421769 -5351540 -2684798 -855354 -168309 -838187
34342 -838187 -2803572 -4407094 -3605893 -1176750 -426496 -2586111 -4705253 -3752937 -800325
34333 -800325 1029834 1132197 1220076 1492836 101858 -3327473 -6368899 -7085372 -6720180
34324 -6720180 -7688042 -10076808 -11643335 -10822964 -8496393 -6711357 -6466611 -7040172 -7047723
34315 -7047723 -5755669 -3485968 -1246423 -268363 -1476249 -4642162 -8032674 -9636227
34307 -9636227 -8969913 -7055592 -4613408 -1421597 2154118 4453045 4470446 3437937 3112269
34298 3112269 3370602 3014532 2100800 1515394 791124 -1281300 -3880768 -4566354 -3091111
34289 -3091111 -2263044 -3747494 -5399069 -4678987 -2700391 -2343695 -3717016 -4374826 -3421664
$$ packed form
34351b856754m10117j837251k114529k03118K070229K666742J829444O87045o69878
34342h38187j965385j603522Q01201K429143P50254k159615k119142R52316K952612
34333h00325J830159J02363Q7879K72760j390978l429331l041426p16473L65192
34324f720180r67862k388766j566527Q20371K326571J785036K44746n73561p551
34315g047723J292054K269701K239545R78060j207886l165913l390512j603553
34307i636227O66314J914321K442184L191811L575715K298927J7401j032509l25668
34298C112269K58333l56070r13732n85406p24270k072424k599468o85586J475243
34289c091111Q28067j484450j651575P20082J978596L56696j373321o57810R53162
$$ plain form
34280 -3421664 -2376287 -1798544 -1634 3854090 7762020 9421573 9043540 8117439 6851373
34271 6851373 4567080 1666509 -499210 -1174065 -261574 2418031 6320529 9197624
34263 9197624 8873491 6053011 3669894 3210607 3302406 2338995 783399 -23630 122749
34254 122749 728779 2020955 4449763 7180667 8417100 7420241 5499412 4782560 6199382
34245 6199382 8541515 9429891 7622038 4496007 2708354 3272777 4709804 5165208 4186766
34236 4186766 2014923 -1295583 -4870503 -6519984 -5058484 -2403403 -1536818 -2740790
34228 -2740790 -3640737 -2749901 -950715 707676 2524409 4641885 5855832 5183075 3387136
34219 3387136 1776224 485615 -906282 -1949592 -1793052 -529702 1050862 2595796
$$ packed form
34280c421664J045377N77743J796910L855724L907930J659553l78033r26101j266066
34271F851373k284293k900571k165719o74855R12491K679605L902498K877095
34263I197624l24133k820480k383117m59287R1799r63411j555596q07029J46379
34254A22749O06030J292176K428808K730904J236433r96859j920829p16852J416822
34245F199382K342133Q88376j807853l126031j787653N64423J437027M55404r78442
34236D186766k171843l310506l574920j649481J461500K655081Q66585j203972
34228b740790q99947Q90836J799186J658391J816733K117476J213947o72757j795939
34219C387136j610912j290609j391897j043310J56540J263350J580564J544934
$$ plain form
34211 2595796 4008918 4575923 3484966 1114371 -1214776 -2709148 -3391913 -3079457 -1377271
34202 -1377271 893141 1475244 -975348 -4663641 -5884539 -2914327 1851706 4229081
34194 4229081 2502259 -1308772 -4320239 -5718734 -6183008 -5691293 -3659633 -840743
34186 -840743 931131 1268925 1712950 2941761 3249086 1082280 -2283435 -4199051 -3894279
34177 -3894279 -2776113 -2153822 -2139482 -2297768 -1973991 -427181 2013257 3505917 2955459
34168 2955459 2098305 3435255 6505073 8470207 8379913 8291978 9508219 10258369 8622128
34159 8622128 5778235 4399308 4963205 5485995 4326090 1744342 -1020266 -3041383
34151 -3041383 -4174014 -4924407 -5640556 -5662819 -4131823 -1856607 -930622 -1817882 -2580293
$$ packed form
34211B595796J413122N67005j090957k370595k329147j494372o82765L12456J702186
34202a377271K270412N82103k450592l688293j220898K970212M766033K377375
34194D229081j726822l811031l011467j398495m64274M91715K031660K818890
34186h40743J771874L37794M44025J228811L07325k166806l365715j915616L04772
34177c894279J118166O22291J4340j58286L23777J546810K440438J492660n50458
34168B955459q57154J336950L069818J965134r0294q7935J216241P50150j636241
34159H622128k843893j378927N63897N22790j159905k581748k764608k021117
34151c041383j132631p50393p16149k2263J530996K275216R25985q87260p62411
$$ plain form
34142 -2580293 -2239891 -2925375 -6464118 -10395145 -10408405 -6264045 -2293449 -1827612 -3921066
34133 -3921066 -6117940 -7476825 -7518185 -4982754 -32572 4022315 3762737 -215403 -4125182
34124 -4125182 -5402673 -4600488 -3453423 -3007377 -3569419 -4714101 -5104110 -3765813 -1723783
34115 -1723783 -920734 -1324306 -765124 1833685 4812921 6356353 7051677 8239776 9046397
34106 9046397 7377430 3697133 1487749 3014497 6245773 7407362 5690222 3782602
34098 3782602 3971741 5460887 6133476 5526015 4760153 4306909 3419973 1769197 171491
34089 171491 -773238 -1546421 -2465820 -2676106 -1535131 -276897 -864686 -3320285 -5446862
34080 -5446862 -5423942 -3743855 -2298391 -2284650 -3304307 -3996645 -3369587 -1857429 -949351
$$ packed form
34142b580293L40402o85484l538743l931027j3260M144360L970596M65837k093454
34133c921066k196874j358885m1360K535431M950182M054887k59578l978140l909779
34124d125182j277491Q02185J147065M46046n62042j144682l90009J338297K042030
34115a723783Q03049m03572N59182K598809K979236J543432O95324J188099Q06621
34106I046397j668967l680297k209384J526748L231276J161589j717140j907620
34098C782602J89139J489146O72589o07461p65862m53244q86936j650776j597706
34089A71491r44729p73183r19399k10286J140975J258234n87789k455599k126577
34080e446862K2920J680087J445464J3741j019657o92338O27058J512158R08078
$$ plain form
34071 -949351 -1371509 -2098185 -1888677 -1129253 -894426 -832199 86560 938381 -544015 -4126045
34061 -4126045 -6397236 -5334036 -3176868 -2748879 -3118103 -1851441 -30660 -1221655
34053 -1221655 -5549208 -8473171 -6611945 -1932648 1469396 2470194 2738748 3086141
34045 3086141 2492436 407983 -1963945 -3083385 -2746037 -2057193 -2312046 -4006048 -6553580
34036 -6553580 -8841813 -10062054 -9900860 -8249682 -5430507 -2642519 -1248972 -1307261 -1555932
34027 -1555932 -1173836 -815599 -1544418 -3407961 -5393589 -6204149 -5000310 -2210214 337727
34018 337727 1154875 1075877 2184122 4535868 5680946 4172002 1727724 598295 388907
34009 388907 -722352 -2780487 -4095037 -3906981 -3171454 -2929384 -3458300 -4829088 -6833081
$$ packed form
34071i49351m22158p26676K09508P59424K34827O2227R18759Q51821j482396l582030
34061d126045k271191J063200K157168M27989l69224J266662J820781j190995
34053a221655m327553k923963J861226M679297L402044J000798K68554L47393
34045C086141n93705k084453k371928j119440L37348O88844k54853j694002k547532
34036f553580k288233j220241J61194J651178K819175K787988J393547n8289k48671
34027a555932L82096L58237p28819j863543j985628q10560J203839K790096K547941
34018C37727Q17148p8998J108245K351746J145078j508944k444278j129429k09388
34009C88907j111259k058135j314550J88056P35527K42070n28916j370788k003993
$$ plain form
34000 -6833081 -8472146 -8825990 -8247632 -7481818 -6024972 -2938452 914743 3182398 2769690
33991 2769690 814807 -1249182 -3113653 -4754249 -5661184 -5592123 -5092137 -4758596 -4754622
33982 -4754622 -5193322 -6041057 -6518035 -5667066 -3735439 -2022037 -1259678 -1155707 -1445495
33973 -1445495 -2095341 -2456781 -1745890 -598490 -575555 -1718545 -2228939 -1234585 -318738
33964 -318738 -1420395 -4513681 -8146240 -10927664 -11678228 -9656493 -5906976 -3164522
33956 -3164522 -3041107 -4139131 -4073930 -2480396 -853542 -224253 -225187 82540 1414486
33947 1414486 3705208 5599324 5346213 3023527 917926 822667 2046148 3044664 3627208
33938 3627208 4113980 3661855 1391555 -1626061 -3442272 -3795122 -3876156 -4071933 -3780373
$$ packed form
34000f833081j639065l53844N78358P65814J456846L086520L853195K267655m12708
33991B769690j954883k063989j864471j640596r06935O9061M99986L33541L974
33982d754622m38700q47735m76978Q50969J931627J713402P62359J03971k89788
33973a445495o49846l61440P10891J147400K2935j142990n10394R94354R15847
33964c18738j101657l093286l632559k781424p50564K021735L749517K742454
33956c164522J23415j098024O5201J593534J626854O29289r34L07727J331946
33947A414486K290722J894116k53111k322686k105601r5259J223481R98516N82544
33938C627208M86772m52125k270300l017616j816211l52850q1034j95777K91560
$$ plain form
33929 -3780373 -3085893 -2717443 -2548359 -1973768 -1555735 -2279056 -3238613 -2313184 474512
33920 474512 2427296 1739320 -323642 -1706161 -2190552 -2487088 -2226527 -503181 2304554
33911 2304554 4563687 4927168 3142832 -104260 -3426603 -5321088 -5267821 -4070471 -2862478
33902 -2862478 -2181711 -2062075 -2275764 -2281480 -1680966 -836567 -181141 968344 3476419
33893 3476419 6046608 5664386 1448916 -3414940 -5065194 -3353436 -1464689 -1926854
33885 -1926854 -4498532 -7509726 -9638921 -10292384 -9520292 -7896370 -5810228 -3028465
33877 -3028465 252955 2358119 1524079 -1555225 -3967579 -3927910 -2777709 -2878411 -4456686
33868 -4456686 -5686343 -5425904 -4527523 -4201549 -4182999 -3310468 -1420835 247760 607545
$$ packed form
33929c780373O94480L68450J69084N74591M18033p23321r59557R25429K787696
33920D74512J952784o87976k062962j382519m84391k96536K60561J723346K807735
33911B304554K259133L63481j784336l247092l322343j894485N3267J197350J207993
33902b862478O80767J19636k13689n716O00514Q44399O55426J149485K508075
33893C476419K570189l82222m215470m863856j650254J711758J888747m62165
33885a926854k571678l011194k129195o53463P72092J623922K086142K781763
33877c028465L281420K105164q34040l079304k412354L9669J150201j00702j578275
33868d456686j229657K60439Q98381L25974J8550Q72531J889633J668595L59785
$$ plain form
33859 607545 12678 -304195 296817 1246927 1374719 -47961 -2542560 -4545650 -4760376
33850 -4760376 -3646118 -2967140 -3440188 -3605544 -1877545 941417 2411692 1423122 -923469
33841 -923469 -3413267 -6232108 -9798672 -13208826 -14812019 -13988631 -11828464 -10174277
33833 -10174277 -10003206 -10414616 -9458220 -6547129 -3577000 -2597731 -2843162 -1719496 1296320
33824 1296320 3730229 3651683 2182837 1376230 1337488 975943 211003 -363949 -1053670
33815 -1053670 -2466100 -3935368 -4227325 -3394053 -2355321 -1101317 919966 2910522
33807 2910522 3217273 1917592 1018400 1505035 1925142 880591 -519954 -140256 1979645
33798 1979645 3398627 2352798 29252 -824413 805898 3009309 3290685 1448589
$$ packed form
33859F07545n94867l16873O01012R50110J27792j422680k494599k003090k14726
33850d760376J114258O78978m73048j65356J727999K818962J470275r88570k346591
33841i23469k489798k818841l566564l410154j603193Q23388K160167J654187
33833a0174277J71071m11410R56396K911091K970129R79269k45431J123666L015816
33824A296320K433909p8546j468846q06607l8742l61545p64940n74952o89721
33815a053670j412430j469268k91957Q33272J038732J254004K021283J990556
33807B910522L06751j299681q99192M86635M20107j044551j400545L79698K119901
33798A979645J418982j045829k323546q53665J630311K203411K81376j842096
$$ plain form
33790 1448589 -717579 -2128642 -3300234 -4218011 -3273948 268867 4193183 5703056
33782 5703056 5102545 5003210 6273793 7126318 6427547 5551361 5976959 6861694 6263352
33773 6263352 3611603 -62797 -3384561 -5226569 -4974891 -3157100 -1190925 137192
33765 137192 1298717 2762827 4115692 4975512 5648451 6101358 5408268 3222802 831972
33756 831972 -345303 -462014 -348239 190929 1787275 3811657 4735854 3988635 2257756
33747 2257756 159639 -2176350 -4229110 -4905924 -3501013 -337235 3311299 5478260
33739 5478260 4510603 942969 -2244579 -2640428 -1312660 -1240627 -3161289 -4834325 -4566114
33730 -4566114 -3401056 -2939876 -2710095 -1129170 1890790 4636346 5432817 3891667 836911
$$ packed form
33790A448589k166168j411063j171592r17777R44063L542815L924316J509873
33782E703056o00511r9335J270583Q52525o98771q76186M25598Q84735n98342
33773F263352k651749l674400l321764j842008K51678J817791J966175J328117
33765A37192J161525J464110J352865Q59820O72939M52907o93090k185466k390830
33756H31972j177275j16711J13775N39168J596346K024382R24197p47219j730879
33747B257756k098117k335989k052760o76814J404911L163778L648534K166961
33739E478260r67657l567634l187548l95849J327768P2033j920662j673036K68211
33730d566114J165058M61180K29781J580925L019960K745556P96471j541150l054756
$$ plain form
33721 836911 -2134597 -3451436 -2809227 -1429249 -550432 -97277 605160 1484029 2031759
33712 2031759 2457298 3357988 4428000 4670836 3952929 3177526 2632643 1378859 -1015718
33703 -1015718 -3156837 -3380040 -2112535 -1408847 -2124123 -2791415 -1859636 -29246 745931
33694 745931 135882 -101399 1087276 2031450 291221 -3822355 -7004849 -6512921 -2999869
33685 -2999869 667924 2553254 2812286 2410565 1953261 1834710 2412649 3437239 3930679
33676 3930679 3274412 2100787 1540120 1781584 1993598 1670095 1421325 2095400 3472746
33667 3472746 4260760 3350893 880227 -1879225 -3516839 -3504231 -2502645 -1635924 -1258545
33658 -1258545 -564771 1246839 3567274 4785693 4308462 3473541 3831017 4966544 4907746
$$ packed form
33721H36911k971508j316839O42209J379978Q78817M53155P02437Q78869N47730
33712B031759M25539R00690J070012K42836p17907p75403n44883j253784k394577
33703a015718k141119k23203J267505P03688p15276o67292R31779J830390P75177
33694G45931o10049k37281J188675R44174j740229m113576l182494M91928L513052
33685b999869L667793J885330K59032m01721m57304j18551N77939J024590M93440
33676C930679o56267j173625n60667K41464K12014l23503k48770O74075J377346
33667C472746P88014r09867k470666k759452j637614J2608J001586Q66721L77379
33658a258545O93774J811610K320435J218419m77231q34921L57476J135527n8798
$$ plain form
33649 4907746 2628501 -715456 -3291857 -4618694 -5639675 -7221664 -9016473 -9621166
33641 -9621166 -7756195 -3716714 252363 1754285 789919 -241380 396863 1665713
33633 1665713 1621693 386528 -353037 -233646 -536682 -1484319 -1373811 694384 3086751
33624 3086751 4011171 4129469 5096952 6590217 6707736 4678146 1286548 -2856608 -7315383
33615 -7315383 -10353365 -10041389 -7422921 -6183414 -7971574 -10024291 -8910584 -4913676
33607 -4913676 -925448 1526566 2927636 3407340 2261335 -167224 -2213535 -2903239
33599 -2903239 -2745159 -2335183 -1711023 -1354418 -2186766 -3969335 -5174543 -5212766 -5455401
33590 -5455401 -7084658 -9044884 -9250143 -7060984 -3573292 -154820 2251497 2938300
$$ packed form
33649D907746k279245l343957k576401j326837j020981j581989j794809o04693
33641i621166J864971M039481L969077J501922r64366j031299O38243J268850
33633A665713m4020j235165p39565J19391l03036r47637J10508K068195K392367
33624C086751R24420J18298R67483J493265J17519k029590l391598m143156m458775
33615g315383l037982L11976K618468J239507j788160k052717J113707L996908
33607d913676L988228K452014J401070M79704j146005k428559k046311o89704
33599b903239J58080M09976O24160L56605q32348j782569j205208l8223k42635
33590e455401j629257j960226k05259K189159L487692L418472K406317O86803
$$ plain form
33582 2938300 1777034 -260410 -1652776 -1436910 378428 2863151 4230239 2826842
33574 2826842 -943824 -4335831 -4976566 -3429370 -2069369 -2027829 -2582255 -3077165 -3678894
33565 -3678894 -4170558 -3803489 -2930683 -3225733 -5356524 -7663813 -8183792 -6992742 -5478098
33556 -5478098 -4249673 -3159078 -2696027 -3649061 -5431807 -6300599 -5600514 -4560438 -4390433
33547 -4390433 -4733050 -4659717 -4139568 -3569969 -2690853 -1147756 418274 1170279 1658280
33538 1658280 3038486 4596734 3849659 29846 -4031532 -5023536 -3248337 -1868569
33530 -1868569 -2540551 -3801557 -3983894 -3636715 -3976430 -4516760 -3850420 -1978640 -269556
33521 -269556 624542 1386861 2483621 3174010 2500441 622338 -1142865 -1357415 262221
$$ packed form
33582B938300j161266k037444j392366K15866J815338K484723J367088j403397
33574B826842l770666l392007o40735J547196J360001M1540n54426m94910o01729
33565c678894m91664L67069Q72806k95050k130791k307289n19979J191050J514644
33556e478098J228425J090595M63051r53034j782746q68792P00085J040076J70005
33547d390433l42617P3333N20149N69599Q79116J543097J566030P52005M88001
33538A658280J380206J558248p47075l819813m061378r92004J775199J379768
33530a868569o71982j261006j82337L47179l39715n40330O66340J871780J709084
33521b69556Q94098P62319J096760O90389o73569j878103j765203k14550J619636
$$ plain form
33512 262221 2207474 2297048 172467 -1840111 -1379757 962597 2689363 2949963 3042623
$$ packed form
33512B62221J945253Q9574k124581k012578M60354K342354J726766K60600R2660
$$ [...]
##END NTUPLES=NMR SPECTRUM
##END=
