##TITLE=31Pdec_DE-73rm1h
 , 64 sc
 5.11.2024
##JCAMPDX= 6.0         $$ Bruker NMR JCAMP-DX V2.0
##DATA TYPE= NMR SPECTRUM
##DATA CLASS= NTUPLES
##ORIGIN= UXNMR, Bruker Analytische Messtechnik GmbH
##OWNER= root
$$ XWIN-NMR		Version 3.5
$$ Tue Nov  5 14:17:56 2024 Russian Standard Time (UT+4h)  she@DPX200
##.OBSERVE FREQUENCY= 81.013821
##.OBSERVE NUCLEUS= ^31P
##.ACQUISITION MODE= SIMULTANEOUS
##.ACQUISITION SCHEME= undefined
##.AVERAGES= 64
##.DIGITISER RES= 17
##SPECTROMETER/DATA SYSTEM= spect
##.PULSE SEQUENCE= zgpg30
##.SOLVENT NAME= D2O
##.SHIFT REFERENCE= (INTERNAL, D2O, 0, 198.062)
##AUDIT TRAIL= $$ (NUMBER, WHEN, WHO, WHERE, WHAT)
$$ ##TITLE= Audit trail, XWIN-NMR		Version 3.5
$$ ##JCAMPDX= 5.01
$$ ##ORIGIN= Bruker BioSpin GmbH
$$ ##OWNER= she
$$ F:/spectra/data/she/nmr/P31/2/pdata/1/auditp.txt
$$ ##AUDIT TRAIL=  $$ (NUMBER, WHEN, WHO, WHERE, WHAT)
(   1,<2024-11-05 14:16:40.20 +0400>,<she>,<DPX200>,
      <created by zg, POWCHK disabled, PULCHK disabled
       configuration hash MD5:
       00 E9 B6 7A A2 85 ED C7 34 08 36 98 17 FE 4E 26
       data hash MD5: 32K
       D3 77 2B 0E 02 90 EC F1 24 47 13 96 E5 DA B7 E3>)
(   2,<2024-11-05 14:16:42.43 +0400>,<she>,<DPX200>,
      <Start of raw data processing
       efp BC_mod = 2 LB = 1.5 FT_mod = 6 PKNL = 1 PHC0 = 2239.61 PHC1 = 158.4882 SI = 64K 
       data hash MD5: 64K
       43 6A F1 22 47 D4 42 56 35 D3 28 7D 04 73 7A 78>)
(   3,<2024-11-05 14:17:12.15 +0400>,<she>,<DPX200>,
      <pk PHC0 = 55.91124 PHC1 = -83.80001 
       data hash MD5: 64K
       E5 43 C8 13 4E AD E4 7F 05 6B 05 35 E5 A5 23 69>)
(   4,<2024-11-05 14:17:15.50 +0400>,<she>,<DPX200>,
      <abs ABSG = 5 
       data hash MD5: 64K
       18 75 81 84 EB B8 29 00 16 69 3A D2 39 6C 07 7F>)
$$ ##END=
$$ 
$$ hash MD5
$$ 19 6A 56 2B 29 6B 9B 8B F2 EA 6E 1C 8E 2C 15 35
##$RELAX= 
##$RELAX= 
##$RELAX= 
##$RELAX= 
##$RELAX= 
##$RELAX= 
##$RELAX= 
##$RELAX= 
$$ Bruker specific parameters
$$ --------------------------
##$DU= <F:/spectra>
##$EXPNO= 2
##$NAME= <P31>
##$PROCNO= 1
##$TYPE= <nmr>
##$USER= <she>
##$AMP= (0..31)
100 100 100 100 100 100 100 100 100 100 100 100 100 100 100 100 100 100 
100 100 100 100 100 100 100 100 100 100 100 100 100 100 
##$AQSEQ= 0
##$AQ_mod= 1
##$AUNM= <au_zg>
##$AUTOPOS= <>
##$BF1= 81.014009
##$BF2= 200.13
##$BF3= 200.13
##$BF4= 200.13
##$BF5= 200.13
##$BF6= 200.13
##$BF7= 200.13
##$BF8= 200.13
##$BYTORDA= 1
##$CFDGTYP= 0
##$CFRGTYP= 5
##$CHEMSTR= <none>
##$CNST= (0..31)
1 1 145 1 1 1 1 1 1 1 1 1 1 1 1 1 1 1 1 1 1 1 1 1 1 1 1 1 1 1 1 1 
##$CPDPRG= <waltz16>
##$CPDPRG1= <>
##$CPDPRG2= <waltz16>
##$CPDPRG3= <>
##$CPDPRG4= <mlev>
##$CPDPRG5= <mlev>
##$CPDPRG6= <mlev>
##$CPDPRG7= <mlev>
##$CPDPRG8= <mlev>
##$CPDPRGB= <>
##$CPDPRGT= <>
##$D= (0..31)
0 1 0 0 0 0 0 0 0 0.06 0 0.03 2e-05 3e-06 0 0 0.0002 0 0 0 0 0 0 0 0 0 
0 0 0 0 0 0 
##$DATE= 1730801799
##$DBL= (0..7)
120 120 120 11 120 120 24 19 
##$DBP= (0..7)
150 150 150 150 150 150 150 150 
##$DBP07= 0
##$DBPNAM0= <>
##$DBPNAM1= <>
##$DBPNAM2= <>
$$ [...]
##$SUBNAM3= <"">
##$SUBNAM4= <"">
##$SUBNAM5= <"">
##$SUBNAM6= <"">
##$SUBNAM7= <"">
##$SUBNAM8= <"">
##$SUBNAM9= <"">
##$SW= 400.765351723535
##$SWIBOX= (0..15)
0 1 3 0 0 0 0 0 0 0 0 0 0 0 0 0 
##$SW_h= 32467.5324675325
##$TD= 32768
##$TD0= 1
##$TE= 0
##$TE2= 300
##$TE3= 300
##$TEG= 300
##$TL= (0..7)
0 120 53 12 22 120 120 120 
##$TP= (0..7)
150 150 150 150 150 150 150 150 
##$TP07= 0
##$TPNAME0= <>
##$TPNAME1= <>
##$TPNAME2= <>
##$TPNAME3= <>
##$TPNAME4= <>
##$TPNAME5= <>
##$TPNAME6= <>
##$TPNAME7= <>
##$TPOAL= (0..7)
0.5 0.5 0.5 0.5 0.5 0.5 0.5 0.5 
##$TPOFFS= (0..7)
0 0 0 0 0 0 0 0 
##$TUNHIN= 0
##$TUNHOUT= 0
##$TUNXOUT= 0
##$USERA1= <user>
##$USERA2= <user>
##$USERA3= <user>
##$USERA4= <user>
##$USERA5= <user>
##$V9= 5
##$VALIST= <valist>
##$VCLIST= <CCCCCCCCCCCCCCC>
##$VD= 0
##$VDLIST= <DDDDDDDDDDDDDDD>
##$VPLIST= <PPPPPPPPPPPPPPP>
##$VTLIST= <TTTTTTTTTTTTTTT>
##$WBST= 1024
##$WBSW= 4
##$XGAIN= (0..3)
0 0 0 0 
##$XL= 0
##$YL= 0
##$YMAX_a= 117912
##$YMIN_a= -104946
##$ZGOPTNS= <>
##$ZL1= 120
##$ZL2= 120
##$ZL3= 120
##$ZL4= 120
##$ABSF1= 198.0616
##$ABSF2= -202.7028
##$ABSG= 5
##$ABSL= 3
##$ALPHA= 0
##$AQORDER= 0
##$ASSFAC= 0
##$ASSFACI= 0
##$ASSFACX= 0
##$ASSWID= 0
##$AUNMP= <proc_1d>
##$AZFE= 0.1
##$AZFW= 0.5
##$BCFW= 0
##$BC_mod= 2
##$BYTORDP= 0
##$COROFFS= 0
##$CY= -3
##$DATMOD= 1
##$DC= 0
##$DFILT= <>
##$DTYPP= 0
##$F1P= 0
##$F2P= 0
##$FCOR= 1
##$FTSIZE= 65536
##$FT_mod= 6
##$GAMMA= 0
##$GB= 0
##$INTBC= 1
##$INTSCL= 9.790993e-09
##$ISEN= 30
##$LB= 1.5
##$LEV0= 0
##$LPBIN= 0
##$MAXI= 10000
##$MC2= 0
##$MEAN= 0
##$ME_mod= 0
##$MI= 50
##$NCOEF= 0
##$NC_proc= -4
##$NLEV= 6
##$NOISF1= 182.463
##$NOISF2= 159.3651
##$NSP= 0
##$NTH_PI= 0
##$NZP= 0
##$OFFSET= 198.0616
##$PC= 4
##$PHC0= 2295.521
##$PHC1= 74.68819
##$PH_mod= 1
##$PKNL= yes
##$PPARMOD= 0
##$PSCAL= 0
##$PSIGN= 0
##$REVERSE= no
##$SF= 81.0140089999434
##$SI= 65536
##$SIGF1= 159.3651
##$SIGF2= -187.1042
##$SINO= 113.3802
##$SIOLD= 16384
##$SREGLST= <1H.CDCl3>
##$SSB= 0
##$STSI= 65536
##$STSR= 0
##$SW_p= 32467.5324675325
##$SYMM= 0
##$S_DEV= 0
##$TDeff= 32768
##$TDoff= 0
##$TI= <>
##$TILT= no
##$TM1= 0
##$TM2= 0
##$TOPLEV= 0
##$USERP1= <user>
##$USERP2= <user>
##$USERP3= <user>
##$USERP4= <user>
##$USERP5= <user>
##$WDW= 1
##$XDIM= 65536
##$YMAX_p= 345321783
##$YMIN_p= -4092227
$$ End of Bruker specific parameters
$$ ---------------------------------
##NTUPLES= NMR SPECTRUM
##VAR_NAME=  FREQUENCY,     SPECTRUM/REAL,   SPECTRUM/IMAG
##SYMBOL=    X,             R,               I
##VAR_TYPE=  INDEPENDENT,   DEPENDENT,       DEPENDENT
##VAR_FORM=  AFFN,          ASDF,            ASDF
##VAR_DIM=   65536,         65536,           65536
##UNITS=     HZ,            ARBITRARY UNITS, ARBITRARY UNITS
##FACTOR=    0.49542278885378, 1,            1
##FIRST=     16045.7642231865, 0,            0
##LAST=      -16421.768244346, 0,            0
##MIN=       -16421.768244346, -4092227,     0
##MAX=       16045.7642231865, 345321783,    0
$$ Real data points
##PAGE= N=1
##DATA TABLE= (X++(R..R)), XYDATA
$$ [...]
$$ plain form
43405 544467 380489 148132 24595 98651 233611 284794 290246 327507 334145 224348 68077
43394 68077 -7930 -9964 -8512 42266 235738 502763 647243 589361 425084 241845 20777
43383 20777 -253414 -510308 -661351 -667710 -533526 -316267 -135343 -70207 -52265 43111 207690
43372 207690 316062 319478 288621 253891 155709 3423 -59117 63819 268784 371573 311342
43361 311342 172440 68518 68185 174252 303550 322620 166800 -82053 -259190 -249734 -74237
43350 -74237 118690 171384 92068 79871 289474 606571 774068 708351 534959 331999
43340 331999 57035 -222723 -272380 -12167 289098 335369 187153 124942 233595 348271
43330 348271 353729 289379 154309 -138321 -522527 -700777 -463782 10816 321861 270381
$$ packed form
43405E44467j63978k32357j23537P4056J34960N1183N452L7261O638j09797j56271
43394F8077p6007k034J452N0778J93472K67025J44480n7882j64277j83239k21068
43383B0777k74191k56894j51043o359J34184K17259J80924O5136J7942R5376J64579
43372B07690J08372L416l0857l4730r8182j52286o2540J22936K04965J02789o0231
43361C11342j38902j03922l33J06067J29298J9070j55820k48853j77137R456J75497
43350g4237J92927N2694p9316j2197K09603L17097J67497o5717j73392k02960
43340C31999k74964k79758m9657K60213L01265M6271j48216o2211J08653J14676
43330C48271N458o4350j35070k92630l84206j78250K36995M74598L11045n1480
$$ plain form
43320 270381 21958 -131742 -75042 84484 194061 214973 208591 222466 247136 275725 330018
43309 330018 385499 332062 91448 -238215 -430122 -349155 -96637 79087 5953 -274259
43299 -274259 -574805 -756880 -830856 -856862 -810174 -634223 -394444 -243006 -203335 -125328
43289 -125328 81484 300021 377559 311416 142425 -193781 -710526 -1146486 -1136745 -634851
43279 -634851 2777 389741 440417 319537 212302 195699 227476 207644 106959 26370
43269 26370 58343 144768 195292 277749 501638 751608 776609 564376 378999 367026 386658
43258 386658 326720 307949 388927 349306 34313 -301514 -318787 -117781 -83032 -271207 -332685
43247 -332685 -78872 227418 275533 112078 -34848 -115965 -234733 -397264 -493614 -474503
$$ packed form
43320B70381k48423j53700N6700J59526J09577K0912o382J3875K4670K8589N4293
43309C30018N5481n3437k40614l29663j91907Q0967K52518J75724p3134k80212
43299b74259l00546j82075p3976k6006M6688J75951K39779J51438L9671P8007
43289a25328K06812K18537P7538o6143j68991l36206n16745m35960R741N01894
43279f34851O37628L86964N0676j20880j07235j6603L1777j9832j00685q0589
43269B6370L1973Q6425N0524Q2457K23889K49970K5001k12233j85377j1973J9632
43258C86658n9938j8771Q0978l9621l14993l35827j7273K01006L4749j88175o1478
43247c32685K53813L06290M8115j63455j46926q1117j18768j62531r6350J9111
$$ plain form
43237 -474503 -398900 -335344 -314105 -337179 -356557 -291496 -137533 -1215 39068 35912 63092
43226 63092 86496 47245 3812 64214 206570 281261 182691 -66992 -376742 -628791 -690088
43215 -690088 -510524 -227372 -64909 -96323 -185383 -182437 -82308 51137 217004 446768
43205 446768 687401 803016 707492 463429 235023 141575 160237 192035 217290 315983 495582
43194 495582 595689 478820 251238 137284 164724 168671 119222 203873 480975 689333
43184 689333 603663 400454 412045 627799 731621 595067 421268 356250 262635 9864
43174 9864 -266802 -381282 -375564 -380033 -346053 -142410 177891 428217 550599 625985 666506
43163 666506 604733 468998 361578 265522 88500 -84660 -19805 320085 681189 868452
$$ packed form
43237d74503P5603O3556K1239k3074j9378O5061J53963J36318M0283l156K7180
43226F3092K3404l9251m3433O0402J42356P4691r8570k49683l09750k52049o1297
43215f90088J79564K83152J62463l1414q9060K946J00129J33445J65867K29764
43205D46768K40633J15615r5524k44063k28406r3448J8662L1798K5255R8693J79599
43194D95582J00107j16869k27582j13954K7440L947m9449Q4651K77102K08358
43184F89333q5670k03209J1591K15754J03822j36554j73799o5018r3615k52771
43174I864k76666j14480N718m469L3980K03643L20301K50326J22382P5386M0521
43163F66506o1773j35735j07420r6056j77022j73160O4855L39890L61104J87263
$$ plain form
43153 868452 965847 1073822 1064077 824582 572171 621431 902508 1000521 710556 312906
43143 312906 203260 427674 705993 798691 715462 606352 562395 549721 497856 411070 356783
43132 356783 344653 286945 125151 -78828 -255119 -442103 -659005 -736914 -476742 23469
43122 23469 403207 459786 352892 310216 320968 261586 158786 127540 143872 86298 -36988
43111 -36988 -94040 -56082 -43655 -125892 -228958 -281326 -312801 -362275 -407661 -433181 -449583
43100 -449583 -403712 -201024 112455 325862 326019 269079 361274 562594 663834 597670 496241
43089 496241 449598 384272 227754 45167 -72026 -148195 -257045 -380003 -431248 -394342
43079 -394342 -344444 -334303 -327227 -263841 -155327 -85459 -128915 -271817 -409542 -432589 -323488
$$ packed form
43153H68452R7395J07975r745k39495k52411M9260K81077R8013k89965l97650
43143C12906j09646K24414K78319R2698q3229j09110m3957j2674n1865q6786n4287
43132C56783j2130n7708j61794k03979j76291j86984k16902p7909K60172N00211
43122B3469L79738N6579j06894m2676J0752n9382j02800l1246J6332n7574j23286
43111c6988n7052L7958J2427q2237j03066n2368l1475m9474m5386k5520j6402
43100d49583M5871K02688L13479K13407J57n6940R2195K01320J01240o6164j01429
43089D96241m6643o5326j56518j82587j17193p6169j08850j22958n1245L6906
43079c94342M9898J0141P076O3386J08514O9868m3456j42902j37725k3047J09101
$$ plain form
43068 -323488 -160901 -29174 52143 105410 141015 151957 133052 77771 -14002 -91513 -53933
43057 -53933 144075 402811 557065 544948 438241 310989 169446 42065 31849 182787
43047 182787 356496 362833 196880 24643 -75296 -213370 -468214 -703443 -742431 -640688
43037 -640688 -606621 -669412 -617384 -324301 33021 202205 179474 156515 218798 270971 247362
43026 247362 222804 267047 326835 331238 315383 349012 405985 396056 297254 184697 140566 184768
43014 184768 280606 369985 415030 426884 431051 398720 270028 73937 -43421 29735 234454
43003 234454 408993 450998 364927 205217 39421 -77542 -155759 -250221 -339527 -313325 -164478
42992 -164478 -80653 -194202 -332022 -220855 96223 281507 162402 -65158 -165113 -159469
$$ packed form
43068c23488J62587J31727Q1317N3267L5605J0942j8905n5281r1773p7511L7580
43057e3933J98008K58736J54254j2117j06707j27252j41543j27381j0216J50938
43047A82787J73709O337j65953j72237r9939j38074k54844k35229l8988J01743
43037f40688L4067o2791N2028K93083L57322J69184k2731k2959O2283N2173k3609
43026B47362k4558M4243N9788M403j5855L3629N6973r929r8802j12557m4131M4202
43014A84768R5838Q9379M5045J1854M167l2331j28692j96091j17358P3156K04719
43003B34454J74539M2005q6071j59710j65796j16963p8217r4462q9306K6202J48847
42992a64478Q3825j13549j37820J11167L17078J85284j19105k27560r9955N644
$$ plain form
42982 -159469 -164030 -137780 -1619 132251 81731 -108832 -193381 -32205 281858 586532
42972 586532 780439 796752 621729 390776 331016 528198 821831 984094 952499 853282
42962 853282 836397 913354 946572 814392 592494 497490 599893 693239 558990 271156
42952 271156 75784 27875 -45355 -221562 -344182 -273007 -84892 79888 221568 414125
42942 414125 651672 874077 1045693 1104530 941456 560372 174215 1413 22466 65489
42932 65489 74992 145998 316537 479836 528551 479735 428081 446739 543566 653697 678416
42921 678416 586847 463296 404591 411439 442410 508492 613289 663091 577234 455999 482602
42910 482602 658039 790978 776193 725304 769552 886038 999272 1114008 1240050 1303680
$$ packed form
42982a59469m561K6250J36161J33870n0520j90563q4549J61176L14063L04674
42972E86532J93907J6313j75023k30953n9760J97182K93633J62263l1595r9217
42962H53282j6885P6957L3218j32180k21898r5004J02403R3346j34249k87834
42952B71156j95372m7909p3230j76207j22620P1175J88115J64780J41680J92557
42942D14125K37547K22405J71616N8837j63074l81084l86157j72802K1053M3023
42932F5489R503P1006J70539J63299M8715m8816n1654J8658R6827J10131K4719
42921F78416r1569j23551n8705O848L0971O6082J04797M9802q5857j21235K6603
42910D82602J75437J32939j4785n0889M4248J16486J13234J14736J26042O3630
$$ plain form
42900 1303680 1260623 1206635 1240133 1280884 1169656 911749 675026 548011 435464 223944
42890 223944 -58463 -293173 -401863 -383479 -284754 -176316 -111635 -77456 -24101 39151 34451
42879 34451 -73400 -216376 -312973 -358097 -365865 -278848 -25860 342369 660526 808690 803557
42868 803557 715758 567221 354462 121704 -50484 -112911 -66126 62534 213807 294130
42858 294130 244622 114081 9099 -31802 -59163 -104756 -124088 -72799 28568 150257 310124
42847 310124 511542 673445 699244 589031 411594 193057 -71108 -294761 -305368 -32878
42837 -32878 367014 649404 720231 688345 689124 715721 655443 462412 237728 116055 112318
42826 112318 133415 124545 129115 190400 278845 365240 485583 652975 770108 738916 626384
$$ packed form
42900A303680m3057n3988L3498M0751j11228k57907k36723j27015j12547k11520
42890B23944k82407k34710j08690J8384R8725J08438O4681L4179N3355O3252m700
42879C4451j07851j42976r6597m5124p768Q7017K52988L68229L18157J48164n133
42868H03557q7799j48537k12759k32758j72188o2427M6785J28660J51273Q0323
42858B94130m9508j30541j04982m0901k7361m5593j9332N1289J01367J21689J59867
42847C10124K01418J61903K5799j10213j77437k18537k64165k23653j0607K72490
42837c2878L99892K82390P0827l1886P79K6597o0278j93031k24684j21673l737
42826A12318K1097q870M570O1285Q8445Q6395J20343J67392J17133l1192j12532
$$ plain form
42815 626384 605059 727789 867082 895319 828155 758217 732217 736937 742672 719845 656488
42804 656488 581637 536819 532384 578175 714791 918898 1018526 852450 519164 308490 353109
42793 353109 513056 649164 799246 966887 951683 606132 131564 -112432 -29534 183494
42783 183494 363262 504585 583186 508398 311411 176011 196915 268846 294106 339700 481394
42772 481394 628113 635478 510019 380630 323419 318418 337574 376062 408639 386640 283720
42761 283720 121921 -27598 -68947 36196 198192 279690 259125 229080 220818 156272 21849
42750 21849 -57175 -15331 21365 -47915 -69722 172027 597913 895367 936352 895395 895065
42739 895065 785926 440355 64201 -35854 92191 91212 -188973 -467211 -422255 -108512
$$ packed form
42815F26384k1325J22730J39293K8237o7164o9938k6000M720N735k2827o3357
42804F56488p4851m4818m435M5791J36616K04107R9628j66076l33286k10674M4619
42793C53109J59947J36108J50082J67641j5204l45551m74568k43996Q2898K13028
42783A83494J79768J41323P8601p4788j96987j35400K0904P1931K5260M5594J41694
42772D81394J46719P365j25459j29389n7211n001J9156L8488L2577k1999j02920
42761B83720j61799j49519m1349J05143J61996Q1498k0565l0045q262o4546j34423
42750B1849p9024M1844L6696o9280k1807K41749M25886K97454M0985m0957l30
42739H95065j09139l45571l76154j00055J28045r79k80185k78238M4956L13743
$$ plain form
42729 -108512 180739 319998 404776 467415 394729 176344 15934 66591 202353 203925 72284
42718 72284 -7463 44629 130052 181477 270628 453218 638189 695870 625173 546334 565816
42707 565816 686709 826551 913138 983746 1156509 1452730 1709094 1771353 1719957 1749500
42697 1749500 1856805 1856288 1732041 1738374 2034551 2421767 2610440 2589990 2539132 2496764 2356666
42686 2356666 2127459 1957853 1894678 1816179 1643801 1454459 1332006 1245869 1132385 984210
42676 984210 817400 662419 626919 835068 1220833 1483443 1359515 904657 438306 240971
42666 240971 351141 610345 831217 924834 919216 888690 877676 892044 931968 998386 1083013
42655 1083013 1180585 1282317 1323571 1192298 866105 506583 323527 353173 455009 516236
$$ packed form
42729a08512K89251J39259Q4778O2639p2686k18385j60410N0657J35762J572j31641
42718G2284p9747N2092Q5423N1425Q9151J82590J84971N7681p0697p8839J9482
42707E65816J20893J39842Q6587P0608J72763K96221K56364O2259n1396K9543
42697A749500J07305n17j24247O333K96177L87216J88673k0450n0858m2368j40098
42686B356666k29207j69606o3175p8499j72378j89342j22453q6137j13484j48175
42676I84210j66810j54981l5500K08149L85765K62610j23928m54858m66351j97335
42666B40971J10170K59204K20872R3617n618l0526j1014J4368L9924O6418Q4627
42655A083013R7572J01732M1254j31273l26193l59522j83056K9646J01836O1227
$$ plain form
42645 516236 556269 619113 673234 668241 616644 570478 566174 623270 748815 913466 1060171
42634 1060171 1154903 1201893 1214021 1204020 1186861 1146948 1034510 850547 690441 628869 616029
42623 616029 581560 567209 615052 595874 357027 26899 -61582 194607 522296 642886
42613 642886 586126 521183 476017 393688 315054 315067 352450 348963 340115 397614 480790 514286
42601 514286 533791 595451 616870 491467 315266 314490 558121 896447 1163779 1285673 1214473
42590 1214473 950593 647461 522970 622239 800362 953842 1113314 1284344 1380919 1393969
42580 1393969 1466355 1693259 1967645 2130426 2174659 2190539 2189354 2105074 1930527 1746205
42570 1746205 1624528 1573930 1562021 1541731 1475987 1378008 1295646 1220305 1067740 815692 611247
$$ packed form
42645E16236M0033O2844N4121m993n1597m6166m304N7096J25545J64651J46705
42634A060171R4732M6990J2128j0001j7159l9913j12438j83963j60106o1572j2840
42623F16029l4469j4351M7843j9178k38847l30128q8481K56189L27689J20590
42613F42886n6760o4943m5166q2329p8634J3L7383l487q848N7499Q3176L3496
42601E14286J9505O1660K1419j25403j76201p76K43631L38326K67332J21894p1200
42590A214473k63880l03132j24491R9269J78123J53480J59472J71030R6575J3050
42580A393969P2386K26904K74386J62781M4233J5880j185q4280j74547j84322
42570A746205j21677n0598j1909k0290o5744r7979q2362p5341j52565k52048k04445
$$ plain form
42559 611247 638964 881130 1100589 1097530 918352 761793 733888 777351 820806 882920 977626
42548 977626 1012474 893950 695937 599204 660392 762076 814697 873000 991121 1093631
42538 1093631 1089696 1009870 922847 818835 700458 685774 854514 1061167 1083757 925346
42528 925346 789532 774626 781982 738886 715116 757906 778720 693847 560419 494101 536864
42517 536864 656211 793959 885378 914111 959557 1093634 1238933 1260626 1199334 1251586 1486511
42506 1486511 1740882 1841764 1776135 1591954 1310224 1015545 858252 856071 842579 719462
42496 719462 612149 662280 816208 947793 1045941 1139780 1179409 1149550 1171385 1316802 1432552
42485 1432552 1331403 1068697 852767 762926 732260 730055 771939 806701 773619 725832 737601
$$ packed form
42559F11247K7717K42166K19459l059j79178j56559k7905M3463M3455O2114R4706
42548I77626L4848j18524j98013r6733O1188J01684N2621N8303J18121J02510
42538A093631l935p9826q7023j04012j18377j4684J68740K06653K2590j58411
42528I25346j35814j4906P356m3096k3770M2790K0814q4873j33428o6318M2763
42517E36864J19347J37748R1419K8733M5446J34077J45299K1693o1292N2252K34925
42506A486511K54371J00882o5629j84181k81730k94679j57293k181j3492j23117
42496G19462j07313N0131J53928J31585R8148R3839L9629k9859K1835J45417J15750
42485A432552j01149k62706k15930q9841l0666k205M1884L4762l3082m7787J1769
$$ plain form
42474 737601 758450 729694 756631 953593 1192816 1254200 1187177 1260884 1547073 1810690 1865301
42463 1865301 1805666 1814671 1942056 2152346 2405938 2606061 2629237 2496750 2382422 2390660
42453 2390660 2462434 2537345 2641614 2762506 2811229 2782140 2780418 2818172 2759547 2556822 2363770
42442 2363770 2308532 2321738 2298829 2255463 2191964 1988936 1617047 1305273 1303821 1573143 1874016
42431 1874016 2071079 2179502 2201701 2107377 1934680 1760498 1604047 1464776 1376554 1310742
42421 1310742 1137757 834205 611075 651153 823284 866299 762042 685646 665533 583081
42411 583081 484599 574807 845036 1005841 902660 739565 745244 845762 843981 729412 610588
42400 610588 496591 365447 336252 536050 842686 974443 833860 593273 442244 411907
$$ packed form
42474G37601K0849k8756K6937J96962K39223O1384o7023P3707K86189K63617N4611
42463A865301n9635R005J27385K10290K53592K00123K3176j32487j14328Q238
42453B390660P1774P4911J04269J20892M8723k9089j722L7754n8625k02725j93052
42442B363770n5238J3206k2909m3366o3499k03028l71889l11774j452K69322L00873
42431A874016J97063J08423K2199r4324j72697j74182j56451j39271q8222o5812
42421A310742j72985l03552k23130M0078J72131M3015j04257p6396k0113q2452
42411E83081r8482R0208K70229J60805j03181j63095N679J00518j781j14569j18824
42400F10588j13997j31144k9195J99798L06636J31757j40583k40587j51029l0337
$$ plain form
42390 411907 453861 523962 549080 460571 321032 294854 431792 593576 658481 675445 723665
42379 723665 743048 649591 539635 602267 840837 1044281 1061806 957964 844685 716429
42369 716429 563712 520088 718353 1045328 1216893 1120116 940632 904238 1014782 1117290
42359 1117290 1113036 1013406 859002 706325 661640 809268 1094511 1360679 1516342 1598300
42349 1598300 1662547 1697386 1684768 1682059 1778841 1994485 2263355 2511590 2717412 2903483
42339 2903483 3095135 3280484 3393548 3351375 3138711 2850366 2612505 2451799 2274538 1992246
42329 1992246 1636268 1322285 1136292 1097380 1194439 1379867 1533747 1529618 1374171 1213667
42319 1213667 1163831 1197180 1226746 1206571 1094883 835519 486134 266873 336544 585370
$$ packed form
42390D11907M1954P0101K5118q8509j39539k6178J36938J61784O4905J6964M8220
42379G23665J9383r3457j09956O2632K38570K03444J7525j03842j13279j28256
42369G16429j52717m3624J98265L26975J71565r6777j79484l6394J10544J02508
42359A117290m254r9630j54404j52677m4685J47628K85243K66168J55663Q1958
42349A598300O4247L4839j2618k709R6782K15644K68870K48235K05822J86071
42339B903483J91652J85349J13064m2173k12664k88345k37861j60706j77261k82292
42329A992246l55978l13983j85993l8912R7059J85428J53880m129j55447j60504
42319A213667m9836L3349K9566k0175j11688k59364l49385k19261O9671K48826
$$ plain form
42309 585370 794732 927974 1078774 1203456 1165268 1045166 1117746 1427974 1661967 1589428
42299 1589428 1389949 1332209 1337908 1137648 737898 448463 478138 734208 1012792 1187011
42289 1187011 1209656 1117719 1048567 1096195 1157095 1073199 901208 851102 963894 1057943 1019762
42278 1019762 936033 878325 763681 528483 267783 89302 -26480 -112303 -102414 33812
42268 33812 162862 141364 32410 35992 237744 525266 726706 756606 650297 511788
42258 511788 407526 290259 75417 -199710 -376758 -362120 -222487 -66166 66648 155381
42248 155381 159846 96964 54752 67437 81694 100742 223732 456082 626550 615431 534843
42237 534843 543001 605618 607150 581427 627180 676812 579079 379955 293248 383788 498078
$$ packed form
42309E85370K09362J33242J50800J24682l8188j20102P2580L10228K33993p2539
42299A589428j99479n7740N699k00260l99750k89435K9675K56070K78584J74219
42289A187011K2645r1937o9152M7628O0900q3896j71991n0106J12792R4049l8181
42278A019762q3729n7708j14644k35198k60700j78481j15782q5823R889J36226
42268C3812J29050k1498j08954L582K01752K87522K01440K9900j06309j38509
42258E11788j04262j17267k14842k75127j77048J4638J39633J56321J32814Q8733
42248A55381M465o2882m2212J2685J4257J9048J22990K32350J70468j1119q0588
42237E34843Q158O2617J532k5723M5753M9632r7733j99124q6707R0540J14290
$$ plain form
42226 498078 546951 636855 830536 973883 906824 714416 606391 617534 585815 418736
42216 418736 248738 276072 528651 841813 1060243 1199026 1368507 1575606 1677801 1553485
42206 1553485 1251246 933689 734924 710723 844175 1027807 1117612 1094540 1097797 1199209
42196 1199209 1245189 1082419 858266 870811 1128172 1299416 1172976 940209 887268 986602
42186 986602 987799 809413 629018 603359 683569 752335 808295 926414 1101200 1222794 1212210
42175 1212210 1122138 1067627 1082033 1095324 1056138 999997 954452 863094 705630 630770 812604
42164 812604 1169055 1382197 1263549 976496 817105 885266 1074205 1285302 1504382 1698549
42154 1698549 1779854 1704769 1537483 1392521 1349828 1411809 1497705 1500974 1405476 1323932 1364591
$$ packed form
42226D98078M8873Q9904J93681J43347o7059j92408j08025J1143l1719j67079
42216D18736j69998K7334K52579L13162K18430J38783J69481K07099J02195j24316
42206A553485l02239l17557j98765k4201J33452J83632Q9805k3072L257J01412
42196A199209M5980j62770k24153J2545K57361J71244j26440k32767n2941R9334
42186I86602J197j78386j80395k5659Q0210O8766N5960J18119J74786J21594j0584
42175A212210r0072n4511J4406J3291l9186n6141m5545r1358j57464p4860J81834
42164H12604L56451K13142j18648k87053j59391O8161J88939K11097K19080J94167
42154A698549Q1305p5085j67286j44962m2693O1981Q5896L269r5498q1544M0659
$$ plain form
42143 1364591 1486377 1561276 1565572 1617146 1804705 2061234 2247663 2302328 2261974 2186041 2121910
42132 2121910 2114118 2172942 2230252 2193642 2071859 1986882 2006802 2014929 1842499 1532834 1358762
42121 1358762 1504268 1804979 1914250 1703913 1394018 1277099 1415681 1651490 1823509
42112 1823509 1898377 1924068 1931758 1902961 1822636 1758815 1848775 2140877 2464570 2562096 2393182
42101 2393182 2217832 2296745 2572823 2749307 2652700 2409124 2253257 2268651 2372025 2475847
42091 2475847 2565911 2630599 2619780 2535268 2496850 2612234 2787922 2791024 2554381 2310843 2317146
42080 2317146 2522165 2650334 2571964 2422202 2346770 2311214 2231509 2137706 2093793 2061042 1960204
42069 1960204 1801493 1650167 1518725 1383616 1252793 1128312 960832 736230 550976
$$ packed form
42143A364591J21786P4899M296N1574J87559K56529J86429N4665m0354p5933o4131
42132B121910p792N8824N7310l6610j21783q4977J9920Q127j72430l09665j74072
42121A358762J45506L00711J09271k10337l09895j16919J38582K35809J72019
42112A823509P4868K5691P690k8797q0325o3821Q9960K92102L23693R7526j68914
42101B393182j75350P8913K76078J76484r6607k43576j55867J5394J03374J03822
42091B475847R0064O4688j0819q4512l8418J15384J75688L102k36643k43538O303
42080B317146K05019J28169p8370j49762p5432l5556p9705r3803m3913l2751j00838
42069A960204j58711j51326j31442j35109j30823j24481j67480k24602j85254
$$ plain form
42060 550976 499997 543610 595829 687916 901263 1159749 1241473 1028854 641981 297391
42050 297391 119632 102516 160972 195318 183441 230181 451495 794567 1051854 1079690 938878
42039 938878 801821 785278 889939 1037621 1142497 1192660 1271014 1456516 1723186 1991817
42029 1991817 2242975 2489472 2673317 2717281 2675056 2693451 2799321 2854666 2765347 2604085
42019 2604085 2462000 2301455 2049252 1744954 1502132 1383076 1379893 1451542 1516389 1485314
42009 1485314 1372684 1298677 1313531 1310588 1198680 1058446 1004657 980081 845488 632460
41999 632460 538163 659598 877248 1034937 1107166 1131939 1089895 948727 776996 715832
41989 715832 826129 1020266 1181930 1332149 1615650 2085845 2555524 2756073 2647060 2467905
$$ packed form
42060E50976n0979M3613N2219R2087K13347K58486Q1724k12619l86873l44590
42050B97391j77759j7116N8456L4346j1877M6740K21314L43072K57287K7836j40812
42039I38878j37057j6543J04661J47682J04876N0163P8354J85502K66670K68631
42029A991817K51158K46497J83845M3964m2225J8395J05870N5345q9319j61262
42019B604085j42085j60545k52203l04298k42822j19056l183P1649O4847l1075
42009A485314j12630p4007J4854k943j11908j40234n3789k4576j34593k13028
41999F32460r4297J21435K17650J57689P2229K4773m2044j41168j71731o1164
41989G15832J10297J94137J61664J50219K83501M70195M69679K00549j09013j79155
$$ plain form
41979 2467905 2449704 2576238 2685867 2704260 2684719 2705161 2833784 3125327 3530221 3860807
41969 3860807 3970112 3917757 3835273 3685905 3321648 2751811 2178980 1761138 1501930 1382706
41959 1382706 1409350 1481237 1414695 1197422 1050302 1116869 1245785 1226671 1102480 1061540
41949 1061540 1113289 1084821 919200 785099 855103 1114149 1430235 1703652 1894128 1982570
41939 1982570 1967246 1868851 1722986 1593554 1570630 1688794 1849882 1892667 1749222 1484895
41929 1484895 1195239 931922 726972 605423 545523 489289 421924 388489 407145 423121
41919 423121 388855 346438 382612 522284 704579 854211 943554 979757 956420 852181 695142
41908 695142 597862 662747 840621 957307 925190 854459 880780 954195 912632 722266 512299
$$ packed form
41979B467905j8201J26534J09629J8393j9541K0442J28623K91543M04894L30586
41969C860807J09305n2355q2484j49368l64257n69837n72831m17842k59208j19224
41959A382706K6644P1887o6542k17273j47120O6567J28916j9114j24191m0940
41949A061540N1749k8468j65621j34101P0004K59046L16086K73417J90476Q8442
41939A982570j5324r8395j45865j29432k2924J18164J61088M2785j43445k64327
41929A484895k89656k63317k04950j21549n9900n6234o7365l3435J8656J5976
41919D23121l4266m2417L6174J39672J82295J49632Q9343L6203k3337j04239j57039
41908F95142r7280O4885J77874J16686l2117p0731K6321P3415m1563j90366k09967
$$ plain form
41897 512299 385415 335954 365145 518250 753434 921606 960997 982601 1065032 1096307 955900
41886 955900 743300 652047 682103 661884 529984 405993 364692 320806 199414 71465
41876 71465 37075 90680 185868 329209 512701 640642 637445 576101 595174 720445 859846
41865 859846 945740 985406 980620 890566 694203 434421 192335 50317 53718 157418 244665
41854 244665 267225 328060 533299 799837 940125 929045 925214 984720 930374 627455 250547
41843 250547 94209 183263 266632 197456 124652 234693 462236 590262 551032 480026 488962
41832 488962 518373 457554 322602 239949 278844 365515 380975 305321 222958 190768 155457
41821 155457 37993 -140115 -280187 -339290 -354982 -325736 -170533 126525 416240 535211
$$ packed form
41897E12299j26884m9461K9191J53105K35184J68172L9391K1604Q2431L1275j40407
41886I55900k12600r1253L0056k0219j31900j23991m1301m3886j21392j27949
41876G1465l4390N3605R5188J43341J83492J27941l197o1344J9073J25271J39401
41865H59846Q5894L9666m786r0054j96363k59782k42086j42018L401J03700Q7247
41854B44665K2560O0835K05239K66538J40288j1080l831N9506n4346l02919l76908
41843B50547j56338Q9054Q3369o9176p2804J10041K27543J28026l9230p1006Q936
41832D88962K9411o0819j34952q2653L8895Q6671J5460p5654q2363l2190l5311
41821A55457j17464j78108j40072n9103j5692K9246J55203K97058K89715J18971
$$ plain form
41811 535211 514198 520983 609542 653386 558155 422152 410578 542684 679034 676215 499257
41800 499257 233447 48138 92611 338220 554427 533751 329715 186395 238871 377205
41790 377205 415394 294234 84131 -112998 -198313 -90902 197826 528841 741422 786660
41780 786660 725004 633298 566287 563346 607655 592990 420344 145643 -38724 196 208379
41769 208379 435947 598640 705560 772969 781579 723596 646562 624001 684858 774249 788008
41758 788008 663844 448357 258123 161519 118277 58753 4428 64840 300750 621732
41748 621732 850261 879112 741025 532011 311858 105358 -38385 -52871 70127 259613
41738 259613 441617 595792 711473 741899 660930 528370 423662 338530 232278 186801
$$ packed form
41811E35211k1013O785Q8559M3844r5231j36003j1574J32106J36350k819j76958
41800D99257k65810j85309M4473K45609K16207k0676k04036j43320N2476J38334
41790C77205L8189j21160k10103j97129q5315J07411K88728L31015K12581M5238
41780G86660o1656r1706o7011k941M4309j4665j72646k74701j84367L8920K08183
41769B08379K27568J62693J06920O7409Q610n7983p7034k2561O0857Q9391J3759
41758G88008j24164k15487j90234r6604m3242n9524n4325O0412K35910L20982
41748F21732K28529K8851j38087k09014k20153k06500j43743j4486J22998J89486
41738B59613J82004J54175J15681L0426q0969j32560j04708q5132j06252m5477
$$ plain form
41728 186801 365166 745764 1025448 933191 583860 357574 426474 566843 500572 269806
41718 269806 144668 252732 453144 544097 447228 185913 -162275 -431619 -421701 -105264
41708 -105264 274793 424588 300482 114834 59463 111000 122148 26980 -93344 -122098
41698 -122098 -50507 -3901 -112190 -342548 -491486 -383719 -63294 250802 377904 301281
41688 301281 118974 -46562 -96425 -6260 140412 232490 262073 307928 378688 368984 214182
41677 214182 -4448 -172087 -269344 -308408 -234509 -24813 161005 87173 -268363 -636352
41667 -636352 -720009 -479403 -123752 126210 232466 327789 541283 841221 1068907 1132053
41657 1132053 1105114 1090044 1043567 840293 477558 110148 -118044 -182864 -126119 -7028
$$ packed form
41728A86801J78365L80598K79684r2257l49331k26286O8900J40369o6271k30766
41718B69806j25138J08064K00412R0953r6869k61315l48188k69344R918L16437
41708a05264L80057J49795j24106j85648n5371N1537J1148r5168j20324k8754
41698a22098P1591M6606j08289k30358j48938J07767L20425L14096J27102p6623
41688C01281j82307j65536m9863R0165J46672R2078K9583M5855P0760r704j54802
41677B14182k18630j67639r7257l9064P3899K09696J85818p3832l55536l67989
41667f36352q3657K40606L55651K49962J06256R5323K13494K99938K27686O3146
41657A132053k6939j5070m6477k03274l62735l67410k28192o4820N6745J19091
$$ plain form
41647 -7028 74235 22514 -133243 -259123 -294412 -307397 -325172 -239145 9327 247035 222722
41636 222722 -83216 -423874 -557898 -456593 -235523 15591 282988 561728 795706 898181
41626 898181 838357 702130 625870 648399 673072 608410 491425 418556 408086 406314 391888
41615 391888 389288 402660 424384 493398 644056 791027 771939 548277 284608 171979 222073
41604 222073 283898 228183 74645 -39619 5557 182409 308003 220057 -11902 -111303
41594 -111303 111376 529477 834049 871181 761243 684592 656728 575616 406125 206920
41584 206920 7804 -209094 -386789 -387811 -188519 35620 137360 214737 436111 713309
41574 713309 773215 568001 373238 384482 445917 350728 217002 317480 644852 916348
$$ packed form
41647g028Q1263n1721j55757j25880l5289j2985j7775Q6027K48472K37708k4313
41636B22722l05938l40658j34024J01305K21070K51114K67397K78740K33978J02475
41626H98181n9824j36227p6260K2529K4673o4662j16985p2869j0470j772j4426
41615C91888k600J3372K1724O9014J50658J46971j9088k23662k63669j12629N0094
41604B22073O1825n5715j53538j14264M5176J76852J25594q7946k31959r9401
41594a11303K22679M18101L04572L7132j09938p6651k7864q1112j69491j99205
41584B06920j99116k16898j77695j022J99292K24139J01740P7377K21374K77198
41574G13309N9906k05214j94763J1244O1435r5189j33726J00478L27372K71496
$$ plain form
41564 916348 980859 964093 984977 975345 869916 770116 785385 848379 818426 681405 544387
41553 544387 502020 587511 780705 982230 1042795 898660 641641 414484 291056 277844
41543 277844 338725 379095 310140 181114 141844 228329 325041 407597 642490 1104056 1554995
41532 1554995 1709801 1605704 1493376 1441011 1299306 1032273 812397 738793 705536 649297
41522 649297 711549 998716 1333660 1427720 1230489 961809 833416 860243 928106 937102 861402
41511 861402 736214 610329 491683 352209 206690 154038 295008 612230 952630 1127717
41501 1127717 1044341 777852 523219 430822 473915 506981 446684 341068 267586 246948 279952
41490 279952 380844 520116 602383 566694 465983 394101 374623 369561 351905 313484 242466
$$ packed form
41564I16348O4511j6766K0884r632j05429r9800J5269O2994k9953j37021j37018
41553E44387m2367Q5491J93194K01525O0565j44135k57019k27157j23428j3212
41543B77844O0881M0370o8955j29026l9270Q6485R6712Q2556K34893M61566M50939
41532A554995J54806j04097j12328n2365j41705k67033k19876p3604l3257n6239
41522F49297O2252K87167L34944R4060j97231k68680j28393K6827O7863Q996p5700
41511H61402j25188j25885j18646j39474j45519n2652J40970L17222L40400J75087
41501A127717q3376k66489k54633r2397M3093L3066o0297j05616p3482k0638L3004
41490B79952J00892J39272Q2267l5689j00711p1882j9478n062j7656l8421p1018
$$ plain form
41479 242466 154985 116276 167886 259794 316380 347051 424431 564019 695174 761035 790086
41468 790086 841066 905529 895441 738737 488983 313812 330535 464189 536115 496821 473316
41457 473316 544602 587298 455148 235390 175810 360717 590232 625939 475501 380431
41447 380431 549699 925710 1211210 1161583 872260 704356 861632 1131813 1168719 946627
41437 946627 742435 698739 648755 436537 169326 210 -142501 -387674 -605152 -514748
41427 -514748 -89612 376737 638154 735758 810930 864393 820088 698994 587624 502071
41417 502071 410923 355803 426755 616596 794468 842043 751163 579637 381247 203313
41407 203313 90573 47012 27298 876 -5402 31342 49298 -60526 -325345 -639101 -860120
$$ packed form
41479B42466q7481l8709N1610R1908N6586L0671P7380J39588J31155O5861K9051
41468G90086N0980O4463j0088j56704k49754j75171J6723J33654P1926l9294k3505
41457D73316P1286M2696j32150k19758n9580J84907K29515L5707j50438r5070
41447C80431J69268L76011K85500m9627k89323j67904J57276K70181L6906k22092
41437I46627k04192m3696m9984k12218k67211j69116j42711k45173k17478R0404
41427e14748M25136M66349K61417R7604P5172N3463m4305j21094j11370q5553
41417E02071r1148n5120P0952J89841J77872M7575r0880j71526j98390j77934
41407B03313j12740m3561j9714k6422o278L6744J7956j09824k64819l13756k21019
$$ plain form
41396 -860120 -928356 -860025 -669715 -373044 -69521 66590 -50822 -299953 -464516 -457028
41386 -457028 -365408 -286675 -204406 -64577 106024 222956 241752 171201 23548 -178968
41376 -178968 -361119 -424811 -335414 -149191 35207 128091 90928 -18216 -75345 -36147 -18769
41365 -18769 -150340 -354895 -416863 -267668 -76609 -6417 -6370 64666 220014 367617 469008
41354 469008 539398 536838 397956 179938 37589 38891 106586 158346 196075 221930 169814
41343 169814 -13637 -277555 -500179 -572079 -439159 -138267 187410 386653 443022 446078
41333 446078 412494 258553 -2335 -179622 -135322 18156 90106 94086 187211 378910 505676
41322 505676 514437 567788 773061 964591 898856 576302 219147 -28018 -216361 -398542
$$ packed form
41396h60120o8236O8331J90310K96671L03523J36111j17412k49131j64563P488
41386d57028R1620P8733Q2269J39829J70601J16932J8796p0551j47653k02516
41376a78968j82151o3692Q9397J86223J84398R2884l7163j09144n7129L9198J7378
41365a8769j31571k04555o1968J49195J91059P0192M7P1036J55348J47603J01391
41354D69008P0390k560j38882k18018j42349J302O7695N1760L7729K5855n2116
41343A69814j83451k63918k22624p1900J32920L00892L25677J99243N6369L056
41333D46078l3584j53941k60888j77287M4300J53478P1950L980R3125J91699J26766
41322E05676Q761N3351K05273J91530o5735l22554l57155k47165j88343j82181
$$ plain form
41312 -398542 -477212 -351634 -125330 -21902 -93822 -143859 4629 259623 385061 310877
41302 310877 185091 133912 121952 86132 55156 45958 -27360 -209008 -360516 -319568 -146475
41291 -146475 -55416 -127375 -248009 -317695 -350682 -346173 -238678 -38250 134535 229008 334825
41280 334825 485690 544921 414373 228585 184725 273396 342338 351392 376725 403204 321909
41269 321909 155000 91075 226538 422991 507661 485455 443436 354117 127076 -181441
41259 -181441 -360313 -280858 -52049 111457 125168 89507 139723 299982 487594 604601
41249 604601 591617 435457 189597 -20305 -78286 13674 150948 251210 304013 298416 202975
41238 202975 59172 -6853 63008 184791 288413 435162 654979 777621 620848 299454
$$ packed form
41312c98542p8670J25578K26304J03428p1920n0037J48488K54994J25438p4184
41302C10877j25786n1179j1960l5820l0976r198p3318j81648j51508M0948J73093
41291a46475R1059p1959j20634o9686l2987M509J07495K00428J72785R4473J05817
41280C34825J50865N9231j30548j85788m3860Q8671O8942R054K5333K6479q1295
41269C21909j66909o3925J35463J96453Q4670k2206m2019q9319k27041l08517
41259a81441j78872P9455K28809J63506J3711l5661N0216J60259J87612J17007
41249F04601j2984j56160k45860k09902n7981R1960J37274J00262N2803n597r5441
41238B02975j43803o6025O9861J21783J03622J46749K19817J22642j56773l21394
$$ plain form
41228 299454 134534 242725 412498 428863 323636 224823 148712 70935 49966 118646 153613
41217 153613 16211 -227598 -362960 -272056 -25966 222478 338779 253308 23400 -178736
41207 -178736 -235141 -209029 -225488 -286676 -309972 -289610 -289806 -312944 -304538 -265114 -230229 -162977
41195 -162977 -3356 189135 288233 299709 360062 514241 637968 627212 544206 520858 603428
41184 603428 720996 733015 523449 154547 -104517 -49324 186231 306400 273713 307518
41174 307518 449589 442514 166285 -97504 -48705 215272 402890 447726 453048 384208 138437
41163 138437 -162078 -259719 -121391 56507 172459 275807 325236 206431 25891 74946
41153 74946 406248 718883 774284 666649 555024 396779 131812 -100898 -153683 -105149
$$ packed form
41228B99454j64920J08191J69773J6365j05227r8813p6111p7777k0969O8680L4967
41217A53613j37402k43809j35362R0904K46090K48444J16301q5471k29908k02136
41207a78736n6405K6112j6459o1188k3296K0362j96k3138Q406L9424L4885O7252
41195a62977J59621J92491R9098J1476O0353J54179J23727j0756q3006k3348Q2570
41184F03428J17568J2019k09566l68902k59064N5193K35555J20169l2687L3805
41174C07518J42071p075k76229k63789M8799K63977J87618M4836N322o8840k45771
41163A38437l00515r7641J38328J77898J15952J03348M9429j18805j80540M9055
41153G4946L31302L12635N5401j07635j11625j58245k64967k32710n2785M8534
$$ plain form
41143 -105149 -91872 -54819 126635 372392 502908 515497 541651 595535 574531 459330 314896
41132 314896 142813 -61847 -153885 27119 367263 546555 422443 147560 -108875 -327942
41122 -327942 -477269 -428564 -177178 40738 20050 -135287 -154741 53376 329322 483407
41112 483407 473923 390541 357440 454508 675995 950096 1193620 1326875 1279371 1075853 901921
41101 901921 953903 1191289 1358504 1296276 1107330 960328 876473 805797 770540 787173 753803
41090 753803 589403 428549 500822 818468 1126538 1182447 977030 667726 402065 241055
41080 241055 171022 137054 93321 36280 -21874 -80242 -116293 -77449 32496 108726 71485
41069 71485 325 47933 242329 471362 646525 769605 828135 742326 473851 121734
$$ packed form
41143a05149J3277L7053J81454K45757J30516J2589K6154N3884k1004j15201j44434
41132C14896j72083k04660r2038J81004L40144J79292j24112k74883k56435k19067
41122c27942j49327M8705K51386K17916k0688j55337j9454K08117K75946J54085
41112D83407r484q3382l3101R7068K21487K74101K43524J33255m7504k03518j73932
41101I01921N1982K37386J67215o2228j88946j47002q3855p0676l5257J6633l3370
41090G53803j64400j60854P2273L17646L08070N5909k05417l09304k65661j61010
41080B41055p0033l3968m3733n7041n8154n8368l6051L8844J09945P6230l7241
41069G1485p1160M7608J94396K29033J75163J23080N8530q5809k68475l52117
$$ plain form
41059 121734 -145536 -234888 -195603 -163453 -225462 -312355 -257201 -806 308933 480914 489344
41048 489344 445357 428745 454228 540621 672214 732026 631381 484210 481593 601620 641124
41037 641124 554513 531642 658135 727818 545853 237510 70595 102918 197800 285859 398020
41026 398020 491295 455476 300680 169264 139456 154137 160032 181779 224557 223977 145455 48571
41014 48571 6867 21250 37246 945 -104244 -227692 -275393 -220810 -154881 -146991 -111292
41003 -111292 59110 258138 242636 -22368 -257843 -196965 105072 388215 517134 572242
40993 572242 667422 805660 920487 972214 971181 940397 875136 742913 540583 344657 257356
40982 257356 289549 349951 374178 404047 494448 598781 619704 549593 488559 519630 622836
$$ packed form
41059A21734k67270q9352L9285L2150o2009q6893N5154K56395L09739J71981Q430
41048D89344m3987j6612K5483Q6393J31593N9812j00645j47171k617J20027L9504
41037F41124q6611k2871J26493O9683j81965l08343j66915L2323R4882Q8059J12161
41026C98020R3275l5819j54796j31416k9808J4681N895K1747M2778n80p8522r6884
41014D8571m1704J4383J5996l6301j05189j23448m7701N4583O5929P890L5699
41003a11292J70402J99028j5502k65004k35475O0878L02037K83143J28919N5108
40993E72242R5180J38238J14827N1727j033l0784o5261j32223k02330j95926q7301
40982B57356L2193O0402K4227K9869R0401J04333K0923p0111o1034L1071J03206
$$ plain form
40971 622836 728559 804977 851401 832907 689483 438590 217393 151729 193633 173519 37021
40960 37021 -60410 44230 301687 516216 568533 476113 288915 52277 -151112 -250457
40950 -250457 -276012 -291589 -264814 -145114 -47996 -168964 -475312 -673450 -566381 -276193
40940 -276193 -12260 209702 473934 740833 906312 995224 1105464 1201751 1139469 886695
40930 886695 577835 340219 186572 87051 40817 53839 115128 200866 260333 233031 131350
40919 131350 49384 27262 -14948 -125928 -202666 -138685 1867 102324 193063 355154 505387
40908 505387 495680 382409 356962 415006 349458 108432 -99510 -140239 -144501 -238443 -316625
40897 -316625 -255792 -160651 -194562 -311937 -365321 -358912 -372457 -317378 -17098 477106 867518
$$ packed form
40971F22836J05723P6418M6424j8494j43424k50893k21197o5664M1904k0114j36498
40960C7021r7431J04640K57457K14529N2317r2420j87198k36638k03389r9345
40950b50457k5555j5577K6775J19700R7118j20968l06348j98138J07069K90188
40940b76193K63933K21962K64232K66899J65479Q8912J10240R6287o2282k52774
40930H86695l08860k37616j53647r9521m6234J3022O1289Q5738N9467k7302j01681
40919A31350q1966k2122m2210j10980p6738O3981J40552J00457R0739J62091J50233
40908E05387r707j13271k5447N8044o5548k41026k07942m0729m262r3942p8182
40897c16625O0833R5141l3911j17375n3384O409j3545N5079L00280M94204L90412
$$ plain form
40886 867518 952613 833182 731235 733255 772551 769847 716555 650585 588093 485712 297909
40875 297909 84105 -4388 106962 318342 479857 545585 544903 494813 437986 476032 632723
40864 632723 753121 682937 491646 362573 318754 248866 168231 215825 365514 392506 229925
40853 229925 129630 298902 558391 583760 377497 249485 351142 475920 394846 194506
40843 194506 138596 304295 525645 676218 845620 1166416 1569886 1835110 1859834 1768843
40833 1768843 1724583 1730063 1687818 1574602 1449733 1323280 1132768 867568 628699 531057
40823 531057 597916 763188 921936 975167 895118 763704 685693 655481 577933 420580 250362
40812 250362 107477 -35931 -147507 -104764 104743 270887 196063 -27284 -134134 -43200
$$ packed form
40886H67518Q5095j19431j01947K020L9296k704n3292o5970o2492j02381j87803
40875B97909k13804q8493J11350K11380J61515O5728o82n0090n6827L8046J56691
40864F32723J20398p0184j91291j29073m3819o9888q0635M7594J49689K6992j62581
40853B29925j00295J69272K59489K5369k06263j28012J01657J24778q1074k00340
40843A94506n5910J65699K21350J50573J69402L20796M03470K65224K4724r0991
40833A768843m4260N480m2245j13216j24869j26453j90512k65200k38869r7642
40823E31057O6859J65272J58748N3231q0049j31414p8011l0212p7548j57353j70218
40812B50362j42885j43408j11576M2743K09507J66144p4824k23347j06850R0934
$$ plain form
40802 -43200 85305 155310 293764 604522 923866 990477 791548 574764 526460 593063
40792 593063 658379 746128 930575 1130515 1144941 907105 596498 448789 513938 651610
40782 651610 729099 769505 902564 1190304 1510238 1632625 1445042 1084326 797163 688326
40772 688326 683730 723962 851917 1052050 1150455 1015211 772873 669046 751793 847064 832242
40761 832242 767879 736045 713345 671670 668644 747823 850210 910424 950982 995067 976935
40750 976935 848698 706618 687312 776470 840727 830078 824138 866568 875003 770748 612582
40739 612582 524041 527920 530258 466488 394315 404114 483014 541286 571062 685454 940040 1187586
40727 1187586 1214716 997998 720858 548271 504098 577258 793904 1105144 1324756 1297740
$$ packed form
40802d3200J28505P0005J38454L10758L19344O6611j98929k16784m8304O6603
40792E93063O5316Q7749J84447J99940J4426k37836l10607j47709O5149J37672
40782F51610P7489M0406J33059K87740L19934J22387j87583l60716k87163j08837
40772F88326m596M0232J27955K00133R8405j35244k42338j03827Q2747R5271j4822
40761H32242o4363l1834k2700m1675l026P9179J02387O0214M0558M4085j8132
40750I76935j28237j42080j9306Q9158O4257j0649n940M2430Q435j04255j58166
40739F12582q8541L879K338o3770p2173R799P8900N8272K9776J14392K54586K47546
40727A187586K7130k16718k77140j72587m4173P3160K16646L11240K19612k7016
$$ plain form
40717 1297740 1075128 835154 685503 623458 628775 690718 771497 831164 872671 901819 881571
40706 881571 792232 686501 606492 504334 345294 231743 287826 444920 494967 384016
40696 384016 319187 520645 958540 1402445 1668900 1754240 1757999 1741606 1680230 1538128 1357034
40685 1357034 1217360 1108236 922820 640423 428625 460628 686444 903658 1015028 1077474
40675 1077474 1112676 1030970 783115 457946 175644 -12285 -73714 39017 302926 585580
40665 585580 758798 794627 719932 566856 418091 407912 598909 905735 1182271 1328734
40655 1328734 1305572 1155405 1053569 1202251 1581018 1911384 1975603 1872970 1840690 1915759
40645 1915759 1930090 1785283 1568243 1404591 1334322 1332964 1336497 1247777 1036047 829514 789309
$$ packed form
40717A297740k22612k39974j49651o2045N317O1943Q0779N9667M1507K9148k0248
40706H81571q9339j05731q0009j02158j59040j13551N6083J57094N0047j10951
40696C84016o4829K01458M37895M43905K66455Q5340L759j6393o1376j42102j81094
40685A357034j39674j09124j85416k82397k11798L2003K25816K17214J11370O2446
40675A077474L5202q1706k47855l25169k82302j87929o1429J12731K63909K82654
40665E85580J73218L5829p4695j53076j48765j0179J90997L06826K76536J46463
40655A328734k3162j50167j01836J48682L78767L30366O4219j02633l2280P5069
40645A915759J4331j44807k17040j63652p0269j358L533q8720k11730k06533m0205
$$ plain form
40634 789309 889873 954252 919291 920259 1070457 1300320 1486257 1608260 1686124 1679206 1577233
40623 1577233 1506824 1603064 1811138 1944343 1926165 1860687 1867406 1961044 2107867 2285080 2442254
40612 2442254 2503547 2471705 2456532 2535599 2650993 2717988 2777830 2940183 3192591 3369638
40602 3369638 3332974 3112224 2848577 2666427 2627816 2739617 2940366 3112424 3165190 3099740
40592 3099740 2964182 2774600 2527214 2271478 2111286 2110761 2217204 2289510 2210172 1992914
40582 1992914 1787489 1746285 1871604 2032956 2144294 2246626 2368363 2406544 2277107 2134567
40572 2134567 2272519 2769523 3367957 3768312 3933166 4025519 4162862 4358678 4629070 4990770
40562 4990770 5350728 5536109 5481511 5296458 5104002 4893639 4590594 4200216 3803921 3451273
$$ packed form
40634G89309J00564O4379l4961R68J50198K29863J85937J22003P7864o918j01973
40623A577233p0409R6240K08074J33205j8178o5478O719R3638J46823J77213J57174
40612B442254O1293l1842j5173P9067J15394O6995N9842J62353K52408J77047
40602C369638l6664k20750k63647j82150l8611J11801K00749J72058N2766o5450
40592C099740j35558j89582k47386k55736j60192n25J06443P2306p9338k17258
40582A992914k05425m1204J25319J61352J11338J02332J21737L8181j29437j42540
40572B134567J37952M97004N98434M00355J64854R2353J37343J95816K70392L61700
40562D990770L59958J85381n4598j85053j92456k10363l03045l90378l96295l52648
$$ plain form
40552 3451273 3139184 2883549 2728485 2672918 2658346 2650541 2664914 2681894 2623787 2487577 2423827
40541 2423827 2563704 2800856 2884621 2740088 2550052 2470663 2422724 2277975 2114519 2100637
40531 2100637 2186284 2122839 1825220 1545732 1597657 2001468 2486328 2784171 2856495 2865071
40521 2865071 2968347 3140600 3195508 3020589 2757817 2667972 2822419 3035202 3122688 3111819
40511 3111819 3125308 3165340 3124182 2967011 2800756 2755993 2858873 3025816 3145999 3157222
40501 3157222 3057346 2865559 2611214 2377021 2291502 2407242 2624799 2822237 3020404 3302984
40491 3302984 3601109 3718251 3595090 3394533 3267699 3183165 3067203 2969200 2970607 3034591
40481 3034591 3065845 3049660 3039294 3073999 3179504 3362367 3541486 3600366 3576480 3649788 3848237
$$ packed form
40552C451273l12089k55635j55064n5567j4572p805J4373J6980n8107j36210o3750
40541B423827J39877K37152Q3765j44533j90036p9389m7939j44749j63456j3882
40531B100637Q5647o3445k97619k79488N1925M03811M84860K97843P2324Q576
40521B865071J03276J72253N4908j74919k62772q9845J54447K12783Q7486j0869
40511C111819J3489M0032m1158j57171j66255m4763J02880J66943J20183J1223
40501C157222r9876j91787k54345k34193q5519J15740K17557J97438J98167K82580
40491C302984K98125J17142j23161k00557j26834q4534j15962r8003J407O3984
40481C034591L1254j6185j0366L4705J05505J82863J79119N8880k3886P3308J98449
$$ plain form
40470 3848237 3951528 3846434 3784599 4045984 4492781 4752014 4757347 4785666 4971347 5126340
40460 5126340 5118168 5110594 5272458 5497798 5611429 5667132 5824099 6043735 6127584 6014037
40450 6014037 5857721 5816946 5901179 6043364 6208101 6384469 6540415 6635492 6663206 6659690
40440 6659690 6670939 6713918 6772457 6830736 6893850 6967187 7041321 7108706 7156246 7131863 6993817
40429 6993817 6833017 6848511 7109832 7423670 7553093 7503408 7455345 7475872 7474114 7426477 7444320
40418 7444320 7566583 7656186 7596854 7474083 7456492 7564369 7644044 7548636 7296733 7055853
40408 7055853 6970039 7001639 6994164 6915137 6932747 7164892 7466393 7617160 7636482 7724221 7944148
40397 7944148 8174101 8352835 8562110 8844266 9132395 9390426 9645836 9870507 10023125
$$ packed form
40470C848237J03291j05094o1835K61385M46797K59233N333K8319J85681J54993
40460E126340q172p574J61864K25340J13631N5703J56967K19636Q3849j13547
40450F014037j56316m0775Q4233J42185J64737J76368J55946R5077K7714l516
40440F659690J1249M2979N8539N8279O3114P3337P4134O7385M7540k4383j38046
40429F993817j60800J5494K61321L13838J29423m9685m8063K0527j758m7637J7843
40418G444320J22263Q9603n9332j22771j7591J07877P9675r5408k51903k40880
40408G055853q5814L1600p475p9027J7610K32145L01501J50767J9322Q7739K19927
40397G944148K29953J78734K09275K82156K88129K58031K55410K24671J52618
$$ plain form
40388 10023125 10229242 10708260 11475364 12313033 13083641 13872778 14780240 15783582 16877876
40379 16877876 18157866 19696136 21508189 23660039 26220147 29109687 32230060 35739868
40371 35739868 39979561 45167060 51418554 58934354 67795935 77765481 88843387 101924330
40363 101924330 118323574 138907546 164484771 196267714 233407629 268948837 290554655
40356 290554655 288475081 263529494 226231329 188252434 155724151 129622541 109262505
40349 109262505 93678483 81329283 70756180 61631224 54283899 48508262 43644480
40342 43644480 39475672 36159518 33458432 30840595 28268699 26188489 24747069 23606856
40334 23606856 22498897 21399792 20189301 18703651 17168628 16058911 15449530 14956428
$$ packed form
40388A0023125K06117M79018P67104Q37669P70608P89137R07462J003342J094294
40379A6877876J279990J538270J812053K151850K560108K889540L120373L509808
40371C5739868M239693N187499O251494P515800Q861581R969546J1077906J3080943
40363A01924330J6399244K0583972K5577225L1782943L7139915L5541208K1605818
40356B90554655k079574k4945587l7298165l7978895l2528283k6101610k0360036
40349A09262505j5584022j2349200j0573103r124956p347325n775637m863782
40342D3644480m168808l316154k701086k617837k571896k080210j441420j140213
40334B3606856j107959j099105j210491j485650j535023j109717o09381m93102
$$ plain form
40326 14956428 14360091 13810705 13346803 12725464 11908421 11258930 11001935 10847470 10420025
40317 10420025 9785713 9289883 9079826 9038271 9049059 9106440 9227388 9404202 9613354 9817251
40307 9817251 10012594 10266180 10595631 10855194 10903262 10840688 10869773 10946315 10839718 10563490
40297 10563490 10461566 10776447 11373453 11986293 12502937 12909274 13186077 13390511 13641807
40288 13641807 13923333 14103078 14233515 14584670 15265610 16071878 16854750 17784218 19069077
40279 19069077 20659349 22420692 24382569 26633418 29210604 32286987 36212092 41162705
40271 41162705 47018906 53776341 61737335 71072468 81663639 93769739 108394700 126579830
40263 126579830 148935001 176315712 209505512 245972554 276962802 290580157 280228152
$$ packed form
40326A4956428n96337n49386m63902o21339q17043o49491k56995j54465m27445
40317A0420025o34312m95830k10057m1555J0788N7381J20948J76814K09152K03897
40307I817251J95343K53586L29451K59563M8068o2574K9085P6542j06597k76228
40297A0563490j01924L14881N97006O12840N16644M06337K76803K04434K51296
40288A3641807K81526J79745J30437L51155O80940Q06268P82872R29468J284859
40279A9069077J590272J761343J961877K250849K577186L076383L925105M950613
40271D1162705N856201O757435P960994R335133J0591171J2106100J4624961J8185130
40263A26579830K2355171K7380711L3189800L6467042L0990248J3617355j0352005
$$ plain form
40256 280228152 250124873 211805633 175599344 145797341 122260558 103856849 89581797
40249 89581797 78187286 68497657 60069995 52935823 46923288 41708037 37250374 33651554
40241 33651554 30714055 28081637 25709470 23782988 22229183 20713569 19147877 17839592
40233 17839592 17021450 16484742 15814428 14835358 13719082 12739309 11999730 11382200 10758576
40224 10758576 10235705 10069351 10274802 10486737 10356624 9952807 9581453 9346865 9137822
40215 9137822 8951181 8921471 9036367 9110787 9085363 9095086 9190779 9247624 9222880 9247052 9354222
40204 9354222 9372886 9225033 9099832 9157475 9266591 9227404 9070889 8924347 8746564 8445681
40194 8445681 8140722 8034752 8078905 8015353 7752959 7479706 7372407 7386461 7396914 7402123
$$ packed form
40256B80228152l0103279l8319240l6206289k9802003k3536783j8403709j4275052
40249H9581797j1394511r689629q427662p134172o012535n215251m457663l598820
40241C3651554k937499k632418k372167j926482j553805j515614j565692j308285
40233A7839592q18142n36708o70314r79070j116276r79773p39579o17530o23624
40224A0758576n22871j66354K05451K11935j30113m03817l71354k34588k09043
40215I137822j86641k9710J14896P4420k5424R723R5693N6845k4744K4172J07170
40204I354222J8664j47853j25201N7643J09116l9187j56515j46542j77783l00883
40194H445681l04959j05970M4153o3552k62394k73253j07299J4054J0453N209
$$ plain form
40184 7402123 7497165 7709909 7921735 7946431 7704643 7328897 7033704 6863888 6676725 6408470
40174 6408470 6196916 6139256 6104435 5960336 5845263 5999759 6426278 6932450 7426307 7929903
40164 7929903 8363966 8582203 8599507 8539070 8377200 8016735 7607805 7470743 7628798 7729622
40154 7729622 7552697 7296058 7187162 7093643 6774104 6313422 6024805 6018270 6107637 6099701
40144 6099701 5989329 5899102 5962636 6220018 6517612 6589857 6359103 6063097 5955539 5983242
40134 5983242 5918468 5717700 5557242 5556697 5642918 5674204 5564612 5317194 5060766 5003389 5210407
40123 5210407 5479719 5578890 5541255 5564454 5689464 5789759 5837757 5948065 6149735 6341580
40113 6341580 6507241 6753982 7077802 7302410 7340015 7320900 7361842 7385416 7288443 7126574
$$ packed form
40184G402123R5042K12744K11826K4696k41788l75746k95193j69816j87163k68255
40174F408470k11554n7660l4821j44099j15073J54496M26519N06172M93857N03596
40164G929903M34063K18237J7304o0437j61870l60465m08930j37062J58055J00824
40154G729622j76925k56639j08896r3519l19539m60682k88617o535Q9367p936
40144F099701j10372r0227O3534K57382K97594P2245k30754k96006j07558K7703
40134E983242o4774k00768j60458n45Q6221L1286j09592k47418k56428n7377K07018
40123E210407K69312R9171l7635K3199J25010J00295M7998J10308K01670J91845
40113F341580J65661K46741L23820K24608L7605j9115M0942K3574r6973j61869
$$ plain form
40103 7126574 6998326 6891821 6791551 6806429 7025404 7334051 7524836 7522826 7384863 7170635
40093 7170635 6950796 6838714 6839740 6744517 6359229 5792139 5321710 5018737 4714899 4347884
40083 4347884 4105935 4152444 4384025 4558252 4538624 4348441 4110428 3995902 4096806 4274471
40073 4274471 4280058 4113571 4094013 4422859 4829596 4872877 4523015 4209659 4282111 4632305
40063 4632305 4918038 4982451 4927446 4877862 4828753 4729967 4621887 4621351 4775155 4971526 5049068
40052 5049068 4991129 4941508 4999887 5086320 5070216 4945782 4785495 4607459 4422863 4341979
40042 4341979 4459946 4678784 4839580 5015106 5434466 6073289 6567782 6650315 6447927 6198495
40032 6198495 5892564 5419316 4888664 4516528 4271172 3925953 3461907 3154449 3202289 3480630
$$ packed form
40103G126574j28248j06505j00270J4878K18975L08647J90785k010j37963k14228
40093G170635k19839j12082J026r5223l85288n67090m70429l02973l03838l67015
40083D347884k41949M6509K31581J74227j9628j90183k38013j14526J00904J77665
40073D274471N587j66487j9558L28846M06737M3281l49862l13356P2452L50194
40063D632305K85733O4413n5005m9584m9109r8786j08080n36J53804J96371P7542
40052E049068n7939m9621N8379Q6433j6104j24434j60287j78036j84596q0884
40042D341979J17967K18838J60796J75526M19360O38823M94493Q2533k02388k49432
40032F198495l05931m73248n30652l72136k45356l45219m64046l07458M7840K78341
$$ plain form
40022 3480630 3739815 3877197 3926765 3923394 3880429 3816147 3733554 3634342 3568385 3580350 3607444
40011 3607444 3554213 3479873 3561015 3826824 4085947 4185464 4194584 4242378 4316784 4340829 4319583
40000 4319583 4268158 4097929 3748320 3380459 3259364 3424687 3615868 3583365 3396440 3371921
39990 3371921 3711865 4264206 4683039 4812253 4824842 4934114 5080405 5048625 4818508 4581871
39980 4581871 4419574 4206759 3900210 3664530 3576586 3439453 3091601 2714761 2598104 2732148
39970 2732148 2883059 2964203 3064737 3172328 3157780 3045246 3036891 3213411 3423087 3529374
39960 3529374 3579631 3663853 3782186 3927627 4140672 4394519 4555119 4535345 4385243 4178581
39950 4178581 3924426 3638314 3379101 3160701 2942897 2758581 2725106 2865218 3028993 3062516
$$ packed form
40022C480630K59185J37382M9568l371m2965o4282q2593r9212o5957J1965K7094
40011C607444n3231p4340Q1142K65809K59123R9517R120M7794P4406K4045k1246
40000D319583n1425j70229l49609l67861j21095J65323J91181l2503j86925k4519
39990C371921L39944N52341M18833J29214J2589J09272J46291l1780k30117k36637
39980D581871j62297k12815l06549k35680q7944j37133l47852l76840j16657J34044
39970B732148J50911Q1144J00534J07591j4548j12534q355J76520K09676J06287
39960C529374N0257Q4222J18333J45441K13045K53847J60600j9774j50102k06662
39950D178581k54155k86112k59213k18400k17804j84316l3475J40112J63775L3523
$$ plain form
39940 3062516 2969317 2868477 2884189 3081328 3381183 3537852 3361797 2984239 2717518 2642681
39930 2642681 2577594 2496353 2662579 3190129 3776464 4116156 4318149 4615100 4893591 4899396
39920 4899396 4765782 4909466 5432540 6026604 6487133 6915781 7325326 7455025 7175732
39911 7175732 6742955 6407724 6056641 5508963 4928152 4608306 4505793 4322938 3982432
39902 3982432 3697273 3592006 3562630 3539012 3591220 3693803 3652731 3402055 3155165 3098538
39892 3098538 3110612 2971401 2721741 2605743 2718655 2907043 3009316 3030860 3053319 3092757
39882 3092757 3092901 2992150 2781789 2547916 2438832 2524416 2706113 2832152 2868692 2878382 2881061
39871 2881061 2855715 2845802 2913646 2994625 2958031 2835399 2815136 2954300 3077255 3062370 3053812
$$ packed form
39940C062516r3199j00840J5712J97139K99855J56669j76055l77558k66721p4837
39930B642681o5087q1241J66226N27550N86335L39692K01993K96951K78491N805
39920D899396j33614J43684N23074N94064M60529M28648M09545J29699k79293
39911G175732m32777l35231l51083n47678n80811l19846j02513j82855l40506
39902C982432k85159j05267k9376k3618N2208J02583m1072k50676k46890n6627
39892C098538J2074j39211k49660j15998J12912J88388J02273K1544K2459L9438
39882C092757J44j00751k10361k33873j09084Q5584J81697J26039L6540R690K679
39871B881061k5346r913O7844Q0979l6594j22632k0263J39164J22955j4885q558
$$ plain form
39860 3053812 3230561 3501835 3630260 3584429 3570660 3734672 4005752 4244177 4390947 4445070
39850 4445070 4422551 4380534 4386311 4425315 4407828 4282190 4084511 3886960 3759259 3749881 3825687
39839 3825687 3869786 3832154 3829753 3977547 4175471 4218534 4084277 3937914 3868693 3809468 3718274
39828 3718274 3631866 3512254 3262650 2957305 2831545 2952826 3122074 3207458 3330543 3561167
39818 3561167 3678022 3474348 3110180 2889324 2830275 2746781 2643637 2706431 2935598 3113037
39808 3113037 3160069 3237196 3425063 3575389 3574749 3512653 3467020 3348608 3114028 2938069 2981828
39797 2981828 3125392 3121827 2922529 2671843 2458972 2271857 2160920 2244351 2513633 2782114
39787 2782114 2883052 2821115 2694412 2571679 2500538 2539983 2692848 2853755 2911586 2889345
$$ packed form
39860C053812J76749K71274J28425m5831j3769J64012K71080K38425J46770N4123
39850D445070k2519m2017N777L9004j7487j25638j97679j97551j27701r378P5806
39839C825687M4099l7632k401J47794J97924M3063j34257j46363o9221n9225r1194
39828C718274q6408j19612k49604l05345j25760J21281J69248Q5384J23085K30624
39818C561167J16855k03674l64168k20856n9049q3494j03144O2794K29167J77439
39808C113037M7032P7127J87867J50326o40o2096m5633j18412k34580j75959M3759
39797B981828J43564l565j99298k50686k12871j87115j10937Q3431K69282K68481
39787B782114J00938o1937j26703j22733p1141L9445J52865J60907N7831k2241
$$ plain form
39777 2889345 2912045 3040626 3206186 3313860 3332764 3254440 3055323 2782966 2608736 2664306
39767 2664306 2840523 2888849 2755373 2676805 2864075 3204528 3396811 3312919 3106354 3002459
39757 3002459 3098009 3345809 3622102 3802454 3853181 3846894 3833989 3754963 3577627 3450653
39747 3450653 3554537 3820491 3990375 3996332 4091866 4503880 5102851 5551884 5682827 5589758
39737 5589758 5427470 5274425 5167286 5110435 5010421 4714632 4191987 3629660 3288195 3265278
39727 3265278 3430546 3582906 3632528 3613786 3567489 3488638 3402396 3401564 3528362 3664287 3637021
39716 3637021 3436244 3240991 3218719 3360106 3516155 3531757 3345385 3043502 2833090 2875805
39706 2875805 3120125 3368127 3521256 3665687 3886784 4112900 4215991 4181244 4091619 4004697
$$ packed form
39777B889345K2700J28581J65560J07674J8904p8324j99117k72357j74230N5570
39767B664306J76217M8326j33476p8568J87270L40453J92283q3892k06565j03895
39757C002459R5550K47800K76293J80352N0727o287j2905p9026j77336j26974
39747C450653J03884K65954J69884N957R5534M12014N98971M49033J30943r3069
39737E589758j62288j53045j07139n6851j00014k95789n22645n62327l41465k2917
39727C265278J65268J52360M9622j8742m6297p8851q6242q32J26798J35925k7266
39716C637021k00777j95253k2272J41387J56049J5602j86372l01883k10412M2715
39706B875805K44320K48002J53129J44431K21097K26116J03091l4747q9625q6922
$$ plain form
39696 4004697 3930201 3889332 3914199 4000736 4112872 4216530 4277088 4255630 4144470 3983550
39686 3983550 3828459 3738560 3783564 3972573 4164216 4165473 3975603 3817531 3845733 3939416
39676 3939416 3907245 3799562 3855104 4184355 4671623 5184669 5719962 6305504 6903961 7491410
39666 7491410 8138599 8927971 9845997 10848555 12020357 13570793 15576180 17694262 19202270
39657 19202270 19457925 18415232 16665058 14937328 13606382 12678560 12090730 11842546 11890986
39648 11890986 12116258 12449396 12928603 13611634 14549099 15847335 17560117 19386988 20613340
39639 20613340 20567272 19185140 17060056 14945068 13271648 12088863 11279605 10721630 10308291
39630 10308291 9939496 9530939 9013271 8348309 7597980 6952662 6594887 6495551 6413813 6156189
$$ packed form
39696D004697p4496m0869K4867Q6537J12136J03658O0558k1458j11160j60920
39686C983550j55091q9899M5004J89009J91643J257j89870j58072K8202R3683
39676C939416l2171j07683N5542L29251M87268N13046N35293N85542N98457N87449
39666G491410O47189P89372R18026J002558J171802J550436K005387K118082J508008
39657A9202270K55655j042693j750174j727730j330946r27822n87830k48184M8440
39648A1890986K25272L33138M79207O83031R37465J298236J712782J826871J226352
39639B0613340m6068j382132k125084k114988j673420j182785q09258n57975m13339
39630A0308291l68795m08557n17668o64962p50329o45318l57775r9336q1738k57624
$$ plain form
39620 6156189 5783615 5498877 5388380 5376038 5392023 5445276 5513968 5509899 5421051 5369464 5424410
39609 5424410 5444119 5227409 4784606 4347022 4117175 4094289 4136186 4111883 3991215 3850073
39599 3850073 3793402 3833140 3863513 3800328 3697545 3652492 3644438 3575685 3448636 3372112 3375486
39588 3375486 3345189 3205897 3066343 3102121 3349647 3688229 3982147 4164924 4217325 4169038
39578 4169038 4153304 4375672 4935936 5682091 6314548 6674237 6882153 7151416 7518779 7844377
39568 7844377 8027598 8085257 8011771 7722487 7210230 6629521 6127820 5700834 5314955 5045902
39558 5045902 4943163 4861479 4625046 4309076 4155787 4225869 4341321 4394896 4499925 4751011
39548 4751011 5018828 5106508 4989659 4791165 4615441 4511387 4513155 4602468 4680347 4671904 4625825
$$ packed form
39620F156189l72574k84738j10497j2342J5985N3253O8692m069q8848n1587N4946
39609E424410J9709k16710m42803m37584k29847k2886M1897k4303j20668j41142
39599C850073n6671L9738L0373o3185j02783m5053q054o8753j27049p6524L374
39588C375486l0297j39292j39554L5778K47526L38582K93918J82777N2401m8287
39578D169038j5734K22368N60264P46155O32457L59689K07916K69263L67363L25598
39568G844377J83221N7659p3486k89284n12257n80709n01701m26986l85879k69053
39558E045902j02739q1684k36433l15970j53289P0082J15452N3575J05029K51086
39548D751011K67817Q7680j16849j98494j75724j04054J768Q9313P7879q443m6079
$$ plain form
39537 4625825 4637832 4714345 4784065 4815008 4850466 4937783 5066691 5173550 5187751 5089662 4928042
39526 4928042 4760462 4599448 4464122 4441438 4593387 4817093 4923797 4880463 4851392 4962700
39516 4962700 5155601 5336521 5541784 5851794 6240274 6615664 6934088 7165176 7216334 7015246
39506 7015246 6637620 6251998 5954205 5729701 5544008 5379586 5197670 4952464 4666169
39497 4666169 4447955 4414975 4581924 4805323 4861386 4646611 4296160 4029211 3896001 3789856
39487 3789856 3691945 3729197 3939961 4152163 4186227 4044615 3830827 3645796 3644050 3971678
39477 3971678 4489521 4771758 4608071 4335519 4407648 4776385 5012765 4949878 4850898 4938160
39467 4938160 5099409 5142926 5055096 4892190 4662424 4443185 4406536 4595891 4849014 5047735
$$ packed form
39537D625825J2007P6513O9720L0943L5458Q7317J28908J06859J4201r8089j61620
39526D928042j67580j61014j35326k2684J51949K23706J06704m3334k9071J11308
39516D962700J92901J80920K05263L10010L88480L75390L18424K31088N1158k01088
39506G015246l77626l85622k97793k24504j85693j64422j81916k45206k86295
39497D666169k18214l2980J66949K23399N6063k14775l50451k66949j33210j06145
39487C789856r7911L7252K10764K12202L4064j41612k13788j85031j746L27628
39477C971678N17843K82237j63687k72552P2129L68737K36380o2887r8980Q7262
39467D938160J61249M3517q7830j62906k29766k19239l6649J89355K53123J98721
$$ plain form
39457 5047735 5258383 5510276 5641269 5538187 5373028 5408891 5673634 5988728 6224161 6357038
39447 6357038 6354784 6175114 5852565 5456600 4999991 4494922 4040692 3735256 3552252 3423854
39437 3423854 3384400 3493377 3667348 3752534 3751259 3812560 3973307 4058706 3905702 3577203
39427 3577203 3273909 3099914 2997356 2884552 2777313 2746024 2796891 2860124 2908447 3016405
39417 3016405 3233743 3453449 3519690 3451853 3428443 3531446 3650557 3685782 3687752 3713775 3703058
39406 3703058 3619278 3571322 3630436 3650183 3464682 3181678 3062266 3147074 3218054 3133716 2994362
39395 2994362 2932027 2921182 2876608 2803816 2772256 2828913 2986336 3216680 3434379 3565280
39385 3565280 3632570 3682240 3653830 3466024 3212325 3091835 3128583 3156302 3131582 3243568
$$ packed form
39457E047735K10648K51893J30993j03082j65159L5863K64743L15094K35433J32877
39447F357038k254j79670l22549l95965m56609n05069m54230l05436j83004j28398
39437C423854l9454J08977J73971Q5186j275O1301J60747Q5399j53004l28499
39427C577203l03294j73995j02558j12804j07239l1289N0867O3233M8323J07958
39417C016405K17338K19706O6241o7837k3410J03003J19111L5225J970K6023j0717
39406C703058q3780m7956N9114J9747j85501k83004j19412Q4808P0980q4338j39354
39395B994362o2335j0845m4574p2792l1560N6657J57423K30344K17699J30901
39385C565280O7290M9670k8410j87806k53699j20490L6748K7719k4720J11986
$$ plain form
39375 3243568 3598405 3992384 4166036 4139903 4122819 4201390 4310175 4430224 4613057 4828594
39365 4828594 4966812 5005371 5041366 5141211 5270237 5383872 5489826 5601381 5702220 5764226
39355 5764226 5747200 5603708 5341517 5038192 4729645 4359456 3942069 3688038 3795037 4146414
39345 4146414 4398885 4380303 4234463 4155281 4166304 4221492 4330800 4466710 4497861 4362103
39335 4362103 4201980 4185068 4267228 4276607 4175675 4095472 4143205 4314840 4577138 4885303
39325 4885303 5106409 5076276 4798994 4490966 4360796 4417150 4547320 4701224 4901985 5115636
39315 5115636 5222457 5148116 4962662 4803840 4722913 4647481 4499596 4310046 4180791 4154701
39305 4154701 4176382 4187257 4196758 4224496 4233096 4189858 4162845 4267201 4506346 4736522 4815144
$$ packed form
39375C243568L54837L93979J73652k6133j7084P8571J08785J20049J82833K15537
39365D828594J38218L8559L5995R9845J29026J13635J05954J11555J00839O2006
39355E764226j7026j43492k62191l03325l08547l70189m17387k54031J06999L51377
39345D146414K52471j8582j45840p9182J1023N5188J09308J35910L1151j35758
39335D362103j60123j6912Q2160R379j00932q0203M7733J71635K62298L08165
39325D885303K21106l0133k77282l08028j30170N6354J30170J53904K00761K13651
39315E115636J06821p4341j85454j58822q0927p5432j47885j89550j29255k6090
39305D154701K1681J0875R501K7738Q600m3238k7013J04356K39145K30176P8622
$$ plain form
39294 4815144 4735301 4592260 4467755 4380028 4304897 4201741 4043605 3863876 3758723 3801154
39284 3801154 3953887 4104712 4197906 4296674 4487345 4741076 4916729 4913903 4779851 4625422
39274 4625422 4472146 4255973 3972656 3723272 3584716 3531230 3544036 3695237 4011259 4330571
39264 4330571 4447125 4365905 4267628 4236841 4202357 4166810 4285250 4610221 4930088 5011966
39254 5011966 4886697 4737999 4613784 4439363 4260460 4259707 4506951 4853657 5115205 5231994
39244 5231994 5219669 5091724 4893253 4716961 4628042 4632340 4727588 4893381 5022316 4987688
39234 4987688 4822586 4705952 4704980 4658629 4421015 4117214 4020569 4222065 4540433 4743342
39224 4743342 4764512 4710390 4730334 4885990 5104527 5266003 5349172 5440191 5573986 5653610
$$ packed form
39294D815144p9843j43041j24505q7727p5131j03156j58136j79729j05153M2431
39284C801154J52733J50825R3194R8768J90671K53731J75653k826j34052j54429
39274D625422j53276k16173k83317k49384j38556n3486J2806J51201L16022L19312
39264D330571J16554q1220r8277l0787l4484l5547J18440L24971L19867Q1878
39254E011966j25269j48698j24215j74421j78903p53K47244L46706K61548J16789
39244E231994j2325j27945j98471j76292q8919M298R5248J65793J28935l4628
39234D987688j65102j16634r72m6351k37614l03801r6645K01496L18368K02909
39224D743342K1170n4122J9944J55656K18537J61476Q3169R1019J33795P9624
$$ plain form
39214 5653610 5592597 5456771 5374608 5373446 5403575 5458963 5550920 5609643 5552550 5434706 5400300
39203 5400300 5490137 5623875 5764497 5951340 6154020 6253854 6224652 6187640 6213819 6207381 6080709
39192 6080709 5920641 5853402 5834706 5718676 5492365 5308984 5296226 5434703 5625022 5785829
39182 5785829 5878012 5909238 5937791 6028542 6195884 6413214 6656093 6895483 7070899 7118739
39172 7118739 7020965 6808603 6557253 6399147 6454572 6675138 6829902 6763152 6620666 6679862
39162 6679862 6962742 7171490 7057321 6722567 6469477 6443677 6541043 6623968 6703989 6872164
39152 6872164 7116157 7284342 7257541 7117096 7064594 7153232 7194281 7020931 6766218 6719790
39142 6719790 6925237 7108935 7066302 6934911 6957486 7126040 7248206 7274853 7337577 7469445
$$ packed form
39214E653610o1013j35826q2163j162L0129N5388R1957N8723n7093j17844l4406
39203E400300Q9837J33738J40622J86843K02680R9834k9202l7012K6179o438j26672
39192F080709j60068o7239j8696j16030k26311j83381j2758J38477J90319J60807
39182E785829R2183L1226K8553R0751J67342K17330K42879K39390J75416M7840
39172G118739r7774k12362k51350j58106N5425K20566J54764o6750j42486N9196
39162F679862K82880K08748j14169l34754k53090k5800R7366Q2925Q0021J68175
39152F872164K43993J68185k6801j40445n2502Q8638M1049j73350k54713m6428
39142F719790K05447J83698m2633j31391K2575J68554J22166K6647O2724J31868
$$ plain form
39132 7469445 7506402 7336381 7079883 6918085 6859297 6793207 6695556 6647800 6682545 6723089 6684306
39121 6684306 6558431 6395874 6264048 6227312 6299667 6395976 6383601 6215978 5988615 5843265
39111 5843265 5837279 5916257 5988380 6010666 6018851 6077386 6183044 6229840 6114923 5885926 5727569
39100 5727569 5766412 5928791 6037223 6016908 5947786 5923734 5931640 5900953 5829566 5809911 5926560
39089 5926560 6150392 6347448 6396081 6298873 6181560 6184629 6356026 6631419 6888699 7023442
39079 7023442 7016230 6950257 6925831 6930210 6841527 6611593 6387197 6353259 6479743 6543759 6423838
39068 6423838 6257057 6248591 6426312 6666780 6883344 7082771 7283568 7487221 7711901 7960045
39058 7960045 8162339 8240958 8222174 8204935 8230855 8275879 8352356 8497851 8654660 8695806 8613996
$$ packed form
39132G469445L6957j70021k56498j61798n8788o6090r7651m7756L4745M0544l8783
39121F684306j25875j62557j31826l6736P2355R6309j2375j67623k27363j45350
39111E843265n986P8978P2123K2286Q185N8535J05658M6796j14917k28997j58357
39100E727569L8843J62379J08432k0315o9122k4052P906l0687p1387j9655J16649
39089E926560K23832J97056M8633r7208j17313L069J71397K75393K57280J34743
39079G023442p212o5973k4426M379q8683k29934k24396l3938J26484O4016j19921
39068F423838j66781q466J77721K40468K16564J99427K00797K03653K24680K48144
39058G960045K02294P8619j8784j7239K5920M5024P6477J45495J56809M1146q1810
$$ plain form
39047 8613996 8553979 8585694 8568622 8346836 7983135 7679463 7536047 7513083 7564705 7653367
39037 7653367 7657214 7437840 7040829 6695194 6556085 6554632 6559254 6572555 6673101 6845539 6991616
39026 6991616 7082680 7195055 7390943 7646262 7906090 8135714 8295800 8341284 8288367 8223629
39016 8223629 8190919 8118275 7929653 7690021 7536918 7475664 7367432 7158218 6983759 6948886
39006 6948886 6925154 6731362 6441861 6311120 6404935 6531758 6590059 6745142 7122454 7527638
38996 7527638 7679878 7597901 7539037 7638969 7832012 8067674 8354088 8587838 8596128 8416605
38986 8416605 8325093 8491067 8770008 8915979 8835171 8551050 8110972 7661845 7453266 7589611
38976 7589611 7874799 8044666 8062033 8052326 8058239 8027207 7964597 7920802 7864407 7727306 7553559
$$ packed form
39047H613996o0017L1715j7072k21786l63701l03672j43416k2964N1622Q8662
39037G653367L847k19374l97011l45635j39109j453M622J3301J00546J72438J46077
39026F991616R1064J12375J95888K55319K59828K29624J60086M5484n2917o4738
39016H223629l2710p2644j88622k39632j53103o1254j08232k09214j74459l4873
39006F948886k3732j93792k89501j30741R3815J26823N8301J55083L77312M05184
38996G527638J52240q1977n8864R9932J93043K35662K86414K33750Q290j79523
38986H416605r1512J65974K78941J45971q0808k84121m40078m49127k08579J36345
38976G589611K85188J69867J7367r707N913l1032o2610m3795n6395j37101j73747
$$ plain form
38965 7553559 7462854 7484398 7552010 7634767 7742343 7831119 7846111 7837671 7893566 7963447 7896875
38954 7896875 7666959 7423884 7308319 7330049 7445304 7633919 7866863 8084106 8225546 8238086
38944 8238086 8101207 7918941 7889759 8052208 8167260 8042068 7861362 7928404 8142427 8073291
38934 8073291 7585466 7041777 6779620 6712556 6615029 6489029 6418731 6332416 6186906 6173770
38924 6173770 6441438 6774825 6856985 6723206 6644037 6659121 6567488 6335898 6172149 6175993
38914 6175993 6236295 6323608 6574904 6992971 7343708 7482234 7536943 7628538 7641127 7457185
38904 7457185 7225081 7168914 7249806 7226749 6992443 6672817 6430229 6318834 6314670 6357272
38894 6357272 6364093 6310453 6300581 6474176 6830844 7208921 7450902 7552852 7645460 7845335
$$ packed form
38965G553559r0705K1544O7612Q2757J07576Q8776J4992q440N5895O9881o6572
38954G896875k29916k43075j15565K1730J15255J88615K32944K17243J41440J2540
38944H238086j36879j82266k9182J62449J15052j25192j80706O7042K14023o9136
38934H073291m87825n43689k62157o7064r7527j26000p0298q6315j45510j3136
38924F173770K67668L33387Q2160j33779p9169J5084r1633k31590j63749L844
38914F175993O0302Q7313K51296M18067L50737J38526N4709R1595J2589j83942
38904G457185k32104n6167Q0892k3057k34306l19626k42588j11395m164M2602
38894F357272O821n3640r872J73595L56668L78077K41981J01950R2608J99875
$$ plain form
38884 7845335 8122791 8327064 8373215 8377062 8525188 8815750 9037884 9043452 8924563 8844219
38874 8844219 8788092 8602162 8234599 7825944 7550399 7441206 7397085 7324751 7246230 7252947
38864 7252947 7353393 7411874 7297026 7065497 6914135 6951680 7104062 7246160 7321208 7311702
38854 7311702 7211697 7076097 6992395 6955760 6883924 6806542 6898849 7228739 7595559 7749699
38844 7749699 7679657 7550940 7447196 7327921 7189370 7101471 7086391 7085642 7050104 6965705 6809029
38833 6809029 6585047 6395715 6360608 6465351 6576281 6595754 6520662 6382266 6243336 6231892
38823 6231892 6435490 6740786 6902378 6814215 6618743 6513774 6544399 6625464 6676486 6666637
38813 6666637 6581043 6408106 6151536 5838154 5526708 5295995 5192594 5207799 5332117 5579475
$$ packed form
38884G845335K77456K04273M6151L847J48126K90562K22134N568j18889q0344
38874H844219n6127j85930l67563m08655k75545j09193m4121p2334p8521O717
38864G252947J00446N8481j14848k31529j51362L7545J52382J42098P5048r506
38854G311702j00005j35600q3702l6635p1836p7382R2307L29890L66820J54140
38844G749699p0042j28717j03744j19275j38551q7899j5080p49l5538q4399j56676
38833F809029k23982j89332l5107J04743J10930J9473p5092j38396j38930j1444
38823F231892K03598L05296J61592q8163j95472j04969L0625Q1065N1022r849
38813F666637q5594j72937k56570l13382l11446k30713j03401J5205J24318K47358
$$ plain form
38803 5579475 5899034 6128843 6141946 6004579 5884456 5834128 5785247 5730543 5761077 5908649
38793 5908649 6088711 6227205 6316193 6322421 6195610 6025377 6034404 6310104 6656081 6818844
38783 6818844 6769601 6649394 6524575 6354862 6181056 6179926 6451185 6817715 6940435 6669889
38773 6669889 6238204 6024865 6133973 6309887 6308893 6201819 6182717 6232971 6206399 6154035 6263991
38762 6263991 6481201 6510937 6289619 6140065 6290037 6511234 6464094 6177459 5924633 5803116
38752 5803116 5729789 5726044 5891794 6148534 6298340 6326139 6389230 6522794 6619369 6698624 6906858
38741 6906858 7193869 7271316 7003235 6603977 6325345 6160266 5997927 5873597 5878807 5961038
38731 5961038 5998371 5991349 6027777 6117722 6190998 6208556 6173544 6084494 5964832 5877715 5830354
$$ packed form
38803E579475L19559K29809J3103j37367j20123n0328m8881n4704L0534J47572
38793E908649J80062J38494Q8988O228j26811j70233R027K75700L45977J62763
38783F818844m9243j20207j24819j69713j73806j130K71259L66530J22720k70546
38773F669889m31685k13339J09108J75914r94j07074j9102N0254k6572n2364J09956
38762F263991K17210K9736k21318j49554J49972K21197m7140k86635k52826j21517
38752E803116p3327l745J65750K56740J49806K7799O3091J33564R6575P9255K08234
38741F906858K87011P7447k68081l99258k78632j65079j62339j24330N210Q2231
38731E961038L7333p022L6428Q9945P3276J7558l5012q9050j19662q7117m7361
$$ plain form
38720 5830354 5734101 5541909 5345344 5240492 5178056 5058963 4913573 4862803 4935436 5027672
38710 5027672 5022217 4875045 4627419 4401740 4324702 4374050 4367557 4190469 3957684 3849194
38700 3849194 3869169 3897570 3906685 3973453 4124185 4319969 4560707 4849466 5084864 5155067
38690 5155067 5120933 5135086 5194228 5166109 5066672 5086004 5279527 5447692 5424890 5304597 5262424
38679 5262424 5325491 5447144 5644174 5894402 6033657 5939525 5724238 5577761 5515192 5460486
38669 5460486 5480072 5696554 6010682 6155174 6048239 5883023 5829980 5859702 5923730 6095414
38659 6095414 6406602 6715685 6892067 7012489 7219405 7469430 7578022 7464951 7213749
38650 7213749 6918016 6607716 6322871 6126156 6006953 5868466 5655690 5437245 5324800
$$ packed form
38720E830354r6253j92192j96565j04852o2436j19093j45390n0770P2633R2236
38710E027672n455j47172k47626k25679p7038M9348o493j77088k32785j08490
38700C849194J9975K8401R115O6768J50732J95784K40738K88759K35398P0203
38690E155067l4134J4153N9142k8119r9437J9332J93523J68165k2802j20293m2173
38679E262424O3067J21653J97030K50228J39255r4132k15287j46477o2569n4706
38669E460486J9586K16482L14128J44492j06935j65216n3043K9722O4028J71684
38659F095414L11188L09083J76382J20422K06916K50025J08592j13071k51202
38650G213749k95733l10300k84845j96715j19203j38487k12776k18445j12445
$$ plain form
38641 5324800 5347909 5427500 5445242 5333926 5128072 4932040 4829326 4837785 4947875 5137654
38631 5137654 5319714 5365315 5265564 5189158 5260089 5345962 5234900 4990738 4917794 5129719
38621 5129719 5374803 5409895 5347700 5436492 5642770 5716525 5622148 5628390 5917379 6336051 6644653
38610 6644653 6825998 7005459 7215389 7425127 7716079 8224078 8922686 9632299 10248683
38601 10248683 10796834 11227025 11335470 10992793 10333513 9601613 8887337 8135291 7354656
38592 7354656 6681481 6231311 5992228 5873678 5780267 5636147 5426220 5232878 5156750 5183624
38582 5183624 5201058 5150044 5058806 4905693 4586920 4112038 3716204 3625956 3754500 3778616
38572 3778616 3526552 3159924 2935068 2905429 2938021 2932911 2910688 2912384 2923600 2917422 2892916
$$ packed form
38641E324800K3109P9591J7742j11316k05854j96032j02714Q459J10090J89779
38631E137654J82060M5601r9751p6406P0931Q5873j11062k44162p2944K11925
38621E129719K45084L5092o2195Q8792K06278P3755r4377O242K88989M18672L08602
38610F644653J81345J79461K09930K09738K90952N07999O98608P09613O16384
38601A0248683N48151M30191J08445l42677o59280p31900p14276p52046p80635
38592G354656o73175m50170k39083j18550r3411j44120k09927j93342p6128K6874
38582E183624J7434n1014r1238j53113l18773m74882l95834r0248J28544K4116
38572C778616k52064l66628k24856k9639L2592n110k2223J696J1216o178k4506
$$ plain form
38561 2892916 2839319 2736007 2643528 2720876 3040917 3415800 3550440 3408378 3276854 3367408
38551 3367408 3497580 3357185 2994184 2769797 2827184 2898710 2757245 2584494 2666506 2925075
38541 2925075 3045302 2967939 2949818 3151609 3449666 3692522 3876016 3980908 3888562 3603003
38531 3603003 3362883 3362677 3490579 3492040 3292494 3027449 2844975 2803717 2887803 3009456 3066061
38520 3066061 3079555 3183630 3391344 3512668 3426690 3292147 3317767 3447823 3479530 3397906
38510 3397906 3364399 3425864 3472005 3471242 3521363 3644518 3741591 3791923 3905899 4121374 4317821
38499 4317821 4394534 4386272 4354398 4309706 4278094 4280238 4211368 3931482 3536208 3333171 3445540
38488 3445540 3628022 3601178 3387341 3165836 2971839 2736989 2498526 2350184 2259807 2138787
$$ packed form
38561B892916n3597j03312r2479P7348L20041L74883J34640j42062j31524R0554
38551C367408J30172j40395l63001k24387N7387P1526j41465j72751Q2012K58569
38541B925075J20227p7363j8121K01791K98057K42856J83494J04892r2346k85559
38531C603003k40120k06J27902J461j99546k65045j82474m1258Q4086J21653N6605
38520C066061J3494J04075K07714J21324q5978j34543K5620J30056L1707q1624
38510C397906l3507O1465M6141p63N0121J23155R7073N0332J13976K15475J96447
38499D317821P6713q262l1874m4692l1612K144o8870k79886l95274k03037J12369
38488C445540J82482k6844k13837k21505j93997k34850k38463j48342r0377j21020
$$ plain form
38478 2138787 2047152 2131470 2363994 2515109 2410293 2094396 1736982 1491684 1453558 1630090
38468 1630090 1904681 2096062 2095388 1936198 1752352 1684828 1773424 1903219 1922643 1846154 1839976
38457 1839976 1956892 2023193 1894127 1687920 1617331 1698125 1793051 1847910 1885951 1839468 1614400
38446 1614400 1305064 1129586 1134312 1149095 1057397 934150 893402 977418 1225209 1660768
38436 1660768 2153393 2464054 2512468 2460844 2469130 2503858 2451692 2287627 2063863 1851477
38426 1851477 1743503 1791899 1901219 1914283 1823190 1737358 1638117 1394515 1079912 1004619
38416 1004619 1283941 1604043 1614210 1371359 1188661 1200963 1311153 1446152 1613201 1758520
38406 1758520 1799400 1787481 1863557 2052413 2229165 2260406 2080511 1707368 1300656 1104163
$$ packed form
38478B138787r1635Q4318K32524J51115j04816l15897l57414k45298l8126J76532
38468A630090K74591J91381o74j59190j83846o7524Q8596J29795J9424p6489o178
38457A839976J16916O6301j29066k06207p0589Q0794R4926N4859L8041m6483k25068
38446A614400l09336j75478M726J4783r1698j23247m0748Q4016K47791M35559
38436A660768M92625L10661M8414n1624Q286L4728n2166j64065k23764k12386
38426A851477j07974M8396J09320J3064r1093q5832r9241k43602l14603p5293
38416A004619K79322L20102J0167k42851j82698J2302J10190J34999J67049J45319
38406A758520M0880j1919P6076J88856J76752L1241j79895l73143m06712j96493
$$ plain form
38396 1104163 1189992 1363623 1457121 1560828 1777142 1930543 1804851 1525377 1370830 1309303
38386 1309303 1109470 861101 926505 1307133 1521467 1302619 1010407 1079332 1396774 1559772
38376 1559772 1485259 1388912 1328185 1164501 925722 845721 1003253 1191347 1202727 1038009
38366 1038009 792845 541310 392531 480153 794549 1137336 1319672 1329928 1267917 1203339
38356 1203339 1146472 1084681 997444 878028 762818 699544 683832 675051 670795 709552 798737
38345 798737 890406 926899 870515 710127 497466 361196 414888 637003 876917 980965
38335 980965 903209 728664 605641 598689 588389 406817 107689 -37354 89994 239732
38325 239732 126880 -142663 -227039 -72644 11863 -147723 -307550 -166574 208811 521190
$$ packed form
38396A104163Q5829J73631R3498J03707K16314J53401j25692k79474j54547o1527
38386A309303j99833k48369O5404L80628K14334k18848k92212O8925L17442J62998
38376A559772p4513r6347o0727j63684k38779q0001J57532J88094J1380j64718
38366A038009k45164k51535j48779Q7622L14396L42787J82336J0256o2011o4578
38356A203339n6867o1791q7237j19416j15210o3274j5712q781m256L8757Q9185
38345G98737R1669L6493n6384j60388k12661j36270N3692K22115K39914J04048
38335I80965p7756j74545j23023o952j0300j81572k99128j45043J27348J49738
38325B39732j12852k69543q4376J54395Q4507j59586j59827J40976L75385L12379
$$ plain form
38315 521190 658996 756564 906466 1030649 1054470 1043698 1105469 1240813 1343481 1301169
38305 1301169 1087557 800015 601207 562480 561925 406688 80377 -195731 -199083 35831
38295 35831 259426 295059 209111 166682 199703 214000 192405 250738 440281 615079 609167
38284 609167 477270 425035 522237 621047 577494 433053 327519 323644 376401 411961 385992
38273 385992 308464 242801 241231 278391 314232 413638 686061 1069093 1301465 1209798 937708
38262 937708 779786 840159 965651 987445 911070 851804 873198 934231 953670 890615 772347
38251 772347 658053 580622 533582 509654 523806 588926 688818 777576 792122 693388 537070
38240 537070 465972 554469 687801 701573 629918 675612 901793 1103667 1074268 878153 746241
$$ packed form
38315E21190J37806R7568J49902J24183K3821j0772O1771J35344J02668m2312
38305A301169k13612k87542j98808l8727n55j55237l26311k76108l352K34914
38295C5831K23595L5633q5948m2429L3021J4297k1595N8333J89543J74798n912
38284F09167j31897n2235R7202R8810m3553j44441j05534l875N2757L5560k5969
38273C85992p7528o5663j570L7160L5841R9406K72423L83032K32372r1667k72090
38262I37708j57922O0373J25492K1794p6375n9266K1394O1033J9439o3055j18268
38251G72347j14294p7431m7040k3928J4152O5120R9892Q8758J4546r8734j56318
38240E37070p1098Q8497J33332J3772p1655M5694K26181K01874k9399j96115j31912
$$ plain form
38229 746241 779269 873381 895458 830738 770927 810647 931435 978968 832610 601132 512519
38218 512519 578203 561006 371825 266278 445127 663633 539581 137098 -92689 70566
38208 70566 388442 589158 685316 747500 675330 417743 205527 301492 619074 813543
38198 813543 711997 472223 326370 321174 342329 297656 227196 250830 412625 597199 654097
38187 654097 587921 528691 516762 455292 311709 207179 220116 252676 218543 230674 440795
38176 440795 785771 1062900 1192531 1239318 1230808 1147695 1072299 1140395 1312792 1380176 1262275
38165 1262275 1140442 1195312 1343462 1357440 1159726 867440 595392 354332 150974 64262
38155 64262 148847 313952 376828 249626 34627 -90001 -57864 42713 99852 103765 126265
$$ packed form
38229G46241L3028R4112K2077o4720n9811L9720J20788M7533j46358k31478q8613
38218E12519O5684j7197j89181j05547J78849K18506j24052m02483k29787J63255
38208G0566L17876K00716R6158O2184p2170k57587k12216R5965L17582J94469
38198H13543j01546k39774j45853n196K1155m4673p0460K3634J61795J84574N6898
38187F54097o6176n9230j1929o1470j43583j04530J2937L2560l4133J2131K10121
38176D40795L44976K77129J29631M6787q510q3113p5396O8096J72397O7384j17901
38165A262275j21833N4870J48150J3978j97714k92286k72048k41060k03358q6712
38155F4262Q4585J65105O2876j27202k14999j24628L2137J00577N7139L913K2500
$$ plain form
38144 126265 216343 350163 466119 522615 530886 544296 602474 683651 736267 754246 780760
38133 780760 838295 909182 987615 1074402 1099391 945152 612452 288503 170027 264463 430956
38122 430956 559106 624579 621475 545216 425463 295201 150044 9618 -31188 78328
38112 78328 209853 180874 22642 -16174 213117 546306 685036 521623 221858 34417
38102 34417 77935 281996 476181 536946 477202 402516 391041 433889 474094 462033 378471
38091 378471 250211 149768 140751 213362 297789 336682 320552 270636 222402 205903 203748
38080 203748 154942 44919 -45098 -41904 -844 -43841 -193779 -347241 -400793 -333313 -183560
38069 -183560 -27983 41652 13956 11620 140223 300317 285710 76750 -113920 -128445 -48225
$$ packed form
38144A26265R0078J33820J15956N6496Q271J3410N8178Q1177N2616J7979K6514
38133G80760N7535P0887P8433Q6787K4989j54239l32700l23949j18476R4436J66493
38122D30956J28150O5473l104p6259j19753j30262j45157j40426m0806J09516
38112G8328J31525k8979j58232l8816K29291L33189J38730j63413k99765j87441
38102C4417M3518K04061J94185O0765n9744p4686j1475M2848M0205j2061q3562
38091C78471j28260j00443r017P2611Q4427L8893j6130m9916m8234j6499k155
38080B03748m8806j10023r0017L194M1060m2997j49938j53462n3552O7480J49753
38069a83560J55577O9635k7696k336J28603J60094j4607k08960j90670j4525Q0220
$$ plain form
38058 -48225 -21316 -44921 -23813 64472 181923 328790 510671 659071 695365 642208 581132
38047 581132 534556 477692 428845 426263 437433 396083 326584 330416 431930 531967 557758
38036 557758 583397 728417 965047 1104525 1008169 775193 658319 775328 960723 958996
38026 958996 725235 451325 314358 309336 346639 389402 424602 399988 293532 187178 172898
38015 172898 223679 248566 238465 251732 276976 238439 162277 212460 476046 786267 871872
38004 871872 676454 432978 384753 509965 597872 545601 458747 451718 485279 479236 477158
37993 477158 576298 751229 865968 828652 641359 362435 138753 181854 518254 821819
37983 821819 734419 346156 98318 181809 327820 286294 186898 228235 300535 206713 54182
$$ packed form
38058d8225K6909k3605K1108Q8285J17451J46867J81881J48400L6294n3157o1076
38047E81132m6576n6864m8847k582J1170m1350o9499L832J01514J00037K5791
38036E57758K5639J45020K36630J39478r6356k32976j16874J17009J85395j727
38026I58996k33761k73910j36967n022L7303M2763L5200k4614j06456j06354j4280
38015A72898N0781K4887j0101J3267K5244l8537p6162N0183K63586L10221Q5605
38004H71872j95418k43476m8225J25212Q7907n2271q6854p029L3561o043k078
37993D77158R9140J74931J14739l7316j87293k78924k23682M3101L36400L03565
37983H21819q7400l88263k47838Q3491J46011m1526r9396M1337P2300r3822j52531
$$ plain form
37972 54182 102865 335772 484708 425180 276468 152156 68160 69883 201484 361870 418993
37961 418993 434801 534521 604011 420987 75603 -85984 3628 6905 -280706 -601696 -646271
37950 -646271 -502060 -436552 -450621 -341615 -84333 128160 177434 140346 138186 218486 355249
37939 355249 451269 401098 255808 231383 432845 681782 766070 743768 811158 966379 1026781
37928 1026781 927474 773139 608850 371852 101192 -23408 70530 233831 314328 342903
37918 342903 406927 470579 447424 368272 343121 382018 365476 213514 15107 -56430 59391
37907 59391 240455 333390 341966 397854 545271 653862 602825 465117 410430 475325 538034
37896 538034 503512 412968 364315 404504 515539 649053 758924 825954 842656 773451 596798
$$ packed form
37972E4182M8683K32907J48936n9528j48712j24312q3996J723J31601J60386N7123
37961D18993J5808R9720O9490j83024l45384j61587Q9612L277k87611l20990m4575
37950f46271J44211O5508j4069J09006K57282K12493M9274l7088k160Q0300J36763
37939C55249R6020n0171j45290k4425K01462K48937Q4288k2302O7390J55221O0402
37928A026781r9307j54335j64289k36998k70660j24600R3938J63301Q0497K8575
37918C42903O4024O3652k3155p9152k5151L8897j6542j51962j98407p1537J15821
37907E9391J81064R2935Q576N5888J47417J08591n1037j37708n4687O4895O2709
37896E38034l4522r0544m8653M0189J11035J33514J09871O7030J6702o9205j76653
$$ plain form
37885 596798 413477 406784 610137 809265 792344 620025 515402 559541 656002 738978 823135
37874 823135 863095 763387 554089 379334 279333 162789 39489 83829 372112 718462
37864 718462 880954 804925 577707 288875 43978 -27615 75937 167336 86212 -109874
37854 -109874 -274525 -376861 -445421 -426464 -270421 -76739 25515 79060 197008 312158
37844 312158 241256 -2377 -173840 -126526 2909 20629 -58841 -75576 45804 230713
37834 230713 368823 424992 467885 618096 919102 1234958 1334008 1110854 691012 306293
37824 306293 112275 125520 266999 435748 577565 693871 769490 740628 592610 425752
37814 425752 325161 230468 75378 -8632 160640 476183 602309 445555 314325 468973
$$ packed form
37885E96798j83321o693K03353J99128j6921j72319j04623M4139R6461Q2976Q4157
37874H23135L9960r9708k09298j74755j00001j16544j23300M4340K88283L46350
37864G18462J62492p6029k27218k88832k44897p1593J03552R1399q1124j96086
37854a09874j64651j02336o8560J8957J56043J93682J02254N3545J17948J15150
37844C12158p0902k43633j71463M7314J29435J7720p9470j6735J21380J84909
37834B30713J38110N6169M2893J50211L01006L15856R9050k23154m19842l84719
37824C06293j94018J3245J41479J68749J41817J16306P5619k8862j48018j66858
37814D25752j00591r4693j55090q4010J69272L15543J26126j56754j31230J54648
$$ plain form
37804 468973 743283 817752 677975 541878 465834 327893 153498 144625 339554 510917
37794 510917 499929 436375 502302 648690 691898 577462 413231 310322 294130 318599 295137
37783 295137 166744 9603 -14587 136264 313636 372027 330589 263796 150597 -39688
37773 -39688 -202045 -194527 -46040 75979 94740 97344 175666 304337 399632 421003 394408
37762 394408 383460 432397 501039 493997 397879 318461 309473 259208 71932 -122742 -114000 83063
37750 83063 255837 315482 381202 517421 606076 564901 499279 516961 549973 493904 394340
37739 394340 358824 391551 441627 504658 545551 446089 199356 46384 210626 561290 755179
37728 755179 677127 515294 408094 269409 29762 -179087 -207422 -90080 63494 245985
$$ packed form
37804D68973K74310P4469j39777j36097p6044j37941j74395q873J94929J71363
37794E10917j0988o3554O5927J46388M3208j14436j64231j02909j6192K4469k3462
37783B95137j28393j57141k4190J50851J77372N8391m1438o6793j13199j90285
37773c9688j62357P518J48487J22019J8761K604P8322J28671R5295K1371k6595
37762C94408j0948M8937O8642p042r6118p9418q988n0265j87276j94674Q742J97063
37750H3063J72774N9645O5720J36219Q8655m1175o5622J7682L3012n6069r9564
37739C94340l5516L2727N0076O3031M0893r9462k46733j52972J64242L50664J93889
37728G55179p8052j61833j07200j38685k39647k08849k8335J17342J53574J82491
$$ plain form
37718 245985 480957 684236 748581 701015 640926 575289 451388 312279 267532 311025 313281
37707 313281 229641 189684 314109 538084 700228 746757 759654 813266 891140 944741 955587
37696 955587 914503 806327 664471 593021 662347 795220 830612 717663 582354 566240
37686 566240 652746 702071 613917 397523 124359 -101588 -145547 75072 467602 794467
37676 794467 881167 766386 625238 586238 645862 713328 703940 624937 591549 707832 907793
37665 907793 987631 846469 618608 488821 453218 382835 268582 236293 312933 354820 280453
37654 280453 221384 319063 483609 507813 360039 210189 196464 323070 576002 957049
37644 957049 1360220 1588162 1580149 1482643 1397888 1213681 826634 401100 206139 264819
$$ packed form
37718B45985K34972K03279O4345m7566o0089o5637j23901j39109m4747M3493K256
37707C13281q3640l9957J24425K23975J62144M6529J2897N3612P7874N3601J0846
37696I55587m1084j08176j41856p1450O9326J32873L5392j12949j35309j6114
37686E66240Q6506M9325q8154k16394k73164k25947m3959K20619L92530L26865
37676G94467Q6700j14781j41148l9000N9624O7466r388p9003l3388J16283J99961
37665I07793P9838j41162k27861j29787l5603p0383j14253l2289P6640M1887p4367
37654B80453n9069R7679J64546K4204j47774j49850j3725J26606K52932L81047
37644I57049M03171K27942q013r7506q4755j84207l87047m25534j94961N8680
$$ plain form
37634 264819 369177 408727 470176 609684 755982 899628 1159103 1538698 1797611 1716500
37624 1716500 1379348 1047030 844769 719831 633343 630759 736180 892210 1003788 987561
37614 987561 834553 685385 744191 1008516 1178343 977520 499058 82796 -87930 -99306
37604 -99306 -69098 -2444 104595 203913 284431 382358 474025 495174 485352 559017 698478
37593 698478 735623 599574 436472 410074 509657 622987 674681 623331 450857 241713
37583 241713 161631 270870 449236 564185 601096 573175 448694 259304 141597 157752
37573 157752 193257 137265 35151 -49951 -173745 -353836 -423111 -242611 43704 183084
37563 183084 168876 193833 294623 296221 133855 -3386 63381 261788 384509 334142 179862
$$ packed form
37634B64819J04358L9550O1449J39508J46298J43646K59475L79595K58913q1111
37624A716500l37152l32318k02261j24938q6488k584J05421J56030J11578j6227
37614I87561j53008j49168N8806K64325J69827k00823m78462m16262j70726j1376
37604i9306L0208O6654J07039R9318Q0518R7927R1667K1149r822P3665J39461
37593F98478L7145j36049j63102k6398R9583J13330N1694n1350j72474k09144
37583B41713q0082J09239J78366J14949L6911k7921j24481j89390j17707J6155
37573A57752L5505n5992j02114q5102j23794j80091o9275J80500K86315J39380
37563A83084j4208K4957J00790J598j62366j37241O6767J98407J22721n0367j54280
$$ plain form
37552 179862 56286 60292 182468 310546 352738 348751 389221 460016 475480 443405 468297
37541 468297 590477 741410 853173 885027 757698 427244 41188 -150919 -88205 58593
37531 58593 175456 348314 637218 901879 991679 956020 910646 827710 638259 438472
37521 438472 383149 418180 323988 35893 -249985 -329946 -220280 -89134 -67558 -168098
37511 -168098 -296531 -301148 -94496 223120 427231 404536 273589 234569 357828 567390
37501 567390 769524 914275 954865 840865 588810 316221 160732 161696 231321 242958 151098
37490 151098 34103 14758 120951 227297 170441 -55665 -254795 -227982 -1811 205242
37480 205242 243858 179843 150013 167375 155016 107566 94291 109653 40495 -177231 -448167
$$ packed form
37552A79862j23576M006J22176J28078M2192l987M0470P0795J5464l2075K4892
37541D68297J22180J50933J11763L1854j27329l30454l86056j92107O2714J46798
37531E8593J16863J72858K88904K64661Q9800l5659m5374q2936j89451j99787
37521D38472n5323L5031r4192k88095k85878p9961J09666J31146K1576j00540
37511a68098j28433m617K06652L17616K04111k2695j30947l9020J23259K09562
37501E67390K02134J44751M0590j14000k52055k72589j55489R64O9625J1637r1860
37490A51098j16995j9345J06193J06346n6856k26106j99130K6813K26171K07053
37480B05242L8616o4015k9830J7362j2359m7450j3275J5362o9158k17726k70936
$$ plain form
37469 -448167 -609732 -585629 -423310 -235892 -134559 -156435 -216020 -175830 -6664 165666
37459 165666 211314 144806 75848 63756 86984 114115 113781 7940 -275108 -657015 -900923
37448 -900923 -831480 -535816 -264120 -134164 -33377 144375 281084 193347 -38233 -93654
37438 -93654 165965 470343 476103 219120 45587 143141 349281 443450 420506 379663 308931
37427 308931 131338 -118605 -303155 -331661 -205424 43585 348257 563277 549131 333577
37417 333577 116780 78756 220135 409733 544620 629581 722104 841653 950684 1011658
37407 1011658 1035658 1064889 1129229 1233994 1357435 1430399 1360854 1140888 908283 832053
37397 832053 936042 1083828 1119947 975510 684180 390102 299472 491455 783999 918300
$$ packed form
37469d48167j61565K4103J62319J87418J01333k1876n9585M0190J69166J72330
37459A65666M5648o6508o8958j2092K3228K7131l34j05841k83048l81907k43908
37448i00923O9443K95664K71696J29956J00787J77752J36709q7737k31580n5421
37438i3654K59619L04378N760k56983j73533R7554K06140R4169k2944m0843p0732
37427C08931j77593k49943j84550k8506J26237K49009L04672K15020j4146k15554
37417C33577k16797l8024J41379J89598J34887Q4961R2523J19549J09031O0974
37407A011658K4000K9231O4340J04765J23441P2964o9545k19966k32605p6230
37397H32053J03989J47786L6119j44437k91330k94078r0630J91983K92544J34301
$$ plain form
37387 918300 865975 795771 750147 589878 321951 214214 406767 628212 548683 273320
37377 273320 204774 480158 821029 936055 810390 557929 241252 -61435 -218915 -210687
$$ packed form
37387I18300n2325p0204m5624j60269k67927j07737J92553K21445p9529k75363
37377B73320o8546K75384L40871J15026j25665k52461l16677l02687j57480Q228
$$ [...]
##END NTUPLES=NMR SPECTRUM
##END=
