##TITLE=31Pdec_DE-73_oil
 D2O, 64 sc
 5.11.2024
##JCAMPDX= 6.0         $$ Bruker NMR JCAMP-DX V2.0
##DATA TYPE= NMR SPECTRUM
##DATA CLASS= NTUPLES
##ORIGIN= UXNMR, Bruker Analytische Messtechnik GmbH
##OWNER= root
$$ XWIN-NMR		Version 3.5
$$ Tue Nov  5 15:43:04 2024 Russian Standard Time (UT+4h)  she@DPX200
##.OBSERVE FREQUENCY= 81.013821
##.OBSERVE NUCLEUS= ^31P
##.ACQUISITION MODE= SIMULTANEOUS
##.ACQUISITION SCHEME= undefined
##.AVERAGES= 64
##.DIGITISER RES= 17
##SPECTROMETER/DATA SYSTEM= spect
##.PULSE SEQUENCE= zgpg30
##.SOLVENT NAME= D2O
##.SHIFT REFERENCE= (INTERNAL, D2O, 0, 198.062)
##AUDIT TRAIL= $$ (NUMBER, WHEN, WHO, WHERE, WHAT)
$$ ##TITLE= Audit trail, XWIN-NMR		Version 3.5
$$ ##JCAMPDX= 5.01
$$ ##ORIGIN= Bruker BioSpin GmbH
$$ ##OWNER= she
$$ F:/spectra/data/she/nmr/P31/2/pdata/1/auditp.txt
$$ ##AUDIT TRAIL=  $$ (NUMBER, WHEN, WHO, WHERE, WHAT)
(   1,<2024-11-05 15:41:49.28 +0400>,<she>,<DPX200>,
      <created by zg, POWCHK disabled, PULCHK disabled
       configuration hash MD5:
       00 E9 B6 7A A2 85 ED C7 34 08 36 98 17 FE 4E 26
       data hash MD5: 32K
       C0 87 61 ED 93 1E 7F 7F 6A C1 73 7B 2B E5 DF BD>)
(   2,<2024-11-05 15:41:51.79 +0400>,<she>,<DPX200>,
      <Start of raw data processing
       efp BC_mod = 2 LB = 1.5 FT_mod = 6 PKNL = 1 PHC0 = 2295.521 PHC1 = 74.68819 SI = 64K 
       data hash MD5: 64K
       82 23 D5 E6 B0 67 47 D5 5E BD AF 1B EC 37 0F 68>)
(   3,<2024-11-05 15:42:09.71 +0400>,<she>,<DPX200>,
      <pk PHC0 = -24.55966 PHC1 = 0 
       data hash MD5: 64K
       62 B0 80 CE 20 1C 5D 54 11 D3 29 A1 B7 21 01 D8>)
(   4,<2024-11-05 15:42:34.60 +0400>,<she>,<DPX200>,
      <pk PHC0 = 100.254 PHC1 = -258.4 
       data hash MD5: 64K
       BC AD 04 F2 F8 66 65 D2 28 E0 A5 11 5C A2 48 61>)
$$ ##END=
$$ 
$$ hash MD5
$$ FF 94 C0 BF C8 89 FE 46 28 22 B0 5D BB 21 18 09
##$RELAX= 
##$RELAX= 
##$RELAX= 
##$RELAX= 
##$RELAX= 
##$RELAX= 
##$RELAX= 
##$RELAX= 
$$ Bruker specific parameters
$$ --------------------------
##$DU= <F:/spectra>
##$EXPNO= 2
##$NAME= <P31>
##$PROCNO= 1
##$TYPE= <nmr>
##$USER= <she>
##$AMP= (0..31)
100 100 100 100 100 100 100 100 100 100 100 100 100 100 100 100 100 100 
100 100 100 100 100 100 100 100 100 100 100 100 100 100 
##$AQSEQ= 0
##$AQ_mod= 1
##$AUNM= <au_zg>
##$AUTOPOS= <>
##$BF1= 81.014009
##$BF2= 200.13
##$BF3= 200.13
##$BF4= 200.13
##$BF5= 200.13
##$BF6= 200.13
##$BF7= 200.13
##$BF8= 200.13
##$BYTORDA= 1
##$CFDGTYP= 0
##$CFRGTYP= 5
##$CHEMSTR= <none>
##$CNST= (0..31)
1 1 145 1 1 1 1 1 1 1 1 1 1 1 1 1 1 1 1 1 1 1 1 1 1 1 1 1 1 1 1 1 
##$CPDPRG= <waltz16>
##$CPDPRG1= <>
##$CPDPRG2= <waltz16>
##$CPDPRG3= <>
##$CPDPRG4= <mlev>
##$CPDPRG5= <mlev>
##$CPDPRG6= <mlev>
##$CPDPRG7= <mlev>
##$CPDPRG8= <mlev>
##$CPDPRGB= <>
##$CPDPRGT= <>
##$D= (0..31)
0 1 0 0 0 0 0 0 0 0.06 0 0.03 2e-05 3e-06 0 0 0.0002 0 0 0 0 0 0 0 0 0 
0 0 0 0 0 0 
##$DATE= 1730806908
##$DBL= (0..7)
120 120 120 11 120 120 24 19 
##$DBP= (0..7)
150 150 150 150 150 150 150 150 
##$DBP07= 0
##$DBPNAM0= <>
$$ [...]
##$SUBNAM3= <"">
##$SUBNAM4= <"">
##$SUBNAM5= <"">
##$SUBNAM6= <"">
##$SUBNAM7= <"">
##$SUBNAM8= <"">
##$SUBNAM9= <"">
##$SW= 400.765351723535
##$SWIBOX= (0..15)
0 1 3 0 0 0 0 0 0 0 0 0 0 0 0 0 
##$SW_h= 32467.5324675325
##$TD= 32768
##$TD0= 1
##$TE= 0
##$TE2= 300
##$TE3= 300
##$TEG= 300
##$TL= (0..7)
0 120 53 12 22 120 120 120 
##$TP= (0..7)
150 150 150 150 150 150 150 150 
##$TP07= 0
##$TPNAME0= <>
##$TPNAME1= <>
##$TPNAME2= <>
##$TPNAME3= <>
##$TPNAME4= <>
##$TPNAME5= <>
##$TPNAME6= <>
##$TPNAME7= <>
##$TPOAL= (0..7)
0.5 0.5 0.5 0.5 0.5 0.5 0.5 0.5 
##$TPOFFS= (0..7)
0 0 0 0 0 0 0 0 
##$TUNHIN= 0
##$TUNHOUT= 0
##$TUNXOUT= 0
##$USERA1= <user>
##$USERA2= <user>
##$USERA3= <user>
##$USERA4= <user>
##$USERA5= <user>
##$V9= 5
##$VALIST= <valist>
##$VCLIST= <CCCCCCCCCCCCCCC>
##$VD= 0
##$VDLIST= <DDDDDDDDDDDDDDD>
##$VPLIST= <PPPPPPPPPPPPPPP>
##$VTLIST= <TTTTTTTTTTTTTTT>
##$WBST= 1024
##$WBSW= 4
##$XGAIN= (0..3)
0 0 0 0 
##$XL= 0
##$YL= 0
##$YMAX_a= 11641
##$YMIN_a= -11684
##$ZGOPTNS= <>
##$ZL1= 120
##$ZL2= 120
##$ZL3= 120
##$ZL4= 120
##$ABSF1= 0
##$ABSF2= 0
##$ABSG= 0
##$ABSL= 0
##$ALPHA= 0
##$AQORDER= 0
##$ASSFAC= 0
##$ASSFACI= 0
##$ASSFACX= 0
##$ASSWID= 0
##$AUNMP= <proc_1d>
##$AZFE= 0.1
##$AZFW= 0.5
##$BCFW= 0
##$BC_mod= 2
##$BYTORDP= 0
##$COROFFS= 0
##$CY= -3
##$DATMOD= 1
##$DC= 0
##$DFILT= <>
##$DTYPP= 0
##$F1P= 0
##$F2P= 0
##$FCOR= 1
##$FTSIZE= 65536
##$FT_mod= 6
##$GAMMA= 0
##$GB= 0
##$INTBC= 1
##$INTSCL= 9.790993e-09
##$ISEN= 30
##$LB= 1.5
##$LEV0= 0
##$LPBIN= 0
##$MAXI= 10000
##$MC2= 0
##$MEAN= 0
##$ME_mod= 0
##$MI= 50
##$NCOEF= 0
##$NC_proc= -8
##$NLEV= 6
##$NOISF1= 182.463
##$NOISF2= 159.3651
##$NSP= 0
##$NTH_PI= 0
##$NZP= 0
##$OFFSET= 198.0616
##$PC= 4
##$PHC0= 2371.215
##$PHC1= -183.7118
##$PH_mod= 1
##$PKNL= yes
##$PPARMOD= 0
##$PSCAL= 0
##$PSIGN= 0
##$REVERSE= no
##$SF= 81.0140089999434
##$SI= 65536
##$SIGF1= 159.3651
##$SIGF2= -187.1042
##$SINO= 113.3802
##$SIOLD= 16384
##$SREGLST= <1H.CDCl3>
##$SSB= 0
##$STSI= 65536
##$STSR= 0
##$SW_p= 32467.5324675325
##$SYMM= 0
##$S_DEV= 0
##$TDeff= 32768
##$TDoff= 0
##$TI= <>
##$TILT= no
##$TM1= 0
##$TM2= 0
##$TOPLEV= 0
##$USERP1= <user>
##$USERP2= <user>
##$USERP3= <user>
##$USERP4= <user>
##$USERP5= <user>
##$WDW= 1
##$XDIM= 65536
##$YMAX_p= 488085975
##$YMIN_p= -351232925
$$ End of Bruker specific parameters
$$ ---------------------------------
##NTUPLES= NMR SPECTRUM
##VAR_NAME=  FREQUENCY,     SPECTRUM/REAL,   SPECTRUM/IMAG
##SYMBOL=    X,             R,               I
##VAR_TYPE=  INDEPENDENT,   DEPENDENT,       DEPENDENT
##VAR_FORM=  AFFN,          ASDF,            ASDF
##VAR_DIM=   65536,         65536,           65536
##UNITS=     HZ,            ARBITRARY UNITS, ARBITRARY UNITS
##FACTOR=    0.49542278885378, 1,            1
##FIRST=     16045.7642231865, 0,            0
##LAST=      -16421.768244346, 0,            0
##MIN=       -16421.768244346, -351232925,   0
##MAX=       16045.7642231865, 488085975,    0
$$ Real data points
##PAGE= N=1
##DATA TABLE= (X++(R..R)), XYDATA
$$ [...]
42358h648589n72570p63596J451633L590904L108072J888159K711214L976236
42350F741463K305008j399119l199751k542626k531221l770172l016850P41369
42342f671899L627213K706659M44981J75985N25162j615921m918324n090638j677844
42333a2494626J051570L26204j801149k218249n89064J758888L870938M636333
42325e459155K877208l05634j662531j43718J232172J9900j645897o54971J702923
42316d039703J877506J38050r2571J342013O19269l175320n273754k063676L052762
42307g615424M207671R81735j994362j864423k04429O43745M52914m6509n33151
42298e972233n82439L63878J922025K867357K423166N93462k072505l877100k543656
$$ plain form
42358 -8648589 -9221159 -9984755 -8533122 -4942218 -1834146 54013 2765227 6741463
42350 6741463 9046471 7647352 4447601 1904975 -626246 -4396418 -7413268 -6671899
42342 -6671899 -3044686 -338027 106954 282939 808101 -807820 -5726144 -10816782 -12494626
42333 -12494626 -11443056 -11116852 -12918001 -15136250 -15725314 -13966426 -10095488 -5459155
42325 -5459155 -2581947 -2887581 -4550112 -4693830 -3461658 -3441758 -5087655 -5742626 -4039703
42316 -4039703 -2162197 -2024147 -2116718 -774705 -155436 -3330756 -8604510 -10668186 -7615424
42307 -7615424 -3407753 -2426018 -4420380 -6284803 -6489232 -5845487 -5392573 -5439082 -5972233
42298 -5972233 -6554672 -6190794 -4268769 -1401412 1021754 1615216 -457289 -4334389 -6878045
42289f878045J506293L864482J146336l662408m534644p22759K489587J838179
42281d952979J51202N87807J478755J97485j591176p89209J528738J836109M1370
42272a511898p23437M04611Q80293p92494l116870m496156m744660l322931M10884
42263a7012658M331452M520617P21246k366328j305591J381300J299453j372625
42255i803134k662099o88896K376791L847472L311612J753448J03390q02545m28305
42246b992266O72063J250328Q34070N3284m01035k66535N98547J926438K626817
42237D301711J889769O55633O87961K094252L133712K692769J401706j58990k497090
42228A4201433n301979o313765m174666j284454j151634l112843k730476J498167
$$ plain form
42289 -6878045 -5371752 -1507270 -360934 -4023342 -8557986 -9280745 -6791158 -4952979
42281 -4952979 -4801777 -4213970 -2735215 -2537730 -4128906 -4918115 -3389377 -1553268 -1511898
42272 -1511898 -2235335 -1830724 -950431 -1742925 -4859795 -9355951 -14100611 -17423542 -17012658
42263 -17012658 -12681206 -8160589 -7439343 -9805671 -11111262 -9729962 -8430509 -9803134
42255 -9803134 -12465233 -13154129 -10777338 -6929866 -3618254 -1864806 -1761416 -2563961 -2992266
42246 -2992266 -2320203 -1069875 -235805 -182521 -583556 -850091 -251544 1674894 4301711
42237 4301711 6191480 6847113 7535074 9629326 12763038 15455807 16857513 16698523 14201433
42228 14201433 8899454 2585689 -1588977 -2873431 -4025065 -7137908 -9868384 -8370217
42220h370217M804565K216924l806054n547502R686O944028P835033K743158k009437
42211D820184k422860o52307k69495j212269j220666j2591N29577m57652j758697
42202b656776k278323k368898k295119j001296K166272N345750N598858K701470
42194E211938r3163p5849J359437Q76418j739075l120732j470128L98961q98732
42185D49075m035048m538089j066338K731302L007460M80l178977l978574j826867
42176a2435576J827408L918653K265985j196959j947830R69315L060275R51168
42168b587561k117176j162770K404964K685922j278295l660738p67978L416909
42160c066723L440475j21783l101961m324395n204188m975367j533349L471065
$$ plain form
42220 -8370217 -3565652 -1348728 -5154782 -10702284 -10692598 -3748570 4086463 6829621 4820184
42211 4820184 2397324 1745017 1475522 263253 -957413 -970004 -440427 -898079 -2656776
42202 -2656776 -4935099 -7303997 -9599116 -10600412 -8434140 -3088390 2510468 5211938
42194 5211938 5118775 5042926 6402363 7278781 5539706 2418974 948846 1347807 449075
42185 449075 -3585973 -8124062 -9190400 -6459098 -3451638 -3451158 -6630135 -10608709 -12435576
42176 -12435576 -10608168 -6689515 -4423530 -5620489 -7568319 -6599004 -3538729 -2587561
42168 -2587561 -4704737 -5867507 -3462543 -776621 -2054916 -5715654 -6483632 -3066723
42160 -3066723 373752 251969 -2849992 -7174387 -12378575 -17353942 -18887291 -15416226
42152a5416226N280866K548954q06111j390921l17951J14891J38369N95165L90955
42143h862009j147119j638922J279826N614976O968583M127042j61376l337488
42135B843513m931138m699954k298559O60785J285228p92136k705978k337712
42127a2975951n88021J129594K833974M101867L238879L84733j266729O9929J515084
42118a556641j76337l136905k957781N74791L385275L289129K185790J791471
42110C398792J157280m84655j922986k509156l370276m358540k805989K333207
42102h562323P523903Q480079N284942J315962j379771l076573l979395l695314
42094A911510k723032k144871j930113j316014n13467k64034j52326P08225J632506
$$ plain form
42152 -15416226 -10135360 -7586406 -8392517 -9783438 -10101389 -9986498 -9848129 -9252964 -8862009
42143 -8862009 -10009128 -11648050 -10368224 -4753248 2215335 6342377 6181001 2843513
42135 2843513 -2087625 -6787579 -9086138 -8425353 -7140125 -7932261 -10638239 -12975951
42127 -12975951 -13563972 -12434378 -9600404 -5498537 -2259658 -1874925 -3141654 -3071725 -1556641
42118 -1556641 -1732978 -4869883 -7827664 -7252873 -3867598 -578469 1607321 3398792
42110 3398792 4556072 4071417 2148431 -360725 -3731001 -8089541 -10895530 -8562323
42102 -8562323 -1038420 7441659 12726601 14042563 12662792 9586219 5606824 1911510
42094 1911510 -811522 -2956393 -4886506 -6202520 -6715987 -6980021 -7132347 -6424122 -4791616
42085d791616J059205p75671j891267j460056p12711o36980p65658q65032j766465
42076a2606251l276516l009724P25730N648472P221748M008116k97974j288307
42068b874706P19112J486918r48450l313820j885601J870299L486522K222482
42060G62756J530862K523815J685672k735386o410737m765923P4739K600070J839653
42051b894479J092155J319519L05701j963695k563313r30612R3608m20613M394
42042e957335K054767K923243J783486J876547M324503M857542N75846m390907
42034H047692m595546j135981J129071J354946K299776M019594L494848m8383
42026A4566017m027188o276858o099993k713037K966781O143217K866506l479079
$$ plain form
42085 -4791616 -3732411 -4508082 -6399349 -7859405 -8572116 -9209096 -9974754 -10839786 -12606251
42076 -12606251 -15882767 -18892491 -18166761 -12518289 -5296541 -1288425 -1586399 -2874706
42068 -2874706 -2155594 -668676 -1617126 -4930946 -6816547 -4946248 -1459726 762756
42060 762756 2293618 4817433 6503105 3767719 -2643018 -7408941 -7334202 -4734132 -2894479
42051 -2894479 -1802324 -482805 -177104 -2140799 -4704112 -5634724 -5541116 -5961729 -5957335
42042 -5957335 -3902568 -979325 804161 2680708 7005211 11862753 12438599 8047692
42034 8047692 3452146 2316165 3445236 4800182 7099958 11119552 14614400 14566017
42026 14566017 10538829 4261971 -1838022 -4551059 -1584278 4558939 7425445 3946366
42018C946366n566815j984729J582324J310422l99906o93968n27801r11101k45452
42009c490660J675787J760678j094185l141831j560965J051964J534630J294679
42001a969903K380920K470526j030192n048906m664340p07321J948948J961976
41993d658292J755991J568839n80113l398963l051591O1373J223174o78246j068609
41984h826437K310669M975448K687304j742887k799684j67527J929095J222484
41976d11535o83952j830645k030495j788260j380144q77517J35165K134645M122161
41967b610577L912606R97563k374886l901161l286071r91044K500896N070837
41959f81837L768532p52342l636329k184764K20107l67578k163278j067063K161175
$$ plain form
42018 3946366 -1620449 -3605178 -2022854 -712432 -1112338 -1806306 -2334107 -3245208 -3490660
42009 -3490660 -1814873 -54195 -1148380 -4290211 -5851176 -4799212 -3264582 -1969903
42001 -1969903 411017 2881543 1851351 -3197555 -7861895 -8569216 -6620268 -4658292
41993 -4658292 -2902301 -1333462 -1913575 -5312538 -8364129 -8302756 -7079582 -7757828 -8826437
41984 -8826437 -6515768 -1540320 1146984 -595903 -3395587 -3563114 -1634019 -411535
41976 -411535 -1095487 -2926132 -4956627 -6744887 -8125031 -9002548 -8867383 -6732738 -2610577
41967 -2610577 1302029 2299592 -75294 -3976455 -7262526 -8253570 -5752674 -681837
41959 -681837 3086695 2334353 -1301976 -3486740 -3266633 -3634211 -5797489 -6864552 -4703377
41950d703377L232092J470858L55723J261595J796400Q35348L41366J026564O71638
41941F288207j588815l314753k994317k542563l410283l624035j261385K022134
41933a0425810L573997L391622K750188J673913L64960O21202K772576L490089
41925H212737J79637m251811m904401j930474Q5041p38840j494340j20403J129924
41916c832930k37793k633413k760188m70559J371996J177634N01203J294299K807287
41907b782464K414149o35465l479770k812603O04383K419445K66270l092303l649229
41898a0747587j387808O25665J076891J422060K463757K883612J698394k23596
41890b188612j815352k987926l557099k944771j561877n64178K70645K191230
$$ plain form
41950 -4703377 -1471285 -427 355296 1616891 3413291 4248639 4590005 5616569 6288207
41941 6288207 4699392 1384639 -1609678 -4152241 -7562524 -11186559 -12447944 -10425810
41933 -10425810 -6851813 -3460191 -710003 963910 1328870 1950072 4722648 8212737
41925 8212737 8392374 4140563 -763838 -2694312 -2609271 -3348111 -4842451 -4962854 -3832930
41916 -3832930 -4070723 -6704136 -9464324 -9934883 -8562887 -7385253 -6884050 -5589751 -2782464
41907 -2782464 -368315 -1003780 -4483550 -7296153 -6691770 -4272325 -4006055 -7098358 -10747587
41898 -10747587 -12135395 -11509730 -10432839 -9010779 -6547022 -3663410 -1965016 -2188612
41890 -2188612 -4003964 -6991890 -10548989 -13493760 -15055637 -15619815 -15349170 -13157940
41882a3157940M380631L982792N89140k120719j400522M47571r9665j956755j277112
41873a0612579J883236L112452M14531k527988j683114J784583L833983L315625
41865d79271K382642K113909R98428j715356l787486k639555J128337M361513
41857B363161M823450K867696K14473j618029j912196j153722r41759k309707
41849B333367m048631m043594k409576j501061k207023k403721n31620J442055
41841a3369804J032758m44919K73906L081410M592137L577935K529895K866179
41833D139497K453002J3802j466408R46088M748579M757032K35810m286567n124334
41824F416501l169813j212604m37016n39137j084730j517797j208652l37134K70146
$$ plain form
41882 -13157940 -8777309 -4794517 -4205377 -6326096 -7726618 -7279047 -7378712 -9335467 -10612579
41873 -10612579 -8729343 -5616891 -5202360 -7730348 -9413462 -7628879 -3794896 -479271
41865 -479271 1903371 4017280 5015708 3300352 -487134 -3126689 -1998352 2363161
41857 2363161 7186611 10054307 10268780 8650751 6738555 5584833 4643074 2333367
41849 2333367 -1715264 -5758858 -8168434 -9669495 -11876518 -14280239 -14811859 -13369804
41841 -13369804 -12337046 -12781965 -12508059 -9426649 -4834512 -1256577 1273318 4139497
41833 4139497 6592499 6606301 5139893 6085981 10834560 15591592 15827402 11540835 6416501
41824 6416501 3246688 2034084 1597068 1057931 -26799 -1544596 -2753248 -3090382 -2820236
41815b820236M18580M70260R1521j257054k581212k138642k77662P00749R1004
41806g302692k07644Q32888J537033P68092L42104J801172L105772J704937p87075
41797A794587p18940J624054K224007l28102k753930k515765j513267k187495
41789d374851l161022j838746Q57590J862824R46150P90249K251591K856555Q28623
41780A018963k069315l105246k087083p44684R5759J022740K271217K947497K213335
41771A563183M46887j120833j692444j547287j234919m33922J481551L539209
41763A001425L315103K01272k827393k725022o46813n5624j196938j013585J092771
41754b854804J582527j306937l919768k598795M96860J032716n04685k98079J742693
$$ plain form
41815 -2820236 -2401656 -1931396 -1839875 -3096929 -5678141 -7816783 -8094445 -7393696 -7302692
41806 -7302692 -7510336 -6677448 -5140415 -4372323 -4030219 -2229047 876725 2581662 1794587
41797 1794587 1075647 2699701 4923708 4595606 1841676 -674089 -2187356 -4374851
41789 -4374851 -7535873 -9374619 -8517029 -6654205 -5708055 -4917806 -2666215 190340 1018963
41780 1018963 -1050352 -4155598 -6242681 -6987365 -6891606 -5868866 -3597649 -650152 1563183
41771 1563183 2010070 889237 -803207 -2350494 -3585413 -4019335 -2537784 1001425
41763 1001425 4316528 4517800 1690407 -1034615 -1681428 -1737052 -2933990 -3947575 -2854804
41754 -2854804 -1272277 -2579214 -6498982 -9097777 -8600917 -7568201 -8072886 -8370965 -6628272
41745f628272J870365n97824j780896J01252J760146R11481N61975L633104P090960
41736F922291N976954R81524k641704k569319j394952j461835k008230k108115
41728A696614k589503l491261k719639O21612L717411L229617j40978k444300
41720b120427j459257R20891J544837l7647j310312j60350K307888K966308N60714
41711C212645k533382l104450r22985J342930J672740P56445K64221L70785k8022
41702A030927j174102j606166J13911L159913M659077K743543r69836l018781
41694D938486k298339j223904k053424l672293l559045j666396j49308J92676
41686i491547P39243K123161K831170J633652l97129j409425r50778L51353J911200
$$ plain form
41745 -6628272 -4757907 -5355731 -7136627 -7035375 -5275229 -4363748 -3801773 -168669 6922291
41736 6922291 12899245 13880769 11239065 8669746 7274794 5812959 3804729 1696614
41728 1696614 -892889 -4384150 -7103789 -6482177 -2764766 464851 323873 -2120427
41720 -2120427 -3579684 -2658793 -1113956 -1151603 -2461915 -2622265 -314377 2651931 3212645
41711 3212645 679263 -2425187 -3348172 -2005242 -332502 423943 688164 1058949 1030927
41702 1030927 -143175 -1749341 -1635430 1524483 6183560 8927103 7957267 4938486
41694 4938486 2640147 1416243 -637181 -4309474 -7868519 -9534915 -9684223 -9491547
41686 -9491547 -8752304 -6629143 -3797973 -2164321 -2561450 -3970875 -4921653 -4570300 -2659100
41677b659100K852059J944585n57163k087911o42627K142982K783749O20464j466550
41668B930488j398559o37095j263221k346361j621298K61086K11294k235945l372823
41659i472434n47514L465386M077712J421911j38829J318416K871036J921714
41651D917398M2402n42112j053349l335664n200098k887101K552075N624784L670519
41642C788854n533j460600j056629j025959j120290K37109K183781K121818j60626
41633C501925j822805q79032J261278K026550J092323M09482J338221K793009
41625I720951K568954J16237k638324l483711k400217j233140j321924k349978
41617a021152l247020l053599j020244K622223N662188N293051J404882k693953
$$ plain form
41677 -2659100 192959 2137544 1580381 -507530 -1150157 992825 3776574 4397038 2930488
41668 2930488 1531929 894834 -368387 -2714748 -4336046 -4074960 -3863666 -6099611 -9472434
41659 -9472434 -10019948 -6554562 -2476850 -1054939 -1193768 124648 2995684 4917398
41651 4917398 4959800 4417688 3364339 28675 -5171423 -8058524 -5506449 118335 3788854
41642 3788854 3783321 2322721 1266092 240133 -880157 -643048 1540733 3662551 3501925
41633 3501925 1679120 800088 2061366 4087916 5180239 5589721 6927942 9720951
41625 9720951 12289905 12406142 9767818 6284107 3883890 2650750 1328826 -1021152
41617 -1021152 -4268172 -7321771 -8342015 -5719792 -57604 5235447 6640329 3946376
41609C946376l766822j868725O56322K064756J953739M75067j414532j744105
41601C02076M34789L039449K894048j31590k702835k342153n45304m01975k224566
41592a678061l232402j499171J290546J878511m43328k888513k563025Q8370J979621
41583g067452J115481j330342k733514j936339q044J332355J427625Q87057M57425
41574g855748K5956q95797j806117j311080P65171K387951J784532K22777M82874
41565f199481K743658M100502K591059l92304k565759l565629l935747l221692
41557a0445393j096212Q92840R52180j68348p9624J773405L430501L260741J764559
41548B84649K41870p93930j340168j330729j046988j160944j647804j363871M91736
$$ plain form
41609 3946376 179554 -1689171 -1032849 1031907 2985646 3460713 2046181 302076
41601 302076 736865 3776314 6670362 6538772 3835937 1493784 948480 546505 -1678061
41592 -1678061 -4910463 -6409634 -5119088 -3240577 -3683905 -6572418 -9135443 -9047073 -7067452
41583 -7067452 -5951971 -7282313 -10015827 -11952166 -11960210 -10627855 -9200230 -8313173 -7855748
41574 -7855748 -7829792 -8725589 -10531706 -11842786 -11077615 -8689664 -6905132 -6682355 -6199481
41565 -6199481 -3455823 644679 3235738 2843434 277675 -3287954 -7223701 -10445393
41557 -10445393 -11541605 -10648765 -9696585 -9864933 -9944557 -8171152 -4740651 -1479910 284649
41548 284649 526519 -267411 -1607579 -2938308 -3985296 -5146240 -6794044 -8157915 -7666179
41539g666179K857436L553352J690914j098390k244719j048494N45535L83124
41531c027421j102784j445282M56780K568359K030058j328785m496947m236085
41523a0582107l68299L751467M356023J388380j083537L21952L777305M512269
41515F073453J329193j911177k026752o86574r04508k011888j168266J620464
41507C13945L297058K177766k44132j994687k671833k487879j483491l46562k23022
41498c662837r58347r32042O20107K217991J826865o77285l246286l701927k039825
41489a0553586o11836j349673k938137k303356P73315K875448K023797Q10036
41481a1273992K072915M051677L403611J060398O14527J906844J214298k098677
$$ plain form
41539 -7666179 -4808743 -1255391 435523 -662867 -2907586 -3956080 -3410545 -3027421
41531 -3027421 -4130205 -5575487 -5118707 -2550348 -520290 -1849075 -6346022 -10582107
41523 -10582107 -10950406 -7198939 -2842916 -1454536 -2538073 -2216121 1561184 6073453
41515 6073453 7402646 5491469 3464717 2778143 1873635 -138253 -1306519 313945
41507 313945 3611003 5788769 5544637 3549950 878117 -1609762 -3093253 -3439815 -3662837
41498 -3662837 -4621184 -5553226 -4933119 -2715128 -888263 -1565548 -4811834 -8513761 -10553586
41489 -10553586 -11165422 -12515095 -15453232 -17756588 -16983273 -14107825 -12084028 -11273992
41481 -11273992 -9201077 -5149400 -1745789 -685391 -70864 1835980 3050278 951601
41473I51601m198023l095222j429838j129822j49042K641788L808257N59451l852681
41464e893531m405514j535183M74249N34355J212874K899123K660157l26055k610493
41455f990018j483329J146573J896669N12258p63285p36452j22555K44943L65038
41446e930158N47769J003857J733530K277867K052497J321088J066694J333721
41438E406865O63176j740353l986713l259720K72907K898979J705055j615620
41430C44576k891205r63571J046839N24118q52633K1664K625066L464307J364469
41421D683630r40208j138605m18521p28499j397066p03242Q51964J377754Q04629
41412B391836P66539J544914J461315l61371k504884l099419j779451O57714L217629
$$ plain form
41473 951601 -3246422 -6341644 -7771482 -8901304 -9050346 -6408558 -2600301 -2040850 -5893531
41464 -5893531 -10299045 -11834228 -11359979 -10825624 -9612750 -6713627 -4053470 -4379525 -6990018
41455 -6990018 -8473347 -7326774 -5430105 -4917847 -5681132 -6417584 -6540139 -6295196 -5930158
41446 -5930158 -5382389 -4378532 -2645002 -367135 1685362 3006450 4073144 5406865
41438 5406865 6070041 4329688 342975 -2916745 -2643838 255141 1960196 344576
41430 344576 -2546629 -3510200 -2463361 -1939243 -2791876 -2770212 -145146 3319161 4683630
41421 4683630 3743422 2604817 2186296 1457797 60731 -642511 209453 1587207 2391836
41412 2391836 3158375 4703289 6164604 5803233 3298349 198930 -1580521 -922807 2294822
41403B294822M713987M005098J186799k038652l887534m021419l185074j972562
41395b904535o45529L08278M65681L74554J160485K657016K806815J47931l480414
41386H90282m445543k001972L37432n94486l228775l534378o31788K444784L244075
41377g520369K379408J244848J29355m09913R69638L843459N136639K803774j182056
41368G394783l391779l116029k130609j581602j174186o30259o4434N57930R32823
41359c203362J91639j538895k479266j594528l73782m64123q88218K13779K245928
41350g890828L053366K353626J691145J429356L78001j630361l104141k993133
41342f712969j612237L65798K106030K324450P92549m99564J17921J074092j94399
$$ plain form
41403 2294822 7008809 11013907 12200706 10162054 6274520 2253101 -931973 -2904535
41395 -2904535 -3550064 -3241786 -2776105 -2401551 -1241066 1415950 4222765 4370696 890282
41386 890282 -3555261 -5557233 -5219801 -5814287 -9043062 -12577440 -13209228 -10764444 -7520369
41377 -7520369 -5140961 -3896113 -3766758 -4176671 -3207033 636426 5773065 8576839 7394783
41368 7394783 4003004 886975 -1243634 -2825236 -3999422 -4629681 -4694115 -4136185 -3203362
41359 -3203362 -3011723 -4550618 -7029884 -8624412 -8998194 -9462317 -10350535 -10136756 -7890828
41350 -7890828 -4837462 -2483836 -792691 636665 1014666 -615695 -3719836 -6712969
41342 -6712969 -8325206 -7959408 -5853378 -3528928 -2736379 -3235943 -3118022 -2043930 -2238329
41333b238329k817888l520723j772967l84761o81545p14538Q16443K278889K089821
41324f945598R72429j19230j392154k147110m89720L037959M669738K642011L11804
41315E40129J157773L205238J995312k503430n696290m598426j123886R99694
41307f023886K53598j977593l038898j276294K120396L957096K802743R77016
41299b205822J333269L190741L483480J172274j764143l462406m087604m414794
41291f755005m384086l638008k262117n69737J054470K075742K311013K282551
41283i885177K340303J902422M57911j210816j842078j311028m98673j6029Q3607
41274i979558r6951j61077M22813J290028J286707L69049J6851P12306P41701
$$ plain form
41333 -2238329 -5056217 -8576940 -10349907 -10734668 -11416213 -12130751 -11314308 -9035419 -6945598
41324 -6945598 -5973169 -6092399 -7484553 -9631663 -10121383 -7083424 -2413686 228325 540129
41315 540129 1697902 4903140 6898452 4395022 -1301268 -5899694 -7023580 -6023886
41307 -6023886 -5770288 -7747881 -10786779 -12063073 -9942677 -5985581 -3182838 -2205822
41299 -2205822 -872553 2318188 5801668 6973942 5209799 1747393 -2340211 -6755005
41291 -6755005 -11139091 -14777099 -17039216 -17608953 -16554483 -14478741 -12167728 -9885177
41283 -9885177 -7544874 -5642452 -5184541 -6395357 -8237435 -9548463 -10047136 -10063165 -9979558
41274 -9979558 -10076509 -10237586 -9814773 -8524745 -7238038 -6868989 -6852138 -6139832 -5398131
41265e398131r02316k262496j282722P00146J058981J80926N24408K178064K768776
41256b434364J591150M46452J77296k65876q02214K21940K383192K541147l82808
41247C475915k976230j876152J655807L950849L690185K111927K00891j777019
41239H456173l054519l038794k561637k624907k638800j551407J69123J351321
41231e493447J906684K024059Q06161j957395l638180j327059L555937O063443
41223A940203L767570l84145k212666j223750k6894m22422j742580k377532j607145
41214d289361j28839M85986q05884l071775l820885j605220K058105M060757K919195
41205d197921N1784k082612k393339j419062Q9799J874333L453809L788735K440163
$$ plain form
41265 -5398131 -6300447 -8562943 -9845665 -9145519 -8086538 -7905612 -7381204 -5203140 -2434364
41256 -2434364 -843214 -396762 -219466 -485342 -1287556 -1065616 1317576 3858723 3475915
41247 3475915 499685 -1376467 279340 4230189 7920374 10032301 10233192 8456173
41239 8456173 5401654 2362860 -198777 -2823684 -5462484 -7013891 -6844768 -5493447
41231 -5493447 -3586763 -1562704 -756543 -2713938 -6352118 -7679177 -4123240 1940203
41223 1940203 5707773 5323628 3110962 1887212 1860318 1437896 -304684 -2682216 -4289361
41214 -4289361 -4418200 -3932214 -4738098 -7809873 -11630758 -13235978 -11177873 -7117116 -4197921
41205 -4197921 -4146137 -6228749 -8622088 -10041150 -9951351 -8077018 -4623209 -834474 1605689
41196A605689M89090o42658r42981j326016j720380j159435P5536J29018j833434
41187e325571m148264m767586l595988j707401L71309K243660K878938K028716
41179a2022187J353291K241872L394568K609510K16445j500936j704528j402771
41171f814736r17532L18417J557285J246448r749N5174J504335K011071J140989
41162I1702J091863J934205M14902l988333o065663j882954M540059O338000L203864
41153E677645L32477n03546k520587o264221o808002j298565N473254O758569
41145H47024K277351k431578l278092j154228Q18691Q87798l90972j166541k32591
41136c823138J396946J493501l64981j966066j359005O64600J808829Q76613j504758
$$ plain form
41196 1605689 2094779 1452121 509140 -816876 -2537256 -3696691 -3621155 -3492137 -5325571
41187 -5325571 -9473835 -14241421 -17837409 -19544810 -19173501 -16929841 -14050903 -12022187
41179 -12022187 -10668896 -8427024 -5032456 -2422946 -2206501 -3707437 -5411965 -6814736
41171 -6814736 -7732268 -7413851 -5856566 -4610118 -4619867 -4564693 -3060358 -1049287 91702
41162 91702 1183565 3117770 3532672 -455661 -6521324 -8404278 -3864219 2473781 5677645
41153 5677645 6010122 5506576 2985989 -3278232 -10086234 -11384799 -5911545 847024
41145 847024 3124375 692797 -2585295 -3739523 -2920832 -2033034 -2424006 -3590547 -3823138
41136 -3823138 -2426192 -932691 -1297672 -3263738 -4622743 -3958143 -2149314 -1272701 -2777459
41127b777459l586299l536802j216539R19535N88328o82278M81879L358126L096297
41118c355212j645947n216287k427260L886997O939192N096644K279749R87590
41110F545466M1669j246399j598455r24395p93271j165143m42642P95940J84255
41101A397025j604998q15523L136265N623482L248822j412741m060252m257572
41093A254508l835356k736006k7578K930417L811963K721376J523665P96120j57736
41084F281373j302045k143907l015297m016631l820223j616666R29206J801971
41076f902219J513096J707012K231285J956775J154289M71022j026376l790830
41068b685946n188751k643198J498060K414961L2671o57296K607539N623677L915278
$$ plain form
41127 -2777459 -6363758 -9900560 -11117099 -10197564 -9609236 -10291514 -9809635 -6451509 -3355212
41118 -3355212 -5001159 -10217446 -12644706 -8757709 -1818517 3278127 5557876 6545466
41110 6545466 6587135 5340736 3742281 2817886 2024615 859472 416830 1212770 1397025
41101 1397025 -207973 -1023496 2112769 7736251 10985073 9572332 5512080 1254508
41093 1254508 -2580848 -5316854 -5344432 -2414015 1397948 4119324 5642989 6439109 6281373
41084 6281373 4979328 2835421 -179876 -4196507 -8016730 -9633396 -8704190 -6902219
41076 -6902219 -5389123 -3682111 -1450826 505949 1660238 2131260 1104884 -2685946
41068 -2685946 -7874697 -10517895 -9019835 -6604874 -6572203 -7229499 -4621960 1001717 4916995
41059D916995q81565l715351k803307o06315M60644L99080J38802j7971k13057
41050b322045n87503j144019j395236n47746J242413K361327J428175q35076k304441
41041d104151j854912k87800J048123J691268J773535R78157j212087m022254
41033e990121n168427l293829k09056Q69914n42176j623309l93310J669550K430646
41024a2250118K254478K228204J372899j235132l061806p64720M135784O254079
41016a066332L534495l27726j666837j223563j021327o47920N77552Q45737j232363
41007b228284l110478j473954K314120L689448J356828j342922j803391j410126
40999d008759k222602l307918k506955k06445R28929l54437k111497j495339J869623
$$ plain form
41059 4916995 4035430 320079 -2483228 -3089543 -2628899 -2229819 -2091017 -2108988 -2322045
41050 -2322045 -2909548 -4053567 -5448803 -5996549 -4754136 -2392809 -964634 -1799710 -4104151
41041 -4104151 -5959063 -6246863 -5198740 -3507472 -1733937 -755780 -1967867 -5990121
41033 -5990121 -11158548 -14452377 -14661433 -13791519 -14333695 -15957004 -16350314 -14680764 -12250118
41024 -12250118 -9995640 -7767436 -6394537 -7629669 -10691475 -11456195 -7320411 -1066332
41016 -1066332 2468163 2140437 473600 -749963 -1771290 -2419210 -1841658 -995921 -2228284
41007 -2228284 -5338762 -6812716 -4498596 -809148 547680 -795242 -2598633 -4008759
40999 -4008759 -6231361 -9539279 -12046234 -12252679 -11323750 -11678187 -13789684 -15285023 -13415400
40990a3415400N317341N985075L962295K038405K150592L000990K134237l24154
40982A0849381j630425k70178J761696J489595j250370l826165m200845k946333
40974b3644j707236r66446k00994N83261P56094L34139J44142N07582Q04405O50075
40964H81378M07722J07626q38126k123061k232655q25211R2423r02978j926596
40955g359478l15878L061846M722801L355857Q99627j013564k556220l282572
40947b487581j641479J784390L606157K027389n83691j325840n07119K49258J099957
40938B221441K572534L181110J390908j543781l398990m117707m424627l159050
40930g278162N49494L972177L747361J298385Q94899K625023K221820j389477
$$ plain form
40990 -13415400 -8098059 -2112984 1849311 3887716 6038308 9039298 11173535 10849381
40982 10849381 9218956 8948778 10710474 12200069 10949699 7123534 2922689 -23644
40974 -23644 -1730880 -2697326 -2898320 -2315059 -1558965 -1224826 -1080684 -573102 231303 881378
40964 881378 1289100 1396726 558600 -1564461 -3797116 -4622327 -4529904 -5432882 -7359478
40955 -7359478 -7675356 -4613510 109291 3465148 4364775 3351211 794991 -2487581
40947 -2487581 -4129060 -2344670 1261487 3288876 2705185 1379345 872226 1121484 2221441
40938 2221441 4793975 7975085 9365993 7822212 4423222 305515 -4119112 -7278162
40930 -7278162 -6728668 -2756491 990870 2289255 3184154 5809177 8030997 6641520
40922F641520l532920r57824K907174L101254J26441j853816j352596k54284L01636
40913E126585R52846J656565J505867Q53597Q27022Q37096p23640l246111m090876
40904C698951k424695l47244L84479K42818k35332j761612l930982m010931l57416
40895h741964M532454O594850M764574J082188k468378m866674m904260k207191
40887f214401P37646O38824j952776k901243l85933K346621J894460l02202n70146
40878f709150J283190K188560R75585r8696O57882J828703J534755L81588J01435
40869B143852O69538N89321m90151j072793o2280J243876L31281l170582o065436
40860e883374m718871L79314M731221N126958K979354J133059k86253k196617
$$ plain form
40922 6641520 3108600 2150776 5057950 8159204 8285645 6431829 5079233 4824949 5126585
40913 5126585 6079431 7735996 9241863 10095460 10922482 11759578 11035938 7789827 3698951
40904 3698951 1274256 927012 1311491 1554309 1318977 -442635 -4373617 -8384548 -8741964
40895 -8741964 -4209510 2385340 7149914 8232102 5763724 897050 -4007210 -6214401
40887 -6214401 -5476755 -4837931 -6790707 -9691950 -10077883 -7731262 -5836802 -6139004 -6709150
40878 -6709150 -5425960 -3237400 -2261815 -2360511 -1702629 126074 1660829 2042417 2143852
40869 2143852 2813390 3402711 2912560 1839767 1777487 3021363 3352644 182062 -5883374
40860 -5883374 -10602245 -10222931 -5491710 -364752 2614602 3747661 3461408 1264791
40852A264791k840999N6308M144006M312077M68937j471911J484582M261091J262473
40843A2941355m682432o095355j657659K232901O99410l653925n352504k934210
40835h502419P57000K684017J999251k07886j861843j371694P81980K456989K292231
40826i72374R73061j92195q82270j443379j898172j915602j236759J77898J928494
40817e461298L066545K864207J699609N33493l05680r97835j210139l96961R02859
40808F94800J319660M83794l95916m5392J601868L653464M793633L662687Q4940
40799A5853538l789801m982103l014876o40428m77454j919301k342679o25342
40791a938446J689607K446884J099560j141088k613455k467332j178583j59701
$$ plain form
40852 1264791 -1576208 -1519900 2624106 6936183 7405120 5933209 7417791 11678882 12941355
40843 12941355 8258923 2163568 505909 2738810 3438220 -215705 -5568209 -8502419
40835 -8502419 -7745419 -5061402 -3062151 -3270037 -5131880 -6503574 -5721594 -3264605 -972374
40826 -972374 687 -191508 -1073778 -2517157 -4415329 -6330931 -7567690 -7389792 -5461298
40817 -5461298 -2394753 469454 2169063 2702556 2396876 1399041 188902 -208059 694800
40808 694800 2014460 2498254 2102338 2056946 3658814 7312278 12105911 15768598 15853538
40799 15853538 12063737 7081634 4066758 3426330 2948876 1029575 -1313104 -1938446
40791 -1938446 -248839 2198045 3297605 2156517 -456938 -2924270 -4102853 -4262554
40783d262554n34987j858325k182307J84L717741O091435N448755L215821J901746
40774A1537509J897555J582163J01719j726757l156381m104610l805313j287749
40766A038136K029044K868275P15530p03005J248369L776872K712703j005679
40758A2680245k706399r80909P26353k15098k110032k315138j098674l18915l55346
40749C306087k99060J7850j00282p90972j272219q69146J04524N66447j36820
40740E26409j233819j304185k24918O89115R15266J576443L094847L705567J898134
40731I642859j136724l212325l797615l222953j176171J689988K673661M51574
40723A912294k249161k518460j684271k121001k055459J353833N570251N460297
$$ plain form
40783 -4262554 -4797541 -6655866 -8838173 -8837989 -5120248 971187 6419942 9635763 11537509
40774 11537509 13435064 15017227 15118946 13392189 10235808 6131198 2325885 1038136
40766 1038136 3067180 5935455 6650985 5947980 7196349 10973221 13685924 12680245
40758 12680245 9973846 8992937 9719290 9504192 7394160 5079022 3980348 3661433 3306087
40749 3306087 3007027 3024877 2924595 2133623 861404 -7742 96782 663229 526409
40740 526409 -707410 -2011595 -2236513 -1547398 -632132 944311 4039158 7744725 9642859
40731 9642859 8506135 5293810 1496195 -1726758 -2902929 -1212941 1460720 1912294
40723 1912294 -336867 -2855327 -4539598 -6660599 -8716058 -7362225 -1791974 3668323
40715C668323J763228J06361J390190M76444l966041n934839j835393L154959
40707a176768L237589O95329Q14647K781269J971527j767151m342978m125844
40699a912380k878086j152130K133269O023621P803387O746936M212020Q02654
40691B1779291l170141n492796m129216r09186L62107r85757k391666k300616
40683B762020j249149M73613K795962M035493K462788o18568k302508j985835
40675F373816j011075M32855K632836L705855J607319j868782l130290k353694
40667F388840k772296m637343m526538j203191K293197L453456L113455K260355
40659D369935N5654l220020m803472l088575R7659K434231L674156L952502K449380
$$ plain form
40715 3668323 5431551 5537912 6928102 7404546 3438505 -2496334 -4331727 -1176768
40707 -1176768 2060821 2756150 3570797 6352066 8323593 6556442 2213464 -1912380
40699 -1912380 -4790466 -5942596 -3809327 2214294 10017681 16764617 20976637 21779291
40691 21779291 18609150 13116354 8987138 8077952 8440059 7454302 5062636 2762020
40683 2762020 1512871 1986484 4782446 8817939 11280727 10662159 8359651 6373816
40675 6373816 5362741 5795596 8428432 12134287 13741606 11872824 8742534 6388840
40667 6388840 3616544 -1020799 -5547337 -6750528 -4457331 -1003875 2109580 4369935
40659 4369935 4425589 1205569 -3597903 -6686478 -6588819 -4154588 -480432 3472070 5921450
40650E921450n17768k623705k576889j909963k188891k535231j540701J94043
40642g777655J062566O68170j70945o25089m76135m35611j565837l138052k253024
40633a4711612K072822N866533M750489M76446j443676K716P53840m66295J0898
40624b687839L306305M722384J438919k159035j436716R43078j23944l413693
40616E89459l560601Q3510K772821J825870m90688j534807j235920j43031J527902
40607a65485K378715Q37158j743471k158385j46990R03457j107803m138775n178273
40598a0519852l834898j482543J022270L133965L695315K120151o7606l92685
40590f325883J705158L953392L594333M21711k988539m196140l339172k004926
$$ plain form
40650 5921450 5403682 2779977 203088 -1706875 -3895766 -6430997 -7971698 -7777655
40642 -7777655 -6715089 -6046919 -6217864 -6842953 -7319088 -7754699 -9320536 -12458588 -14711612
40633 -14711612 -12638790 -6772257 -2021768 -1545322 -2988998 -2986282 -2232442 -2698737 -2687839
40624 -2687839 618466 5340850 6779769 4620734 3184018 4127096 4003152 589459
40616 589459 -2971142 -2887632 -114811 1711059 1220371 -314436 -1550356 -1693387 -165485
40607 -165485 2213230 3050388 1306917 -851468 -998458 -95001 -1202804 -5341579 -10519852
40598 -10519852 -14354750 -15837293 -14815023 -11681058 -7985743 -5865592 -5933198 -6325883
40590 -6325883 -4620725 -667333 2927000 3348711 360172 -3835968 -7175140 -9180066
40582i180066o04309J458046L419973L284744Q24239j640730k335942k009367
40574f783412j902140j777459j177841o84845n32070J96675J580909J973799O17015
40565h489369p47946m58551P83643J701067K305765K352992N71152k403352l114895
40556g499494j00493L057138K770550R55496J519285L581144L031524l46272k417543
40547D551335j340023K2434q51208k646753l040641j910022m53248N50167P06652
40538d411307J02857k09059N45279J431123J320892Q49661P11094m12406l191387
40529c263253m682953k127591J644996J594191j397420j511213K414499M465342
40521b863402R56872l476284k641741K533265N985054M431606q2326l620660l671493
$$ plain form
40582 -9180066 -9784375 -8326329 -4906356 -1621612 -797373 -2438103 -4774045 -6783412
40574 -6783412 -8685552 -10463011 -11640852 -12325697 -12857767 -12661092 -11080183 -9106384 -8489369
40565 -8489369 -9237315 -9695866 -8912223 -7211156 -4905391 -2552399 -1981247 -4384599 -7499494
40556 -7499494 -7599987 -4542849 -1772299 -816803 702482 4283626 7315150 6968878 4551335
40547 4551335 3211312 3233746 2382538 -264215 -3304856 -5214878 -5668126 -5117959 -4411307
40538 -4411307 -4308450 -4517509 -3972230 -2541107 -1220215 -370554 340540 -71866 -3263253
40529 -3263253 -7946206 -10073797 -8428801 -6834610 -8232030 -9743243 -7328744 -2863402
40521 -2863402 -1906530 -5382814 -8024555 -5491290 493764 4925370 4843044 1222384 -2449109
40512b449109o37432K082331J191840k144061l382368r62634J668830J766754
40504b865849J101332J707901J759354q77348m112383m492491k301659k25037
40496a0306180J088278K593108L670581K891567Q07680r17028j930984k359933
40488d462911j402935O68171J317845n42038k028981o66088J356275R79438m90732
40479e271956l48917J37577j397198k693208k21044L581355L354257M9431m53056
40470c262759K176088J973148k216035l656027Q61206M772275K173685k502810
40462C18771j843220K818524M258935N12242l817548n286446m328402j707210
40454i074354J829216L307365N03479l408342l287035N24016L211898L101316
$$ plain form
40512 -2449109 -3086541 -1004210 187630 -1956431 -5338799 -6301433 -4632603 -2865849
40504 -2865849 -1764517 -56616 1702738 825390 -3286993 -7779484 -10081143 -10306180
40496 -10306180 -9217902 -6624794 -2954213 -62646 745034 -171994 -2102978 -4462911
40488 -4462911 -5865846 -5197675 -3879830 -4421868 -6450849 -7116937 -5760662 -4781224 -5271956
40479 -5271956 -5620873 -5483296 -6880494 -9573702 -9794746 -6213391 -2859134 -2809703 -3262759
40470 -3262759 -1086671 886477 -1329558 -4985585 -4124379 647896 2821581 318771
40462 318771 -1524449 1294075 5553010 6065252 2247704 -3038742 -7367144 -9074354
40454 -9074354 -7245138 -3937773 -3434294 -6842636 -10129671 -9605655 -6393757 -3292441
40446c292441K593554K053827p41122m460220m245482K34830L040884R51449j749567
40437e614288r04150Q83253j35041j654409M70934M478720N383850L110514J761778
40428G781161K056405O93630k845050m734303l058546n94398J91488N27524J787349
40419A805260K409029P97647j609794k557496k058670j314916n54472K53871L86797
40410b442744k32998l20902O03144J115207L39003n42237p54487j546557l280354
40401g062925l399637k39520L158138K692925m57538j137130K198620N107860
40393H60793L506759q80742l447942k847649j667053j865004k062166q3925L215118
40384e271811M294470J440662k326302k509754R07014K952824R8732m881673o472936
$$ plain form
40446 -3292441 -698887 1354940 613818 -3846402 -8091884 -7857054 -4816170 -3864721 -5614288
40437 -5614288 -6518438 -5635185 -5770226 -7424635 -6953701 -2474981 2908869 6019383 7781161
40428 7781161 9837566 10531196 7686146 2951843 -106703 -701101 -509613 17911 1805260
40419 1805260 4214289 5011936 3402142 844646 -1214024 -2528940 -3083412 -2829541 -2442744
40410 -2442744 -2675742 -2996644 -2393500 -1278293 -939290 -1481527 -2236014 -3782571 -7062925
40401 -7062925 -10462562 -10702082 -7543944 -4851019 -5308557 -6445687 -4247067 860793
40393 860793 4367552 3486810 38868 -2808781 -4475834 -6340838 -8403004 -8486929 -5271811
40384 -5271811 -977341 463321 -1862981 -4372735 -3465721 -512897 -414165 -5295838 -11768774
40375a1768774l374581O55397K160405J328170r4077j316725j857040p19187J974029
40366a3012383L881137K838141j41002j803234o07700J538442K021909J033839
40358d250851J045985K819340L660508J084869k959164m040160j325486J242791
40350b722168Q11172n30499j013P00320j789479o112349o971602k392929L483326
40341a5525221N754318M004886J177294l08492l1420R25163P62847j355873l734500
40332h330998l627911p01451K492957L718690L042562J507089j44070j035241
40324c078373n22853M15883Q506j642945k546030j717027j09538J406524K656386
40315e129467K744230Q19748j514800j614632N8165N80837k90681K02896K121245
$$ plain form
40375 -11768774 -15143355 -14487958 -12327553 -10999383 -11093460 -12410185 -14267225 -14986412 -13012383
40366 -13012383 -9131246 -6293105 -6434107 -8237341 -8845041 -7306599 -5284690 -4250851
40358 -4250851 -3204866 -385526 3274982 4359851 1400687 -2639473 -3964959 -2722168
40350 -2722168 -1910996 -2441495 -2442508 -1742188 -3531667 -9644016 -16615618 -19008547 -15525221
40341 -15525221 -9770903 -5766017 -4588723 -4897215 -4928635 -4003472 -3240625 -4596498 -8330998
40332 -8330998 -11958909 -12660360 -10167403 -6448713 -3406151 -1899062 -2043132 -3078373
40324 -3078373 -3601226 -3185343 -3176837 -4819782 -7365812 -9082839 -9192377 -7785853 -5129467
40315 -5129467 -2385237 -1565489 -3080289 -4694921 -4636756 -4055919 -4346600 -4143704 -2022459
40306b022459J725354j867934m006063j700463J292784P99431p97785P62992L594748
40297b219395K652887j474879l452066k013082j299957k965863l215784M22118
40289a3566021M521591M638451J191159k010265k594084j055797P38071J140697
40281f996198K57900K35959K318774M077534K244449k039512m178345k503610
40273f583049r8572L94047J2689K92737N35428J23260L37788J723562K400362
40264h61748J192459k0608O76763K027679J704236j27582j497262j555349j062889
40255D75699j055959k128547l751338l805020p93220L106388L962411J665507
40247b324079J70831J172557J704244r0172j469705m49995N9882k216479l665249
$$ plain form
40306 -2022459 -297105 -2165039 -6171102 -7871565 -6578781 -5779350 -6577135 -5814143 -2219395
40297 -2219395 433492 -1041387 -4493453 -6506535 -7806492 -10772355 -13988139 -13566021
40289 -13566021 -9044430 -4405979 -3214820 -5225085 -7819169 -8874966 -8136895 -6996198
40281 -6996198 -6738298 -6502339 -4183565 -106031 2138418 98906 -4079439 -6583049
40273 -6583049 -6681621 -6287574 -6274885 -5982148 -5446720 -5323460 -4985672 -3262110 -861748
40264 -861748 330711 310103 986866 3014545 4718781 4591199 3093937 1538588 475699
40255 475699 -580260 -2708807 -6460145 -10265165 -11058385 -7951997 -3989586 -2324079
40247 -2324079 -2153248 -980691 723553 633381 -836324 -1286319 -1226437 -3442916 -7108165
40238g108165o53340L065486J706469k332581j629842L691703N260572j43881
40230A856421m897450k119688M073095N423094J494344j577462j133689k37021
40222B881644j043504j925605j665842j686831k765007l142161j526689O76270
40214a0197725J685836J839540K241394K505026J475729o64215k357561k413838
40206e885814j035910N83568J238103O24675m23067q98058p46992m86168N8956
40197f970707J548700L528031M255353K764417K06372j526903j752352r62690
40189A090221K22641J145322R65331l55458j451221j202187n56951j192989k590809
40180c926100k399822j55698J464925M44520j265710m34383K349478L033286j013
$$ plain form
40238 -7108165 -7761505 -4696019 -2989550 -5322131 -6951973 -3260270 2000302 1856421
40230 1856421 -3041029 -5160717 -1087622 4335472 5829816 4252354 3118665 2881644
40222 2881644 1838140 -87465 -1753307 -3440138 -6205145 -9347306 -10873995 -10197725
40214 -10197725 -8511889 -6672349 -4430955 -1925929 -450200 -1114415 -3471976 -5885814
40206 -5885814 -6921724 -6338156 -5100053 -4475378 -4898445 -5796503 -6543495 -7029663 -6970707
40197 -6970707 -5422007 -1893976 2361377 5125794 5332166 3805263 2052911 1090221
40189 1090221 1312862 2458184 3423515 3068057 1616836 414649 -142302 -1335291 -3926100
40180 -3926100 -6325922 -6481620 -5016695 -4572175 -5837885 -6272268 -3922790 -889504 -890517
40171h90517l012599j725869K496626L995831L08611m316675m322884J25627L953436
40162c388413M159295K785602K290326J467518j385393l858237k208421K062780
40154A925057L097142r29133m733524l556609O5502P55822j497963k276315k80144
40145g430165J181764K59907o99417K97190J702687J692251J224535J583685J684191
40136A496628L37515j095239r46493k23427n96387j048472L50079K386980J838738
40127B499922j444736l721017k334670R19070K461061J190742j052494k116151
40119c598273j535731m17769J2956j99729Q5814J367891K620952K821936K442710
40110C600757K228652J451014p21156k651078j538084K267264M608883K430664
$$ plain form
40171 -890517 -3903116 -5628985 -3132359 863472 1172083 -3144592 -7467476 -7341849 -3388413
40162 -3388413 770882 3556484 5846810 7314328 5928935 2070698 -137723 1925057
40154 1925057 5022199 4093066 -640458 -4197067 -4131565 -3375743 -4873706 -7150021 -7430165
40145 -7430165 -6248401 -5988494 -6687911 -6390721 -4688034 -2995783 -1771248 -187563 1496628
40136 1496628 1834143 738904 -207589 -431016 -1027403 -2075875 -1725796 661184 2499922
40127 2499922 1055186 -2665831 -5000501 -4081431 -1620370 -429628 -1482122 -3598273
40119 -3598273 -5134004 -5551773 -5538817 -5738546 -5652732 -4284841 -1663889 1158047 3600757
40110 3600757 5829409 7280423 6559267 3908189 2370105 4637369 9246252 11676916
40102A1676916k423105n800862o159731m961621l242465n13354K638786L534065
40094e251371Q30829k484543k023476K186355N192302L342698j052443l063820
40086b323469j545440M07976O37930L84537J128466K005807J803665J113729O99653
40077D312854k63540k290384l666497k702155n12407P67167J231576K120007K695705
40068A692326J266161j333571k427225j469308l04252M10360J690802K872504
40060B397797J440791k657398n838124n520582k995588k13143K998459O411175
40052c976613P418963M636697Q95569o73064j328948l753536o244599m509491
40044g535022J241412N584784M977131J645398p94433j942787k903519l123232
$$ plain form
40102 11676916 9253811 3452949 -2706782 -7668403 -10910868 -11424222 -8785436 -5251371
40094 -5251371 -4420542 -6905085 -8928561 -6742206 -1549904 1792794 740351 -2323469
40086 -2323469 -3868909 -3460933 -2823003 -2438466 -1310000 695807 2499472 3613201 4312854
40077 4312854 4049314 1758930 -1907567 -4609722 -5122129 -4354962 -3123386 -1003379 1692326
40068 1692326 2958487 1624916 -802309 -2271617 -2575869 -2165509 -474707 2397797
40060 2397797 3838588 1181190 -4656934 -10177516 -13173104 -13386247 -10387788 -3976613
40052 -3976613 3442350 8079047 8974616 8301552 6972604 3219068 -3025531 -7535022
40044 -7535022 -6293610 -708826 4268305 5913703 5119270 3176483 272964 -2850268
40036b850268j726394j1088K56507n3140J263966L787254M441696J814934j669236
40027E254231k921218j966676j084722j081479m04003J771137L456205K368664
40019E392139m69616j754166m79810Q05415J66559o93550M70489K295924J723790
40010G457174r39888k324468j378487q42487k251013k942756l41475L491785M610514
40001D538899K791698J172019J144924R32254o83510k232107k052876o48749N37015
39992E499567R64759O00771p62544k553273k947371p11965K928271N086436L671047
39983A1775698r25039n720535o877440l152474J979413L411320L70203k608375
39975a747229j774549J039924J770266J63727o92478K12469N67272q92425k235692
$$ plain form
40036 -2850268 -4576662 -4587750 -4331243 -4384383 -3120417 666837 5108533 6923467 5254231
40027 5254231 2333013 366337 -718385 -1799864 -2203867 -432730 3023475 5392139
40019 5392139 4922523 3168357 2688547 3493962 3660521 2966971 3437460 5733384 7457174
40010 7457174 6517286 4192818 2814331 1971844 -279169 -3221925 -3563400 -71615 4538899
40001 4538899 7330597 8502616 9647540 10579794 9896284 7664177 5611301 4962552 5499567
39992 5499567 6464326 7065097 6302553 3749280 801909 89944 3018215 8104651 11775698
39983 11775698 10850659 5130124 -1747316 -4899790 -2920377 490943 861146 -1747229
39975 -1747229 -3521778 -2481854 -711588 -547861 -1240339 -1027870 -460598 -1353023 -3588715
39966c588715j752673o60503o16001p44172O75465L002811L940505K724831P47623
39957C729171n67862q64420j38360J403268K673694K284793K11904j952721k679668
39948D099799j917894q50903p15079j686405k530744j771684L35268J702635J032682
39939b302325l09459k13475J132618J686711O48480o20881p64436J43244J474309
39930H74786K662483K682370P96840j591956j813294L89307K065377J345070M12599
39921G823582K003522M717307M887213K254663L06654P54231J152460o62248k792961
39912B0444423k207665O28300K621362K324796Q73225n43736j616985j735108
39904B0788612m78081O29663n63119l285324m184057k123031m9035n65021k089681
$$ plain form
39966 -3588715 -5341388 -6001891 -6617892 -7362064 -6686599 -3683788 256717 2981548 3729171
39957 3729171 3161309 2296889 2158529 3561797 6235491 8520284 8732188 6779467 4099799
39948 4099799 2181905 1331002 615923 -1070482 -3601226 -5372910 -5037642 -3335007 -2302325
39939 -2302325 -2611784 -2825259 -1692641 -5930 642550 21669 -742767 -599523 874786
39930 874786 3537269 6219639 7016479 5424523 3611229 4000536 6065913 7410983 7823582
39921 7823582 9827104 14544411 19431624 21686287 21992941 22747172 23899632 23237384 20444423
39912 20444423 18236758 18865058 21486420 23811216 24684441 24140705 22523720 20788612
39904 20788612 20310531 20940194 20377075 17091751 12907694 10784663 10735628 10170607 8080926
39895H080926j615133P05113K400635K690617K678216K392321Q31003j193702
39887A6969996j435561O1041N43952j230259l092723l029520k055756j845935
39879D885235j888078j172880o95462j624391k404502o53834K670478L938651
39871C055217J859334p15644p37376J282914K548587J667703j16890p71382L41203
39862H413666J997927K480180J388640j1585l46313L87544J178783J259641N31627
39853A7280110o41364j466461j186121j43401L52647r0538j61601J108356K576289
39844A7627916K599880J487740P47889O81549O00646Q88765K617256N038800N619247
39835C7909688L275502L0451j338264k33911J729150K754527K474164K094727
$$ plain form
39895 8080926 6465793 7170906 9571541 12262158 14940374 17332695 18163698 16969996
39887 16969996 15534435 15595476 16139428 14909169 11816446 8786926 6731170 4885235
39879 4885235 2997157 1824277 1128815 -495576 -2900078 -3553912 -883434 3055217
39871 3055217 4914551 4198907 3461531 4744445 7293032 8960735 8843845 8072463 8413666
39862 8413666 10411593 12891773 14280413 14268828 13922515 14310059 15488842 16748483 17280110
39853 17280110 16638746 15172285 13986164 13842763 14195410 14104872 13943271 15051627 17627916
39844 17627916 20227796 21715536 22463425 23144974 23745620 24634385 27251641 32290441 37909688
39835 37909688 41185190 41215641 39877377 39643466 41372616 44127143 46601307 48696034
39827D8696034L040355N113111O599508O865667P676571J0437582J3268598J3189828
39819A14887254J0791532J0157297J3883238K0412417K6659968L1053406L3487783
39812B61332895L4562576L5627876L7454559L8103456L4323785K5830387J5647908
39805D82883442N202533p709104k3764104l7774558m3142359l9619943l3464774
39798C02611133l0064875k9020351k6745819k1627878j5616419j1861211j1566041
39791A56108539j2908114j3010400j1026966q717964p905253q492449r377640
39784H4669753r820480r089266o430762k725520n97960j171336k125577r97160
39776E1711692Q81857K67291k944041n328818m574798j963957J17711P66373l7358
$$ plain form
39827 48696034 51736389 56849500 63449008 70314675 77991246 88428828 101697426 114887254
39819 114887254 125678786 135836083 149719321 170131738 196791706 227845112 261332895
39812 261332895 295895471 331523347 368977906 407081362 441405147 467235534 482883442
39805 482883442 488085975 480376871 456612767 418838209 375695850 336075907 302611133
39798 302611133 272546258 243525907 216780088 195152210 179535791 167674580 156108539
39791 156108539 143200425 130190025 119163059 110445095 102539842 94047393 84669753
39784 84669753 74849273 65760007 59329245 56603725 56005765 54834429 52708852 51711692
39776 51711692 52593549 52860840 49916799 44587981 40013183 38049226 38166937 38933310 38895952
39767C8895952k351993n313390o855804n778504l113881m95762J676481L319425
39759A9982524L181187K40840l690954m814665j684813K483530L178408q6803
39751A8789254l165067k323632J332899L515279K023256j164536k954864k613161
39743A3439428j520955q28855n79831n36357o57271p42472l65820N99020J623544
39734A0430431J818916P20563j055764k200289k111917j567769j492310j572949
39726B968912q81638O26179K110712K736030J709192j338967m538530m050559
39718f58669J094526N747718M092556k015607m674146p03714M017492L229422
39710A0129578j174622k921764l33532K803448L414593J977535k5326j924822
$$ plain form
39767 38895952 36543959 31230569 24374765 18596261 15482380 14986618 16663099 19982524
39759 19982524 23163711 23404551 19713597 14898932 13214119 15697649 18876057 18789254
39751 18789254 15624187 13300555 14633454 18148733 20171989 19007453 16052589 13439428
39743 13439428 11918473 11089618 10509787 9973430 9316159 8573687 8207867 8806887 10430431
39734 10430431 12249347 12969910 11914146 9713857 7601940 6034171 4541861 2968912
39726 2968912 2087274 2713453 4824165 7560195 9269387 7930420 3391890 -658669
39718 -658669 435857 6183575 10276131 8260524 3586378 2882664 6900156 10129578
39710 10129578 8954956 6033192 5699660 8503108 11917701 13895236 13869910 11945088
39702A1945088l199609l507392l268983k656393r48033J621883L007238K203250
39694E197049J062704J148605J000715q50436k519536j652040M69376J228089
39686E084526J014296J427986J281859j105639l457956k415737M92178J074985
39678C396498m14979k61705J274376J03781l659012m650002r20235K813437L039759
39669G21918K421713L647245M111740J063578k646696k756528j15580J446362
39661G893752J081711O43292O29671J59963o99064j585028l009308m447835l697393
39652c030239o82918R39773j025912l402177k266236J288154L676308M406322
39644i6925N028747M887629K463301p15770j915264j656373k181905k817776j280811
$$ plain form
39702 11945088 8745479 5238087 1969104 -687289 -1635322 -13439 2993799 5197049
39694 5197049 6259753 7408358 8409073 7558637 5039101 3387061 3856437 5084526
39686 5084526 6098822 7526808 8808667 7703028 4245072 1829335 2321513 3396498
39678 3396498 2981519 2719814 3994190 4097971 438959 -4211043 -5131278 -2317841 721918
39669 721918 3143631 6790876 10902616 11966194 9319498 6562970 6447390 7893752
39661 7893752 8975463 9618755 10248426 10408389 9709325 8124297 5114989 667154 -3030239
39652 -3030239 -3713157 -2773384 -3799296 -7201473 -9467709 -8179555 -4503247 -96925
39644 -96925 4931822 9819451 12282752 11566982 9651718 7995345 5813440 2995664 1714853
39635A714853J430891K059111M78511l50671M50014R05464N26016R98464K149538
39626A0362191J535522j034355k514101j373080J96343J69193m58624l09332k97560
39617F276197j746000l753908m143869k035992J266612L191584J969243j046507
39609b2640k050209M96684L200701K306858o32088j227648P40573J256280j112630
39600B955881l006106j840036O26059J756469J419278L89638j198662k276620
39592a174099j101432J270872J221829j800568l377219l14699M400774N743091
39584D868549L187611J47502j048007o32620N76186J805572J949857P65453m44598
39575A1175505q73400j483492k679408k615278L7110L254814L930056J795419
$$ plain form
39635 1714853 3145744 5204855 5683366 5332695 5782709 6688173 7214189 8212653 10362191
39626 10362191 11897713 10863358 8349257 6976177 7172520 7341713 6883089 6573757 6276197
39617 6276197 4530197 776289 -3367580 -5403572 -4136960 -945376 1023867 -22640
39609 -22640 -2072849 -1576165 1624536 3931394 3299306 2071658 2812231 4068511 2955881
39600 2955881 -50225 -1890261 -1264202 492267 1911545 2301183 1102521 -1174099
39592 -1174099 -2275531 -1004659 217170 -1583398 -4960617 -5275316 -874542 4868549
39584 4868549 8056160 8203662 7155655 6523035 7099221 8904793 10854650 11620103 11175505
39575 11175505 10302105 8818613 6139205 3523927 3561037 6815851 10745907 12541326
39567A2541326r46001k713783l299145k719454j353457k85068J26693Q60345J997294
39558D208750J654899r03328k967498j776447J160560J851427r34894m600578
39550b307109o070935m067404Q35213N991730P605274M529594L55458p98382M56451
39541F529890N22768j342579k477047j579952k74801K36692M79872K02543j784838
39532E12548m322003m088066o73418J855501N94394j862431j313921K063889M517289
39523b716218M035826J995890K33443q41102j271588r38917l58145n50169j590553
39514b001533k270887j600310R055J328705J690431J586779J932070K647656K304953
39505E626919p9562l043826l763160j579015Q97705J144123n7216j87778J156534
$$ plain form
39567 12541326 11595325 8881542 5582397 2862943 1509486 1224418 1351111 2211456 4208750
39558 4208750 5863649 4960321 1992823 216376 1376936 3228363 2293469 -2307109
39550 -2307109 -8378044 -12445448 -11610235 -5618505 1986769 6516363 6871821 6073439 6529890
39541 6529890 7052658 5710079 3233032 1653080 1378279 1614971 2094843 2297386 512548
39532 512548 -3809455 -7897521 -8570939 -6715438 -6121044 -7983475 -9297396 -7233507 -2716218
39523 -2716218 1319608 3315498 3548941 2707839 1436251 497334 139189 -410980 -2001533
39514 -2001533 -4272420 -5872730 -5863675 -4534970 -2844539 -1257760 674310 3321966 5626919
39505 5626919 5547357 2503531 -1259629 -2838644 -1940939 -796816 -854032 -1041810 114724
39496A14724J929791R81240k37766N6705J491756K329776J799489N42261o99708
39487H308268j686990k135575j654949m89693M40939O09485M72651O99825J265021
39478E828982J580230J111803k81019k003154k593558r73648J670191K501478
39470F841305N33991j778846j965007j152878j847119l113836j520339K831276
39462a171453N052305K052307k820095m376595k345099l14164K57326J126977
39454b538491K995724L983603K925905J122292j24375j188134k332035k533837
39446B310652j353381o0311L95744Q27185J835314K020927j8142k935057l775968
39437g53037j581989J567231L080330K410666J006467L93395N61449K11737j358204
$$ plain form
39496 114724 2044515 3025755 2787989 2844694 4336450 6666226 8465715 9007976 8308268
39487 8308268 6621278 4485703 2830754 2341061 2782000 3391485 3864136 4563961 5828982
39478 5828982 7409212 8521015 8239996 6236842 3643284 2669636 4339827 6841305
39470 6841305 7375296 5596450 3631443 2478565 631446 -2482390 -4002729 -1171453
39462 -1171453 3880852 5933159 3113064 -1263531 -3608630 -3922794 -3665468 -2538491
39454 -2538491 457233 4440836 7366741 8489033 8364658 7176524 4844489 2310652
39446 2310652 957271 896960 1292704 2119889 3955203 5976130 5957988 3022931 -753037
39437 -753037 -2335026 -767795 2312535 4723201 5729668 6123063 6684512 6896249 5538045
39428E538045l028273l142418j572414N99452K995299N718777P226523M942903
39420A9277894p41041n224373m600225o35631J343209r83948m547413n042631
39412a154159j653132K760256M800110L326538R2714j875070j066026J150613
39404F381844K330048J785052P40447k2794j181284l062584m216235l061272l95516
39395g02294J148911L83343q79331m08907J103211Q95069j552217k994132o45014
39386c651361L514873M998504K800184L07557n1741J17673j071524k046259n50837
39377D367069K010853K436732P49926j86228M38082N68349m63764o79250N92488
39368I834257J166497J07675o1023K266641M176873K244251j934191l693084j557787
$$ plain form
39428 5538045 2509772 -632646 -2205060 -1605608 1389691 7108468 14334991 19277894
39420 19277894 18536853 13312480 8712255 8076624 9419833 8435885 3888472 -1154159
39412 -1154159 -2807291 -47035 4753075 8079613 8172327 6297257 5231231 6381844
39404 6381844 8711892 10496944 11237391 11214597 10033313 6970729 2754494 -306778 -702294
39395 -702294 446617 829960 -49371 -458278 644933 1540002 -12215 -3006347 -3651361
39386 -3651361 -136488 4862016 7662200 7969757 7918016 8035689 6964165 4917906 4367069
39377 4367069 6377922 8814654 9564580 9378352 9816434 10384783 9921019 9241769 9834257
39368 9834257 11000754 11108429 11047406 13314047 17490920 19735171 17800980 14107896 12550109
39359A2550109J753568L758856M317491L676004J722656n87315j926810k910440
39351B2354119m924386o678795n364682j704723J11067j080248j136661K540343
39343D116034N696801K849291m210353q170169n584599k10848L087698L716294
39335A290149L506108K895886J169115j215146k506718j512987J157435L402955
39327H186797L322778J299627j38933M10946J021365p62000l831569m776465k844401
39318A888145p09508p2152L59549J602479K262765J322496L45917Q18905J507893
39309I326489O94322q68893j574669j833565k759686l372864j943736O84081J894578
39300B46057J099311K33649N26550J076313Q48975J32457l42677k62625L59103
$$ plain form
39359 12550109 14303677 18062533 22380024 26056028 27778684 27191369 25264559 22354119
39351 22354119 17429733 10750938 5386256 3681533 3792600 2712352 1575691 4116034
39343 4116034 9812835 12662126 8451773 281604 -5302995 -5513843 -2426145 1290149
39335 1290149 4796257 7692143 8861258 7646112 5139394 3626407 4783842 8186797
39327 8186797 11509575 12809202 12670269 13081215 14102580 13340580 9509011 4732546 1888145
39318 1888145 1178637 1106485 1466034 3068513 5331278 6653774 6999691 7818596 9326489
39309 9326489 10020811 9151918 7577249 5743684 2983998 -388866 -2332602 -1648521 246057
39300 246057 1345368 1579017 2105567 3181880 4030855 4163312 3820635 3558010 3917113
39291C917113R10269K28526j682031k710809j220475J213643J859935R12690P93670
39282D222531J766168J491950o68037k217064j485237m5558L12684K58785P19515
39273D355737N86206j006495k225078j090288J033400J357580P7579j16136J439478
39264D411983K333148J006527q46355r44002L16842O91005p10309k283553j872119
39255B103167P55580L474073L881984J890311j44183k12590R74049J121823n74867
39246A3269347k485800k615715p98041J272902J649409j49709k506608l050224
39238D585561j276242N56707N3401k146289l091122j412788R42271J388971j47326
39229e46856j621951j458505K73147K545093M048019L603009J224812j195472
$$ plain form
39291 3917113 4827382 5055908 3373877 663068 -557407 656236 2516171 3428861 4222531
39282 4222531 5988699 7480649 6812612 4595548 3110311 3064753 3377437 3636222 4355737
39273 4355737 4941943 3935448 1710370 620082 1653482 3011062 3088641 2972505 4411983
39264 4411983 6745131 7751658 6905303 5961301 6278143 6969148 6258839 3975286 2103167
39255 2103167 2858747 6332820 10214804 12105115 11960932 11748342 12722391 13844214 13269347
39246 13269347 10783547 8167832 7369791 8642693 10292102 10142393 7635785 4585561
39238 4585561 3309319 3866026 3919427 1773138 -1317984 -2730772 -1788501 -399530 -546856
39229 -546856 -2168807 -3627312 -3354165 -809072 3238947 6841956 8066768 6871296
39221F871296j443704M82946K326053K317459R76791k18118p44875q01919l14288
39212I451641N38434O30038p46479k347828k457983j491717j173378j332491m4994
39203A025243K537530L336809Q63924j929026j659464N37956R61207r45768k061583
39194B666828n39624J794855K569201J777023N32070r78118k834482l963621k836486
39185a812354O30989M399109N575492K948553j213095k959523j350489J14138
39177F332820j442337l667463k604700O21996J364807o11768k89327L994531O707981
39168A0406540L382407j969044k612344R26981K326953o28450l441366k350372
39160F041305Q45776K807877L185330K971573J722737q32270k630454j627061
$$ plain form
39221 6871296 5427592 5910538 8236591 10554050 11530841 11312723 10567848 9765929 9451641
39212 9451641 9990075 10620113 9873634 7525806 5067823 3576106 2402728 1070237 1025243
39203 1025243 3562773 6899582 7763506 5834480 4175016 4712972 5674179 4728411 2666828
39194 2666828 2127204 3922059 6491260 8268283 8800353 7822235 4987753 1024132 -1812354
39185 -1812354 -1181365 3217744 8793236 11741789 10528694 7569171 6218682 6332820
39177 6332820 4890483 1223020 -1381680 -759684 605123 -6645 -295972 3698559 10406540
39168 10406540 13788947 11819903 9207559 10134540 12461493 11833043 8391677 6041305
39160 6041305 6887081 9694958 12880288 15851861 17574598 16742328 14111874 12484813
39152A2484813P33950R66285j700491m054037k934163P63214L055867J439772
39144A0755210k362471m429699k838112P18754L102717K660592J34087k296123
39136E444955k709830j121734M53599N10973K26619J532304L492641L196364M61675
39127A1487566j505022j167618r25176k420600l172853r21349J838703J528917
39119D742568q41122j962665j961072k846087l005486O76436N683095N509968
39111E995635k91378m080461r13530M225439L993671r15143l866964k021189J149563
39102C275643K045203J106578M02055L61808J23825n79897r84264l77323P19072
39093F092700Q84011j17032m18617J207205K645655J189368j548327j258286K099634
$$ plain form
39152 12484813 13218763 14185048 12484557 8430520 5496357 6259571 9315438 10755210
39144 10755210 8392739 3963040 1124928 1843682 4946399 7606991 7741078 5444955
39136 5444955 2735125 1613391 2066990 2577963 2804582 4336886 7829527 11025891 11487566
39127 11487566 9982544 8814926 7889750 5469150 2296297 1374948 3213651 4742568
39119 4742568 3901446 1938781 -22291 -2868378 -5873864 -5197428 485667 5995635
39111 5995635 5704257 1623796 710266 4935705 8929376 8014233 4147269 2126080 3275643
39102 3275643 5320846 6427424 6829479 7191287 7315112 6735215 5750951 5373628 6092700
39093 6092700 6976711 6859679 6441062 7648267 10293922 11483290 9934963 8676677 10776311
39084A0776311L368949o7551m038985l924538j218983J9936j39756J012079L086594
39075H874056L327554J739123O95955J59225j998531m974296m981598j074148
39067A767340K858285L186547O53932j667051k006621o23257J000981J201519
39059F371675Q2848N523K012666K972942l64609n411092o172869j589681L165077
39050A072480M275380L270152K171307l1788l459419m742610j989752J443596
39042B009346J878101O35811O00217Q26791p84069k261875l91479L008974L196412
39033H718229O6667j856539q60190O750r52881j473792l94878j75725j881522
39024A196119k303857O16695L415477K093133j544123k844947j432452p39691
$$ plain form
39084 10776311 14145260 14077709 10038724 6114186 4895203 4915139 4775383 5787462 8874056
39075 8874056 12201610 13940733 14636688 14795913 12797382 7823086 2841488 1767340
39067 1767340 4625625 7812172 8466104 6799053 4792432 4169175 5170156 6371675
39059 6371675 6454523 6460046 8472712 11445654 11081045 5669953 -502916 -2092597 1072480
39050 1072480 5347860 8618012 10789319 10757531 7298112 2555502 565750 2009346
39042 2009346 3887447 4523258 5123475 5950266 5166197 2904322 2512843 5521817 8718229
39033 8718229 8784896 6928357 6068167 6074917 5122036 3648244 3253366 3077641 1196119
39024 1196119 -1107738 -491043 2924434 5017567 3473444 628497 -803955 -1543646
39016a543646j684946j704437q7673M40211j279212k262573J160L348041L992778
39007g80297J834191J5869K93025J422624J826147J547194J196712O65447l37961
38998G682951j370400j535875m39806J224227J938796P23178j341447j755689
38990E125935L00137K313689J335917j954364l860606k311824R78478L330707
38982E258069M089466L946931L176385J959819J061905O36387n18442k943504
38974A6667016m780946l856585q31317J498822J578898J01413j793816l341315
38966E242170l478828j576883R03356J449428k80659j867689j192212J334325
38958E33008L800390M560807K984226K26598q45216J241536L572372J909263k787059
$$ plain form
39016 -1543646 -3228592 -4933029 -5020702 -4580491 -5859703 -8122276 -8121116 -4773075 -780297
39007 -780297 1053894 1069763 1362788 2785412 4611559 6158753 7355465 8020912 7682951
38998 7682951 6312551 4776676 4336870 5561097 7499893 8223071 6881624 5125935
38990 5125935 5426072 7739761 9075678 7121314 3260708 948884 1927362 5258069
38982 5258069 9347535 13294466 16470851 18430670 19492575 20128962 19610520 16667016
38974 16667016 11886070 8029485 7198168 8696990 10275888 10377301 8583485 5242170
38966 5242170 1763342 186459 1089815 2539243 2258584 390895 -801317 533008
38958 533008 4333398 8894205 11878431 12105029 11259813 12501349 16073721 17982984 15195925
38949A5195925m562796q13691L397579K408063j855841l009697L50064L149276
38941A4258882J523492k434650m597319l919275k008130j71214J205313J800614
38933E657713J398169J75867j454824k535812j543563J600840L899702K209842
38925I407934j909385l177155M42711M559767M087794j82975l290511k701377
38917G236803k63220J602830K559956K971821K514625J211530Q5026l56844j023105
38908A6539422k474513l303525j858548Q10431J593977m44592k090815O3727M459988
38899A3295552N783883J828412l324777m661784k663432j587660k635991k612989
38891C421214K98210L146765K389091j207646m051642m287505k666975k71237
$$ plain form
38949 15195925 10633129 9819438 13217017 15625080 13769239 10759542 11109606 14258882
38941 14258882 15782374 13347724 8750405 4831130 2823000 2651786 3857099 5657713
38933 5657713 7055882 7231749 5776925 3241113 1697550 3298390 7198092 9407934
38925 9407934 7498549 4321394 4764105 9323872 13411666 13228691 9938180 7236803
38917 7236803 6973583 8576413 11136369 14108190 16622815 17834345 17919371 17562527 16539422
38908 16539422 14064909 10761384 8902836 9713267 11307244 10862652 8771837 8835564 13295552
38899 13295552 19079435 20907847 17583070 12921286 10257854 8670194 6034203 3421214
38891 3421214 3719424 6866189 9255280 8047634 3995992 -291513 -2958488 -3229725
38883c229725K245662L847269L698265K411406J287709O84689K99368L14230Q75529
38874A2434402J203102P11374K34237N62041O77929o21695k155222j700954M83597
38865A1828811J843232J158122k76168j154880j499284j229580J31594J716411
38857A2518258J680668J92843l16041R87725J716965J90719j379757j12278K791135
38848A8270237L418045O10244k704364l720664k849854j905715j224132J1756
38840I905553J629484K171535P63257j551181k683420j522776J031947K940241
38832A2684640K825950J098437m43953k52671J275095J883321O4155k477401k422997
38823A4234576N58987K703196J128552j936710k415919m52436K30694j439109
$$ plain form
38883 -3229725 -984063 2863206 6561471 8972877 10260586 10945275 11244643 11558873 12434402
38874 12434402 13637504 14348878 14583115 15145156 15823085 15201390 13046168 11345214 11828811
38865 11828811 13672043 14830165 14553997 13399117 11899833 10670253 10801847 12518258
38857 12518258 14198926 14391769 14075728 15063453 16780418 16971137 15591380 15479102 18270237
38848 18270237 21688282 22298526 19594162 15873498 13023644 11117929 9893797 9905553
38840 9905553 11535037 13706572 14469829 12918648 10235228 8712452 9744399 12684640
38832 12684640 15510590 16609027 16165074 15912403 17187498 19070819 19134974 16657573 14234576
38823 14234576 14793563 17496759 18625311 16688601 14272682 13820246 14050940 12611831
38815A2611831k327567o05765J098521Q9183k062950k234543m13649J135909J535001
38806H825971J361497O19254n65508n81807J384955K874745J140295k257910l273707
38797I527785j287568N09695O25155J077704K795333L271882Q97969j716206j522253
38788A4179496K96243M79421j122041j751090m32021O83214n8902j420696j457977
38779I395647k49320Q44981J493453K456434L680062L763926J855361p90615k056885
38770B0393044j456895l74452J75544P30593J747656K118932O38723j830633l157694
38761A8984818k564911j097933K06932J100007J186003q7359k156810l453027
38753A2117720l223808k155091j033642j03188J27077q81060k090257j206117
$$ plain form
38815 12611831 10284264 9678499 10777020 10866203 8803253 6568710 6155061 7290970 8825971
38806 8825971 10187468 10806722 10241214 9659407 11044362 13919107 15059402 12801492 9527785
38797 9527785 8240217 8749912 9375067 10452771 13248104 16519986 17417955 15701749 14179496
38788 14179496 14475739 14955160 13833119 12082029 11650008 12333222 12274320 10853624 9395647
38779 9395647 9146327 9991308 11484761 13941195 17621257 21385183 23240544 22449929 20393044
38770 20393044 18936149 18561697 18737241 19467834 21215490 23334422 23973145 22142512 18984818
38761 18984818 16419907 15321974 15528906 16628913 17814916 17727557 15570747 12117720
38753 12117720 8893912 6738821 5705179 5601991 5729068 4848008 2757751 1551634
38745A551634K328844N872524O252293L159278q70435l049639k289622M13119
38737A3367996K618734K243066l66956k643186k680018j292517o21543j375720
38729I249856k219424j558452N80269K325492J684438j085258l256367k737757
38721B982797q98648p35826k456938k976833l00552L593202N251305L600466L60206
38712H419179k030417k054020k4120J857787J585106j26584r71095p42485j358706
38703D554645k772633k313823L25662J194680j872163m595050j809613M444278
38695b844017P115706L614162j450775l101953j364343J023808K509996K811288
38687H313872J972886R83520J287272K511483K531664O18848j452643k158287
$$ plain form
38745 1551634 3880478 9753002 16005295 19164573 18294138 15244499 12954877 13367996
38737 13367996 15986730 18229796 17862840 15219654 12539636 11247119 10625576 9249856
38729 9249856 7030432 5471980 6052249 8377741 10062179 8976921 5720554 2982797
38721 2982797 2084149 1348323 -1108615 -4085448 -4386000 -792798 4458507 8058973 8419179
38712 8419179 6388762 4334742 4310622 6168409 7753515 7626931 6655836 5913351 4554645
38703 4554645 1782012 -531811 -206149 988531 -883632 -5478682 -7288295 -2844017
38695 -2844017 4271689 7885851 6435076 3333123 1968780 2992588 5502584 8313872
38687 8313872 10286758 11270278 12557550 15069033 17600697 18219545 16766902 14608615
38679A4608615j927874j336466l3375J387423J000145j264179k372370l36321
38671I725598K315926J859437j131397k559615o94600J609971J231536j003405
38663A1353451j921077o04159M40609j130643m091873n005631k667348L48216
38655c278455J292290R00194J677373L418083L038724p07921m766316n397132
38647c823160k624140N16823J989129K185806J957455J247060J07181m17609M70886
38638A609431J768594J585398j17287q77367J012908L414018K632499j099634
38630I928560l205084j174174J508459O03625k216020k071473J164788K664034
38622G202715M82611j640524q42202M60666n58575k172967j611212l6506J19608
$$ plain form
38679 14608615 12680741 11344275 11310900 12698323 13698468 12434289 10061919 9725598
38671 9725598 12041524 13900961 12769564 10209949 9515349 11125320 12356856 11353451
38663 11353451 9432374 8828215 9268824 8138181 4046308 -959323 -3626671 -3278455
38655 -3278455 -1986165 -1085971 591402 4009485 7048209 6340288 1573972 -3823160
38647 -3823160 -6447300 -5930477 -3941348 -1755542 201913 1448973 1556154 1138545 1609431
38638 1609431 3378025 4963423 4846136 3968769 4981677 8395695 11028194 9928560
38630 9928560 6723476 5549302 7057761 7661386 5445366 3373893 4538681 7202715
38622 7202715 7685326 6044802 5202600 5663266 5104691 2931724 1320512 1284006 1403614
38613A403614N2246K217872M949827M284736L29340k739249k747743j351845P5775
38604F474573J892858L078411J291624k629221m412185k377333J24074K91428
38596C734229n0916J310088K450110P73191j931645k215209p62049r17096k580680
38587a89977k346747L69275K011346O64444r58988m4182K202635L073105K253803
38578G034714R28070o97576k467554k779186p93484J168497L25334k204140k630955
38569b116280M7458K588904K030123o56767k403983j857192k65052M18605m64491
38560b678675j617072j024003J437930L072869J461446j839218k674216L73329
38552c487610M069243M697051K278075m55074j731363k035524k656058l948861
$$ plain form
38613 1403614 1455860 3673732 8623559 12908295 13237635 10498386 7750643 6398798 6474573
38604 6474573 8367431 11445842 12737466 10108245 5696060 3318727 3442801 3734229
38596 3734229 3683313 4993401 7443511 8216702 6285057 4069848 3307799 2390703 -189977
38587 -189977 -2536724 -2167449 -156103 508341 -450647 -494829 1707806 4780911 7034714
38578 7034714 7962784 7265208 4797654 2018468 1224984 2393481 2718815 514675 -2116280
38569 -2116280 -2068822 520082 2550205 1893438 -510545 -2367737 -2632789 -2214184 -2678675
38560 -2678675 -4295747 -5319750 -3881820 -808951 652495 -1186723 -3860939 -3487610
38552 -3487610 581633 5278684 7556759 7101685 5370322 3334798 678740 -3270121
38544c270121m574460k472592K254597N850727M519899l83555l479209k176382
38536c731096P35883K156216K454408K334903K31405l763658n173146r25073M879731
38527h00427N952505K512893k38139o73444j758582m115944m432533j637171J056358
38518d134484J726209K166989L128680K314541p05043k473272j103649P29114
38510A649085Q20047Q91051K155397K162487l57843k007020k33117J809850N41997
38501G431934j719277r17813J514653J277579j381188k609084j511190j59909
38493A925705J398035M312803O250477L676408j559344l908210k419096j346479
38485H330299k160102j496434J504637K418352j037829m454980l304068M27583
$$ plain form
38544 -3270121 -7844581 -10317173 -8062576 -2211849 2308050 1924495 -1554714 -3731096
38536 -3731096 -2995213 -838997 1615411 3950314 4181719 418061 -4755085 -5680158 -800427
38527 -800427 5152078 7664971 7426832 6753388 4994806 878862 -3553671 -5190842 -4134484
38518 -4134484 -2408275 -241286 2887394 5201935 4496892 2023620 919971 1649085
38510 1649085 2469132 3360183 5515580 7678067 7320224 5313204 5080087 6889937 7431934
38501 7431934 5712657 4794844 6309497 7587076 6205888 3596804 2085614 1925705
38493 1925705 3323740 7636543 13887020 17563428 16004084 12095874 9676778 8330299
38485 8330299 6170197 4673763 6178400 8596752 7558923 3103943 -200125 227458
38477B27458K049727J023204M0129k9080l72424j117100j248865o30417J56821
38468I9453Q86772J115277J98111q68757P4141K576613L093311L28084j912954
38459E590051q0603L530946M067553J051338j775661k356515k144136k310441
38451E572532j816483O1677K078095K872103K578050J834254O79222r00101k376093
38442A0583256l128754k919339j940193q56371l52103j46549O72962J685282R22519
38433D520710j976522l824355j405523L693044O353509M268100N98684o62965
38425A1564682J38953k77258k740116m230731k398212O69015J111837j134354
38417B703816j966894J146486N429449O450940L689087J22936k382063m235021
$$ plain form
38477 227458 2277185 3300389 3340518 3311438 2939014 1821914 573049 -57368 99453
38468 99453 986225 2101502 2299613 1430856 1504997 4081610 7174921 7503005 5590051
38459 5590051 5509448 9040394 13107947 14159285 12383624 10027109 7882973 5572532
38451 5572532 3756049 3817726 5895821 8767924 11345974 13180228 13859450 12959349 10583256
38442 10583256 7454502 4535163 2594970 1738599 1386496 1239947 1912909 3598191 4520710
38433 4520710 2544188 -1280167 -2685690 1007354 7360863 11628963 12227647 11564682
38425 11564682 11703635 11426377 8686261 4455530 2057318 2726333 3838170 2703816
38417 2703816 736922 1883408 7312857 13763797 17452884 17575820 15193757 10958736
38409A0958736n154164l516020M53380L601871L426295R75292q50704m34694J664736
38400A1124728L318231K059330k294120o068869n192241m80434L309333L968817
38392I744775L802488M324353L439165J63031k098135n20773K158940J615645
38384B2629489j535094l222005k157256o17296k35149p36974j904922l320109
38376H900684l092921k93578K287196J361606j739999k952538j781352j559021
38368A130077l473208m576586k548030J152393L908972M737667L618509Q97224
38360D847018j709467k013356j73331J352663J040611m14667j869130k591692
38352a531351j802391J95040J128695k16914j204549R26893L842632L233443K56571
$$ plain form
38409 10958736 5804572 2288552 2741932 6343803 9770098 10745390 9894686 9459992 11124728
38400 11124728 14442959 16502289 14208169 8139300 2947059 2466625 5775958 9744775
38392 9744775 13547263 17871616 21310781 21473812 19375677 18854904 21013844 22629489
38384 22629489 21094395 17872390 15715134 15097838 14862689 14125715 12220793 8900684
38376 8900684 5807763 5514185 7801381 9162987 7422988 4470450 2689098 1130077
38368 1130077 -2343131 -6919717 -9467747 -8315354 -4406382 331285 3949794 4847018
38360 4847018 3137551 1124195 950864 2303527 3344138 2929471 1060341 -1531351
38352 -1531351 -3333742 -3138702 -2010007 -2226921 -3431470 -2504577 1338055 4571498 4828069
38343D828069J57575L344884M226313M41807l200874k789583j175652j897466
38335C935073k811212p24201K199605K193281N16987O93518J921597J049111j006657
38326G967102q15937R24352L97142k157067k308978R89624L375100K038547l14151
38317A0095734o21720l41052k325012n729192o848969l606856K417811P250429
38309B91173P195834K039293l830688n385736k522489K98439J32806j354961j467960
38300d604289k12999R22218J444092J419312N06662r96161j749427j308944q57185
38291e436721r14271k35434J666836K881740J751738m10946j069084K53340J918715
38282D05913K285995P39390j953149l305178j141586K718745L347479o35444m035718
$$ plain form
38343 4828069 4985644 8330528 12556841 12998648 9797774 7008191 5832539 3935073
38335 3935073 1123861 399660 2599265 4792546 5309533 6003051 7924648 8973759 7967102
38326 7967102 7151165 8075517 8472659 6315592 4006614 4996238 8371338 10409885 10095734
38317 10095734 9474014 9132962 6807950 1078758 -5770211 -9377067 -6959256 291173
38309 291173 7487007 9526300 5695612 309876 -2212613 -1914174 -1781368 -3136329 -4604289
38300 -4604289 -4817288 -3895070 -2450978 -1031666 -525004 -1521165 -3270592 -4579536 -5436721
38291 -5436721 -6350992 -6586426 -4919590 -2037850 -286112 -697058 -1766142 -1512802 405913
38282 405913 2691908 3431298 1478149 -1827029 -2968615 -249870 3097609 2462165 -1573553
38273a573553j899341L056318M152354M87945k134170j51512L014590K853118
38265G805749K4785k048900k579883l064028l628610l097390j665004o07573Q7043
38256h773811J237960K096219J145645p29603o49459J926731L694213J782468
38248A730363k156660l871678j592439K432352N012822N036380L322187R39710
38240A0853037j413305k961492k845458r41619J626248L223957L104606J945841
38232A2591815R09585L59274k50268j318565k311836k232803q04169R40030J366529
38223I249592k59879k896183m508025l921308j837797L3308O38261K54247j85086
38214c432870r7453L10118L49412l73294j398781j793235j155281K7680J115917
$$ plain form
38273 -1573553 -3472894 -416576 3735778 4223723 2089553 1938041 4952631 7805749
38265 7805749 7830534 5781634 3201751 137723 -3490887 -6588277 -8253281 -8860854 -8773811
38256 -8773811 -7535851 -5439632 -4293987 -5023590 -5673049 -3746318 -52105 1730363
38248 1730363 -426297 -4297975 -5890414 -3458062 1554760 6591140 9913327 10853037
38240 10853037 9439732 6478240 3632782 2691163 4317411 7541368 10645974 12591815
38232 12591815 13501400 13860674 13610406 12291841 9980005 7747202 6943033 7883063 9249592
38223 9249592 8989713 6093530 1585505 -2335803 -4173600 -4140292 -3502031 -3247784 -3432870
38214 -3432870 -3530323 -3220205 -2870793 -3244087 -4642868 -6436103 -7591384 -7563704 -6447787
38205f447787K003460K852885L549044L706596K937742J065235j383264k909443
38197E374468k283340l88652L56923q77547k064625j232853O79702J496155J192190
38188B252421J453515K399349K129856k60618l196862m579939l735360j312015
38180d849653J182853J822820R5328j713925r97198J333580J836401n13749l078704
38171d882247l646256k745131j181841J274504L423536K564886r31991k538968
38163h663508J53799L435582L121623R43681J036817K790199K372949k57463j380303
38154C553376n0973O99693l99669q56189P48906K221646J532928m38645k220589
38145D790484l477722l383456p82213K751745L510906P70497k057834k762534
$$ plain form
38205 -6447787 -4444327 -1591442 1957602 5664198 8601940 9667175 8283911 5374468
38197 5374468 3091128 2702476 3059399 2181852 117227 -1115626 -435924 1060231 2252421
38188 2252421 3705936 6105285 8235141 7974523 4777661 197722 -3537638 -4849653
38180 -4849653 -3666800 -1843980 -1748652 -3462577 -4459775 -3126195 -1289794 -1803543 -4882247
38171 -4882247 -8528503 -11273634 -12455475 -11180971 -7757435 -5192549 -6124540 -8663508
38163 -8663508 -8509709 -5074127 -1952504 -1008823 27994 2818193 5191142 4933679 3553376
38154 3553376 3502403 4202096 3802427 2946238 3695144 5916790 7449718 7011073 4790484
38145 4790484 1312762 -2070694 -2852907 -101162 3409744 4180241 2122407 -640127
38137f40127l086095m371935m523480k040387N62717P36533K56168J873827M046757
38128g186022L122749o19677l026127j649321J862597M635341N167279L316000
38120E622819L9432k838077m179751m484723m212066k445147J168954M543524
38112f785035N238111L418515J033338p20983j438558o46756R84533J157424r95042
38103A245547k856391j780907R24850K132769J455324P08417L11691m06813n89472
38094A145015P37777J604882m66048l512984l074581P92944L096596J530698n5531
38085A798768K025944N352225M833391k29739n456075o628321l526870Q07328
38077a023349L175468K848620J642825J167795P42753o75076j672153j56246K545677
$$ plain form
38137 -640127 -3726222 -8098157 -12621637 -14662024 -14099307 -13362774 -13106606 -11232779 -7186022
38128 -7186022 -4063273 -4682950 -7709077 -9358398 -7495801 -2860460 2306819 5622819
38120 5622819 5662251 2824174 -1355577 -5840300 -10052366 -12497513 -11328559 -6785035
38112 -6785035 -1546924 1871591 2904929 2183946 745388 98632 1083165 2240589 1245547
38103 1245547 -1610844 -3391751 -2466901 -334132 1121192 1829609 2141300 1734487 1145015
38094 1145015 1882792 3487674 3021626 -491358 -3565939 -2772995 323601 1854299 1798768
38085 1798768 3824712 9176937 14010328 13780589 8324514 1696193 -1830677 -1023349
38077 -1023349 2152119 5000739 6643564 7811359 8554112 7879036 6206883 6050637 8596314
38068H596314K674572m79877l400021l607080k811391l220262l807331k572100
38060h627176j50018J334963J421430J149433J039541J094756J640807K510604
38052A414340K516412J173047k82284r18996j666053l239486m011137j991898
38044g006055J940479M665494M254954J528886j260906k320958j553298n89279
38036c40683q06797j252992j93550J276199J9698l803710n550157k391545K342310
38027a0701227M128842L648650M169002M822196J812600m143994p013923l530086
38019f807940K128769L989793J565092j021256j032191N20706J614613J892819
38011B850405K262840L011833L037266J179412j729550l084046j675547L02420
$$ plain form
38068 8596314 11270886 10791009 7390988 3783908 972517 -2247745 -6055076 -8627176
38060 -8627176 -8777194 -7442231 -6020801 -4871368 -3831827 -2737071 -1096264 1414340
38052 1414340 3930752 5103799 4821515 3902519 2236466 -1003020 -5014157 -7006055
38044 -7006055 -5065576 -400082 3854872 5383758 4122852 1801894 248596 -340683
38036 -340683 -1147480 -2400472 -2594022 -1317823 -1298125 -5101835 -10651992 -13043537 -10701227
38027 -10701227 -6572385 -2923735 1245267 6067463 7880063 3736069 -3277854 -6807940
38019 -6807940 -4679171 -689378 875714 -145542 -1177733 -657027 957586 2850405
38011 2850405 5113245 8125078 11162344 12341756 10612206 7528160 5852613 6155033
38003F155033J3894k022511k920775k026173j628579k553249k200129J185882
37995e996607M790003M450582L01765l391532l479153p47553K226574L788335
37987A942414L517687J833191J4132p48889q43258j501427k321687j376323J364700
37978A880540K834072R74351j589906o98166L233394N335804K869091j353473
37970A3485707l354946k967737k304527j749461o24765k69460k564764n644291
37962e994244n057868k80566L442477J829855k539539l767865l85907L383117
37954i370540L484897M82039k099594j869314O16610K893455K876178P87605j041587
37945c240251q00573O92914J320162O41257J98003Q13938J117502m17931k947214
$$ plain form
38003 6155033 6168927 4146416 1225641 -800532 -2429111 -4982360 -7182489 -5996607
37995 -5996607 -1206604 3243978 3545743 154211 -3324942 -4072495 -1845921 1942414
37987 1942414 5460101 7293292 7307424 6558535 5715277 4213850 1892163 515840 1880540
37978 1880540 4714612 5688963 4099057 3400891 6634285 11970089 14839180 13485707
37970 13485707 10130761 7163024 4858497 3109036 2484271 2214811 -349953 -5994244
37962 -5994244 -11052112 -11332678 -7890201 -6060346 -8599885 -12367750 -12753657 -9370540
37954 -9370540 -5885643 -5403604 -7503198 -9372512 -8755902 -5862447 -2986269 -2198664 -3240251
37945 -3240251 -4040824 -3347910 -2027748 -1386491 -1188488 -374550 742952 325021 -2622193
37936b622193l984653k494840k09155N59371k76518p90556J50771J405781J334248
37927f927744O6586r29833q47883K5613J319840K665412L127408K090646N92325
37918A182370J97072N96832Q2126j527509k413436j560246J8835J324348K401570
37909C01962K712250J103054j465617j950807K61828J595563o53806m016608m470639
37900f582820k187085l56448l3057J52587L60654l84368j049781M16279K879921
37891f784118K787533j96556k095085l74172K605461L466286K132070M69558p00810
37882A310167j197224l63403J431522J944146j75283l090179m013665k479876
37874f633795Q9952K527651L926354L134907L71167j883375j740890o24730r56134
$$ plain form
37936 -2622193 -6606846 -9101686 -9310841 -8751470 -9027988 -9818544 -9667773 -8261992 -6927744
37927 -6927744 -6861158 -7790991 -8638874 -8613261 -7293421 -4628009 -1500601 590045 1182370
37918 1182370 1379442 1976274 2058400 530891 -1882545 -3442791 -3423956 -2099608 301962
37909 301962 3014212 4117266 2651649 700842 962670 2558233 1904427 -2112181 -6582820
37900 -6582820 -8769905 -9126353 -9159410 -9006823 -8646169 -9030537 -10080318 -9664039 -6784118
37891 -6784118 -3996585 -4193141 -6288226 -6662398 -4056937 -590651 1541419 2010977 1310167
37882 1310167 112943 -250460 1181062 3125208 2949925 -140254 -4153919 -6633795
37874 -6633795 -6543843 -4016192 -89838 3045069 3416236 1532861 -208029 -832759 -1788893
37865a788893k137027j483954J234204K980758J664028j068931k203902j016710
37857c820427O51422R40654j2152m45011P61543K311791J870724m60739j661289
37848A36516m2958J857956J019096j042163n68723J810399J323950l169273o379064
37839e054264m101628O50193K825591L063793N029298P400968N082672j712271
37831A3184352o169701m494703j026467p86601k215658j563305K67q33199k728231
37822f633246j790209J290457K306348R58890R50232K577587J829482j810508
37814c20967l273512k97865K293287O06229j641610L84692M036747L334782j215655
37805C906128l564644j610976N19583k21907j770140j336912N39234J818768J672516
$$ plain form
37865 -1788893 -3925920 -5409874 -4175670 -1194912 469116 -599815 -2803717 -3820427
37857 -3820427 -3169005 -2228351 -2240503 -2685514 -1923971 387820 2258544 1797805 136516
37848 136516 93558 1951514 2970610 1928447 1359724 3170123 4494073 1324800 -5054264
37839 -5054264 -9155892 -8505699 -5680108 -2616315 2412983 9813951 14896623 13184352
37831 13184352 7014651 2519948 1493481 706880 -1508778 -3072083 -3071816 -3905015 -6633246
37822 -6633246 -8423455 -7132998 -4826650 -3867760 -2917528 -339941 1489541 -320967
37814 -320967 -3594479 -3892344 -1599057 -992828 -2634438 -2249746 1787001 5121783 3906128
37805 3906128 341484 -1269492 -749909 -971816 -2741956 -4078868 -3539634 -1720866 -48350
37796d8350L23264j279534j274996J027842K983304J535567j813138k444416O84669
37787c05788L445317K453522q54270l184362l287015j701032M59649J284201n14703
37778b204481k842398j844873K499735N492036L853540l20379l318888m238490
37770b924198l634120j144705K649508M715873L137832L21227k42409J255023
37762D134031K183230J876580J728160J954205J305608m08363k055712l231151
37754G486588m398398n093493l953955q32657K389068L418778J613538j222523
37746e93054k090807Q0363K591396J959849j178531k644984q13069R35447n00763
37737b254153l104227k721193J180044N284670O520727M333108L79343k279459
$$ plain form
37796 -48350 274914 -1004620 -2279616 -1251774 1731530 3267097 1453959 -990457 -305788
37787 -305788 3139529 5593051 4738781 1554419 -1732596 -3433628 -2973979 -1689778 -2204481
37778 -2204481 -5046879 -6891752 -4392017 1100019 4953559 4633180 1314292 -2924198
37770 -2924198 -6558318 -7703023 -5053515 -337642 2800190 3121417 2879008 4134031
37762 4134031 6317261 8193841 9922001 11876206 13181814 12773451 10717739 7486588
37754 7486588 3088190 -2005303 -5959258 -6791915 -4402847 -984069 629469 -593054
37746 -593054 -2683861 -2603498 -12102 1947747 769216 -1875768 -2688837 -1753390 -2254153
37737 -2254153 -5358380 -8079573 -6899529 -1614859 4905868 9238976 9618319 7338860
37729G338860j444572J141599J177808k119394m309799k379305M61814J30660
37721b329j617716o03117K285751K670627L56687n30740J065296J415344j273815
37712C765988l594170k403559M78509J324841o20082l168026l903249j712661
37704i832409K321253M936273L837937J066541O04106K588721L193229O45250
37696I360901k366895l343601l264070l526005l090300r78828J210514J706753
37688d291531J261499J298114J410221P32074j37554n83060j516122l452405m679348
37679i958112l346466q0996L074608M902816M864208K649775l99772j396727M77325
37670G86659K190974R19850j765353k307225m14742R55281K04283j074835q67295
$$ plain form
37729 7338860 5894288 7035887 8213695 6094301 1784502 -594803 -132989 -2329
37721 -2329 -1620045 -2223162 62589 2733216 3089903 2559163 3624459 5039803 3765988
37712 3765988 171818 -2231741 -1753232 -428391 -1048473 -4216499 -8119748 -9832409
37704 -9832409 -7511156 -2574883 1263054 2329595 2933701 5522422 8715651 9360901
37696 9360901 6994006 3650405 386335 -3139670 -6229970 -7208798 -5998284 -4291531
37688 -4291531 -3030032 -1731918 -321697 410377 272823 -310237 -1826359 -5278764 -9958112
37679 -9958112 -13304578 -13385574 -10310966 -5408150 -543942 2105833 1706061 309334 786659
37670 786659 2977633 3897483 2132130 -175095 -589837 365444 569727 -505108 -1372403
37661a372403Q51955K701219L310332K135958J25413p28299K67366J175715p2331
37652H394925k495746l285047j913516q42922j721497k912612j964614Q26162
37644e914867K832574K512635R17515k94518q83203j200930o00930J474549L288843
37635B131668K235628q97389j860300J107705L972258K488852j186077j579623
37627F412722J705866L564780J337596j835920k710175k124729j552227j47437
37619D650476J895645J372838k756888n838191l578442J140674K317284k80868
37611a077472j456858J082569L945242L937724K077254M96299q06500k313875
37603E884383k998314k032172o18860l33003q08961n17772Q20503J713864P16517
$$ plain form
37661 -1372403 -520448 2180771 5491103 7627061 7752474 7024175 7291541 8467256 8394925
37652 8394925 5899179 2614132 700616 -142306 -1863803 -4776415 -6741029 -5914867
37644 -5914867 -3082293 -569658 347857 53339 -829864 -2030794 -2631724 -1157175 2131668
37635 2131668 4367296 3469907 1609607 2717312 6689570 9178422 7992345 6412722
37627 6412722 8118588 11683368 13020964 11185044 8474869 6350140 4797913 4650476
37619 4650476 6546121 7918959 5162071 -676120 -4254562 -3113888 -796604 -1077472
37611 -1077472 -2534330 -1451761 2493481 6431205 8508459 9004758 8198258 5884383
37603 5884383 2886069 853897 235037 -97966 -906927 -1424699 -604196 1109668 1826185
37594A826185j675958l193657k220659J00880J189316M65628j58922L49250N51208
37585b766729m48311q04170J085710L350584L005765K06699k315721k908499j792345
37576c387017M43502K651779K784783L90870j844191j645160n62453q85813j228612
37567c282312Q71145L708536L481882N62974j226201r78525j131414j810358n08629
37558c12902K090085K061252n72034p74058K968070N097397J542622l608836m465030
37549D026566j838821l83497p88017k67279J441480J809319J30123j896202l376301
37540a142629m428804m151331j793065Q99689J595408P56579M27661R44058J539064
37531e353370K532755L885343L443225J23408k935688k258199N62716J471602
$$ plain form
37594 1826185 150227 -3043430 -5264089 -5163209 -3973893 -3508265 -3667187 -3317937 -2766729
37585 -2766729 -3215040 -4019210 -2933500 417084 3422849 3629548 1313827 -1594672 -3387017
37576 -3387017 -2943515 -291736 2493047 2883917 1039726 -605434 -1167887 -2053700 -3282312
37567 -3282312 -2411167 1297369 4779251 5342225 4116024 3137499 2006085 195727 -312902
37558 -312902 1777183 3838435 3266401 2492343 5460413 10557810 12100432 8491596 4026566
37549 4026566 2187745 1804248 1016231 748952 2190432 3999751 4129874 2233672 -1142629
37540 -1142629 -5571433 -9722764 -11515829 -10616140 -9020732 -8264153 -7836492 -6892434 -5353370
37531 -5353370 -2820615 1064728 4507953 4631361 1695673 -562526 190 1471792
37523A471792L83301L45502J519175J190055p70502j753047j605494k588608l972611
37514e780437k509402R05248J295527j899565k818147J342326N047534L008087
37506a408829j356390j560472J920429L426266J365073n12745m2747P70504J80338
37497B781427q53230j130111o04601Q45074K918514L430487O61394l100385l895390
37488A053179j876511j008084k764493m131525k739104k7391K132387M156155
37480e205387O048192N545533J760408k134170k960358k101509k752794m344312
37472f144397l503866O7397K522896J346164j132025j129533J641646M062270
37464b269448L649679J058996j281132k030346j968882k369609l011146k577005
$$ plain form
37523 1471792 1855093 2200595 3719770 4909825 4139323 2386276 780782 -1807826 -5780437
37514 -5780437 -8289839 -7384591 -6089064 -7988629 -10806776 -9464450 -4416916 -1408829
37506 -1408829 -2765219 -4325691 -2405262 1021004 2386077 1873332 1830585 2601089 2781427
37497 2781427 1928197 798086 193485 1038559 3957073 7387560 8048954 4948569 1053179
37488 1053179 -823332 -1831416 -4595909 -8727434 -11466538 -11493929 -9361542 -5205387
37480 -5205387 842805 6388338 8148746 6014576 3054218 952709 -1800085 -6144397
37472 -6144397 -9648263 -9580866 -7057970 -5711806 -6843831 -7973364 -6331718 -2269448
37464 -2269448 1380231 2439227 1158095 -872251 -2841133 -5210742 -8221888 -10798893
37456a0798893q35842Q50935J646886K455411L935699M616894K780446m81856
37448D169680k125885j021983Q68609J391587M96095q07988j953391k391085j347937
37439b722298O82143J563410K05482j440694r23166R07437Q89981j678601l661686
37430f177992k373863P49229K369975J782918J208891K109690L331712L243587
37422F244147J968396O13782n13535j848013l390877m525845m633967l305654
37414i391566n34166K629372M348118L879808K553682J830322J183719n56027
37406E943262k444820k242818m8598J273679R2362j779914k154990j649131j886730
37397d897698k284946j189798P73096J259536j10534j258568j069459p34096r38859
$$ plain form
37456 -10798893 -11634735 -10783800 -9136914 -6681503 -2745804 1871090 4651536 4169680
37448 4169680 2043795 1021812 1890421 3282008 3778103 2970115 1016724 -1374361 -2722298
37439 -2722298 -2040155 -476745 -271263 -1711957 -2635123 -1727686 -837705 -2516306 -6177992
37430 -6177992 -8551855 -7802626 -5432651 -3649733 -2440842 -331152 3000560 6244147
37422 6244147 8212543 8826325 8312790 6464777 3073900 -1451945 -6085912 -9391566
37414 -9391566 -9925732 -7296360 -2948242 931566 3485248 5315570 6499289 5943262
37406 5943262 3498442 1255624 1207026 2480705 2573067 793153 -1361837 -3010968 -4897698
37397 -4897698 -7182644 -8372442 -7599346 -6339810 -6450344 -7708912 -8778371 -9512467 -10451326
37388a0451326k53641K172580M374552M134108K501559K410181M198106M814329
37380A3900448K013605k397083m669169l632111j817842k024227l767287m021504
37372f415170j339629J844804J911267j353350m071805k613590K222103O109865
37364c705505N893040K580797l40322p94918L12702J136687J367508J792864K096575
37355A0339428R40088j318221j992448K43606K605664J588919j755526l036950
37347G614560j131821n5339k684425n810962m473585O69559L923954K161739j501684
37338a288004k449158l33645J502783P45260j623679l157838k480116N7159L092327
37329e934911N128527N213340L350226M05101k409651l999479l605457j119303
$$ plain form
37388 -10451326 -10704967 -8532387 -4157835 -23727 2477832 4888013 9086119 13900448
37380 13900448 15914053 13516970 8847801 5215690 3397848 1373621 -2393666 -6415170
37372 -6415170 -7754799 -5909995 -3998728 -5352078 -9423883 -12037473 -9815370 -3705505
37364 -3705505 2187535 4768332 4428010 3633092 3945794 5082481 6449989 8242853 10339428
37355 10339428 11279516 9961295 7968847 8212453 10818117 12407036 10651510 7614560
37347 7614560 6482739 6427400 3742975 -2067987 -6541572 -5872013 -1948059 213680 -1288004
37338 -1288004 -3737162 -4070807 -2568024 -1822764 -3446443 -6604281 -9084397 -9027238 -5934911
37329 -5934911 -806384 4406956 7757182 8162283 5752632 1753153 -1852304 -2971607
37321b971607K405431M857803M499887J621181j725475l857126m620036m149115
37313c939057j835423K147156N289656M780792J053420k470740l345641k125262
37305d45099l44742J298416K015987N32913k719847m692154k969170R73753L474617
37296b875326L024005J389534Q10233J432457J549766k83854l261830m509767
37288b724782k238248J406478K457962L82622j209420m193J807502J659520R14773
37279B452214J936340L298778J927828j378991k847057j685310r53440k149048
37271F01314k908097j206924J500210K801544K343988J040984l87114r46550K86052
37262C125407K231271K379130L48807j284831p51411O01954R30623N05172K78554
$$ plain form
37321 -2971607 -566176 4291627 8791514 10412695 8687220 4830094 210058 -3939057
37313 -3939057 -5774480 -3627324 1662332 6443124 7496544 5025804 1680163 -445099
37305 -445099 -789841 508575 2524562 3057475 337628 -4354526 -7323696 -6349943 -2875326
37296 -2875326 148679 1538213 2348446 3780903 5330669 5046815 1784985 -2724782
37288 -2724782 -4963030 -3556552 -1098590 -715968 -1925388 -1929581 -122079 1537441 2452214
37279 2452214 4388554 7687332 9615160 8236169 5389112 3703802 2750362 601314
37271 601314 -2306783 -3513707 -2013497 788047 3132035 4173019 3785905 2839355 3125407
37262 3125407 5356678 7735808 8084615 6799784 6048373 6650327 7580950 8086122 8364676
$$ [...]
##END NTUPLES=NMR SPECTRUM
##END=
