##TITLE=31Pdec_DE-73
 D2O, 64 sc
 6.11.2024
##JCAMPDX= 6.0         $$ Bruker NMR JCAMP-DX V2.0
##DATA TYPE= NMR SPECTRUM
##DATA CLASS= NTUPLES
##ORIGIN= UXNMR, Bruker Analytische Messtechnik GmbH
##OWNER= root
$$ XWIN-NMR		Version 3.5
$$ Wed Nov  6 16:37:20 2024 Russian Standard Time (UT+4h)  she@DPX200
##.OBSERVE FREQUENCY= 81.013821
##.OBSERVE NUCLEUS= ^31P
##.ACQUISITION MODE= SIMULTANEOUS
##.ACQUISITION SCHEME= undefined
##.AVERAGES= 64
##.DIGITISER RES= 17
##SPECTROMETER/DATA SYSTEM= spect
##.PULSE SEQUENCE= zgpg30
##.SOLVENT NAME= D2O
##.SHIFT REFERENCE= (INTERNAL, D2O, 0, 198.062)
##AUDIT TRAIL= $$ (NUMBER, WHEN, WHO, WHERE, WHAT)
$$ ##TITLE= Audit trail, XWIN-NMR		Version 3.5
$$ ##JCAMPDX= 5.01
$$ ##ORIGIN= Bruker BioSpin GmbH
$$ ##OWNER= she
$$ F:/spectra/data/she/nmr/P31/2/pdata/1/auditp.txt
$$ ##AUDIT TRAIL=  $$ (NUMBER, WHEN, WHO, WHERE, WHAT)
(   1,<2024-11-06 16:36:08.23 +0400>,<she>,<DPX200>,
      <created by zg, POWCHK disabled, PULCHK disabled
       configuration hash MD5:
       00 E9 B6 7A A2 85 ED C7 34 08 36 98 17 FE 4E 26
       data hash MD5: 32K
       1E 58 C6 5D 9B D2 37 74 65 CD 78 6A 51 4D 84 60>)
(   2,<2024-11-06 16:36:10.81 +0400>,<she>,<DPX200>,
      <Start of raw data processing
       efp BC_mod = 2 LB = 1.5 FT_mod = 6 PKNL = 1 PHC0 = 2371.215 PHC1 = -183.7118 SI = 64K 
       data hash MD5: 64K
       20 7C 58 4F DC 0A DD 45 29 90 B8 B4 54 6E 9D B0>)
(   3,<2024-11-06 16:36:54.15 +0400>,<she>,<DPX200>,
      <pk PHC0 = 41.66009 PHC1 = -92.19991 
       data hash MD5: 64K
       20 AA FF 2C F7 B1 51 CF 74 66 5B 26 FF E5 68 1F>)
$$ ##END=
$$ 
$$ hash MD5
$$ 3D BA 28 D3 2C E0 B0 02 7D 58 F1 60 00 30 F1 3F
##$RELAX= 
##$RELAX= 
##$RELAX= 
##$RELAX= 
##$RELAX= 
##$RELAX= 
##$RELAX= 
##$RELAX= 
$$ Bruker specific parameters
$$ --------------------------
##$DU= <F:/spectra>
##$EXPNO= 2
##$NAME= <P31>
##$PROCNO= 1
##$TYPE= <nmr>
##$USER= <she>
##$AMP= (0..31)
100 100 100 100 100 100 100 100 100 100 100 100 100 100 100 100 100 100 
100 100 100 100 100 100 100 100 100 100 100 100 100 100 
##$AQSEQ= 0
##$AQ_mod= 1
##$AUNM= <au_zg>
##$AUTOPOS= <>
##$BF1= 81.014009
##$BF2= 200.13
##$BF3= 200.13
##$BF4= 200.13
##$BF5= 200.13
##$BF6= 200.13
##$BF7= 200.13
##$BF8= 200.13
##$BYTORDA= 1
##$CFDGTYP= 0
##$CFRGTYP= 5
##$CHEMSTR= <none>
##$CNST= (0..31)
1 1 145 1 1 1 1 1 1 1 1 1 1 1 1 1 1 1 1 1 1 1 1 1 1 1 1 1 1 1 1 1 
##$CPDPRG= <waltz16>
##$CPDPRG1= <>
##$CPDPRG2= <waltz16>
##$CPDPRG3= <>
##$CPDPRG4= <mlev>
##$CPDPRG5= <mlev>
##$CPDPRG6= <mlev>
##$CPDPRG7= <mlev>
##$CPDPRG8= <mlev>
##$CPDPRGB= <>
##$CPDPRGT= <>
##$D= (0..31)
0 1 0 0 0 0 0 0 0 0.06 0 0.03 2e-05 3e-06 0 0 0.0002 0 0 0 0 0 0 0 0 0 
0 0 0 0 0 0 
##$DATE= 1730896567
##$DBL= (0..7)
120 120 120 11 120 120 24 19 
##$DBP= (0..7)
150 150 150 150 150 150 150 150 
##$DBP07= 0
##$DBPNAM0= <>
##$DBPNAM1= <>
##$DBPNAM2= <>
##$DBPNAM3= <>
##$DBPNAM4= <>
##$DBPNAM5= <>
##$DBPNAM6= <>
##$DBPNAM7= <>
##$DBPOAL= (0..7)
0.5 0.5 0.5 0.5 0.5 0.5 0.5 0.5 
##$DBPOFFS= (0..7)
$$ [...]
##$SUBNAM3= <"">
##$SUBNAM4= <"">
##$SUBNAM5= <"">
##$SUBNAM6= <"">
##$SUBNAM7= <"">
##$SUBNAM8= <"">
##$SUBNAM9= <"">
##$SW= 400.765351723535
##$SWIBOX= (0..15)
0 1 3 0 0 0 0 0 0 0 0 0 0 0 0 0 
##$SW_h= 32467.5324675325
##$TD= 32768
##$TD0= 1
##$TE= 0
##$TE2= 300
##$TE3= 300
##$TEG= 300
##$TL= (0..7)
0 120 53 12 22 120 120 120 
##$TP= (0..7)
150 150 150 150 150 150 150 150 
##$TP07= 0
##$TPNAME0= <>
##$TPNAME1= <>
##$TPNAME2= <>
##$TPNAME3= <>
##$TPNAME4= <>
##$TPNAME5= <>
##$TPNAME6= <>
##$TPNAME7= <>
##$TPOAL= (0..7)
0.5 0.5 0.5 0.5 0.5 0.5 0.5 0.5 
##$TPOFFS= (0..7)
0 0 0 0 0 0 0 0 
##$TUNHIN= 0
##$TUNHOUT= 0
##$TUNXOUT= 0
##$USERA1= <user>
##$USERA2= <user>
##$USERA3= <user>
##$USERA4= <user>
##$USERA5= <user>
##$V9= 5
##$VALIST= <valist>
##$VCLIST= <CCCCCCCCCCCCCCC>
##$VD= 0
##$VDLIST= <DDDDDDDDDDDDDDD>
##$VPLIST= <PPPPPPPPPPPPPPP>
##$VTLIST= <TTTTTTTTTTTTTTT>
##$WBST= 1024
##$WBSW= 4
##$XGAIN= (0..3)
0 0 0 0 
##$XL= 0
##$YL= 0
##$YMAX_a= 5038
##$YMIN_a= -15179
##$ZGOPTNS= <>
##$ZL1= 120
##$ZL2= 120
##$ZL3= 120
##$ZL4= 120
##$ABSF1= 0
##$ABSF2= 0
##$ABSG= 0
##$ABSL= 0
##$ALPHA= 0
##$AQORDER= 0
##$ASSFAC= 0
##$ASSFACI= 0
##$ASSFACX= 0
##$ASSWID= 0
##$AUNMP= <proc_1d>
##$AZFE= 0.1
##$AZFW= 0.5
##$BCFW= 0
##$BC_mod= 2
##$BYTORDP= 0
##$COROFFS= 0
##$CY= -3
##$DATMOD= 1
##$DC= 0
##$DFILT= <>
##$DTYPP= 0
##$F1P= 0
##$F2P= 0
##$FCOR= 1
##$FTSIZE= 65536
##$FT_mod= 6
##$GAMMA= 0
##$GB= 0
##$INTBC= 1
##$INTSCL= 9.790993e-09
##$ISEN= 30
##$LB= 1.5
##$LEV0= 0
##$LPBIN= 0
##$MAXI= 10000
##$MC2= 0
##$MEAN= 0
##$ME_mod= 0
##$MI= 50
##$NCOEF= 0
##$NC_proc= -8
##$NLEV= 6
##$NOISF1= 182.463
##$NOISF2= 159.3651
##$NSP= 0
##$NTH_PI= 0
##$NZP= 0
##$OFFSET= 198.0616
##$PC= 4
##$PHC0= 2412.875
##$PHC1= -275.9117
##$PH_mod= 1
##$PKNL= yes
##$PPARMOD= 0
##$PSCAL= 0
##$PSIGN= 0
##$REVERSE= no
##$SF= 81.0140089999434
##$SI= 65536
##$SIGF1= 159.3651
##$SIGF2= -187.1042
##$SINO= 113.3802
##$SIOLD= 16384
##$SREGLST= <1H.CDCl3>
##$SSB= 0
##$STSI= 65536
##$STSR= 0
##$SW_p= 32467.5324675325
##$SYMM= 0
##$S_DEV= 0
##$TDeff= 32768
##$TDoff= 0
##$TI= <>
##$TILT= no
##$TM1= 0
##$TM2= 0
##$TOPLEV= 0
##$USERP1= <user>
##$USERP2= <user>
##$USERP3= <user>
##$USERP4= <user>
##$USERP5= <user>
##$WDW= 1
##$XDIM= 65536
##$YMAX_p= 431736327
##$YMIN_p= -129795033
$$ End of Bruker specific parameters
$$ ---------------------------------
##NTUPLES= NMR SPECTRUM
##VAR_NAME=  FREQUENCY,     SPECTRUM/REAL,   SPECTRUM/IMAG
##SYMBOL=    X,             R,               I
##VAR_TYPE=  INDEPENDENT,   DEPENDENT,       DEPENDENT
##VAR_FORM=  AFFN,          ASDF,            ASDF
##VAR_DIM=   65536,         65536,           65536
##UNITS=     HZ,            ARBITRARY UNITS, ARBITRARY UNITS
##FACTOR=    0.49542278885378, 1,            1
##FIRST=     16045.7642231865, 0,            0
##LAST=      -16421.768244346, 0,            0
##MIN=       -16421.768244346, -129795033,   0
##MAX=       16045.7642231865, 431736327,    0
$$ Real data points
##PAGE= N=1
##DATA TABLE= (X++(R..R)), XYDATA
$$ [...]
##PAGE= N=2
##DATA TABLE= (X++(I..I)), XYDATA
7469g525215M786682K994346m83479l812109n408956l647180R29647M670534M524172
7460b971558J508863j352039k889785l465316k647877r4641K395128K615669J201257
7451e700299O07832J322768J596774P04238m2628K60513P98658O31079o789l74372
7441b02226o4350Q75634J780378J700899O96830m5912k25856j064481k614942
7432H35974k422312Q50367M263029M063228J011562j061553j066569j346269k973394
7423B154063m187362l747640k347600m21700J980891L031437Q50007k157078j199341
7414f044323L517583O024264L093268j214111k164290q56701n11319n09764J237001
7405B571608L177908K385340j49524j135094k54851N51104J383761L218068L867384
$$ plain form
7469 -7525215 -2738533 255813 -227666 -4039775 -9448731 -13095911 -12166264 -7495730 -2971558
7460 -2971558 -1462695 -2814734 -5704519 -9169835 -11817712 -11912353 -9517225 -6901556 -5700299
7451 -5700299 -5092467 -3769699 -2172925 -1468687 -1511315 -1250802 -452144 178935 172146 -202226
7441 -202226 -266576 609058 2389436 4090335 4787165 4741253 4515397 3450916 835974
7432 835974 -1586338 -735971 3527058 7590286 8601848 7540295 6473726 5127457 2154063
7423 2154063 -2033299 -5780939 -8128539 -8550239 -6569348 -3537911 -2687904 -4844982 -6044323
7414 -6044323 -2526740 3497524 6590792 5376681 3212391 2355690 1844371 1334607 2571608
7405 2571608 5749516 8134856 7985332 6850238 6595387 7146491 8530252 11748320 15615704
7396A5615704M71845m510183n282595j117269K379363J469440j132746j605180
7388F288379m58221j64054r50198j657926k097663k151323q31474J581130K553334
7379B111984N73148k358241l381510k295243p82711J80218N17691K67526J04794
7370e062344J040574K339738J765654o41405j471953J181885M050979K819327
7362F022455j601665m083658j894286K511541N103128M266911J157087j885893
7354I595620k984492k205967j414995j675942j548057N65614L256767L452578
7346G041126P07284j974855j993878j25847J037812L97330p79095p62468N69430
7337D116839J781285J863981J472384J441614Q68288j558067m613030n373314
$$ plain form
7396 15615704 16087549 11577366 6294771 5177502 7556865 9026305 7893559 6288379
7388 6288379 5830158 5666104 4715906 3057980 960317 -1191006 -2022480 -441350 2111984
7379 2111984 2685132 326891 -3054619 -5349862 -6132573 -5952355 -5434664 -5167138 -5062344
7370 -5062344 -4021770 -1682032 83622 -557783 -2029736 -847851 3203128 6022455
7362 6022455 4420790 337132 -1557154 954387 6057515 10324426 11481513 9595620
7354 9595620 6611128 4405161 2990166 1314224 -233833 331781 3588548 7041126
7346 7041126 7748410 5773555 3779677 3653830 4691642 5088972 4309877 3547409 4116839
7337 4116839 5898124 7762105 9234489 10676103 11544391 9986324 5373294 -20
7329b0l412724j466214r92007j79968J932013K774986N46510j869016j077931
7320c744371J111903N56448k350260l565213k277672j650953k563314j928729
7312a6412161J449577M189739L628530J768627J466107K079500J578208J84199
7304f7674p59964j276532j637575p96677J695054L971067M197433K970549J506823
7295I802504n56071l391874n020831l680972o95783J352155J909506J783798R06878
7286B409310p11502j388448K1640J535448N52903j972749k753321q58534J601866
7277a563387K903261K988378J743376j048378l910515m392363j963103J590215
7269c652516M374500N221052L256045q06361l675937k749096m9961O1907l005800
$$ plain form
7329 -20 -3412744 -4878958 -5870965 -6050933 -4118920 -1343934 -797424 -2666440 -3744371
7320 -3744371 -2632468 -2076020 -4426280 -7991493 -10269165 -11920118 -14483432 -16412161
7312 -16412161 -14962584 -10772845 -7144315 -5375688 -3909581 -1830081 -251873 -67674
7304 -67674 -827638 -2104170 -3741745 -4538422 -2843368 1127699 5325132 8295681 9802504
7295 9802504 9246433 5854559 833728 -2847244 -3543027 -2190872 -281366 1502432 2409310
7286 2409310 1697808 309360 331000 1866448 2419351 446602 -2306719 -3165253 -1563387
7277 -1563387 1339874 4328252 6071628 5023250 1112735 -3279628 -5242731 -3652516
7269 -3652516 721984 5943036 9199081 8392720 4716783 1967687 1917726 1979633 -1026167
7260a026167n353120m119938o67682K187506L180067K297095L04707q27056L39551
7251c685037K191777J999935L31420J37850J360579O90961k357284l648250o35932
7242c613981L663999N223352L834873J097157k483080n504298m741108R4696L941444
7233A513054K592494j538340l547921k824218j558949K02633K885961L624179
7225A348893J87565l329209j319681L891024M415821j239515n708309l779685
7217e533096Q07017K347943J122210O51266J560689K166090J982111J247457l98672
7208E953015k054433j272821J681690K491736j079984m747085l251057J980922
7200b98017M854682K774471j173458l284058k747676m92057K088468L112309J656680
$$ plain form
7260 -1026167 -6379287 -10499225 -11166907 -8979401 -5799334 -3502239 -3197532 -4024588 -3685037
7251 -3685037 -1493260 506675 838095 975945 2336524 3027485 670201 -2978049 -3613981
7242 -3613981 50018 5273370 9108243 10205400 7722320 2218022 -2523086 -2428390 1513054
7233 1513054 4105548 2567208 -980713 -3804931 -5363880 -5161247 -2275286 1348893
7225 1348893 1536458 -1792751 -3112432 778592 5194413 3954898 -1753411 -5533096
7217 -5533096 -4726079 -2378136 -1255926 -604660 956029 3122119 5104230 6351687 5953015
7208 5953015 3898582 2625761 4307451 6799187 5719203 972118 -2278939 -298017
7200 -298017 4556665 7331136 6157678 2873620 125944 -366113 1722355 4834664 6491344
7191F491344n33621q85226N34733J329399K94646j335260k016673j488019k96369
7182B094954Q30396J277138J166214J082367N21140j862188n315750o370349l185527
7173i761605J307739L026777J885626P19588P04145R43957J296671K146482K211384
7164D480764J04460k386751k053122R07955L121458K858630J247836j002509m152948
7155C125773o524006n249732r89319J846429R34588j140577j162327P47899K700281
7146e710991L583839K826261M82329j449054p76484J129037P83748j632170k220439
7137b983924r8711P95567j475656l498984k729126j642184k025013p24353L882644
7128a0499740O426919K067374m563323n164508L20545N023918O131215O353239
$$ plain form
7191 6491344 5957723 5072497 5607230 6936629 7231275 5896015 3879342 2391323 2094954
7182 2094954 2925350 4202488 5368702 6451069 6972209 5110021 -205729 -6576078 -9761605
7173 -9761605 -8453866 -5427089 -3541463 -2821875 -2117730 -1173773 122898 2269380 4480764
7164 4480764 4585224 2198473 145351 1053306 4174764 7033394 8281230 7278721 3125773
7155 3125773 -3398233 -8647965 -9637284 -7790855 -6856267 -7996844 -9159171 -8411272 -5710991
7146 -5710991 -2127152 699109 1181438 -267616 -1044100 84937 868685 -763485 -2983924
7137 -2983924 -3082635 -2287068 -3762724 -7261708 -9990834 -11633018 -13658031 -14382384 -10499740
7128 -10499740 -4072821 -2005447 -6568770 -11733278 -11412733 -6388815 -257600 6095639
7120F095639N687833R44727n614947o291093L63902N744477L260057k521108l728807
7111C940680m43124J715148R48617L3719K72841L70217m639j45532o65298k011144
7101D011485k107453N01274K735381P69036l371107l965888q4096L121231K158846
7092C768709o24388j970555k186929k407654j462915J263175K853404N26532l380703
7083c621324l793530K51281M304441M289804J017606j829390k231196j141599
7075b753907l88109n54864q47166m34780L48975L54510p58045j745610j171943
7066g950939P79534K512272K708065J141318j602166l984357l579705O45891N656057
7057c674030O219440J080082m482803m549480J27324L496926K361781l07937q65675
$$ plain form
7120 6095639 11783472 12728199 7113252 822159 1186061 6930538 10190595 7669487 3940680
7111 3940680 3497556 5212704 6161321 6195040 6467881 6838098 6833459 6687927 6022629 4011485
7101 4011485 1904032 2405306 5140687 5909723 2538616 -1427272 -1511368 1609863 3768709
7092 3768709 3144321 1173766 -1013163 -3420817 -4883732 -3620557 -767153 -240621 -3621324
7083 -3621324 -7414854 -7163573 -2859132 1430672 2448278 618888 -1612308 -2753907
7075 -2753907 -3142016 -3696880 -4544046 -4978826 -4629851 -4275341 -5033386 -6778996 -7950939
7066 -7950939 -7171405 -4659133 -1951068 -809750 -2411916 -6396273 -9975978 -9330087 -3674030
7057 -3674030 2545410 3625492 -857311 -5406791 -5279467 -1782541 579240 271303 -594372
7048e94372j32470q09982k557906k859121j306963J71245P01134J109428J467023
7039d811984R06747N1916Q05650L131084M583396L797827K066851O95673o69848
7030A0557312k060451k213235j082000p67320k111829k857463j409356Q2199o83885
7021b546028j749429R1477L276430K962405j457958m715233k935320J030251J868500
7012d174905j030167l392415j939702J975099M531533L597753L56095k314437
7004b391146k537558o78626J687493L386150L872678K679979j22872l037117l974661
6995a115680k452377k17807O45187k74774j691197k045151q76335Q23568J719129
6986e485437J796672K271939L371231L372405J091624j772130k657596j786211
$$ plain form
7048 -594372 -726842 -1536824 -4094730 -6953851 -8260814 -8089569 -7388435 -6279007 -4811984
7039 -4811984 -3905237 -3853321 -3047671 83413 4666809 8464636 10531487 11227160 10557312
7030 10557312 8496861 6283626 5201626 4434306 2322477 -534986 -1944342 -1862143 -2546028
7021 -2546028 -4295457 -4203980 -927550 2034855 576897 -4138336 -7073656 -6043405 -4174905
7012 -4174905 -5205072 -8597487 -10537189 -8562090 -4030557 -432804 -76709 -2391146
7004 -2391146 -4928704 -5607330 -3919837 -533687 3338991 6018970 5896098 2858981 -1115680
6995 -1115680 -3568057 -3785864 -3140677 -3415451 -5106648 -7151799 -8028134 -7204566 -5485437
6986 -5485437 -3688765 -1416826 1954405 5326810 6418434 4646304 1988708 202497
6978B02497j504330k275617k005071J73290K079766J658016j87567j353925j327956
6969d540897o90576M87093J947323K324743R54038l49880N57296K660119K503734
6960E852993j356737o027403o848561j851369O021425J0753144Q338322J020108
6952A5901922m513281m262431j055303j54421k366935m120834l369053j890861
6944e831197j312593l11495K368422M588173L135199j586657n480785n397891
6936i828824k354679J81599K48008r01135p09612J547536L935659M178186K115797
6927a587465o56831k774680l659877k899628p53812J113306J349255J163854K536007
6918f169871M174595K447879k603059n656691k963943K087048L604718J218240
$$ plain form
6978 202497 -1301833 -3577450 -5582521 -5409231 -3329465 -1671449 -1859016 -3212941 -4540897
6969 -4540897 -5231473 -4744380 -2797057 -472314 481724 131844 689140 3349259 5852993
6960 5852993 4496256 -1531147 -8379708 -10231077 -4209652 6543492 14881814 15901922
6952 15901922 11388641 7126210 6070907 5916486 3549551 -571283 -3940336 -5831197
6944 -5831197 -7143790 -7455285 -5086863 -498690 2636509 1049852 -4430933 -9828824
6936 -9828824 -12183503 -12001904 -11753896 -12655031 -13364643 -11817107 -7881448 -3703262 -1587465
6927 -1587465 -2244296 -5018976 -8678853 -11578481 -12332293 -11218987 -9869732 -8705878 -6169871
6918 -6169871 -1995276 452603 -2150456 -7807147 -10771090 -8684042 -5079324 -3861084
6910c861084n74966K34215J151123N30444J99161J294374J553952q29597l656709
6901c959087l670205r49417J974004L509898L316356J213325j626085k210382
6893b401593N63798L201283J902609j547488j962491J612494M570093L612607
6885I551312R43483J5434N70856L27823q99349j438808o36779P52412K006858
6876A1193242K493137J393566r01756k234061j297098J78696l05066k481062l972467
6867D067131l644260k210547k05943K235974L832165K906888R2300j858523j551832
6858C663353m11610q4118k81049j27330P8588k30174m84594Q8953R12436P86250
6848C910705k00681o89878n343Q00725K17444j763610l401316l144187j546498
$$ plain form
6910 -3861084 -4436050 -4201835 -3050712 -2520268 -2321107 -1026733 527219 -302378 -3959087
6901 -3959087 -7629292 -8578709 -6604705 -3094807 221549 1434874 -191211 -2401593
6893 -2401593 -1837795 1363488 3266097 1718609 -243882 1368612 5938705 9551312
6885 9551312 10494795 10510229 11081085 11408908 10509559 9070751 8433972 9186384 11193242
6876 11193242 13686379 15079945 14178189 11944128 10647030 10825726 10520660 8039598 4067131
6867 4067131 422871 -1787676 -1993619 242355 4074520 6981408 7073708 5215185 3663353
6858 3663353 3251743 3167625 2886576 2759246 2837834 2607660 2123066 2212019 3124455 3910705
6848 3910705 3710024 3020146 3014803 3815528 4032972 2269362 -1131954 -4276141 -5822639
6839e822639n06902n10576J03778K249558L824507K184961j805232m364324l347477
6830g994346j61218K853109M531318M053982R29974k873021l529558k15819K833024
6821D27445J645701j936204l054398q69335Q24011k35783j723835q58277J477192
6812d303483K563220J813768J014611J647685L376044M522768L306975m30867
6804A3510721m163708m724051k210437j93467q84501k118155j147003N50105m85782
6795a866278l611178m237887o71963K963995K496226o60997k248563j225540J22190
6786h939995O41795J230140J789366J033703j91299R46396M404933N881267K573927
6777I370233k303167l570223o95903K677333M285806M755656M324849K028018
$$ plain form
6839 -5822639 -6329541 -6840117 -6736339 -4486781 -662274 1522687 -282545 -4646869 -7994346
6830 -7994346 -8155564 -5302455 -771137 3282845 4212819 1339798 -2189760 -2405579 427445
6821 427445 2073146 136942 -2917456 -3786791 -2962780 -3198563 -4922398 -5780675 -4303483
6812 -4303483 -1740263 73505 1088116 2735801 6111845 10634613 13941588 13510721
6804 13510721 9347013 4622962 2412525 2219058 1334557 -783598 -1930601 -1380496 -1866278
6795 -1866278 -5477456 -9715343 -10387306 -7423311 -4927085 -5588082 -7836645 -9062185 -8939995
6786 -8939995 -8298200 -7068060 -5278694 -4244991 -4436290 -3489894 915039 6796306 9370233
6777 9370233 7067066 3496843 2800940 5478273 9764079 14519735 18844584 20872602
6769B0872602j351713l044230k221442j261926j758189k123673r70952n7322j234892
6760F848263k685842j441824J626350K698641M68396k364978l130854j882232
6752A35920K26218K332634K910746M67323l291097l832287L22873M404468L120548
6743F797346j943223m227275j007504L502326M522228K504273O96117K2543o51658
6734A0215173j165890m27391O95267J69946j577940j943725l77751P67539L75252
6725F730480K54516J267117J161111j338115l360189k065493N12669O68356q63191
6716B967261m97793J659066J957630j94955j188098L10972R98503q21807j688010
6707C502769R73778L612007J792604k470335l564321o24412J825245Q14632j906662
$$ plain form
6769 20872602 19520889 16476659 14255217 12993291 11235102 9111429 8140477 8083155 6848263
6760 6848263 4162421 2720597 4346947 7045588 7513984 5149006 2018152 135920
6752 135920 362138 2694772 5605518 6072841 2781744 -1050543 -727670 3676798 6797346
6743 6797346 4854123 626848 -380656 3121670 7643898 10148171 10844288 10866831 10215173
6734 10215173 9049283 8621892 9317159 9487105 7909165 5965440 5587689 6355228 6730480
6725 6730480 6984996 8252113 9413224 8075109 4714920 2649427 3162096 3830452 2967261
6716 2967261 2469468 4128534 6086164 5891209 4703111 5014083 6012586 5190779 3502769
6707 3502769 4476547 8088554 9881158 7410823 3846502 3222090 5047335 5861967 3955305
6698C955305l617244l708269k649703j048927j25619n02830o00664J120457K863311
6689d314183J741972j101234j656709L95648P10836k808515o312048n444648j041984
6680a9830865L065369M897610M376298J483628k395401l597666k23311M342456
6672g881882N193512K149581p51708r77881M88165K130521L410136L335125Q88301
6663G983870k497705l768048k393749j147151j781975k421773o70289K716281
6655c980539M950300M618261K502886J24689j211055q66994L58508O37659p02367
6646F431348k178166k227671j269899n32419J09892J474852K900343K626579L82120
6637G716979j996611k844793k294519j298898l27652L13209o0452j721775l631720
$$ plain form
6698 3955305 338061 -3370208 -6019911 -7068838 -7194457 -7697287 -8297951 -7177494 -4314183
6689 -4314183 -2572211 -3673445 -5330154 -4934506 -4223670 -7032185 -13344233 -18788881 -19830865
6680 -19830865 -16765496 -11867886 -7491588 -6007960 -8403361 -12001027 -12224338 -7881882
6672 -7881882 -2688370 -538789 -1290497 -2268378 -1780213 350308 3760444 7095569 7983870
6663 7983870 5486165 1718117 -675632 -1822783 -3604758 -6026531 -6696820 -3980539
6655 -3980539 969761 5588022 8090908 8215597 7004542 6137548 6496056 7133715 6431348
6646 6431348 4253182 2025511 755612 223193 333085 1807937 4708280 7334859 7716979
6637 7716979 5720368 2875575 581056 -717842 -1045494 -732285 -792737 -2514512 -6146232
6628f146232m118073k464999L56200K359968K094584J41847r92949N89901L619157
6619d560596M737472K583184m60486j387952j43655J201823J689780K014366K331804
6610H005740J563659p51812l258672l903503j728445K038064M018888J145235
6602G129154n171649q688237m995657K227410N154732J863623j812211j333384
6594e626219N70719l70819k783331k467385O60275L138124L514807K778404Q13029
6585B27604k687073m781720k077181L108906M635620J257521j687651n56879J842386
6576g18467J935628Q68392J138848J879400J229630K54510P49418J638382J143691
6567A0119432L50772J009623J723655J28736k602226l310286j980232j535346
$$ plain form
6628 -6146232 -10264305 -12729304 -12373104 -10013136 -7918552 -7776705 -8769654 -8179753 -4560596
6619 -4560596 176876 2760060 2299574 911622 767967 1969790 3659570 5673936 8005740
6610 8005740 9569399 8817587 5558915 1655412 -73033 1965031 5983919 7129154
6602 7129154 1957505 -6730732 -11726389 -9498979 -4344247 -2480624 -4292835 -5626219
6594 -5626219 -5055500 -5426319 -8209650 -10677035 -10016760 -6878636 -3363829 -585425 227604
6585 227604 -2459469 -7241189 -9318370 -6209464 -1573844 -316323 -2003974 -2560853 -718467
6576 -718467 1217161 2085553 3224401 5103801 6333431 6587941 7337359 8975741 10119432
6567 10119432 10470204 11479827 13203482 13332218 10729992 7419706 5439474 3904128
6559C904128k858940l505057j572234J889300M492053M406664J115925l455297
6551D416542n324438k588603J520399K483396N31947n09411K67539k13525l009327
6542b425481m416950j318788L844982O013876L673018j8327j268212O29641K974654
6533G688413K329181j793367n829088n930617k655324o8898j53516n57380J214844
6524e755752L758869L756494O35809k682205l365032j684784k35528o65606j686036
6515g923771q62810J777343L368957K135640m2961n08743M54375R48556Q91948
6506B38534J321461J625549P81327K72781J961543L815718K174227j979865l969570
6497F241705l026764l323287n918375n782356j47927N685037N630569J640849
$$ plain form
6559 3904128 1045188 -2459869 -4032103 -2142803 2349250 6755914 7871839 4416542
6551 4416542 -907896 -3496499 -1976100 507296 1039243 529832 797371 583846 -2425481
6542 -2425481 -6842431 -8161219 -4316237 1697639 5370657 5352330 4084118 4713759 7688413
6533 7688413 10017594 8224227 2395139 -3535478 -6190802 -6259700 -6413216 -6970596 -5755752
6524 -5755752 -1996883 1759611 2395420 -286785 -3651817 -5336601 -5572129 -6237735 -7923771
6515 -7923771 -8786581 -7009238 -3640281 -1504641 -1547602 -2056345 -1601970 -653414 238534
6506 238534 1559995 3185544 3966871 4239652 6201195 10016913 12191140 10211275 6241705
6497 6241705 3214941 -108346 -6026721 -11809077 -11957004 -6271967 -641398 999451
6489I99451j53301J041897J011109j400552k711108j215688M23843L7892q90260
6480b856717m26900P31106J042779O68812P01477J286906J589999R04437m93590
6471C148309j215189j67515J363413O47895k255018l399656l46873L514360L258583
6462D548309o18067l321234k745875j119798r4579J214721K674377J989227j333633
6453A193448m369696m764377l443373k081099q84924j76835r08090j974257m01276
6444a7810479L699765N763203L071633p36848q15590J963066L167747J800537
6436A03034O54831Q43435O79815q6675M56788J997561J227579k616006n165750
6427a905388k724687K085687L858398J860819K21973J259912K586411J760908
$$ plain form
6489 999451 846150 1888047 2899156 1498604 -1212504 -2428192 -2004349 -1966457 -2856717
6480 -2856717 -3283617 -2552511 -1509732 -840920 -139443 1147463 2737462 3641899 3148309
6471 3148309 1933120 1765605 3129018 3776913 1521895 -1877761 -2224634 1289726 4548309
6462 4548309 3930242 609008 -2136867 -3256665 -3351244 -2136523 537854 2527081 1193448
6453 1193448 -3176248 -7940625 -11383998 -13465097 -14350021 -14526856 -15434946 -17409203 -17810479
6444 -17810479 -14110714 -8347511 -5275878 -6012726 -6828316 -4865250 -1697503 103034
6436 103034 757865 1601300 2281115 2194440 2651228 4648789 5876368 3260362 -1905388
6427 -1905388 -4630075 -2544388 1314010 3174829 3396802 4656714 7243125 9004033
6419I004033K47482L79035R16275r70785m337381m879881j324975K038100J182826
6410B254729j908826k257054Q61202L191472J967015l53218j92519J871675K289860
6401G724336j23469k422338j420379K103900M079186J805100k788098n109049
6393C849189k957518J281901L763803L312088J513436r3730j189457j636857j257520
6384F585335p08916r74972j881006k539926l048352l904319l960289j460481K417664
6375i475262L731371P85563l221684m192017j974578N18267J478576J441804J335658
6366i572302J290461J128620P83772N04111J149559L242079N178120M179308K44056
6357H127784k844432k415500r32317k322421n595341n713966r24775M163406M191934
$$ plain form
6419 9004033 9251515 9630550 10546825 9576040 5238659 358778 -966197 1071903 2254729
6410 2254729 345903 -1911151 -1049949 2141523 4108538 3755320 3562801 5434476 7724336
6401 7724336 7600867 5178529 3758150 5862050 9941236 11746336 8958238 3849189
6393 3849189 891671 2173572 5937375 9249463 10762899 10669169 9479712 7842855 6585335
6384 6585335 5876419 4901447 3020441 480515 -2567837 -6472156 -10432445 -11892926 -9475262
6375 -9475262 -5743891 -4958328 -8180012 -12372029 -14346607 -13828340 -12349764 -10907960 -9572302
6366 -9572302 -8281841 -7153221 -6369449 -5865338 -4715779 -1473700 3704420 7883728 8127784
6357 8127784 5283352 2867852 1935535 -386886 -5982227 -11696193 -12620968 -8457562 -4265628
6348d265628m93445m665454m278717k61143L265988L492957J465239L12421J249378
6339d178404K260093J296970m82216l35159J815428K868709O49277l180327n108988
6330d394617l535964K09181L681859N290622M956065L593896J985921P0894k429747
6321I428110m810978n454064l466866m3088K157223J284090j792315m024937l132826
6312i855651Q6972K912161L756655L040488J510548l92129j430046k59829J945829
6303A314998K097192j79504j216038J184525L640332J908526k406353l986172
6295B357506j488557J334043J900808J544231J317763l13247l717771n901348
6287b966572m588838j637523M0851M70806J065534J369817J88365j607020k146859
$$ plain form
6348 -4265628 -4759073 -9424527 -13703244 -13964387 -10698399 -7205442 -5740203 -5427782 -4178404
6339 -4178404 -1918311 -621341 -1103557 -1438716 376712 3245421 3894698 714371 -4394617
6330 -4394617 -7930581 -7721400 -4039541 1251081 6207146 9801042 11786963 11857857 9428110
6321 9428110 4617132 -836932 -4303798 -4346886 -2189663 -905573 -2697888 -6722825 -9855651
6312 -9855651 -9768679 -6856518 -3099863 -59375 1451173 1059044 -371002 -630831 1314998
6303 1314998 3412190 3232686 2016648 3201173 6841505 8750031 6343678 2357506
6295 2357506 868949 2202992 4103800 5648031 6965794 6652547 2934776 -2966572
6287 -2966572 -7555410 -9192933 -9152082 -8681276 -7615742 -6245925 -6057560 -7664580 -9811439
6278i811439j439683q10353l00592J100640L103908L983675K746977K52329j573000
6269b747538j133320J186588K404371j51866m604197n782500k153888J578869
6261a1403481J285043m25018J223148N001556N396456J549922j201940M48808
6253A874494L174439K741803J39280j007787j53333L79397l34770q46075j17260
6244E850188R41524Q16693q48924k773671l010240j054386J051293J000135m96514
6235A476098p04635O74866P84544j572074l330288j562570J935285L299576K137205
6226C138007J227881J667362J681952K42047j239939j521890j363493j718449
6218B113478j999987j340852k98699j98333j448771l139447l855888k814884q16347
$$ plain form
6278 -9811439 -11251122 -12061475 -12362067 -11261427 -8157519 -4173844 -1426867 -1174538 -2747538
6269 -2747538 -3880858 -2694270 -289899 -441765 -5045962 -10828462 -12982350 -11403481
6261 -11403481 -10118438 -10543456 -9320308 -4318752 1077704 2627626 1425686 1874494
6253 1874494 5048933 7790736 7930016 6922229 6768896 7148293 6813523 5967448 5850188
6244 5850188 6791712 7608405 6759481 3985810 975570 -78816 972477 1972612 1476098
6235 1476098 771463 1446329 2230873 658799 -2671489 -4234059 -2298774 1000802 3138007
6226 3138007 4365888 6033250 7715202 7957249 6717310 5195420 3831927 2113478
6218 2113478 113491 -1227361 -1526060 -1724393 -3173164 -6312611 -10168499 -12983383 -13799730
6209a3799730J50259q68808k324705k057757j40149J712407K986111M382393N164672
6200d795307L399779l08959k210812k89806K636320K936220J205238M42721Q07139
6191C822533j40112k406961k757533K3834K426578R29732k830229m188411j607060
6182f727629J782772K505024M57841j995181k920689k020507p6987J778699K580005
6173d636652K014052N73759p90913j223770o14327n5855j014060l157714l625219
6164a2530699p3091N501514P949552M929738p1618k248048j426882j100580k499915
6155a570029k993507q94138J472026J409299M1083J47102J412733J039588j385441
6146a321284k860239j433571R64974J434510j07449j520995j466802l71025P43380
$$ plain form
6209 -13799730 -13649471 -14518279 -16842984 -18900741 -19040890 -17328483 -14342372 -9959979 -4795307
6200 -4795307 -1395528 -1704487 -3915299 -4205105 -1568785 1367435 2572673 3015394 3822533
6191 3822533 3682421 1275460 -1482073 -1458239 968339 1898071 -932158 -5120569 -6727629
6182 -6727629 -4944857 -2439833 -1981992 -3977173 -6897862 -8918369 -8995356 -7216657 -4636652
6173 -4636652 -2622600 -2048841 -2839754 -4063524 -4677851 -4733706 -5747766 -8905480 -12530699
6164 -12530699 -12603790 -7102276 847276 5777014 5705396 3457348 2030466 929886 -1570029
6155 -1570029 -4563536 -5457674 -3985648 -2576349 -2535266 -2388164 -975431 64157 -1321284
6146 -1321284 -4181523 -5615094 -4650120 -3215610 -3323059 -4844054 -6310856 -6681881 -5938501
6137e938501J120068N37257l56604m87245L05344J150154J740655K717508L775141
6128D563777L125527K57838k361027k281903n22943J94602l82838l46232M33846
6119B680647j69542k619834m274279l106125n20592J071127J526676J991135K169476
6110a251311Q22656j582105k729503j253678J472183K778218J520398p49757j505133
6101b478032j82759J174751Q17607j34832M07648J771075J196658j604808l413082
6092b445774k083599M67700J519922J344245J524665J609423K56084j696671k237396
6083a741401j430654r04853p46768K50634J625665J535346R4901m90853M09931
6074a398052Q96888O0303l09765J054681K312361J039493k141099m208274l221292
$$ plain form
6137 -5938501 -4818433 -4281176 -4637780 -5125025 -4819681 -3669527 -1928872 788636 4563777
6128 4563777 7689304 7947142 5586115 3304212 2781269 2975871 2593033 2246801 2680647
6119 2680647 2511105 -108729 -4383008 -7489133 -8009725 -6938598 -5411922 -3420787 -1251311
6110 -1251311 -428655 -2010760 -4740263 -5993941 -4521758 -1743540 -223142 -972899 -2478032
6101 -2478032 -2660791 -1486040 -668433 -803265 -395617 1375458 2572116 967308 -2445774
6092 -2445774 -4529373 -4061673 -2541751 -1197506 327159 1936582 2192666 495995 -1741401
6083 -1741401 -3172055 -4076908 -4823676 -4573042 -2947377 -1412031 -1317130 -1807983 -1398052
6074 -1398052 -501164 -440861 -750626 304055 2616416 3655909 1514810 -2693464 -5914756
6065e914756k2344K772243K738047l88229l881246m108775k96967M436829O322403
6056A657205M531656J352125k88727O85395K489384K005345j522709m730777l853632
6047B325265J38975K537292J089910j640241k729389k515377k309215j566138
6039d668918L56282K019322J996136J293822J380811J616390R47468J75651p0243
6030E046721j458247m753472o462434k863293L648706O717846M441115J283273
6022E600215R82792J835549O67859k122615l815152l166694q77091J838248L398046
6013D341157K347230n67170k252587p62190K228827L585625K085298j259332m574823
6004E172035n715705l341127J004115L418784J919161j097984k141653q90145
$$ plain form
6065 -5914756 -5937100 -3164857 -426810 -815039 -4696285 -8805060 -9102027 -4665198 1657205
6056 1657205 6188861 7540986 7252259 7937654 10427038 12432383 10909674 6178897 2325265
6047 2325265 2464240 5001532 6091442 4451201 1721812 -793565 -3102780 -4668918
6039 -4668918 -4312636 -2293314 -297178 996644 2377455 3993845 4941313 5116964 5046721
6030 5046721 3588474 -1164998 -7627432 -10490725 -6842019 -124173 4316942 5600215
6022 5600215 6583007 8418556 9086415 6963800 3148648 -18046 -895137 943111 4341157
6013 4341157 6688387 6121217 3868630 3106440 5335267 8920892 11006190 9746858 5172035
6004 5172035 -543670 -3884797 -2880682 538102 2457263 1359279 -782374 -1672519
5996a672519N42613J048301J016266N31171n10017j139292m48155N02940J31392
5987B700p66224p8402J778012J924792m18930k191116p96807J979805K408718
5978C842548j29414k637099k507927j03993K643788M392404M554148K829549j26670
5969A2757334k285487j993835k26201K48007j471284k845323j255103J961455
5961D889563K800932k7640l078931k532871R78740L429409K389404o66224k742935
5952E439447k550740j110969p9377J16488N73168K107389L327314J828275k065168
5943G585827m481404k633824J095164K148852P6491j250397K09248J757412O29159
5934E136528j491750j216192J277079K709240J529566n62427j686825j788830
$$ plain form
5996 -1672519 -1129906 -81605 934661 1465832 955815 -183477 -631632 -128692 2700
5987 2700 -763524 -841926 936086 2860878 2441948 250832 -545975 1433830 3842548
5978 3842548 3713134 1076035 -1431892 -1535885 1107903 5500307 10054455 12884004 12757334
5969 12757334 10471847 8478012 8251811 8499818 7028534 4183211 2928108 4889563
5961 4889563 7690495 7662855 4583924 2051053 3029793 6459202 8848606 8182382 5439447
5952 5439447 2888707 1777738 1698361 1814849 2388017 4495406 7822720 9650995 7585827
5943 7585827 3104423 470599 1565763 3714615 3791106 2540709 2749957 4507369 5136528
5934 5136528 3644778 2428586 3705665 6414905 7944471 7382044 5695219 3906389
5926C906389j377019o39354l63819j532413l150920k581610P22213L680695L359972
5917B024134P34490j076832r47117j9832R92473K173990K588676R44584j682326
5908E732240k493795j088383l35358j877012l279292j674323J792957L731708
5900E08742L400781K971554L384091K851817O5923l334463m607892l067967o64319
5891A508267k8165j971468m217517l135260J985196O979373P010722K456929j660282
5882H927795k211801j181310j461318k379902j622170M92770J565417J084097
5874C213578J031996K372553L219878J464723k073650m218849k885579O07822
5866B732472K879279K153227J70104k03976J200988J885911N44601j160747j607969
$$ plain form
5926 3906389 2529370 1890016 1526197 -6216 -3157136 -5738746 -5016533 -1335838 2024134
5917 2024134 2758624 1681792 734675 714843 1707316 3881306 6469982 7414566 5732240
5908 5732240 3238445 2150062 1814704 -62308 -3341600 -5015923 -3222966 508742
5900 508742 3909523 6881077 10265168 13116985 13182908 9848445 5240553 2172586 1508267
5891 1508267 1480102 -491366 -4708883 -7844143 -5858947 1120426 8131148 10588077 8927795
5882 8927795 6715994 5534684 4073366 1693464 71294 564064 2129481 3213578
5874 3213578 4245574 6618127 9838005 11302728 9229078 5010229 2124650 2732472
5866 2732472 5611751 7764978 7935082 7731106 8932094 10818005 11362606 10201859 8593890
5857H593890j851635l326535m596088l141229K82343K024317O33653j047070n336
5848b433690K788856M065238K823810J198380R82650J161850k43132k922626m296665
5839C124671k843545j20922J341975J145416O19367Q2128j317619k942616k414155
5830c325300P57935L420062K526755q00121k891985k099936J54362J851966J853335
5821A447073j62366k957373l660087r03591K436184K313661q19194k300531L58940
5812d247284M197267M964267K221306j108886k569501k139784j380851j524027
5804a587493j921870o34380K454100M189547K100396j159587q00318K787984L942445
5795I370824R5834m109035l536388L63656K516532J353252p44698k015660k463286
$$ plain form
5857 8593890 6742255 3415720 -1180368 -4321597 -4039254 -2014937 -1381284 -2428354 -2433690
5848 -2433690 355166 4420404 7244214 8442594 9425244 10587094 10343962 7421336 3124671
5839 3124671 281126 160204 1502179 2647595 3266962 3349090 2031471 -911145 -3325300
5830 -3325300 -2567365 852697 3379452 2579331 -312654 -2412590 -2258228 -406262 1447073
5821 1447073 1284707 -1672666 -5332753 -6236344 -3800160 -1486499 -2305693 -4606224 -4247284
5812 -4247284 -50017 4914250 7135556 6026670 3457169 1317385 -63466 -1587493
5804 -1587493 -3509363 -4143743 -1689643 2499904 4600300 3440713 2640395 5428379 9370824
5795 9370824 9466658 5357623 1821235 2184891 4701423 6054675 5309977 3294317 831031
5786H31031j759495L27432K154039J988991P85042K77287m15905k812964m916656
5777c541198l354639P64980K764171J535021J014711L235668M618423J738183
5769H775320l094219n283381m199957k622688j903749j065816L63206J622257
5761g409027K389616K872661K590372R85816j087470k061100j411695M05256K748953
5752B3382M190542K645156j780368n337488m614091j156946O01883n40962j635121
5743g604013p18686N82511N31438J17302O33450J060450J85808o35088M63650
5734e383178K186148J294442k626362n997745n392127j270197K984290M623945
5726i580784L645438K213012K412211M039017M586885K114514k032960m438174
$$ plain form
5786 831031 -928464 -601032 1553007 3541998 4327040 4604327 4188422 1375458 -3541198
5777 -3541198 -6895837 -6130857 -3366686 -1831665 -816954 2418714 7037137 8775320
5769 8775320 5681101 397720 -3802237 -6424925 -8328674 -9394490 -9031284 -7409027
5761 -7409027 -5019411 -2146750 443622 1429438 341968 -1719132 -3130827 -2725571 23382
5752 23382 4213924 6859080 5078712 -258776 -4872867 -6029813 -5427930 -5968892 -7604013
5743 -7604013 -8322699 -7740188 -7208750 -7091448 -6457998 -5397548 -5211740 -5846828 -5383178
5734 -5383178 -3197030 -1902588 -4528950 -10526695 -15918822 -17189019 -14204729 -9580784
5726 -9580784 -5935346 -3722334 -1310123 2728894 7315779 9430293 7397333 2959159
5718B959159l612370j502238n82243q34353n94060P69243K456197L801939M568275
5709G429549L935168J071927k855371m933676l750746j206539m1496o48063j610765
5700b610012k335439l238325l808917k674924P7639K493644L240034K870856K029559
5691c955885L33284j853726k536216p87380J263125J298552L26808P07218J715105
5682c489115M67724k771259l881217o96393L615718M979528L748551L175570M306894
5673I456001N115282L886767J117738j591909k737303j543440Q66702J615736
5665A6185574p32849l806011m321951k627959j773659k501857k315055L5917K285682
5656D27832K164444N64039m43013n92117o39234m33194K29306K63864j135511
$$ plain form
5718 2959159 -653211 -2155449 -2737692 -3572045 -4166105 -3396862 -940665 2861274 7429549
5709 7429549 11364717 12436644 9581273 4647597 896851 -309688 -351184 -999247 -2610012
5700 -2610012 -4945451 -8183776 -11992693 -14667617 -14589978 -12096334 -8856300 -5985444 -3955885
5691 -3955885 -3622601 -5476327 -8012543 -8799923 -7536798 -6238246 -5911438 -5204220 -3489115
5682 -3489115 -3021391 -5792650 -9673867 -10370260 -6754542 -1775014 1973537 5149107 9456001
5673 9456001 14571283 18458050 19575788 17983879 15246576 13703136 14569838 16185574
5665 16185574 15452725 11646714 7324763 4696804 2923145 421288 -1893767 -1857850 427832
5656 427832 2592276 3156315 2713302 2121185 1481951 1048757 1278063 1541927 406416
5647D06416k649666k513772j204927n21568o24018k0023J676168K812011J870738
5638g68641n40963k194007j343726J366641K991054J302168k012386k866307j43111
5629d209278K755846L086225K617665L664740M065804L90465n414725p616610
5621f59868m842326j708911j424378j642383L06903K614292K618691J638308K310454
5612g89218L623297K718910J26657r27804J65140O81213o45124j642356m68239
5603B842476J539791K236948J754083J505835J503986M91350j675548l281327
5595F917594k799347r90516k23024j567415l252574k813347l21537J853740K337779
5586h58647J909403J070924r92134l627696l505876J087133O418711O990510K354361
$$ plain form
5647 406416 -2243250 -4757022 -5961949 -6483517 -7107535 -7127558 -5451390 -2639379 -768641
5638 -768641 -1309604 -3503611 -4847337 -3480696 -489642 812526 -1199860 -4066167 -4209278
5629 -4209278 -1453432 1632793 4250458 7915198 11981002 12371467 6956742 -659868
5621 -659868 -5502194 -7211105 -8635483 -10277866 -9970963 -7356671 -4737980 -3099672 -789218
5612 -789218 2834079 5552989 5679646 4751842 4916982 5598195 4953071 3310715 2842476
5603 2842476 4382267 6619215 8373298 9879133 11383119 11874469 10198921 6917594
5595 6917594 4118247 3127731 2904707 1337292 -1915282 -4728629 -5050166 -3196426 -858647
5586 -858647 1050756 2121680 1129546 -2498150 -6004026 -4916893 1501818 8492328 10846689
5577A0846689k787947m924241m909024m584759l683922j465435J148849K706519
5569g653271K793022J478655r18291k680873j663179J279761K283878k53640k771599
5560h105537j388573K408595M035853K343005K99419k44731o29495j722755j847518
5551d851737p828J604588N25922k306233l850164k762022j32012K515515M086352
5542e177619L598498J068995j521094j937490l49424J188940J640259J626624
5534A37689J410216M81516n32644k3270J568275J353635j648586m010808k256108
5525c520085J917645L815251K261487N67302R91035J739981O22054j314774j737260
5516E342636n59214N28446O79382J85159p95891k053780k647326j961773q04920
$$ plain form
5577 10846689 8058742 3134501 -1774523 -6359282 -10043204 -11508639 -10359790 -7653271
5569 -7653271 -4860249 -3381594 -4299885 -6980758 -8643937 -7364176 -5080298 -5333938 -8105537
5560 -8105537 -9494110 -7085515 -3049662 -706657 -407238 -651969 -1281464 -3004219 -4851737
5551 -4851737 -4859565 -3254977 -2729055 -5035288 -8885452 -11647474 -11779486 -9263971 -5177619
5542 -5177619 -1579121 -510126 -2031220 -3968710 -4318134 -3129194 -1488935 137689
5534 137689 1547905 2029421 1496777 1473507 3041782 4395417 2746831 -1263977 -3520085
5525 -3520085 -1602440 2212811 4474298 5041600 6032635 7772616 8394670 7079896 5342636
5516 5342636 4783422 5311868 5991250 6176409 5380518 3326738 679412 -1282361 -2087281
5507b087281j41372M64572J756108K971717K707071J004381q56959k078776k559441
5498A180020k219284j544380j792245k959155k718075M42527M141291M843219
5490f26082K790018J078236M98633q35192k705744k213169O85582J606529j618243
5481a339432m661115k750144K038171L924167J871641P7833Q39989J881265J311413
5472C193788O96976J490824K056476N84040j685354k570454k282239k234245k134595
5463b884783q99919N54874K16499j573625k090357m2913K601869L302988J901051
5454A085684J41254n28245P4889J125484J331830K3608j766122k129711o38014
5445a279343J123781J865954K168996K866796L185530J941569l22908k008204
$$ plain form
5507 -2087281 -2228653 -1764081 -7973 2963744 5670815 6675196 5818237 3739461 1180020
5498 1180020 -1039264 -2583644 -4375889 -7335044 -10053119 -9610592 -5469301 -626082
5490 -626082 2163936 3242172 3740805 2905613 199869 -2013300 -1327718 278811 -1339432
5481 -1339432 -6000547 -8750691 -6712520 -2788353 -916712 -838879 1110 1882375 3193788
5472 3193788 3890764 5381588 7438064 8022104 6336750 3766296 1484057 -750188 -2884783
5463 -2884783 -3784702 -3229828 -3013329 -4586954 -6677311 -6720224 -4118355 -815367 1085684
5454 1085684 1226938 698693 773582 1899066 3230896 3254504 1488382 -641329 -1279343
5445 -1279343 -155562 1710392 3879388 6746184 9931714 11873283 11550375 9542171
5437I542171k655037k850166k433218o91758J696553K740801J493514j057831
5429E785029l523084n016284m593793j779368J928933L991288L888647L462185
5421D143553L690832L306080J497651l34366r14778j034733j584588j776818j134685
5412E858148j020679j935858j564807J521459M129245K111713l193209o015113
5404a09101l620360O55139K314005P25649j505075j812242M87859L791848N135211
5395F062933L031314n46188k416586j902056o08677M61802J192859P87275j085857
5386D976819k353129j052533Q98451J98680k174074k281841o2193M15517j684981
5377c119284k109303Q90027K821454K85406l018208k109975J490631K873798J608421
$$ plain form
5437 9542171 6887134 4036968 1603750 911992 2608545 5349346 6842860 5785029
5429 5785029 2261945 -2754339 -7348132 -9127500 -7198567 -3207279 681368 4143553
5421 4143553 7834385 11140465 12638116 12303750 11388972 10354239 8769651 6992833 5858148
5412 5858148 4837469 2901611 1336804 2858263 6987508 9099221 5906012 -109101
5404 -109101 -3729461 -3074322 -760317 -34668 -1539743 -3351985 -2864126 927722 6062933
5395 6062933 9094247 8548059 6131473 4229417 3620740 4082542 5275401 6062676 4976819
5386 4976819 2623690 1571157 2469608 2668288 494214 -1787627 -1849820 -1434303 -3119284
5377 -3119284 -5228587 -4338560 -1517106 -1231700 -4249908 -6359883 -4869252 -1995454 -387033
5368c87033J132570K194532K266616P60084j617Q90685J567272O78581j063581
5359H038109k750682l945030l667799j435984R12053J100434p5795K60042K719706
5350A155054M836253M558630K257424o17039k690319k782733j107386m168j261344
5341D344372l198776k822566l96833Q27250o31060k525513j944550J548510N741504
5332I42338P251347M082177j482096l978398j147435K495221J537758k759991
5324F940921m847044l249659j409590p99826Q86391L809323M096579K10119l723260
5315A913954l910722k115884j668665j926622n45586J513070J462162l44809q20372
5306f443474R84712K601081J866064m12583j947536j628627k03356J040098J894399
$$ plain form
5368 -387033 745537 2940069 5206685 5966769 5965152 6855837 8423109 9101690 8038109
5359 8038109 5287427 1342397 -2325402 -3761386 -2849333 -1748899 -1824694 -1564652 1155054
5350 1155054 5991307 10549937 12807361 12190322 9500003 6717270 5609884 5605716 4344372
5341 4344372 1145596 -1676970 -2073803 -1246553 -1877613 -4403126 -6347676 -4799166 942338
5332 942338 8193685 12275862 10793766 6815368 5667933 8163154 9700912 6940921
5324 6940921 2093877 -1155782 -2565372 -3365198 -2478807 1330516 5427095 5637214 1913954
5315 1913954 -1996768 -4112652 -5781317 -7707939 -8253525 -6740455 -5278293 -5623102 -6443474
5306 -6443474 -5458762 -2857681 -991617 -1404200 -3351736 -4980363 -5183719 -4143621 -2249222
5297b249222L136073M421029L456915q86865n504802n976985k601362l06761j741442
5288h253422l729137k281886J715435M130935K986740J26733j329399J44330L055818
5279c433853L858561J016801j998891o42012L663578M475870m07195n160322m012168
5270b639631J082121M438872M662617M221590L737330J660369j700378m215917
5262A1246973n256803n401455l976033n95392K070240J191608j427465j712808
5254c861135J62267K23964k435455m079761k379161N11802K232502L319947M269064
5245b035966L479362N42042j720333j137712N14802O47908n0225O53225K544896
5236C437999L431881K428502N20478j153953j730905n49678J458016J657709q72785
$$ plain form
5297 -2249222 886851 5307880 8764795 7877930 2373128 -3603857 -6205219 -6511980 -8253422
5288 -8253422 -11982559 -14264445 -12549010 -8418075 -5431335 -5304602 -6634001 -6489671 -3433853
5279 -3433853 424708 1441509 -557382 -1199394 2464184 6940054 6532859 1372537 -2639631
5270 -2639631 -1557510 2881362 7543979 11765569 15502899 17163268 15462890 11246973
5262 11246973 5990170 588715 -3387318 -3982710 -1912470 -720862 -2148327 -3861135
5254 -3861135 -3698868 -3474904 -5910359 -9990120 -12369281 -11857479 -9624977 -6305030 -2035966
5245 -2035966 1443396 1985438 265105 -872607 -357805 290103 239878 893103 3437999
5236 3437999 6869880 9298382 9818860 8664907 6934002 6384324 7842340 9500049 8627264
5227H627264l140321j954879J254743K301553L22464j331515n35086O60484k09093
5218E995614k168075k712919j528619q7592R85609J821329J641922k39552k236535
5209A471182j922526L18179J663536J257101J394786L209317M091551J600392
5201A3083518k335819l912088k625909r95112j09472J243150L218031L927629
5193A1493928K415479K6415j821850k933448k999713j543614K00955R3150j369155
5184C562147j218614J076593K110546p0704k240426o28004L136400M253507J536561
5175A1518006j562121k168384r99042L0291N22748J121855J958858K318231J285738
5166A4026180j060851k772724j591495J665373K962257M0959l974611m336878
$$ plain form
5227 8627264 5486943 3532064 4786807 7088360 7410824 6079309 5544223 6204707 5995614
5218 5995614 3827539 1114620 -413999 -501591 484018 2305347 3947269 3707717 1471182
5209 1471182 -451344 -133165 1530371 2787472 4182258 7391575 11483126 13083518
5201 13083518 10747699 6835611 4209702 3214590 3105118 4348268 7566299 11493928
5193 11493928 13909407 13935822 12113972 9180524 6180811 4637197 4838152 4931302 3562147
5184 3562147 2343533 3420126 5530672 5459968 3219542 2591538 5727938 9981445 11518006
5175 11518006 9955885 7787501 6788459 6818750 7341498 8463353 10422211 12740442 14026180
5166 14026180 12965329 10192605 8601110 10266483 13228740 13269699 9295088 4958210
5158D958210r77220J657004O77767k002098k815896p96005J957740K683221M51711
5149E794434k812299l899645j716316J437476K889599K843697L150198L908724
5141A1595868L367219P98095k381641m245990l788632j223806J792298K966512
5133H879923J826312M76738M69750L64380j499423l383760k388059N87126J635114
5124F968101l48173k048169p58802J893551K635584Q06725j549818k459741j675881
5115C463377m13690j49402j164793k243890k362420k013686j783023o15213K604787
5106d677953O346153P496024N089926J158201j975826l370091k732948l19466
5098G014020K169110K620588J003619o50417r63405m73673j62193k41738n34167
$$ plain form
5158 4958210 3980990 5637994 6315761 4313663 1497767 701762 2659502 5342723 5794434
5149 5794434 2982135 -917510 -2633826 -1196350 1693249 4536946 7687144 11595868
5141 11595868 14963087 15761182 13379541 9133551 5344919 4121113 5913411 8879923
5133 8879923 10706235 11182973 11652723 12017103 10517680 7133920 4745861 5332987 6968101
5124 6968101 6619928 4571759 3812957 5706508 8342092 9148817 7598999 5139258 3463377
5115 3463377 3049687 2900285 1735492 -508398 -2870818 -4884504 -6667527 -7282740 -4677953
5106 -4677953 1668200 9164224 14254150 15412351 13436525 10066434 7333486 7014020
5098 7014020 9183130 11803718 12807337 12156920 11193515 10719842 10557649 10315911 9781744
5089I781744p71113n59398o2560j73669r14382p33434J049832K398246J220593
5080A1235859j342207k672393k489243k146507j322698J187754M038253M328688
5072A0817506K020998k8285n76025j170465k548462l328476k962340k679132k619672
5063c074353j255381J216829K030670k7816k269105j633946J306819L384758K584473
5054B262948j23585j719406J66493M348669O497427M024523n22433k999063l009857
5045H925716k795315k524559p93528J222548P21448j872801l437728l356223l549248
5036g459690l453953k96416N025240P776130O321625L991112K691401K89522l650955
5027A1234016n310825k774445L98694J026722R44124K328267L082290R91937j508786
$$ plain form
5089 9781744 9010631 8451233 8388673 8215004 7300622 6567188 7617020 10015266 11235859
5080 11235859 9893652 7221259 4732016 2585509 1262811 2450565 6488818 10817506
5072 10817506 12838504 12810219 12234194 11063729 8515267 5186791 2224451 -454681 -3074353
5063 -3074353 -4329734 -3112905 -1082235 -1110051 -3379156 -5013102 -3706283 -321525 2262948
5054 2262948 2139363 419957 586450 4935119 11432546 15457069 14934636 11935573 8925716
5045 8925716 6130401 3605842 2812314 4034862 4756310 2883509 -554219 -3910442 -7459690
5036 -7459690 -10913643 -11210059 -6184819 1591311 7912936 11904048 14595449 14884971 11234016
5027 11234016 5923191 3148746 3547440 4574162 5518286 7846553 10928843 11920780 10411994
5018A0411994j052522J365931K745955K802789K654339J705983m18195j543543
5010A8672731k75897P95301j130411m318614n042826k889449k75935J433759K293244
5001I261903K059004R20575L36153R20491J305997P21118K00576k18010k189659
4992A3318148n189525n771755k936834k28385j1372q3350J128900R79419j878548
4983f73302l307013j4841M074299L283209j252127l935355k948599q21149R68145
4974d626733K695432L341925J653350q51581j709413r62341J51976J615388K840729
4965D148732J625531j794604l191941n13567K257811J434935m46781K52445J610368
4956E382929J79662k200030j637051R86053K203885J925582J720087N74108j995722
$$ plain form
5018 10411994 9359472 10725403 13471358 16274147 18928486 20634469 20216274 18672731
5010 18672731 18396834 19192135 18061724 13743110 8700284 5810835 5534900 6968659 9261903
5001 9261903 11320907 12241482 12577635 13498126 14804123 15525241 15725817 15507807 13318148
4992 13318148 8128623 2356868 -579966 -808351 -819723 -903073 225827 1205246 -673302
4983 -673302 -3980315 -3995156 79143 3362352 2110225 -1825130 -4773729 -5594878 -4626733
4974 -4626733 -1931301 1410624 3063974 2212393 502980 -459361 -307385 1308003 4148732
4965 4148732 5774263 3979659 787718 274151 2531962 3966897 3520116 3772561 5382929
4956 5382929 5562591 3362561 1725510 2711563 4915448 6841030 8561117 9135225 7139503
4947G139503k387550J388546M388868J854753k222063j104835L588356M814460
4939A7460038J387047j828992k888764l854170m426353k216466J583781L509993
4931H726114L436418K996478J118154k541978l392794J451678O127329L792977
4923B1714376k331825m453368k724288k505686k976212M38564N039434L892535
4915A6093530j613900l451892j61399K360515K137667K441474K973503M64487
4907B1243985k994132k623353l37381j175453l081215j151514J652913R1669j613729
4898A0011790K864364Q007388N131106m94397J478114O164866J860669o473892
4890B8550008m563881M501137N509534k27097J673829R166222P523366Q46275
$$ plain form
4947 7139503 4751953 6140499 10529367 12384120 10162057 9057222 12645578 17460038
4939 17460038 18847085 17018093 14129329 10275159 5848806 3632340 5216121 8726114
4931 8726114 12162532 15159010 16277164 13735186 10342392 11794070 17921399 21714376
4923 21714376 19382551 14929183 12204895 9699209 6722997 7161561 12200995 16093530
4915 16093530 14479630 11027738 10866339 13226854 15364521 17805995 20779498 21243985
4907 21243985 18249853 15626500 15289119 14113666 11032451 9880937 11533850 11625519 10011790
4898 10011790 12876154 20883542 26014648 25520251 26998365 33163231 35023900 28550008
4890 28550008 23986127 28487264 33996798 33769701 35443530 44609752 52133118 52979393
4882E2979393O327361J7587687J2154322l026723J524354K0664202J8523510J517765
4874A28251871K0300649O8084928N1993992p1904342j96726941j84282036n1781811
4867b36063690N3176687N0683582O070598R73263K2711974K1506039J732993j541246
4859h0749800J0193467J0736752L93250j158151N383161N075121N10047M228105
4851d5388048J0974475O873659l480929n181052O46789K157911k99695J287022
4843c2409868L683183o02112n404535p24127P101437N451616j527848n78358O286298
4834a8724314O131820q97347k948432J154861J345948l269970l071381K924356
4826a7354459N010784J051888m02385K962631L466075r44423k706668M87771J192204
$$ plain form
4882 52979393 59306754 76894441 89048763 86022040 87546394 108210596 126734106 128251871
4874 128251871 148552520 216637448 268631440 196727098 157 -184281879 -236063690
4867 -236063690 -182887003 -132203421 -126132823 -125159560 -102447586 -80941547 -79208554 -80749800
4859 -80749800 -70556333 -59819581 -59426331 -60584482 -55201321 -50126200 -49616153 -45388048
4851 -45388048 -34413573 -27539914 -31020843 -36201895 -35555106 -33397195 -33696890 -32409868
4843 -32409868 -28726685 -29328797 -34733332 -35457459 -28356022 -22904406 -24432254 -25010612 -18724314
4834 -18724314 -12592494 -13489841 -16438273 -15283412 -13937464 -17207434 -20278815 -17354459
4826 -17354459 -12343675 -11291787 -11694172 -8731541 -5265466 -6209889 -8916557 -8428786 -7236582
4817g236582l517825o405848l120780Q44988O95908o19213o4818K43296p74292
4808a9955166l73161J509481J225212p00201Q01590N487195O489418J792284j740612
4799e463960N21403L929610K815431j290023m002627m619245m247636k490373
4791a4847420M32505K422905K935215L828056N281809N025454K679152N46320
4783H303996n43660j706884k261709n23118J766395J243053j017664j095960L90888
4774D555337r34733m894734o194289l000737P27626K434245L550119L871473Q40229
4765I54536l798143m163893M13162L368200R95825k449101k759669j728796j464489
4756a0632368J12639L552262M261755r3944m239618k845959J420791K869966J433477
$$ plain form
4817 -7236582 -10754407 -17160255 -20281035 -19436047 -18740139 -19359352 -19424170 -19180874 -19955166
4808 -19955166 -20328327 -18818846 -17593634 -18293835 -17492245 -12005050 -5515632 -3723348 -5463960
4799 -5463960 -4942557 -1012947 1802484 512461 -3490166 -8109411 -12357047 -14847420
4791 -14847420 -14414915 -11992010 -9056795 -5228739 53070 5078524 7757676 8303996
4783 8303996 7760336 6053452 3791743 3268625 5035020 6278073 5260409 4164449 4555337
4774 4555337 3620604 -1274130 -7468419 -10469156 -9741530 -7307285 -3757166 114307 954536
4765 954536 -2843607 -7007500 -6594338 -3226138 -2230313 -4679414 -7439083 -9167879 -10632368
4756 -10632368 -10519729 -6967467 -2705712 -2799656 -7039274 -9885233 -8464442 -5594476 -4160999
4747d160999P10002J078678N22741m15504J62067J389210J241365K88859m4981
4738G71438n53136j696453q95070L059005N665327K271375l881768n064071P9846
4729b43507M761626L692397o48059k946562j991340k84040K86817l12396j704418
4720F10518l340158l832473j912010J713329M475448M359463J820227r25821k130632
4711H37891j666845m10417O61438Q71357L65300K51775J044098J166752j028629
4702B092720l720748l015225J138949L824419K025092q32932l43014K146418K501849
4693E817528Q81130O92758K023671J563654j327509l578091l548510k543108j066851
4684a085328J615778L795323K209242k357521n055960l761406j341189K0325J748403
$$ plain form
4747 -4160999 -3450997 -2372319 -1849578 -2265082 -2103015 -713805 527560 816419 771438
4738 771438 218302 -1478151 -2373221 685784 6351111 8622486 4740718 -323353 -243507
4729 -243507 4518119 8210516 7562457 4615895 2624555 2340515 2627332 2314936 610518
4720 610518 -2729640 -6562113 -8474123 -6760794 -2285346 2074117 3894344 2968523 837891
4711 837891 -828954 -1239371 -577933 293424 658724 910499 1954597 3121349 2092720
4702 2092720 -1628028 -4643253 -3504304 320115 2345207 1512275 1169261 3315679 5817528
4693 5817528 6698658 7391416 9415087 10978741 9651232 6073141 2524631 -18477 -1085328
4684 -1085328 530450 4325773 6535015 4177494 -878466 -4639872 -5981061 -5960736 -4212333
4675d212333M230141M318196N53241l206229k805159N79511K884684K626211J046021
4666F014284q96586k730306l247402j665286Q32154K352844K317759J417429O54243
4657E049133P93173J468321R95789j289983l235747k676176r85166p72550j184106
4648a837312N47175L696044M856851L847899L683979M426129K605014k174583
4640A9651196n566292n094651l276068k363978j216698N49348O63334j007420
4632B338771r98599J610598K759885J57052k733384k831662k302468l372159l518157
4623h890123m89501K574258K137466L44261R62151K844936K610778O80105l96827
4614B377504p35286j418070r62773J643430L357622J543328r88502o32397N05001
$$ plain form
4675 -4212333 17808 4336004 4889245 1683016 -1122143 -542632 2342052 4968263 6014284
4666 6014284 5117698 2387392 -860010 -2525296 -1693142 659702 2977461 4394890 5049133
4657 5049133 5842306 7310627 8306416 7016433 3780686 1104510 119344 -653206 -1837312
4648 -1837312 -1290137 2405907 7262758 11110657 14794636 19220765 21825779 19651196
4640 19651196 14084904 8990253 5714185 3350207 2133509 2682857 3346191 2338771
4632 2338771 1340172 2950770 5710655 5867707 3134323 302661 -1999807 -5371966 -8890123
4623 -8890123 -9379624 -6805366 -4667900 -4323639 -3361488 -516552 2094226 2774331 2377504
4614 2377504 1642218 224148 -738625 904805 4262427 5805755 4817253 4184856 4689857
4605D689857j322981l919132k502657J402163J776855k042006m520201l019072
4597i457174q36035k99354N16610K341526K119948j173785l130605l0184N029228
4588d919825N872298J256868m048980n462497l312622j059002m97592k43424J068503
4579a1346273K059833J017162m07754O67075K965388K245505j435367k812810
4571g047241K26352K856636J259343j060393L59562L175465K772219N32354Q22822
4562C897119K670243J655786j645839k357119K23683J595185m13045l105956m129083
4553a609026l682784j596915K190299M338523J262602m137335m984811l32648
4545h552095L583240L014020J186646J250353J134433j391514l868142l171911
$$ plain form
4605 4689857 3366876 -552256 -3054913 -1652750 124105 -1917901 -6438102 -9457174
4597 -9457174 -10293209 -10592563 -10075953 -7734427 -5614479 -6788264 -9918869 -9949053 -4919825
4588 -4919825 952473 2209341 -1839639 -7302136 -10614758 -11673760 -12171352 -12414776 -11346273
4579 -11346273 -9286440 -8269278 -8677032 -8009957 -5044569 -2799064 -4234431 -7047241
4571 -7047241 -6820889 -3964253 -2704910 -3765303 -3405741 -230276 2541943 3074297 3897119
4562 3897119 6567362 8223148 6577309 4220190 4443873 6039058 5626013 2520057 -1609026
4553 -1609026 -5291810 -6888725 -4698426 -359903 902699 -3234636 -8219447 -8552095
4545 -8552095 -4968855 -1954835 -768189 482164 1616597 225083 -3643059 -6814970
4537f814970n85172N43399n51232k186678k579543m98419L770946P073600N998513
4528D170444J619710j628358k151862k252671k638420r86237K561417L715571
4520B409594M62537l286523l351119p51802J262223K038309K459793K290115J477452
4511E010579J385821K286488K299763Q09684j78415k6481j157200m321991n991432
4502A16816l611312q174R75973K04917Q23869K673414L081598J396823q92106
4493D761818l040073m750973m506930j549284J611399J847798j97854j132685
4485f956784M84164K871782L752922K265639r94119l965800m194642j645813P66047
4476g616604R67967K63551L35055J15381j597551k575489P4032M650588O177457
$$ plain form
4537 -6814970 -7400142 -6856743 -7407975 -9594653 -12174196 -12672615 -8901669 -1828069 4170444
4528 4170444 5790154 4161796 2009934 -242737 -2881157 -3867394 -1305977 2409594
4520 2409594 2872131 -414392 -3765511 -4517313 -3255090 -1216781 1243012 3533127 5010579
4511 5010579 6396400 8682888 10982651 11792335 11613920 11587439 10430239 6108248 116816
4502 116816 -3494496 -3502670 -2526697 -2321780 -1497911 1175503 4257101 5653924 4761818
4493 4761818 1721745 -3029228 -7536158 -9085442 -7474043 -5626245 -5824099 -6956784
4485 -6956784 -6472620 -3600838 152084 2417723 1423604 -2542196 -6736838 -8382651 -7616604
4476 -7616604 -6648637 -6385086 -6050031 -5934650 -7532201 -10107690 -10033658 -5383070 794387
4467G94387K979280j246100k402083m33149J869095K314951O76606j764246l045312
4458b56571j930125O79670K296431J393333q76790j932474p00139J125740J209017
4449A008092l39856j139586n5944J071508K74468j627748k586676k168129q36417
4440f400288J699440M702418N015590J194212k675117j849536J639889J801187
4432E127795j772582l488374j256171N85579l47971l54795K755807M740194K327750
4423H317232m61587Q37574L062227P90588m154855n706669l384895j843479k108896
4414d652760o50829K930051M306863J777702p64132k24579J259920P29423p26747
4405C984912l38893J756377K971547J938286j55325j288988p62978J02134m79854
$$ plain form
4467 794387 3773667 2527567 125484 -307665 1561430 3876381 4552987 2788741 -256571
4458 -256571 -2186696 -1507026 789405 2182738 1305948 -626526 -1326665 -200925 1008092
4449 1008092 668236 -471350 -527294 544214 818682 -809066 -3395742 -5563871 -6400288
4440 -6400288 -4700848 1570 5017160 6211372 3536255 1686719 3326608 5127795
4432 5127795 3355213 -133161 -1389332 -803753 -1151724 -1506519 1249288 5989482 8317232
4423 8317232 7855645 8693219 11755446 12546034 8391179 2684510 -700385 -2543864 -4652760
4414 -4652760 -5303589 -2373538 1933325 3711027 2946895 2722316 3982236 4711659 3984912
4405 3984912 3646019 5402396 8373943 10312229 10156904 8867916 8104938 8207072 7727218
4396G727218k184940k654786j030219L21755o71406k389904k074357q1327J369349
4387a668617K180472L539887M201500J834172k051968k903704J85584K496614
4379G813940J74267m453067o312553m104792r57234J34006p79858j865188j867809
4370a2218288q12340O52455J822978J995997P95843r18081j163156Q45141K885162
4361f114289K108686p54253j875302M34111L501519M378711L494751K636119J904928
4352I714981P82859j35613p16115k256992m509575m310563k15245L860817L178664
4343E393218j421485n114054n372048l088246P02494M921538O629869L850799
4335F502085l21956r83275J441636J937186j094644l537196k375576q7403j18105
$$ plain form
4396 7727218 5542278 2887492 1857273 2179028 1507622 -882282 -2956639 -3037966 -1668617
4387 -1668617 511855 4051742 8253242 10087414 8035446 5131742 5317326 7813940
4379 7813940 7988207 3535140 -2777413 -6882205 -7839439 -7705433 -8485291 -10350479 -12218288
4370 -12218288 -13030628 -12378173 -10555195 -8559198 -7763355 -8681436 -9844592 -8999451 -6114289
4361 -6114289 -4005603 -4759856 -6635158 -6201047 -2699528 1679183 5173934 7810053 9714981
4352 9714981 10497840 10362227 9646112 7389120 2879545 -1431018 -1646263 2214554 5393218
4343 5393218 3971733 -1142321 -6514369 -9602615 -8900121 -3978583 2651286 6502085
4335 6502085 6180129 5196854 6638490 8575676 7481032 3943836 1568260 1480857 1362752
4326A362752j810413k421153j377778N559J073643J866141J950733R71853n03080
4317A118257j732165k521750k650689j702957J0018J417791J962110J987918J767630
4308c43837J071524k47390j853811k784043j538711K227026N566241M268744j312227
4299E053516n202747l287153Q38875J234920j552962k038072J075941L068895
4291h08787J010272j939866j832150P13144K679118K892585J856224m1377j969241
4282B559922k247140l82743J832418K501029J607259N9531j680994l098723l119436
4273a968877j150307J976957M425360M404524J519863k078582l009215m42670
4265C677053K608787L164274J816733P32190K32423k86796k56583M07467j44057
$$ plain form
4326 1362752 -447661 -2868814 -4246592 -4241033 -3167390 -1301249 649484 1621337 1118257
4317 1118257 -613908 -3135658 -5786347 -7489304 -7479286 -6061495 -4099385 -2111467 -343837
4308 -343837 727687 480297 -1373514 -4157557 -5696268 -3469242 2096999 6365743 5053516
4299 5053516 -149231 -3436384 -2597509 -1362589 -2915551 -4953623 -3877682 -808787
4291 -808787 201485 -1738381 -3570531 -2857387 -178269 2714316 4570540 4529163 2559922
4282 2559922 312782 -69961 1762457 4263486 5870745 5930276 4249282 1150559 -1968877
4273 -1968877 -3119184 -1142227 3283133 7687657 9207520 7128938 4119723 3677053
4265 3677053 6285840 9450114 11266847 11999037 12231460 11944664 11688081 12095548 11951491
4256A1951491k278124k678006M53446K839170q7438n279084o023838k042236J100884
4247b043735J579238K742886M933164L939359o96911l479087j800500q561j346508
4238C819345k573119p72000P35317j549250m493926l276525P60084K813153K268189
4229b268732K197049L218478L020355J017767r09729j979693l321849n283297
4221d309651o486879n649986k875107M92093K596082K760543K793051M851034
4213e828820P806453Q147344M853140N92054k346915m128608m862504l704684
4205E27460j522542q63877k057086k778612k403079k896339m369841m049637j128551
4196b1542104J567190K248486K284348K382708J319364j12263J034682M298016
$$ plain form
4256 11951491 9673367 6995361 7448807 10287977 10200539 4921455 -1102383 -3144619 -2043735
4247 -2043735 -464497 2278389 7211553 11150912 10454001 6974914 5174414 5165853 3819345
4238 3819345 1246226 474226 1209543 -339707 -4833633 -8110158 -7350074 -4536921 -2268732
4229 -2268732 -71683 3146795 6167150 7184917 6275188 4295495 973646 -4309651
4221 -4309651 -10796530 -16446516 -19321623 -18829530 -16233448 -13472905 -10679854 -5828820
4213 -5828820 1977633 10124977 14978117 15570171 13223256 9094648 4232144 527460
4205 527460 -995082 -1858959 -3916045 -6694657 -9097736 -11994075 -16363916 -20413553 -21542104
4196 -21542104 -19974914 -17726428 -15442080 -13059372 -11740008 -11852271 -10817589 -6519573
4188f519573N346050K973108J027948J315387O77222k167606l247343l15472K817348
4179A907069K731860J426855J155782J79880k358785l375752j812825j500629
4171a646545l848830m304993p02015J937953J94581j417449J202843M349477L859891
4162c75087K493026L104660K049892l036518o489213l786436R7337j40039p83512
4153f865890K058185L251109j345926m962846j693971J474826k470960o013320
4145a6568793p41401N077465O57230o039113k387636L651073k404977j1513344
4137c0269496o171536Q24011j8371637n0290194m3367727J5772290P0119200O4649417
4129B894328J8458169r837543l645171N346510j967513r045632j952007P296777
$$ plain form
4188 -6519573 -1173523 1799585 2827533 4142920 4820142 2652536 -594807 -910279 1907069
4179 1907069 4638929 6065784 7221566 7401446 5042661 1666909 -145916 -1646545
4171 -1646545 -5495375 -9800368 -10502383 -8564430 -8369849 -9787298 -8584455 -4234978 -375087
4162 -375087 2117939 5222599 7272491 4235973 -2253240 -6039676 -5942339 -6082378 -6865890
4153 -6865890 -4807705 -1556596 -2902522 -7865368 -9559339 -8084513 -10555473 -16568793
4145 -16568793 -17310194 -12232729 -11575499 -17614612 -20002248 -16351175 -18756152 -30269496
4137 -30269496 -36441032 -35617021 -53988658 -104278852 -147646579 -131874289 -61755089 2894328
4129 2894328 21352497 11514954 7869783 13216293 11248780 2203148 251141 7547918
4121G547918N713064j39799n96006P52615j576449l393885q90604P61157k239348
4112E938663m461367j527842J687556L17181k034204q31673J465280J349817Q06750
4103B710161K021955K392666L89329j56605K832481M524315Q96094m063938m818694
4094F727764k990538l524117o152441o684082l953421k37415L022832N443691
4086h347727N679026L190100M02858j31181Q79516J353604R89714L25071q33100
4077C507881j806862o70622K185432L133844N52751k147603j700827R417l13938
4068B749473j573799n22332K221848K972340Q68584j230650j598482j676191k731713
4059e20922l510769k387349K512J483700J044948J57370J108784L737085M700862
$$ plain form
4121 7547918 13260982 13121183 12525177 13277792 11701343 8307458 7416854 8178011 5938663
4112 5938663 1477296 -50546 1637010 1954191 -80013 -911686 553594 1903411 2710161
4103 2710161 4732116 7124782 7514111 7357506 10189987 14714302 15610396 11546458 6727764
4094 6727764 3737226 213109 -5939332 -12623414 -16576835 -16814250 -13791418 -8347727
4086 -8347727 -2668701 521399 924257 793076 1672592 3026196 4015910 4340981 3507881
4077 3507881 1701019 1030397 3215829 6349673 6902424 4754821 3053994 3063411 2749473
4068 2749473 1175674 653342 2875190 5847530 6716114 5485464 3886982 2210791 -520922
4059 -520922 -4031691 -6419040 -6416528 -4932828 -3887880 -3730510 -2621726 1115359 5816221
4050E816221J668678k500979k808408N02153J663773j841299m662875j389292
4042c552028M667944N821615J272995k025353K2264L057748J545593l048610n074266
4033B687902k827943K60137J356109J154597R04388J4366j921056l196405k217927
4024c785832l01775q9238j747741k809497j739860L09249J689455K289131K525454
4015c660654K062451R25160N77788K166532M348242M480927J816854j665106l542425
4006G509769l261481k334177k703173m517139n438098l235244P84951K796411
3998a0398181J624405N20753K170669M521157M355571K777246L178408M935833
3990A3685861L811372r72462m556777l174360M79989J237857j543916l890831
$$ plain form
4050 5816221 7484899 4983920 2175512 2677665 4341438 2500139 -2162736 -3552028
4042 -3552028 1115916 6937531 8210526 6185173 6207437 9265185 10810778 7762168 2687902
4033 2687902 -140041 120096 1476205 2630802 3535190 3549556 1628500 -1567905 -3785832
4024 -3785832 -4087607 -4176845 -5924586 -8734083 -10473943 -10164694 -8475239 -6186108 -3660654
4015 -3660654 -1598203 -673043 -95255 2071277 6419519 10900446 12717300 11052194 7509769
4006 7509769 4248288 1914111 -789062 -5306201 -10744299 -13979543 -13194592 -10398181
3998 -10398181 -8773776 -8253023 -6082354 -1561197 2794374 5571620 8750028 13685861
3990 13685861 17497233 16524771 11967994 8793634 9273623 10511480 8967564 5076733
3982E076733l001633m39126N74968o95762j840095m05389K809165M207761J603678
3973G890300k862816n212482m331179k394273r95143O73951L178925M766521L527784
3964D241588K43072k552662l594810l558955l096902j671127J163781M105523
3956d720492M773195K430552o57516j657758o34666J133n16669k98994J302746
3947B1531J683486q59039l512169k795912j17548N23171q43699n40122J939224
3938d501077K641116m5054k166727l45892K878681L218058J136630L30335J557040
3929D703110J993817K23348j678605j591786l07528P4922p80987j195637J03754
3920A544408K119201K594801Q85744r58898p76547P40433J072424n07981k133052
$$ plain form
3982 5076733 2075100 1635974 2210942 1515180 -324915 -730304 2078861 6286622 7890300
3973 7890300 5027484 -184998 -4516177 -6910450 -7905593 -7231642 -4052717 713804 4241588
3964 4241588 4484660 1931998 -1662812 -5221767 -8318669 -9989796 -8826015 -4720492
3956 -4720492 52703 2483255 1825739 167981 -466685 -465552 -982221 -1281215 21531
3947 21531 1705017 845978 -2666191 -5462103 -5579651 -5056480 -5900179 -6440301 -4501077
3938 -4501077 -1859961 -1905015 -4071742 -4417634 -1538953 1679105 2815735 3146070 4703110
3929 4703110 6696927 6920275 5241670 3649884 3342356 3417278 2636291 1440654 1544408
3920 1544408 3663609 6258410 7144154 6185256 5408709 6149142 7221566 6713585 4580533
3911D580533k200132j163954j10049O58482J065287R31799O92005Q77600P01220
3902F032791r33440k859123k498310J86698K165258J551792l01959j764748k840303
3893a261344k860935K4962M708623O095831J690291l767242m378176j453814r01047
3884b102851l615809m181942K86433N311022N406475J485363j171820j61266J906663
3875C162268J755432n77920k485593k150383l99275O36235K56997p0436R92414
3866A119739K500716K375617J95378k353941l543899k920309q28018J867735L466677
3857A879695K429980o10157k984351k965501j779029j702205k742302k482799
3849a0956669N17288M179945M808794J506959k320158k596095Q76833M470791
$$ plain form
3911 4580533 2380401 1216447 1106398 1764880 2830167 3761966 4453971 5331571 6032791
3902 6032791 5099351 2240228 -258082 -71384 2093874 3645666 3343707 1578959 -1261344
3893 -1261344 -4122279 -4097317 611306 6707137 8397428 4630186 252010 -1201804 -2102851
3884 -2102851 -5718660 -9900602 -9614169 -4303147 1103328 2588691 1416871 1255605 3162268
3875 3162268 4917700 4339780 1854187 -296196 -695471 -59236 197761 127325 1119739
3866 1119739 3620455 5996072 6191450 3837509 293610 -2626699 -3454717 -1586982 1879695
3857 1879695 4309675 3699518 715167 -2250334 -4029363 -5731568 -8473870 -10956669
3849 -10956669 -10439381 -6259436 -1450642 56317 -2263841 -4859936 -3983103 487688
3841D87688M995057K653282k56212k084620k610283k260667j598738j079755o45390
3832b399638J34585J327886K577648L681204M326572L486494N76512k702486l522260
3823G486517j492130P00434Q77749l17661j463602k328717k446001l23315L621783
3814D315057N526340K453548l055396n747035m053448r08871R25209J162296J22241
3805G39941j935812l364101k303089L7230L85034j436785j644072J695346N166336
3796b659972M712465J303458r97646q49768l09817o25374o93041J10371M61384
3787D52060n01057j333541k40133K254731L808892K968899O08568j104837q50348
3778F063234M78285N74679j576564m060474m198651k273954j359609k788828l806976
$$ plain form
3841 487688 5482745 8136027 7879815 5795195 3184912 924245 -674493 -1754248 -2399638
3832 -2399638 -2265053 -937167 1640481 5321685 9648257 13134751 13711263 11008777 7486517
3823 7486517 5994387 6694821 7572570 7254909 5791307 3462590 1016589 693274 4315057
3814 4315057 9841397 12294945 9239549 3492514 -560934 -1469805 -544596 617700 739941
3805 739941 -1195871 -4559972 -6863061 -6825831 -6440797 -7877582 -9521654 -7826308 -2659972
3796 -2659972 2052493 3355951 2358305 1508537 1198720 573346 -119695 -9324 452060
3787 452060 -48997 -1382538 -1622671 632060 4440952 7409851 8018419 6913582 6063234
3778 6063234 6541519 7116198 5539634 1479160 -2719491 -4993445 -6353054 -9141882 -12948858
3769a2948858j447924K881504N225384M546749L295366K677964R62302k427072
3761B765415m647081l541832j174594m15773l79149J296793L480292L010849K42651
3752F37571j216565k81222L86911m52682n47866J299588K670771J717104M24320
3743D637930J062729K283497J581099p26725k742012m063446m843596l811411
3735f621935k66190L574290N104464M669180L655579J314279k960798o024599
3727B444270m171634P79949L156904J309335o05892M57814K108591J039393j723201
3718D795529k822992j514385J15066O15123N81776J062548K113008K841959K161124
3709I948756k05341l091718m725761m344811k523668j92133J806432K561462J770356
$$ plain form
3769 -12948858 -14396782 -11515278 -6289894 -1743145 1552221 4230185 5192487 2765415
3761 2765415 -1881666 -5423498 -6598092 -7013865 -7393014 -6096221 -2615929 394920 637571
3752 637571 -578994 -860216 -473305 -925987 -1473853 -174265 2496506 4213610 4637930
3743 4637930 5700659 7984156 9565255 8838530 6096518 2033072 -2810524 -6621935
3735 -6621935 -6888125 -3313835 1790629 6459809 10115388 11429667 8468869 2444270
3727 2444270 -1727364 -947415 2209489 3518824 2912932 3370746 5479337 6518730 4795529
3718 4795529 1972537 458152 573218 1188341 1770117 2832665 4945673 7787632 9948756
3709 9948756 9743415 6651697 1925936 -2418875 -4942543 -5134676 -3328244 -766782 1003574
3700A003574M87986M9353L58332L31206k93363q54572j080695j096722n96400
3691a691301M13024O27114q54563k369318j578758P40617J487467K2338p55204
3682c958584R68425K977337K336071m54128k471342k148807l57725J308113J883224
3673H2584J290184L02890k01088m27495j278037k421144k027936P24147L914900
3664d0995M676724K232813j456014l621394k975043o74122P37399j76482k305906
3655c603020l424832k535482j50863K771434M926555M747037K188540l82358r73635
3646C563376o12236r72212q90220J306311L265188J231055k903731k868859K106076
3637C224748M615297k06199o565356n928708O82026M743207K775043m3717P54092
$$ plain form
3700 1003574 1491560 1540913 1899245 2230451 1937088 1082516 1821 -1094901 -1691301
3691 -1691301 -1278277 -651163 -1505726 -3875044 -5453802 -4713185 -3225718 -3203380 -3958584
3682 -3958584 -2990159 -12822 2323249 1869121 -602221 -2751028 -3108753 -1800640 82584
3673 82584 1372768 1675658 1474570 1047075 -230962 -2652106 -4680042 -3955895 -40995
3664 -40995 4635729 6868542 5412528 1791134 -1183909 -1858031 -1120632 -1297114 -3603020
3655 -3603020 -7027852 -9563334 -9714197 -6942763 -2016208 2730829 4919369 4537011 3563376
3646 3563376 2951140 1978928 1088708 2395019 5660207 6891262 3987531 1118672 3224748
3637 3224748 7840045 7633846 1068490 -4860218 -4178192 565015 3340058 3296341 4050433
3628D050433K368995L05427m104383n734668l050206K26461M25957j803543l170797
3619a0486324k088200j26459O50665O77381K074753M961422O304699L736389p01090
3610E003236k669399j010209J134157J001432l06432k74594J006448J386423K37211
3601E508273r52214j529301k696307m538800m324446o9259N394832O797148L002125
3592F592051j398898j939432N95853K300281J334092r72720k637070k472574k09981
3583A191602K625220L005963p3451l330359l023904j21565J363560M00722m09459
3574A628329o7855p77367l242913m450446k300369P50863J200098p80491k557379
3565a0597530k908167k221052n34937K054803M106325M136262K507803N18715
$$ plain form
3628 4050433 6419428 6724855 2620472 -3114196 -6164402 -5937941 -5511984 -7315527 -10486324
3619 -10486324 -12574524 -12700983 -12050318 -11372937 -9298184 -4336762 1967937 5704326 5003236
3610 5003236 2333837 1323628 2457785 3459217 3152785 2878191 3884639 5271062 5508273
3601 5508273 4556059 3026758 330451 -4208349 -8532795 -8602054 -3207222 3589926 6592051
3592 6592051 5193153 3253721 3849574 6149855 7483947 6511227 3874157 1401583 1191602
3583 1191602 3816822 6822785 6749334 3418975 395071 273506 1637066 2037788 1628329
3574 1628329 1560474 783107 -2459806 -6910252 -9210621 -8459758 -7259660 -8040151 -10597530
3565 -10597530 -13505697 -15726749 -16261686 -14206883 -10100558 -5964296 -3456493 -2937778
3557b937778j311209k631810k372026k66860J859488K124418J023570L35906N46302
3548c629999P97575N05570k46219j036640r63414N45710K096454J432179q96708
3539a395492j453362R98977L143528K106189l3366J58465J879570K015890P63428
3530H183827P30615J328488q99067n769486p970992m055933K480095N546289L670029
3521C243865N14325m20016P11158J555324P43344r17867j759329j146131J45600
3512B670273J166040J720692J928100J655473Q24357l28647j498238k107785j082213
3503D948052J781585M325965L879324Q63502j633099k244319k555933l272007
3495F093070k627987l26923N20797j867387m341199l205634L37279K579435K861112
$$ plain form
3557 -2937778 -4248987 -6880797 -9252823 -9519683 -7660195 -5535777 -4512207 -4176301 -3629999
3548 -3629999 -2832424 -2326854 -2573073 -3609713 -4573127 -4027417 -1930963 -498784 -1395492
3539 -1395492 -2848854 -1849877 1293651 3399840 3366474 3524939 5404509 7420399 8183827
3530 8183827 8914442 10242930 9343863 3574377 -4396615 -8452548 -5972453 -426164 3243865
3521 3243865 3758190 3338174 4049332 5604656 6348000 5430133 3670804 2524673 2670273
3512 2670273 3836313 5557005 7485105 9140578 9964935 9636288 8138050 6030265 4948052
3503 4948052 6729637 11055602 14934926 15798428 14165329 11921010 9365077 6093070
3495 6093070 3465083 3138160 3658957 1791570 -2549629 -5755263 -5417984 -2838549 22563
3486B2563L031888L303720K543019J222124L86981q28912l015016l670155q43022
3477B153190K161846O98203l723425n157971k004365J320483J662845P20992M59691
3468a708511p64j295358j818160n74601J124152J805334R35619j883842n439413
3459h855544n622887k35182N890246O224459K283254J182228L620465K811295
3451G298334k886662n638665p81530M826592L445112j763746l115660q09944n40576
3442C3255k731583k887149m87441P00331J78545R58144K544512J025619l192803
3433c858570m566398r25813L013133K691565n57772k841899k661931o38067K137343
3424h208409L758238K645984L24161r348J457854J136773j778069l230577o08487
$$ plain form
3486 22563 3054451 6358171 8901190 10123314 10510295 9681383 6666367 2996212 2153190
3477 2153190 4315036 5013239 1289814 -3868157 -5872522 -4552039 -2889194 -2168202 -1708511
3468 -1708511 -1709275 -3004633 -4822793 -5397394 -4273242 -2467908 -1532289 -3416131 -8855544
3459 -8855544 -14478431 -14713613 -8823367 -2598908 -315654 866574 4487039 7298334
3451 7298334 4411672 -1226993 -2008523 2818069 6263181 4499435 1383775 573831 33255
3442 33255 -2698328 -5585477 -6072918 -5372587 -5194042 -4235898 -1691386 -665767 -3858570
3433 -3858570 -8424968 -9350781 -6337648 -3646083 -4203855 -7045754 -9707685 -10345752 -8208409
3424 -8208409 -4450171 -1804187 -1480026 -1489374 -31520 1105253 -672816 -3903393 -4511880
3415d511880K657405K025655j312482k199272J154573M995564N201808K153652
3407A0165023l94529o5142J610300J500112j009209l399202l646388k626566j779323
3398C55076n20510J708757K743418M89901k673925k314392J415407L714321K237317
3389G155370p1580n65223q26702k485266l144402k76769L573801L752821L31580
3380G443630j998189n87539K019013K073847q23042l994517m807335k809927J98634
3371c285425J837705J436826M72784L17353N03512J49047j72217L58288P68637
3362B386510l27643j859195j293727J370743L082758J952906k09293p88850O0999
3353D375208L87147l31209q30534m01193J14522l12195j643401k898898k786060
$$ plain form
3415 -4511880 -1854475 171180 -1141302 -3340574 -2186001 2809563 8011371 10165023
3407 10165023 9770494 9705352 11315652 12815764 11806555 8407353 4760965 2134399 355076
3398 355076 -165434 1543323 4286741 4776642 2102717 -211675 1203732 4918053 7155370
3389 7155370 7083790 6518567 5691865 3206599 62197 -214572 3359229 7112050 7443630
3380 7443630 5445441 4857902 6876915 8950762 8127720 4133203 -674132 -3484059 -3285425
3371 -3285425 -1447720 -10894 461890 779243 1282755 1431802 1259585 1617873 2386510
3362 2386510 2058867 199672 -1094055 276688 3359446 5312352 5103059 4314209 4375208
3353 4375208 4762355 4431146 3600612 3199419 3313941 3001746 1358345 -1540553 -4326613
3344d326613n36334K939491N056727L919046O97332j432750q85462P77589J094526
3335G303552m32327k092097j929981K54436K400038J950316j074719l351368k026823
3326A001027J300232K487455N92623j057408j51180J422414J319870N59620R15719
3317H390372J140968p02986l024778k767430n74348K54903n47196L116K397421
3308D570042L212883P23099k203432k800482k363626k991252l464703j512664
3300f830135J863031L479553K415723Q52684Q84651K216258K844614J207820j915277
3291G018922l665337k431713m07859n86476j756770o7193M151046N627694J941825
3282I824139k429701k802406r89815j402951l708158m025254j429481J293394
$$ plain form
3344 -4326613 -4862947 -1923456 3133271 7052317 7749649 6316899 5431437 6209026 7303552
3335 7303552 6871225 4779128 2849147 3103583 5503621 7453937 6379218 3027850 1001027
3326 1001027 2301259 4788714 5381337 4323929 4172749 5595163 6915033 7474653 8390372
3317 8390372 9531340 8828354 5803576 3036146 2461798 2716701 2169505 2172621 4570042
3308 4570042 7782925 8506024 6302592 3502110 1138484 -1852768 -5317471 -6830135
3300 -6830135 -4967104 -1487551 928172 1780856 2665507 4881765 7726379 8934199 7018922
3291 7018922 3353585 921872 514013 -72463 -1829233 -1896426 2254620 7882314 9824139
3282 9824139 7394438 4592032 3602217 2199266 -1508892 -5534146 -6963627 -5670233
3274e670233K276410J958665O84800j367281k456469r15938J835952K837430J575412
3265G58748j59078j335024j790783o28312K223702M007082K153637j643418l722082
3256a35528l642315l462935l150672j009325K088595L340582K572947J974310
3248a424341J703892K05214j463478n46884J971351J896768j437962l796105k503565
3239e395110K70059J877101K351783J930461j01405k604669k888684j112993o8334
3230e741791K94840K859279O595693O022424K1511m945389m148837j404729k028386
3221b475385m232913l150899O51495K700201J934046R40547Q49025R71311J818313
3212E741L829299M675645K254850j120703j741502j34483M94786k84071o93934
$$ plain form
3274 -5670233 -3393823 -1435158 -750358 -2117639 -4574108 -5490046 -3654094 -816664 758748
3265 758748 599670 -735354 -2526137 -3154449 -930747 3076335 5229972 3586554 -135528
3256 -135528 -3777843 -7240778 -10391450 -11400775 -9312180 -5971598 -3398651 -1424341
3248 -1424341 279551 484765 -978713 -1525597 445754 2342522 904560 -2891545 -5395110
3239 -5395110 -5125051 -3247950 -896167 1034294 932889 -1671780 -4560464 -5673457 -5741791
3230 -5741791 -5446951 -2587672 4008021 10030445 10051956 5106567 957730 -446999 -2475385
3221 -2475385 -6708298 -9859197 -9207702 -6507501 -4573455 -3632908 -2783883 -1812572 5741
3212 5741 3835040 8510685 10765535 9644832 7903330 7768847 8263633 7979562 7285628
3203G285628j101692k928642m466256k853830N00347J498500j2703j76883K262901
3194G370M178092L393510J312674m60265j918289k453874j053057O25035l92598
3185C238598l138036l247210N6157K137074n747l278085l619422j667796k52445
3176i776912M54102J812350L183412L016787J940607J721067K192460J822194
3168F366067M95987n40886q31521q20568n19282R9303R3307j151716k200770j158090
3158a68169J274942K353336J074126n09015m33922L98308n3602j533642j672234
3149G30128L38968K086907J059932j797485l335778k380875o25023N74618J852538
3140a496070L513321L940417J963483q86605k207520j522276J46180J942851K892128
$$ plain form
3203 7285628 6183936 3255294 -1210962 -4064792 -3564445 -2065945 -2078648 -2255531 7370
3194 7370 4185462 7578972 8891646 8431381 6513092 4059218 3006161 3631196 3238598
3185 3238598 100562 -3146648 -3090491 -953417 -959164 -4237249 -7856671 -9524467 -9776912
3176 -9776912 -9322810 -7510460 -4327048 -1310261 630346 2351413 4543873 6366067
3168 6366067 6862054 6321168 5489647 4669079 4149797 4249100 4342407 3190691 989921 -168169
3158 -168169 1106773 3460109 4534235 4025220 3591298 3989606 3936004 2402362 730128
3149 730128 1069096 3156003 4215935 2418450 -917328 -3298203 -3923226 -3348608 -1496070
3140 -1496070 2017251 5957668 7921151 7034546 4827026 3304750 3450930 5393781 8285909
3131H285909J714557j156623l039904k445279j195067j025335n08544J684110
3123B313824K995382N37972l439588m298525k015458m70057m68570R46219L989392
3114I0591M759304J801906j278711j805421j645820k390751j843866J326913L771902
3105B786047K309022q22275j651887n83886o08196j771769j887391j112977j316547
3096d659859j779120K2663L382877M209774P95979l412804m122533j154726K069515
3087d648234K634350P24890j238146j433580m69993j27342p35100j127269j027488
3078g447912j359620j776550m39341K660363M768612M223113K545580J024286
3070D198531j532124n104260o031394k110051K713994L349838J143875J276603
$$ plain form
3131 8285909 10000466 8843843 5803939 3358660 2163593 1138258 629714 2313824
3123 2313824 5309206 5847178 2407590 -1890935 -3906393 -4376450 -4845020 -3898801 90591
3114 90591 4849895 6651801 5373090 3567669 1921849 -468902 -2312768 -985855 2786047
3105 2786047 5095069 4272794 2620907 2037021 1428825 -342944 -2230335 -3343312 -4659859
3096 -4659859 -6438979 -6416316 -3033439 1176335 1972314 -1440490 -5563023 -6717749 -4648234
3087 -4648234 -2013884 -1288994 -2527140 -3960720 -4430713 -4558055 -5293155 -6420424 -7447912
3078 -7447912 -8807532 -10584082 -11023423 -8363060 -3594448 628665 3174245 4198531
3070 4198531 2666407 -2437853 -8469247 -10579298 -7865304 -4515466 -3371591 -2094988
3062b094988L933409M021961r7015l462436j900659K179687L854060J954520j166083
3053G222456l228294l051222m58330K584290K828834j54555k628614j447164J649939
3044C317340K636275N31186k115807k920740j689398M51736J986802J589176n75774
3035C210796k486695k435854j010989J22340M81355M92233m5021j448299k630762
3026e750896j870820Q74651L698809M790283L831890J671234l51340j009241j83172
3017E701398Q53635Q75581N8834p64115j422975j993841j985266j307885j144520
3008a129154k095612k334705J049L055490K893371o97880l244077j808217Q99351
2999d460384J068034j94347R38629M133328M558413j097n394490o312552k744459
$$ plain form
3062 -2094988 1838421 5860382 5763367 2300931 400272 2579959 6434019 8388539 7222456
3053 7222456 3994162 942940 484610 3068900 5897734 5743179 3114565 1667401 3317340
3044 3317340 5953615 6484801 4368994 1448254 -241144 210592 2197394 3786570 3210796
3035 3210796 724101 -1711753 -2722742 -2600402 -2119047 -1626814 -1671835 -3120134 -5750896
3026 -5750896 -7621716 -6747065 -3048256 1742027 5573917 7245151 6893811 5884570 5701398
3017 5701398 6555033 7430614 7489448 6725333 5302358 3308517 1323251 15366 -1129154
3008 -1129154 -3224766 -5559471 -5558422 -2502932 390439 -307441 -3551518 -5359735 -4460384
2999 -4460384 -3392350 -3586697 -2648068 1485260 6043673 6042576 648086 -5664466 -8408925
2990h408925R47338J767406N67115m15042k33170O60198J419604J464092Q92477
2981a338907L91783L46441L67356J21814p9133j94807r99078k594301l328581
2972g307413j779292Q51562K152469J873385J795069K399027K133477M58139r18990
2963A657433r65570j115419k404787k870139k59747L828731N182530K213574k130617
2954C135989l936986k219804R86490K962565K313429j10252j715866n41183K273223
2945C147605L145969q6204n386917q277796o306411j332774K612394L282239J779786
2936g422109O13571J004762K323126L336104L233179J938736L72350N0086J334372
2927F784177K347390R61445k164398l993288k765222J75058K431411K850860J447398
$$ plain form
2990 -8408925 -7461587 -5694181 -5127066 -5542108 -5775278 -5115080 -3695476 -2231384 -1338907
2981 -1338907 -947124 -600683 -233327 -111513 -190646 -385453 -1384531 -3978832 -7307413
2972 -7307413 -9086705 -8235143 -6082674 -4209289 -2414220 -15193 2118284 2576423 1657433
2963 1657433 691863 -423556 -2828343 -5698482 -5958229 -2129498 3053032 5266606 3135989
2954 3135989 -800997 -3020801 -2034311 928254 3241683 3131431 1415565 874382 3147605
2945 3147605 6293574 6207370 820453 -7457343 -13763754 -15096528 -12484134 -9201895 -7422109
2936 -7422109 -6808538 -5803776 -3480650 -144546 3088633 5027369 5399719 5449805 6784177
2927 6784177 9131567 10093012 7928614 3935326 1170104 1345162 3776573 6627433 8074831
2918H074831j061974k900371k317135q2666R18307k80084j149825L19857K218822
2909C739762J631548p76676j825487l94729J736835K883853K707868J112591j419680
2900I395885k793574j392204R32567Q05509j608729k449433L28664M101297N235979
2891A2555961L151475l52094l475224m876159l925787j966046j488436k740068
2883c116378k974384m15110K958553M147378K799869M57465j917497l566519k985395
2874d612018n6321K289391J600496J44696K113066O772136Q300044L642820k875162
2865A7319148n037324k369950M80949M32147j205909k193542k377721k244807
2857B802991j031375J732876M147084L552229n2334l829107n361523m734433l250854
$$ plain form
2918 8074831 7012857 4112486 1795351 1712685 2630992 2350908 1201083 1520940 3739762
2909 3739762 5371310 4594634 2769147 2374418 4111253 6995106 9702974 10815565 9395885
2900 9395885 6602311 5210107 6142674 6948183 5339454 2890021 3218685 7319982 12555961
2891 12555961 15707436 15355342 11880118 7003959 3078172 1112126 -376310 -3116378
2883 -3116378 -6090762 -6505872 -3547319 600059 3399928 3857393 1939896 -1626623 -4612018
2874 -4612018 -4668339 -2378948 -778452 -633756 1479310 8251446 16551490 20194310 17319148
2865 17319148 12281824 9911874 10392823 10824970 9619061 7425519 5047798 2802991
2857 2802991 1771616 3504492 7651576 11203805 11151471 7322364 1960841 -2773592 -6024446
2848f024446j548297L18488J918590K468721J592365j48304j241735k38026K289351
2839f13293L369649Q93105l007874m049225j499671R00514O90847K79253K547851
2830d88844N558909N076605J002184k291925j871254N19388J523897K04959j600417
2821G633502j568116O54936K588659J408522j933585l103507m97479J807112Q1622
2812G071666l058783l045137j108200j729233l907032k220048L081949M769548
2804a45270j62056n111692l680133J268443L339366K247552J841834K349702J015151
2795B962897j711870k638200j430868o09236o67791J17184J560307J663095N44419
2786b10063K62809J008551J216501R72738J471450J644407n37465l695327m193464
$$ plain form
2848 -6024446 -7572743 -7254255 -5335665 -2866944 -1274579 -1422883 -2664618 -2902644 -613293
2839 -613293 2756356 3649461 641587 -3407638 -4907309 -4006795 -3315948 -3036695 -488844
2830 -488844 5070065 10146670 11148854 8856929 6985675 7505063 9028960 9233919 7633502
2821 7633502 6065386 6720322 9308981 10717503 8783918 5680411 5182932 6990044 7071666
2812 7071666 4012883 967746 -140454 -1869687 -5776719 -7996767 -4914818 -145270
2804 -145270 -307326 -5419018 -9099151 -7830708 -4491342 -2243790 -401956 1947746 2962897
2795 2962897 1251027 -1387173 -2818041 -3427277 -4095068 -3977884 -2417577 -754482 -210063
2786 -210063 52746 1061297 2277798 3250536 4721986 6366393 5828928 2133601 -2059863
2777b059863j685741N33534P35141J88956n62320k290365l576705j556072K821617
2768g451818M903896K992914L58570p08988j846454l650445l080593R70562M221621
2759c290735L075128K98506M51021K884847L709325K106153K07282j252513k709796
2750E479218k842003l15329K686800K938096J210538N87036O77039j587992n504564
2741C328839o182709j874586K810418L148696K09214j855598j550981l96908M55419
2732a908196J224599K015121K391115K065877Q85884j170456l085637k956281
2724e37974k78238K729158L342759J368148j103551k449587k834825k994880k908693
2715e667683k048402l47307J440358K211648J387066m38554j783040j576803k95390
$$ plain form
2777 -2059863 -3745604 -3212070 -2476929 -2287973 -2850293 -5140658 -8717363 -10273435 -7451818
2768 -7451818 -2547922 444992 803562 94574 -1751880 -5402325 -8482918 -7512356 -3290735
2759 -3290735 -215607 82899 533920 3418767 7128092 9234245 9441527 8189014 5479218
2750 5479218 2637215 2321886 5008686 7946782 9157320 9744356 10421395 8833403 3328839
2741 3328839 -2853870 -4728456 -1918038 1230658 1439872 -415726 -1966707 -2363615 -1908196
2732 -1908196 -683597 1331524 3722639 5788516 6674400 5503944 2418307 -537974
2724 -537974 -816212 1912946 5255705 6623853 5520302 3070715 235890 -2758990 -5667683
2715 -5667683 -7716085 -8063392 -6623034 -4411386 -3024320 -3462874 -5245914 -6822717 -7118107
2706g118107N07231O3143m81276O08540L184013M891322L803563O10190k531523
2697C537096m384691m681177k920293O44916L312438K129018j627313k991008
2689f981014L31768M711304N499270K790621j1232j207292j473990j156446j87086
2680B315903J74699j253299k833820j833720J219673K841667J375687j290386
2672G16404k980379l435602k946775j573246k89344l22188q54855K9166J838829
2663i817990K134776R09980R76243K996530L894220J876779o49112j369633j640988
2654f89195k980497l425551r43108K317423L011397J590195M87418m59118k430708
2645c521744l422484p55062L219609L387162j58078j871478O25234L109910J901941
$$ plain form
2706 -7118107 -6610876 -6547733 -7029009 -6420469 -3236456 1654866 5458429 6068619 3537096
2697 3537096 -847595 -5528772 -8449065 -7804149 -4491711 -2362693 -3990006 -6981014
2689 -6981014 -6649246 -1937942 3561328 6351949 6340717 5133425 3659435 2502989 2315903
2680 2315903 2490602 1237303 -1596517 -3430237 -2210564 631103 2006790 716404
2672 716404 -2263975 -5699577 -8646352 -10219598 -10508942 -10831130 -11685985 -11656819 -9817990
2663 -9817990 -7683214 -6773234 -5796991 -2800461 1093759 2970538 2321426 951793 -689195
2654 -689195 -3669692 -7095243 -8038351 -5720928 -2709531 -1119336 -631918 -1091036 -3521744
2645 -3521744 -6944228 -7699290 -4479681 -1092519 -1250597 -3122075 -2496841 613069 2515010
2636B515010o43869q88339J13258n70445j943595o02293L341206N878849M369748
2627A1569530K02511l605781m979893l266857L19648K719158J783888q38304j696209
2618B207691m14619j4394j846906l161829j458752J193639R61843j943447l444346
2609g921120j487684J363866K226517J946818K763347M045758L363263Q35178
2601G135943q02352m18621L99932R23554K432123M393700L269467j963081o260555
2592I110110m609948L51187J622667k043168m567027j846190K477945L007768
2584C503344K85881j092668L96937J885473J139406m44948m49615J069075J830411
2575H123296M18792j764773k151640m79120O32725n34857k006152j140086R63836
$$ plain form
2636 2515010 1871141 982802 1096060 525615 -1417980 -2020273 1320933 7199782 11569530
2627 11569530 11772041 8166260 3186367 -80490 239158 2958316 4742204 3903900 2207691
2618 2207691 1793072 1778678 -68228 -3230057 -4688809 -3495170 -2533327 -4476774 -7921120
2609 -7921120 -9408804 -8044938 -5818421 -3871603 -1108256 2937502 6300765 7135943
2601 7135943 6333591 5914970 6314902 7238456 9670579 14064279 17333746 15370665 9110110
2592 9110110 4500162 4851349 6474016 4430848 -136179 -1982369 495576 3503344
2584 3503344 3789225 2696557 3093494 4978967 6118373 5673425 5223810 6292885 8123296
2575 8123296 8542088 6777315 4625675 4146555 4779280 4244423 2238271 1098185 2062021
2566B062021J215098j79906k22465J084873K04383l400703n103403k081607K016521
2557d405188K856124J852559K519820L824852K428115o99563j469849M94476J422297
2548H823643l84836k550080l095387k754697k307350j242525L42389J490026K091272
2539D12455K198490N96213k660930l924879p23704K711696O16389m447205m115529
2530i337004K702857P198863L803145j713884j838786J691223K506901J9849j612351
2521C420813j472798j983705k992138k100553N1752M57287p85927p24294R66137
2512e163426J479420n1938j303641q36467M25397J916146L903977N172941L949660
2503I492069J302658Q077p38j220099l538611l868087j467533N73958K92960o86477
$$ plain form
2566 2062021 3277119 3097213 2874748 3959621 4164004 763301 -4340102 -6421709 -4405188
2557 -4405188 -1549064 303495 2823315 6648167 9076282 8376719 6906870 7401346 8823643
2548 8823643 8438807 5888727 2793340 38643 -2268707 -3511232 -3168843 -1678817 412455
2539 412455 2610945 3207158 546228 -3378651 -4102355 -1390659 -774270 -5221475 -9337004
2530 -9337004 -6634147 564716 4367861 2653977 815191 2506414 5013315 5033164 3420813
2521 3420813 1948015 -35690 -3027828 -5128381 -5076629 -4619342 -5405269 -6129563 -5163426
2512 -5163426 -3684006 -3735944 -5039585 -5876052 -5450655 -3534509 369468 5542409 9492069
2503 9492069 10794727 10802804 10802066 9581967 6043356 2175269 707736 1281694 1574654 888177
2493H88177r39193j494047k625492k286060J24253J991047J792507J685028L155566
2484B291786L624089Q51364k261406j498854J961363L076839L70003k365003j995788
2475D054393l4164M31328q93670j804501q49303J059120J864313O20638j451074
2466B997080k363182j832170j414808j764584j262637J252079L686825K809067
2458B107670j211617m521467m153616j088983J836325L330744L707618K892498
2450B899172M55063k419450l013662l29794K929616L362721J390046O74603K708723
2441H657038M386936K447764j724207m110960l575811k581909k935170l696478
2433c132797l556040k711695j763976q47216l72591o90621p90327M77090J845529
$$ plain form
2493 888177 -51016 -1545063 -4170555 -6456615 -6332362 -4341315 -2548808 -863780 2291786
2484 2291786 5915875 6767239 4505833 3006979 4968342 8045181 8415184 6050181 4054393
2475 4054393 4020229 4451557 3557887 1753386 904083 1963203 3827516 4448154 2997080
2466 2997080 633898 -1198272 -2613080 -4377664 -5640301 -4388222 -701397 2107670
2458 2107670 896053 -3625414 -7779030 -8868013 -7031688 -3700944 6674 2899172
2450 2899172 3354235 934785 -2078877 -2408671 520945 3883666 5273712 5948315 8657038
2441 8657038 13043974 15491738 13767531 9656571 6080760 3498851 563681 -3132797
2433 -3132797 -6688837 -9400532 -11164508 -12011724 -12384315 -13074936 -13865263 -13388173 -11542644
2424a1542644J119401n13076P96170N321074P982701N079991m40170l306277k739761
2415A757409j589601r11122O08774K886042L832889K403079m14175l233894m643444
2406F95957k997651J324413M430231K956401r89651k401751n74643J69866k610858
2397B314n854682n723544k570536P45805K767688L539215K978617J365911K3330
2388b725882k21260k1889J97011J194306K770045K701836j23284l153148l106431
2379b488696l41066K009797K344881J628875Q07319j43561o93880J09609J575215
2370D808493J718749L12267n72234R2941N74910o77820k369574k492702j596955
2361b01925j686449k786715l013913j727810k56003N96402J385041J940173J009035
$$ plain form
2424 -11542644 -10423243 -10936319 -10140149 -4819075 3163626 8243617 7803447 4497170 1757409
2415 1757409 167808 -743314 -134540 2751502 6584391 8987470 8573295 5339401 695957
2406 695957 -2301694 -977281 3452950 6409351 5419700 3017949 2443306 2613172 2314
2397 2314 -5852368 -11575912 -14146448 -13400643 -10632955 -7093740 -4115123 -2749212 -2725882
2388 -2725882 -2947142 -2969031 -2772020 -1577714 1192331 3894167 3770883 617735 -2488696
2379 -2488696 -2829762 -819965 1524916 3153791 3961110 3817549 3123669 3233278 4808493
2370 4808493 6527242 6839509 6267275 6360216 6935126 6257306 3887732 1395030 -201925
2361 -201925 -1888374 -4675089 -7689002 -9416812 -9672815 -9076413 -7691372 -5751199 -4742164
2352d742164q92920q27003K364617N307580M267061O25526j050219K70945J041199
2343F364622p31603k193106m67717K332499J998873j613581m594510m533024k940858
2334f378405j844529q66575R42025K486766J971748J7835o24598J328627L936253
2325I69147M557083K958945Q32648q27027k107540k372255n14683K283275K610195
2316H389788m85536l017077j048696L327917M427477O83596l842014n669158n488102
2307b721805m651427k473509P79839K142290L44927j159141Q60824M019296L917959
2298A059253J198346L62712K386266L280446N40553l114527l890737j760080M80948
2289E43180Q69248m28323j962550k068199j90214K209043K984597J756540R8766
$$ plain form
2352 -4742164 -5635084 -6462087 -4097470 1210110 5477171 6102697 5052478 5323423 6364622
2343 6364622 5633019 3439913 2972196 5304695 7303568 5689987 1095477 -3437547 -6378405
2334 -6378405 -8222934 -9089509 -8147484 -5660718 -3688970 -3671135 -4295733 -2967106 969147
2325 969147 5526230 8485175 9317823 8490796 6383256 4011001 3496318 5779593 8389788
2316 8389788 7904252 4887175 3838479 7166396 11593873 12277469 8435455 2766297 -2721805
2307 -2721805 -7373232 -9846741 -9066902 -6924612 -6579685 -7738826 -6878002 -2858706 1059253
2298 1059253 2257599 2620311 5006577 8287023 8827576 5713049 1822312 62232 543180
2289 543180 1412428 984105 -978445 -3046644 -3236858 -1027815 1956782 3713322 3812088
2280C812088n57803j34480O10238O22103q17771k686772k400966Q39670L940561
2271C226868L398910L673k503086k632607j997206j503288k38676J621713K279152
2262A655453J460579R88423J347448P99831j004160j741591k93669J100273N23237
2253D835824m59172L72538K078323K114019K59284j370993j446277o92916m52867
2244E237763j143130j847119j106575J133087K591502J184015j759147k895861
$$ plain form
2280 3812088 3254285 3119805 3730043 4352146 3534375 847603 -1553363 -713693 3226868
2271 3226868 6625778 6629451 4126365 1493758 -503448 -2006736 -2245412 -623699 1655453
2262 1655453 3116032 4104455 5451903 6251734 5247574 3505983 3212314 4312587 4835824
2253 4835824 4376652 4749190 6827513 8941532 9200816 7829823 6383546 5690630 5237763
2244 5237763 4094633 2247514 1140939 2274026 4865528 6049543 4290396 1394535
$$ [...]
##END NTUPLES=NMR SPECTRUM
##END=
