##TITLE=31Pdec_DE-73-9
 D2O, 64 sc
 7.11.2024
##JCAMPDX= 6.0         $$ Bruker NMR JCAMP-DX V2.0
##DATA TYPE= NMR SPECTRUM
##DATA CLASS= NTUPLES
##ORIGIN= UXNMR, Bruker Analytische Messtechnik GmbH
##OWNER= root
$$ XWIN-NMR		Version 3.5
$$ Thu Nov  7 14:01:19 2024 Russian Standard Time (UT+4h)  she@DPX200
##.OBSERVE FREQUENCY= 81.013821
##.OBSERVE NUCLEUS= ^31P
##.ACQUISITION MODE= SIMULTANEOUS
##.ACQUISITION SCHEME= undefined
##.AVERAGES= 64
##.DIGITISER RES= 17
##SPECTROMETER/DATA SYSTEM= spect
##.PULSE SEQUENCE= zgpg30
##.SOLVENT NAME= D2O
##.SHIFT REFERENCE= (INTERNAL, D2O, 0, 198.062)
##AUDIT TRAIL= $$ (NUMBER, WHEN, WHO, WHERE, WHAT)
$$ ##TITLE= Audit trail, XWIN-NMR		Version 3.5
$$ ##JCAMPDX= 5.01
$$ ##ORIGIN= Bruker BioSpin GmbH
$$ ##OWNER= she
$$ F:/spectra/data/she/nmr/P31/2/pdata/1/auditp.txt
$$ ##AUDIT TRAIL=  $$ (NUMBER, WHEN, WHO, WHERE, WHAT)
(   1,<2024-11-07 14:00:21.87 +0400>,<she>,<DPX200>,
      <created by zg, POWCHK disabled, PULCHK disabled
       configuration hash MD5:
       00 E9 B6 7A A2 85 ED C7 34 08 36 98 17 FE 4E 26
       data hash MD5: 32K
       FA 49 31 51 24 0E 64 B6 41 C3 1F DB CB 6D 5A 8B>)
(   2,<2024-11-07 14:00:25.09 +0400>,<she>,<DPX200>,
      <Start of raw data processing
       efp BC_mod = 2 LB = 1.5 FT_mod = 6 PKNL = 1 PHC0 = 2403.784 PHC1 = -275.9117 SI = 64K 
       data hash MD5: 64K
       0E E7 9C 0C 65 78 CA 0F CA 5A A5 F5 C0 BE E7 02>)
(   3,<2024-11-07 14:00:45.92 +0400>,<she>,<DPX200>,
      <pk PHC0 = -106.4203 PHC1 = 280.3999 
       data hash MD5: 64K
       90 26 09 06 F5 25 F0 62 7E EB 3B B8 B4 FE 69 39>)
(   4,<2024-11-07 14:00:57.45 +0400>,<she>,<DPX200>,
      <abs ABSG = 5 
       data hash MD5: 64K
       CA 4F A7 29 9A A2 C8 69 20 56 E1 70 22 BE 05 C7>)
$$ ##END=
$$ 
$$ hash MD5
$$ 01 F1 A6 CA AF A4 9A CE E2 F5 D9 77 0C 68 A2 2F
##$RELAX= 
##$RELAX= 
##$RELAX= 
##$RELAX= 
##$RELAX= 
##$RELAX= 
##$RELAX= 
##$RELAX= 
$$ Bruker specific parameters
$$ --------------------------
##$DU= <F:/spectra>
##$EXPNO= 2
##$NAME= <P31>
##$PROCNO= 1
##$TYPE= <nmr>
##$USER= <she>
##$AMP= (0..31)
100 100 100 100 100 100 100 100 100 100 100 100 100 100 100 100 100 100 
100 100 100 100 100 100 100 100 100 100 100 100 100 100 
##$AQSEQ= 0
##$AQ_mod= 1
##$AUNM= <au_zg>
##$AUTOPOS= <>
##$BF1= 81.014009
##$BF2= 200.13
##$BF3= 200.13
##$BF4= 200.13
##$BF5= 200.13
##$BF6= 200.13
##$BF7= 200.13
##$BF8= 200.13
##$BYTORDA= 1
##$CFDGTYP= 0
##$CFRGTYP= 5
##$CHEMSTR= <none>
##$CNST= (0..31)
1 1 145 1 1 1 1 1 1 1 1 1 1 1 1 1 1 1 1 1 1 1 1 1 1 1 1 1 1 1 1 1 
##$CPDPRG= <waltz16>
##$CPDPRG1= <>
##$CPDPRG2= <waltz16>
##$CPDPRG3= <>
##$CPDPRG4= <mlev>
##$CPDPRG5= <mlev>
##$CPDPRG6= <mlev>
##$CPDPRG7= <mlev>
##$CPDPRG8= <mlev>
##$CPDPRGB= <>
##$CPDPRGT= <>
##$D= (0..31)
0 1 0 0 0 0 0 0 0 0.06 0 0.03 2e-05 3e-06 0 0 0.0002 0 0 0 0 0 0 0 0 0 
0 0 0 0 0 0 
##$DATE= 1730973621
##$DBL= (0..7)
120 120 120 11 120 120 24 19 
##$DBP= (0..7)
150 150 150 150 150 150 150 150 
##$DBP07= 0
##$DBPNAM0= <>
##$DBPNAM1= <>
$$ [...]
##$SUBNAM3= <"">
##$SUBNAM4= <"">
##$SUBNAM5= <"">
##$SUBNAM6= <"">
##$SUBNAM7= <"">
##$SUBNAM8= <"">
##$SUBNAM9= <"">
##$SW= 400.765351723535
##$SWIBOX= (0..15)
0 1 3 0 0 0 0 0 0 0 0 0 0 0 0 0 
##$SW_h= 32467.5324675325
##$TD= 32768
##$TD0= 1
##$TE= 0
##$TE2= 300
##$TE3= 300
##$TEG= 300
##$TL= (0..7)
0 120 53 12 22 120 120 120 
##$TP= (0..7)
150 150 150 150 150 150 150 150 
##$TP07= 0
##$TPNAME0= <>
##$TPNAME1= <>
##$TPNAME2= <>
##$TPNAME3= <>
##$TPNAME4= <>
##$TPNAME5= <>
##$TPNAME6= <>
##$TPNAME7= <>
##$TPOAL= (0..7)
0.5 0.5 0.5 0.5 0.5 0.5 0.5 0.5 
##$TPOFFS= (0..7)
0 0 0 0 0 0 0 0 
##$TUNHIN= 0
##$TUNHOUT= 0
##$TUNXOUT= 0
##$USERA1= <user>
##$USERA2= <user>
##$USERA3= <user>
##$USERA4= <user>
##$USERA5= <user>
##$V9= 5
##$VALIST= <valist>
##$VCLIST= <CCCCCCCCCCCCCCC>
##$VD= 0
##$VDLIST= <DDDDDDDDDDDDDDD>
##$VPLIST= <PPPPPPPPPPPPPPP>
##$VTLIST= <TTTTTTTTTTTTTTT>
##$WBST= 1024
##$WBSW= 4
##$XGAIN= (0..3)
0 0 0 0 
##$XL= 0
##$YL= 0
##$YMAX_a= 6972
##$YMIN_a= -6014
##$ZGOPTNS= <>
##$ZL1= 120
##$ZL2= 120
##$ZL3= 120
##$ZL4= 120
##$ABSF1= 198.0616
##$ABSF2= -202.7028
##$ABSG= 5
##$ABSL= 3
##$ALPHA= 0
##$AQORDER= 0
##$ASSFAC= 0
##$ASSFACI= 0
##$ASSFACX= 0
##$ASSWID= 0
##$AUNMP= <proc_1d>
##$AZFE= 0.1
##$AZFW= 0.5
##$BCFW= 0
##$BC_mod= 2
##$BYTORDP= 0
##$COROFFS= 0
##$CY= -3
##$DATMOD= 1
##$DC= 0
##$DFILT= <>
##$DTYPP= 0
##$F1P= 0
##$F2P= 0
##$FCOR= 1
##$FTSIZE= 65536
##$FT_mod= 6
##$GAMMA= 0
##$GB= 0
##$INTBC= 1
##$INTSCL= 9.790993e-09
##$ISEN= 30
##$LB= 1.5
##$LEV0= 0
##$LPBIN= 0
##$MAXI= 10000
##$MC2= 0
##$MEAN= 0
##$ME_mod= 0
##$MI= 50
##$NCOEF= 0
##$NC_proc= -8
##$NLEV= 6
##$NOISF1= 182.463
##$NOISF2= 159.3651
##$NSP= 0
##$NTH_PI= 0
##$NZP= 0
##$OFFSET= 198.0616
##$PC= 4
##$PHC0= 2297.364
##$PHC1= 4.48819
##$PH_mod= 1
##$PKNL= yes
##$PPARMOD= 0
##$PSCAL= 0
##$PSIGN= 0
##$REVERSE= no
##$SF= 81.0140089999434
##$SI= 65536
##$SIGF1= 159.3651
##$SIGF2= -187.1042
##$SINO= 113.3802
##$SIOLD= 16384
##$SREGLST= <1H.CDCl3>
##$SSB= 0
##$STSI= 65536
##$STSR= 0
##$SW_p= 32467.5324675325
##$SYMM= 0
##$S_DEV= 0
##$TDeff= 32768
##$TDoff= 0
##$TI= <>
##$TILT= no
##$TM1= 0
##$TM2= 0
##$TOPLEV= 0
##$USERP1= <user>
##$USERP2= <user>
##$USERP3= <user>
##$USERP4= <user>
##$USERP5= <user>
##$WDW= 1
##$XDIM= 65536
##$YMAX_p= 504940425
##$YMIN_p= -508108606
$$ End of Bruker specific parameters
$$ ---------------------------------
##NTUPLES= NMR SPECTRUM
##VAR_NAME=  FREQUENCY,     SPECTRUM/REAL,   SPECTRUM/IMAG
##SYMBOL=    X,             R,               I
##VAR_TYPE=  INDEPENDENT,   DEPENDENT,       DEPENDENT
##VAR_FORM=  AFFN,          ASDF,            ASDF
##VAR_DIM=   65536,         65536,           65536
##UNITS=     HZ,            ARBITRARY UNITS, ARBITRARY UNITS
##FACTOR=    0.49542278885378, 1,            1
##FIRST=     16045.7642231865, 0,            0
##LAST=      -16421.768244346, 0,            0
##MIN=       -16421.768244346, -508108606,   0
##MAX=       16045.7642231865, 504940425,    0
$$ Real data points
##PAGE= N=1
##DATA TABLE= (X++(R..R)), XYDATA
$$ [...]
44417 147701 586471 1911321 2296020 1473570 426086 -517300 -1637001 -2466396 -2533500
44408 -2533500 -3031343 -5216295 -7238272 -5640454 -651095 3249480 3366159 2178270
44400 2178270 2773391 4194364 4242394 3970421 5440324 6957021 4957477 -163360 -4319633
44391 -4319633 -5578466 -5666750 -5609038 -4282176 -2142016 -1889522 -3641989 -3593494 62862
44382 62862 3739957 4126670 3685408 6304343 10136853 9812301 4636013 -376767 -1679175
44373 -1679175 -893349 -582565 -511257 303854 1318048 2174039 3708019 5149000 3221461
44364 3221461 -3117504 -9323628 -10091114 -6353823 -4084556 -6460366 -10385634 -11151674
44356 -11151674 -7734512 -2539812 1777270 3860242 3689340 2586073 2306148 3127804
44348 3127804 3595490 2735837 1334888 179788 -1593274 -5001073 -9086318 -11891118
44340 -11891118 -12857596 -12600601 -10941477 -7363040 -3412807 -2215992 -4588025 -7475287
44332 -7475287 -7613983 -5330909 -3203588 -2200287 -1188201 348189 1392244 1394402 1101138
44323 1101138 581507 -1756226 -6642746 -11461448 -12096187 -7359444 -530426 3703958
44315 3703958 3226307 -432173 -3980211 -4937358 -3030261 163980 2752130 3804701
44307 3804701 3371084 1861534 -17261 -1134389 -900637 -702858 -3262045 -9451870 -16204402
44298 -16204402 -18908557 -16150375 -11014815 -7210301 -5092669 -2684665 347898 1883097
44290 1883097 747019 -1223022 -1907768 -2150804 -4153011 -7340447 -8411197 -5953230
44282 -5953230 -2691526 -1837654 -3012328 -3660822 -3273194 -3774278 -5944756 -7833170 -7475450
44273 -7475450 -5452852 -3584179 -2197760 -39413 3530729 7332749 9410347 8838418
44265 8838418 6669008 5309322 6389350 8721389 9000896 5465363 569873 -1076631
44257 -1076631 2321414 7634103 10027201 7680796 2873699 -953957 -2255200 -1619576
44249 -1619576 -163384 1416663 2566264 2771488 2229180 2070513 3289595 5568356 7517389
44240 7517389 7906922 6425972 3712773 1194420 384335 1398310 2404296 1572445 -549712
44231 -549712 -1779236 -1372182 -832958 -1280177 -1715138 -906347 514288 1256551 1465495
44222 1465495 1912226 1985195 473203 -1997348 -3241634 -2315258 -408042 1170588 2275092
44213 2275092 2906787 2508505 889923 -1297430 -3415154 -5112231 -5617550 -4075513 -830507
44204 -830507 2852588 6287265 9026222 9384067 5872251 476084 -2504105 -2157212 -2552431
44195 -2552431 -6623248 -11275212 -11490073 -7163564 -2544889 -390689 -172260 -1002158 -2494916
44186 -2494916 -3075770 -1273720 1031193 242971 -3512550 -6074658 -5103610 -2590417 -462473
44177 -462473 2197798 5475804 6235801 2798359 -988390 -231744 4315339 7679569 7399153
44168 7399153 5282715 3530634 2854319 3959773 7098879 9909735 9157243 5273709
44160 5273709 2100594 1380993 632278 -2290274 -5526292 -6054551 -3920580 -1394799 608408
44151 608408 3090521 6609622 10004430 11315485 9252709 4231366 -1644025 -6294159
44143 -6294159 -9404132 -11488719 -11782764 -9230991 -5493294 -3923004 -4595867 -3624484 608751
44134 608751 3793293 1482393 -3996188 -6570349 -4959065 -3620188 -5393365 -7862140
44126 -7862140 -8219924 -7676512 -8778212 -11308445 -13335646 -14168969 -13827582 -11353596 -6363700
44117 -6363700 -1203219 1085021 496023 -439357 -474426 -633357 -1448566 -1724199 -818233
44108 -818233 -119410 -977080 -2452996 -2398098 -21954 3576499 6789793 8476095 8083547
44099 8083547 5869028 2951212 502297 -1028491 -1488842 -304613 2888317 6914012
44091 6914012 9276583 8221175 4299090 -302586 -3649368 -5081202 -4821095 -3301557
44083 -3301557 -1204201 196392 -417830 -2871538 -4867873 -4014081 -874000 1059335
44075 1059335 -532493 -3418124 -3013170 2161320 8734167 12451220 12234473 9566420
44067 9566420 5759444 1749302 -571284 474342 3451670 4181075 190845 -6205233
44059 -6205233 -10208217 -9294418 -5089079 -1200852 72502 -663633 -887268 1177399 4666183
44050 4666183 7065810 6961982 5135904 3048325 1331098 32489 -768706 -1068939 -729960
44041 -729960 966172 4158235 6717977 5965805 2855300 1695813 3938633 5248126
44033 5248126 1899163 -2620982 -2161154 2317186 3295211 -2337570 -8556248 -8823523 -4584941
44024 -4584941 -1644908 -1993359 -3595235 -5451858 -7904486 -9416213 -8002108 -5499675
44016 -5499675 -5948556 -9476186 -11861444 -10727793 -8183594 -6296434 -3917050 132830
44008 132830 4016789 5253552 3701877 499076 -3360052 -5707657 -3592276 2436314
44000 2436314 7145296 6763877 4062661 4051854 6711208 7918164 6200810 4200025 3745903
43991 3745903 3619002 2642963 1372287 -35852 -2331308 -4640440 -4523440 -1680033 1223236
43982 1223236 2491938 3276418 4365709 4361106 2860316 2310142 4158774 5752444 3886899
43973 3886899 -575040 -4366761 -6210659 -6718179 -5772044 -3307147 -1252992 -1179288 -1118390
43964 -1118390 1505684 4639285 3677773 -1167690 -4164215 -1889043 2434610 4419705
43956 4419705 4586815 6059010 8926658 10290977 8620652 5265865 2228484 458286
43948 458286 -98804 -205884 -506365 -152199 2357117 5908934 6404955 1697693 -4812000
43939 -4812000 -8014095 -7178162 -5425556 -4297318 -2406658 607547 2381714 1116188
43931 1116188 -2095031 -5246614 -7373775 -7609910 -5012339 -1004681 424651 -2674728
43923 -2674728 -7040144 -8041264 -5469494 -2813160 -1527013 693555 5282793 9350423
43915 9350423 8881117 4059178 -655957 -1632459 236157 1341332 -132919 -2395497
43907 -2395497 -2515603 163978 3530483 5187378 4774885 3876443 4299577 6664740 10096453
43898 10096453 12864799 13650327 12507966 10369398 7609379 3836386 -591039 -3854058
43890 -3854058 -4515059 -3559803 -3420578 -5062731 -7132267 -8060896 -7857923 -7430301 -7199638
43881 -7199638 -7081497 -7013567 -6722101 -5639934 -3895791 -2698549 -2615654 -2050975 938223
43872 938223 5285730 7171210 4487971 -261144 -2721005 -1438913 1416469 3319939
43864 3319939 3629788 2725333 830361 -1561040 -3433016 -4435072 -5462554 -7064680
43856 -7064680 -7921722 -6048541 -1341798 3978700 7533778 8847536 9299587 10457889
43848 10457889 12376438 13294894 11360598 6961046 2837153 1421469 2630437 4715536
43840 4715536 6229848 6135888 3265213 -2160829 -6909390 -7240617 -3683349 -988179 -2046538
43831 -2046538 -3990852 -2380811 2408763 5817519 5398335 3227424 1519154 -827739
43823 -827739 -5163688 -8984500 -8315625 -3653099 -137921 -890197 -3019567 -2250162 669243
43814 669243 1211711 -2173764 -5998236 -6922239 -5770907 -4713333 -3226558 263924 4319925
43805 4319925 5432643 2854743 -328372 -1309794 -290067 1423180 3417200 4954916
43797 4954916 3965572 -704644 -7085244 -11706682 -12798482 -10973121 -7896063 -5482642
43789 -5482642 -5219173 -6686447 -7517818 -6227229 -4289157 -4003098 -5247918 -6127980 -6027347
43780 -6027347 -5890044 -5893701 -5175329 -3994806 -3979966 -5672096 -7635643 -8569695 -8617225 -8021003
43770 -8021003 -6281627 -3517731 -1019553 575807 2150712 4031052 4575763 2365799
43762 2365799 -1339872 -3961334 -4630336 -4378620 -4072752 -3887901 -4347494 -5917768 -7419003
43753 -7419003 -6603442 -3006264 960614 2510320 1316443 -761926 -2119768 -2744389
43745 -2744389 -3305032 -3700630 -3047933 -1110221 777512 867267 -909607 -2733164 -3052565
43736 -3052565 -2167288 -1119418 126204 2343042 5310058 7531510 7676294 5554765
43728 5554765 1895832 -1935980 -4209162 -4016089 -2463176 -1746245 -2694839 -3937094 -3680372
43719 -3680372 -1508458 1795347 5216870 7756629 8529990 7391706 5101717 2479733
43711 2479733 -73293 -1851744 -1475455 1821111 6775213 10711081 11653599 9703148
43703 9703148 6734215 5007276 5438988 6647583 6224698 3618354 1226080 1775779 5055945
43694 5055945 8245884 9152372 7907984 5632045 2999699 653609 -375065 261522
43686 261522 1511821 2285588 3015301 4888176 7830246 10185054 10321112 7898317 3815299
43677 3815299 -258369 -2545280 -2504641 -1701405 -2328226 -4507529 -5996337 -5064247 -2714270
43668 -2714270 -1217939 -1164144 -1039513 546298 3230740 5512988 6208617 5155703 3049883
43659 3049883 730310 -1659484 -4587104 -7777010 -9475151 -8174736 -5040577 -3390194
43651 -3390194 -5258673 -9272835 -12281368 -12194750 -8840104 -3306373 2396964 5837455
43643 5837455 5793477 3418214 982584 -306928 -502610 465846 2953772 6337973 8859524
43634 8859524 9168395 7296999 4058242 446086 -2314276 -3393648 -3479687 -4122409 -5418753
43625 -5418753 -5541513 -3321083 -81881 2130806 3030681 3510849 3661911 3127614 2748418
43616 2748418 3727727 5164315 4495621 1042639 -2526739 -3141662 -494684 3477183 6909027
43607 6909027 8678256 7970530 4883493 1133978 -1262560 -2119716 -2886551 -4253260 -5038938
43598 -5038938 -4073373 -2517695 -3204320 -7179805 -11484276 -11642303 -6914407 -1847093 -1096600
43589 -1096600 -3507138 -3660943 660389 5459789 6245644 3994994 2897731 4176033
43581 4176033 5457835 5308968 4749610 4143010 2019271 -1993358 -5895319 -8246780 -9881005
43572 -9881005 -11283692 -10750688 -7118232 -2297926 1063135 2784160 3889898 3910043 2132614
43563 2132614 230792 533002 2264544 2566089 1109192 608508 2364875 4372050 4913328
43554 4913328 5276295 7189327 9641007 10212020 8250811 4981991 1446745 -1957905
43546 -1957905 -4448595 -4972433 -3504725 -1489696 -874566 -2611563 -5440057 -6277715 -3158193
43537 -3158193 1889527 4392164 2529725 -846294 -2164818 -1375039 -850062 -1715629 -3251606
43528 -3251606 -4749812 -5668295 -4584186 -418521 5222838 8917722 8935254 6373562 2892840
43519 2892840 -774867 -3827769 -5021071 -4232161 -2853052 -1691490 116936 3084937
43511 3084937 5681455 6143466 5002873 4127534 3779535 2529373 286538 -438523 2524705
43502 2524705 7787816 11561875 11797233 9764137 7288495 4123183 -580909 -5415575
43494 -5415575 -7620957 -6801596 -5459710 -5161799 -4455600 -2005143 373606 163455 -1784301
43485 -1784301 -2381840 -846575 698839 1042896 1360127 2242271 2012242 -567122 -3898126
43476 -3898126 -5493489 -5065539 -4344750 -4731973 -6128535 -7333674 -6995840 -4995824 -3028647
43467 -3028647 -2532841 -2194848 308106 3895001 4489934 1142195 -1544513 296607 3793967
43458 3793967 3175760 -2111875 -7057859 -8130436 -6709118 -5293352 -4063130 -2425981
43450 -2425981 -1041864 -641375 -709637 -597392 -478718 -475729 -413346 -940031 -2984756 -5454959
43440 -5454959 -5555836 -2360099 1856770 4715086 6021975 6012273 3998273 591486 -1313807
43431 -1313807 -420665 89920 -3366630 -9131324 -11978535 -9807722 -5517614 -2426754
43423 -2426754 -1020001 -599212 -1045014 -1822404 -1673302 -530167 170310 -46407 5009
43414 5009 512299 -200854 -2357336 -2997761 153842 5016678 7950344 8690024 9510385
43405 9510385 10613990 10017199 7942364 7482543 9701219 11351705 9467089 5602368
43397 5602368 2973640 1377404 -1860670 -6782164 -9964066 -9100074 -5704816 -2401361
43389 -2401361 178013 2417639 3494600 2128692 -1126179 -3942826 -4471211 -2646152
43381 -2646152 321352 2753152 3167253 1298547 -1482881 -3537121 -4637558 -5596732
43373 -5596732 -6572115 -6808658 -5913280 -4168269 -1530788 2246894 5986848 6996160 3829678
43364 3829678 -1463037 -4883298 -4128412 -312798 3290341 3632074 -43599 -5216002
43356 -5216002 -7587527 -5043318 -305681 1548393 -1401317 -5922066 -7631465 -5872251
43348 -5872251 -3555851 -2915285 -2980895 -1508621 1793272 4784911 5178478 2684535 -817449
43339 -817449 -2706480 -1597864 1255233 2681142 767721 -2496738 -2962430 716855
43331 716855 5161167 6453499 4989336 4213219 5299245 5774307 3763876 852627 -726688
43322 -726688 -1543750 -3478379 -6242632 -7811971 -7568456 -6573626 -4956306 -1571057 3213893
43313 3213893 6589568 6309279 3234964 -49251 -1956529 -2326750 -1395132 284698 1526034
43304 1526034 1462521 732415 734399 1560149 1410437 -1404544 -6025352 -9212822 -8583835
43295 -8583835 -5476250 -3470403 -3765059 -3623524 -558399 3745255 5990689 6363118 7700641
43286 7700641 9997866 9793559 6005123 2323170 1550067 1126446 -2440028 -7512285 -9740164
43277 -9740164 -8787978 -8297683 -9813121 -11011571 -10248420 -8986056 -8775201 -9088441 -9254339
43268 -9254339 -9601679 -9493364 -7126036 -2889849 -350954 -1924194 -5461639 -6862852
43260 -6862852 -4480903 333417 5110320 7246336 5245318 833571 -1958296 -1552928
43252 -1552928 -764031 -2274263 -4590169 -4942765 -3847107 -3569777 -3974935 -3605806 -3483989
43243 -3483989 -5611934 -8315228 -7526995 -3014307 925672 1886510 2317758 4479528 6455813
43234 6455813 5855271 4288293 4829986 7049660 7919215 6643510 5553914 6417126 8245830
43225 8245830 8955590 7507285 4273790 623078 -1702963 -1823696 -598286 195822 -428233
43216 -428233 -1835027 -2242297 -225362 3357170 5307115 3590346 737542 1374801 5940248
43207 5940248 9795269 9866416 8825682 10017602 11266260 7865174 148700 -6401326
43199 -6401326 -8344174 -7446915 -6264932 -4637991 -2009065 267660 1113564 1709688 3110561
43190 3110561 3862532 2270916 -462675 -1748551 -1375528 -1503100 -3168894 -4788924 -4450725
43181 -4450725 -2321816 -189127 713870 871591 1537448 2926059 3917007 3865858 3808654
43172 3808654 4737238 5507125 4417197 2523879 2765348 5244300 6196130 3191330 -1108924
43163 -1108924 -2614108 -1252725 -88991 -451147 -1092056 -1591502 -3272791 -6248788 -8273340
43154 -8273340 -7547944 -4761245 -1555837 1226725 2986282 2974704 1749134 1524321 3609723
43145 3609723 6450739 7425127 5696433 2171862 -2263968 -6817748 -9793543 -9583552
43137 -9583552 -6958314 -4912633 -5621792 -8373993 -10790049 -11161301 -9272847 -6080251
43129 -6080251 -3401033 -2979052 -4578424 -5417586 -2868233 2221449 6153608 6592563 4765029
43120 4765029 2812067 591896 -3218366 -7889212 -10806244 -10857508 -9566018 -8365531
43112 -8365531 -6738335 -4050318 -1468285 -557796 -1146550 -1972963 -2427342 -2296977 -963728
43103 -963728 1397136 2838162 1959394 490480 1155128 3278805 3281570 29208 -2944281
43094 -2944281 -1812084 2930645 7637125 9708387 9097043 6871710 4044883 1344755
43086 1344755 -1144367 -3940208 -7144163 -9987179 -11781582 -12374946 -11237158 -7623890
43078 -7623890 -2704011 107946 -1141975 -3842077 -3498789 814532 5640640 7733207
43070 7733207 7460894 7055188 7216416 6784500 5059896 3148387 2605811 3078281 1985700
43061 1985700 -2607075 -8840984 -12104683 -10034029 -5339570 -2472362 -2560614 -3284338 -2794253
43052 -2794253 -1450482 -17888 1264286 1413690 -928827 -4724040 -6276168 -3386610
43044 -3386610 1697242 4993002 5162690 3738792 2473539 2541780 5266609 10923000 16842011
43035 16842011 19150127 17125638 14095990 13289365 14355224 14869072 13776931 11973797
43027 11973797 10416561 9169373 8022361 6912280 5804077 4895840 4639190 4806196
43019 4806196 4070703 1667685 -906770 -1345825 304928 1571439 1011659 -79709 -338269
43010 -338269 -699012 -2243562 -3326773 -1661196 1395514 1872785 -996737 -3088549 -1011786
43001 -1011786 3124523 4662599 2155654 -2171006 -6016534 -8139307 -7075635 -2388287
42993 -2388287 2619212 2826125 -2804083 -9600149 -12594961 -11401471 -8552249 -5465065
42985 -5465065 -2190400 526003 1401932 212596 -2463631 -6257385 -10061294 -11109304
42977 -11109304 -7435196 -1085040 3384848 4004363 3123673 3526402 4681928 4079753 1043051
42968 1043051 -2386506 -4116120 -4263440 -4271938 -4444860 -3379310 -248556 3181172 4121045
42959 4121045 2337221 669324 1353184 3246741 3773368 2288219 51157 -1943925
42951 -1943925 -3218017 -2815335 -341130 2443298 3404940 3263657 4560127 7352065 8851656
42942 8851656 8068779 7646490 9284923 10143434 6604587 -110340 -5129029 -5973519 -4637593
42933 -4637593 -3863368 -4039442 -4239986 -4022668 -3221734 -1633102 61983 337757 -1210528
42924 -1210528 -2995837 -3535627 -3419895 -3911691 -4389108 -2994561 137703 2123667 741407
42915 741407 -2623257 -4767070 -4632246 -3804657 -3363965 -2428731 -542595 636225 -248857
42906 -248857 -1652114 -1132465 963398 2263831 2302622 2843403 4080529 3535852 -106011
42897 -106011 -4584045 -6964612 -6810226 -4960690 -1480160 3088339 6450456 7061549 6378772
42888 6378772 6151184 5093055 1342999 -3029815 -3799167 -729474 1733470 649192
42880 649192 -1774725 -2033985 -140494 1178909 302359 -1903546 -3436952 -2825957 -342770
42871 -342770 1834107 1593125 -750247 -3103340 -4327846 -4733860 -4320829 -2926251 -2067110
42862 -2067110 -3759994 -6979486 -8269268 -6778672 -5515988 -6250625 -6672049 -4883523
42854 -4883523 -3409186 -5548293 -10267638 -14129198 -16241001 -17669913 -17630568 -14308668
42846 -14308668 -8621503 -3377854 713596 4512766 6620993 4498820 -379541 -3017550
42838 -3017550 -1771649 -677180 -3109586 -6849814 -7993970 -6736583 -6152988 -7143625
42830 -7143625 -7622192 -5839895 -2187760 1762435 4313828 4372922 2576754 1128142 1462327
42821 1462327 2900646 4446643 6481863 9240583 10902427 9189168 4434989 -408425
42813 -408425 -2627327 -1796185 319691 1052265 -1067425 -4520197 -6033998 -4456816 -2142242
42804 -2142242 -1522263 -2073717 -2336707 -3092937 -5928244 -9710556 -11372305 -9942033 -7288085
42795 -7288085 -4955485 -2808464 -1023040 -780803 -2099597 -3165926 -3000162 -3075944 -5057960
42786 -5057960 -8273271 -10671413 -11311323 -10740654 -9607114 -8016985 -6097036 -4530325
42778 -4530325 -4380241 -6159110 -8733553 -9732325 -7999021 -5188405 -3688470 -3415502 -2380796
42769 -2380796 -249259 811260 -689376 -3516416 -5648160 -6469517 -6106106 -4413766
42761 -4413766 -1996731 -731886 -1719533 -3690358 -4627573 -3937846 -2085661 414054 2349535
42752 2349535 1847018 -1129005 -3776168 -4021707 -3679019 -5518912 -8387610 -8413807 -4646943
42743 -4646943 -154542 2763602 5089296 7802577 9290451 7978860 5176804 3088073
42735 3088073 1687691 -236156 -2262006 -2885796 -2113068 -1302269 -796942 272026 1931526
42726 1931526 2996103 2935358 2491424 2148933 1489845 497887 89368 672328 1331845
42717 1331845 1198984 653970 330987 -249354 -2014054 -4701805 -6813973 -7131222 -5714372
42708 -5714372 -3555429 -1786486 -1133742 -1598369 -2548958 -3344330 -3781473 -3749729 -2795705
42699 -2795705 -601900 2184006 4236021 4886544 4711277 4495138 4124201 3142448 2128727
42690 2128727 2488109 4444454 6110511 5579776 3598477 2874907 4466110 6067211 4664434
42681 4664434 -14791 -5596498 -9661391 -10904619 -8550084 -2903575 3105711 5069718
42673 5069718 1342816 -4745301 -8178210 -7283596 -4554746 -3044907 -3192596 -3205499 -1611564
42664 -1611564 975602 2463364 1720752 269653 702288 3205758 5000236 4157609 2564726
42655 2564726 3300913 5950628 6835012 3892909 -852825 -4194535 -5095066 -4244334 -2131926
42646 -2131926 831377 3250922 3382149 771442 -3263792 -6396112 -6480207 -3167394 1156212
42637 1156212 3232028 2334864 566796 -665392 -2389749 -5081070 -6368734 -4298288
42629 -4298288 -1258100 -1457423 -5096503 -8182298 -8094197 -6157124 -4180004 -1769969 1358936
42620 1358936 3133308 1412440 -3048373 -7714840 -11008228 -12401808 -11356523 -8138793
42612 -8138793 -4608805 -2320693 -760731 835823 1210512 -1044935 -4295401 -5305064
42604 -5305064 -3578863 -1569968 -593753 507410 2115179 2437045 807033 -473752
42596 -473752 175593 371755 -2918117 -8216267 -10830068 -8884256 -5129703 -2567525 -1142479
42587 -1142479 300793 1438783 1703459 2276041 4549407 7435630 8445808 7358597
42579 7358597 6783589 8544307 11180402 12078683 10871642 9286924 8226746 6710318
42571 6710318 4019550 1390401 377987 243254 -1441907 -5240485 -8225484 -7094977
42563 -7094977 -2351483 2135035 3972038 5103437 8623259 13726293 15827528 12015382
42555 12015382 4710275 -1187199 -3676397 -4665543 -6130472 -7261979 -6224347 -3426697
42547 -3426697 -1545329 -2397837 -4823851 -5985279 -4252556 -606541 2339080 2479448
42539 2479448 -22509 -2557291 -2106699 1619650 5123093 4249652 -1118454 -6370459
42531 -6370459 -6973255 -3287826 481220 1541466 1023645 1148515 1871315 1630650 244402
42522 244402 -660492 61746 1617890 2334164 1480504 -112846 -940965 -451984 101649
42513 101649 -949143 -3229228 -4404354 -3566163 -3250741 -6478527 -12610071 -18025508 -20422777
42504 -20422777 -20356932 -18830267 -16028147 -13007427 -11960737 -13263571 -14158815 -12085612
42496 -12085612 -7959266 -4579335 -3043526 -2472663 -2258844 -2607176 -3288799 -3591362 -3434720
42487 -3434720 -3314952 -3359966 -3436378 -3696686 -3944901 -3115073 -693249 1914232 2860159
42478 2860159 2259975 1707791 1865410 2092466 2086637 2148425 1955030 854109 -465759 -221962
42468 -221962 2185734 5381526 7619701 8020484 6390115 3331659 577358 -251064 669542
42459 669542 2062267 3444666 4680475 4369137 1244592 -2887968 -4409917 -2604824
42451 -2604824 -440405 80318 443251 2214724 3989758 3776653 2204080 1199952 1190113
42442 1190113 1550661 2263603 3302809 3882170 3873264 4180343 4284639 1975035 -2401706
42433 -2401706 -4449395 -1736602 1431409 -405253 -5391154 -6523656 -1619608 4037761
42425 4037761 5448706 3456323 1324913 174989 -273722 -196659 -1043862 -4956570 -10331128
42416 -10331128 -11198654 -4220716 6015193 11941323 11628786 9341543 8707321 8757256 6709314
42407 6709314 1890162 -3857509 -8077137 -9435483 -8414201 -6505476 -4526411 -2283111
42399 -2283111 -24540 1090146 639392 -268003 -584058 -249381 1078231 4036926 7050659
42390 7050659 6374518 1029087 -4301238 -4181393 1041004 6330153 8278976 7198343
42382 7198343 4023739 -862355 -5563398 -7177582 -5507957 -3474056 -2821240 -2061649
42374 -2061649 184939 2486737 3003439 2542884 3220702 5266598 6736927 5639183 1473089
42365 1473089 -4282249 -8539725 -8836586 -5992768 -3131055 -1422840 1177370 5791280
42357 5791280 9588138 9292508 6214952 4890022 7048185 9576657 8978228 5774124
42349 5774124 3296740 3228873 3698493 1809409 -2736813 -7196179 -8908217 -7940044 -5864815
42340 -5864815 -2919240 1723074 7040533 9997427 9363073 7770598 8405651 11041974
42332 11041974 13051077 13253340 12874253 13225370 14141600 14554272 13379907 10124296 5707758
42323 5707758 2374651 1797381 3519867 5786612 7101041 6456226 3518678 -253415
42315 -253415 -2189496 -1631242 -1081854 -2409157 -3733220 -2590877 -450071 -624408 -2687353
42306 -2687353 -2892018 -68832 2857621 3869637 4462079 5855695 6234706 3942909 607424
42297 607424 -1222248 -1273063 -320766 1853437 4846662 6158674 4232736 1404137 875183
42288 875183 1881150 823971 -3459182 -8367956 -11082312 -10780223 -7596886 -2232610
42280 -2232610 3009329 5276785 4099989 1607286 -550293 -2749343 -5514993 -7931386
42272 -7931386 -8683620 -7424049 -4697845 -1699959 -166403 -988436 -2768314 -3337366 -2830542
42263 -2830542 -3395332 -5591061 -7312233 -7091279 -6229850 -6309655 -6619861 -5899824 -5046889
42254 -5046889 -5894299 -8209502 -10028507 -10516443 -10531223 -10521102 -9826955 -8412624 -7598612
42245 -7598612 -8231815 -9126202 -8174443 -4646390 -765 3312789 3784195 2001474 -3638
42236 -3638 -834348 -996992 -1678890 -2613920 -2080228 876882 5066493 8314845 9289285
42227 9289285 7806442 4242891 -379978 -4141260 -5267634 -3817865 -1765137 -1213674
42219 -1213674 -2987097 -6773720 -11402188 -14458226 -13154523 -7313946 -908472 1309153
42211 1309153 -1117592 -4253958 -4893676 -3697598 -2518281 -1083139 1624256 4369243
42203 4369243 4631241 1898655 -2123355 -5895277 -8381510 -7889219 -3772036 693856
42195 693856 697462 -3648024 -6385194 -3150637 3185209 6783706 6407425 5412601 5548833
42186 5548833 4730572 1427058 -2009346 -2158587 961755 3845597 3384208 -218600 -4186503
42177 -4186503 -6119237 -6036544 -5666275 -6051379 -6423356 -5567810 -3567239 -1615322 -590679
42168 -590679 -447583 -752127 -1344942 -2572990 -4818546 -7318964 -7873533 -5118256 -1115453
42159 -1115453 250094 -1800698 -3593485 -1833425 2231753 5325853 6856435 8436205
42151 8436205 10061222 10006841 8197083 6675249 6487089 6643073 6387080 5910784 4501309
42142 4501309 848417 -3916790 -6238072 -4614250 -1812237 -1100844 -2280351 -3039270
42134 -3039270 -2370607 -806002 1192337 3133583 3914502 3052490 1593503 429905 -1158915
42125 -1158915 -3914104 -6809669 -8329687 -8219990 -6546642 -2831728 1827455 3764345
42117 3764345 930730 -3201484 -3364924 558376 4002079 4897719 6047551 9275862
42109 9275862 11608532 9992417 6531204 5433745 6653032 6290234 2575339 -2121364
42101 -2121364 -5445449 -7935060 -10527244 -11834308 -10099119 -6560219 -4555515 -5339388
42093 -5339388 -6550472 -5416902 -2282415 35430 -198284 -1837437 -2549904 -1223092
42085 -1223092 1688057 5139314 7847309 8343815 6112676 2811238 1193006 2247165
42077 2247165 4110343 4357265 2830118 1558493 2088479 3448106 3007006 -507992 -4821933
42068 -4821933 -5506084 -336115 7944274 14084865 15414026 13429949 10631459 7743368
42060 7743368 4758712 2582442 1758784 926790 -1157734 -2781164 -1076443 3222307
42052 3222307 5480430 2687459 -2782447 -6376215 -6635880 -5424613 -4158737 -2259117
42044 -2259117 771471 3869143 5688103 6059017 5519283 4284740 2252946 -558032
42036 -558032 -3845426 -6697980 -7468247 -5086393 -912885 1846240 1416497 -606500 -1397030
42027 -1397030 -214199 1473680 2540445 3358300 4313635 4591130 3311645 1273922 632682
42018 632682 2663681 6176000 8425714 7708930 4943439 2504265 1707881 1989321 2463341
42009 2463341 3243780 4594733 5682919 5407465 4247309 4086136 5880667 8266373 8897082
42000 8897082 6762446 2886352 -987896 -4050240 -6622895 -8769233 -9290518 -7012508
41992 -7012508 -2992148 -101142 213791 -491997 -270040 379026 -186228 -1692503 -2222365
41983 -2222365 -968197 1316028 4209808 7753112 10851840 11949832 11391115 10667196
41975 10667196 9272166 5406644 360281 -1565860 735903 2675486 408950 -3454344
41967 -3454344 -4258686 -2757109 -3411498 -6525803 -7223027 -2697024 3905109 8071536 8782346
41958 8782346 7306574 4448746 1061262 -1195554 -1701111 -1630822 -1306999 941052 5255480
41949 5255480 7928096 5590716 313997 -2712797 -1996719 -916957 -1847876 -2535038 -49154
41940 -49154 4170706 6036081 4712426 3910826 6526724 10193335 10178581 5820937 1617782
41931 1617782 1401097 3625553 3972718 987821 -3120071 -6304163 -8480336 -9525026
41923 -9525026 -8458924 -5744344 -3970542 -4547347 -5505532 -4485127 -2525472 -2660650 -5402814
41914 -5402814 -7778264 -6975195 -3484723 -395122 -486859 -3986181 -8411574 -10742243 -10207477
41905 -10207477 -8480649 -6855309 -4517968 -610902 3409025 5255150 4768814 3463690
41897 3463690 1784286 -897656 -3711959 -4195330 -1463939 2380468 4836165 5560376
41889 5560376 5728353 6307449 7707371 9788971 11385267 10958331 8461696 5513332 3297470
41880 3297470 1655517 609864 800636 1496708 456807 -2466417 -3647307 -119964
41872 -119964 5731525 8719314 7193590 3891352 1075119 -1632075 -4298630 -5380528
41864 -5380528 -4871275 -5479050 -8387119 -10496045 -8694096 -4838385 -3220991 -4360200
41856 -4360200 -4867105 -3048423 -978373 -468455 -380722 644463 1567940 970623 -360358
41847 -360358 -862421 -611349 -253003 1102639 4454228 8016954 8244860 4018428 -1874066
41838 -1874066 -5685696 -5828109 -3077076 725887 3714840 4983427 5153121 5276562 5035202
41829 5035202 2946418 -1354419 -5851256 -7588204 -5128714 97995 4291260 3806375
41821 3806375 -1378189 -6820894 -7690338 -3899080 87975 698712 -1046115 -1785095 -179764
41812 -179764 2088766 2728652 1172661 -1021284 -1483448 725603 3771023 4661125 2721370
41803 2721370 761900 2154187 7152914 12537025 14652274 12790320 9901070 9635253
41795 9635253 12178284 13858972 11942109 8513815 7419432 8370440 7425544 3340620
41787 3340620 -396641 -1072239 -513731 -1120339 -1557644 369643 3231325 4215410 4119518
41778 4119518 6010624 9717533 11705441 10522050 8746921 8813305 9878935 9815601 7962693
41769 7962693 5015863 2012308 -49601 -1174026 -2931574 -6300222 -9484001 -10313279
41761 -10313279 -10157359 -12041221 -14915794 -13915409 -7455217 -66752 3852408 5371279
41753 5371279 7276981 8385376 5650892 38315 -3965989 -4295120 -3310020 -3691542 -5092064
41744 -5092064 -5405475 -3369928 496337 4077530 4859680 2524547 122246 908589 4223099
41735 4223099 6463455 6000541 4672789 3961284 2477242 -1066843 -4552304 -4739221 -2025591
41726 -2025591 -272149 -1580151 -3561430 -3054438 -776023 -54065 -1616751 -2428721 -547425
41717 -547425 1413139 -80718 -3917726 -5442360 -2898361 294362 579077 -1136933
41709 -1136933 -1685223 -445193 351262 -828299 -3060164 -4542936 -4479259 -3469655 -2899553
41700 -2899553 -3518713 -4022588 -2067770 2323981 5639769 4702600 643370 -2656225 -3188143
41691 -3188143 -1927697 -169199 1687831 2824385 2080738 -89882 -1885454 -2948658
41683 -2948658 -4678726 -6884859 -6593631 -2090272 3587854 5607387 3117377 -117202
41675 -117202 -840738 -87209 -1074399 -4607905 -7826460 -7383058 -3131641 1682198 3754604
41666 3754604 2937509 1930945 2933657 5038936 5221825 1789955 -3414906 -6485523
41658 -6485523 -5292210 -1797259 -223860 -2861234 -8013753 -12031543 -12636665 -10104501
41650 -10104501 -6347865 -3747202 -3926778 -6227906 -7738885 -6232542 -2952072 -1093960
41642 -1093960 -1606209 -2251249 -1259129 32774 -536294 -2480767 -3288630 -1885514 218120
41633 218120 1052813 -120690 -3269809 -7902583 -12168842 -13324338 -10703915 -7395916
41625 -7395916 -7182492 -10066300 -12653832 -13059232 -13120736 -14638686 -15711329 -13271017 -7970511
41616 -7970511 -3500022 -1321595 611307 3189742 3758017 631764 -2815318 -2063751
41608 -2063751 1859677 3279833 -534388 -5971605 -8096972 -6138091 -2358921 2027041
41600 2027041 7097596 11515307 12641409 9987806 6491572 5002423 4647096 2339894
41592 2339894 -2493401 -6669666 -7355492 -5591340 -4132202 -3234275 -1203780 1432240
41584 1432240 1709511 -889479 -2584667 -510198 2793213 3042125 561542 -504278
41576 -504278 1538515 4104700 4874127 4764885 5488421 6951557 8315968 9417133 9957626
41567 9957626 9218631 7602352 6563049 6042654 4078209 215509 -2798362 -2379795 627000
41558 627000 3721506 5992841 7679301 8256074 7408853 6638423 7304332 8000272 6594737
41549 6594737 4164505 3713594 5041691 4404521 269997 -3968585 -5111791 -5139172 -7845303
41540 -7845303 -12157986 -12855099 -8126437 -2594673 -987311 -1749830 8298 4876099
41532 4876099 8255198 7141561 4095416 2918011 3368488 2746567 702619 -717792
41524 -717792 -993280 -1923133 -4318413 -6512255 -6849572 -5700100 -4395285 -3857945 -4693714
41515 -4693714 -6846335 -8686151 -8283329 -6161051 -4902170 -5349983 -5216102 -2462235 1805623
41506 1805623 4980684 5850469 4808741 2886632 1631797 2084138 2610059 -279126 -7321279
41497 -7321279 -14453941 -17087043 -14865887 -10618765 -6497875 -3280702 -1742371 -2040901
41489 -2040901 -2612690 -1829767 16479 1946408 4015279 5928390 5827482 3034204 272947
41480 272947 176292 1214908 605646 -237372 2420794 7856128 10701220 8136001 3030674
41471 3030674 -1052394 -3748591 -5141897 -3333453 2279076 8141661 10109029 8346498
41463 8346498 6356406 6398959 7788602 8569210 7197290 3506798 -773166 -3429858 -4353662
41454 -4353662 -5246482 -6386761 -6107602 -4433959 -4284781 -7126829 -10187647 -10578319 -9712122
41445 -9712122 -10368222 -11342827 -9035313 -3588922 486441 135955 -2935509 -5318534 -5561715
41436 -5561715 -4147262 -2286213 -1601978 -2921543 -4554244 -3701971 -359890 2184178
41428 2184178 1695205 -254877 -1311698 -2164835 -5129714 -9890104 -12960468 -11504798
41420 -11504798 -6255808 -502011 2745538 2583672 523297 -458934 1944360 7268817
41412 7268817 12413229 14408428 13148684 11126683 10516474 11030639 10963613 9751527 8458409
41403 8458409 7656375 6100702 2530646 -1890679 -4299728 -3351176 -628467 1433896
41395 1433896 2068915 2182491 2803251 4326867 6629829 8936462 9884293 8732252 6518604
41386 6518604 5186737 5477016 6443709 7043270 7106585 6458039 4459083 1441825 -471466
41377 -471466 577432 3853948 7098614 9302916 10657457 10219308 6222000 -623432
41369 -623432 -6458677 -8233243 -6646898 -4098479 -1820686 -615237 -1996509 -5835571
41361 -5835571 -8512600 -6579451 -1368167 2974216 4942892 5617949 4252646 -1011366
41353 -1011366 -7496785 -8603948 -2692951 3203874 2235939 -3275822 -6073656 -4435286
41345 -4435286 -3100693 -4898823 -7015696 -6364536 -4040653 -2605787 -2404664 -2750234 -4168907
41336 -4168907 -7092414 -10025365 -11220914 -11107969 -11205795 -11501769 -10760275 -8976015 -7742745
41327 -7742745 -8036480 -8821940 -8108628 -4726388 832656 6568561 10062336 10280600 8485060
41318 8485060 6761913 5587462 3529900 -457744 -5195041 -8217500 -8110141 -5484243
41310 -5484243 -2182982 -194658 -819151 -3681252 -6430558 -6529672 -3869882 -860815 404678
41301 404678 39400 -1044646 -2891851 -5508479 -7403363 -7168812 -5955872 -6267415 -8427591
41292 -8427591 -10344901 -10855569 -11007122 -11506850 -11240612 -9401613 -7077069 -5447665 -4175371
41283 -4175371 -2842445 -2148425 -2142837 -1069704 2132568 5691703 7341412 7365106 7093038
41274 7093038 5765134 1767770 -3610749 -6599775 -5396387 -1969765 872616 2216020
41266 2216020 2416556 1593249 -391113 -3328807 -6308754 -7455416 -4833888 1033642
41258 1033642 6322496 7435309 5029280 2777083 2618166 3374293 3776748 4288080 5411034
41249 5411034 6339518 6099055 4578720 2179605 -26560 25246 3349359 7380288 7978900
41240 7978900 4677317 1612289 2280825 5515958 7725810 6973475 3538686 -1434424
41232 -1434424 -6046215 -7996878 -6751727 -4534697 -3958340 -5513736 -8019608 -10035071
41224 -10035071 -10051267 -7252911 -3400697 -2051148 -4307615 -7149367 -7674258 -6941266 -7330093
41215 -7330093 -8168102 -7231297 -5294187 -5370374 -7522090 -8099908 -5100195 -1196983 204688
41206 204688 -423293 -186730 1656198 2960041 2204842 708789 666310 2077264 2621207
41197 2621207 469136 -3418742 -6128608 -5741139 -3114046 -679317 301649 1077928 3839432
41188 3839432 8643047 12262344 11076912 5382237 -373332 -2464067 -1703754 -1075428
41180 -1075428 -1131689 -288327 1218122 1048825 -1216549 -2999666 -2742881 -2050376 -2304676
41171 -2304676 -2059136 -3200 2010964 1677134 96326 -16706 1319791 1771580 636962
41162 636962 -528959 -902162 -1277772 -1812416 -1156166 1624515 5649771 8936725 9764486
41153 9764486 8072643 6363713 7709588 11445855 12826945 9157252 4103078 2760905
41145 2760905 4387983 4138685 693124 -2738184 -4614695 -6836352 -9434509 -8928419
41137 -8928419 -4257544 306782 1151152 298451 1129099 2703753 2258485 486080 965
41128 965 584554 379789 344077 2781765 6052547 5609546 859215 -3390886 -3634767 -1990918
41118 -1990918 -1937789 -3004417 -2301652 869129 4622805 7443538 9197153 9894222 9414098
41109 9414098 8189860 6768466 5036051 3009521 1756314 2121119 3054145 2858200 1934397
41100 1934397 2501556 5184832 7459656 6382871 1871923 -3570081 -7586276 -9523373
41092 -9523373 -9918496 -9589368 -9193826 -8915275 -8431448 -7447325 -6024067 -4198841 -2004798
41083 -2004798 -458362 -1558865 -5954580 -11136442 -13651498 -13117245 -12308048 -12951510 -13422020
41074 -13422020 -11609335 -8247208 -5697308 -4647763 -3953825 -3091245 -2783893 -3315528 -4005606
41065 -4005606 -4609368 -5749479 -7543749 -9042261 -9503982 -9156592 -8139936 -5681507 -1189210
41056 -1189210 4257330 8230261 8903630 6689627 4041633 3388643 4921616 6627537
41048 6627537 6741187 5606945 4605285 3959057 2648305 252960 -2070563 -2518923 -150116
41039 -150116 4179268 8025615 9252183 8282402 7560910 8180847 8443692 6786159 4349713
41030 4349713 2829685 1453666 -1449474 -5233585 -8049269 -9799132 -10545740 -7276442
41022 -7276442 2897467 16142056 23656238 21768735 15930536 12585671 11619018 10026219
41014 10026219 8624336 10105795 13013705 12972753 9082892 4645030 1867438 -58480
41006 -58480 -1558474 -1399990 272915 979079 -643578 -2792879 -3004870 -808954 2697528
40997 2697528 5860128 6560472 3715100 -321981 -1085376 2876060 7901900 9537078
40989 9537078 7390542 4373464 2653380 2157056 2153591 2435073 2996171 3752616 4697841
40980 4697841 5716811 6299820 5815492 3950876 871097 -2542871 -4569630 -3567761
40972 -3567761 522569 5959017 10536518 12693463 11647205 7667622 2530080 -1339576
40964 -1339576 -2767969 -2415843 -1480595 -674932 -398150 -610974 -296231 1535260 3810688
40955 3810688 3918741 1164314 -1779928 -2161665 -629533 149894 -687079 -1752848 -2238315
40946 -2238315 -2877761 -3730014 -3073568 263567 4624062 6853316 5553392 2312388 106564
40937 106564 1036325 5040822 9927228 12875965 12765625 11060312 9852152 9253731 7612966
40928 7612966 4259057 821618 -741012 -472157 33414 -304802 -1347466 -2497664 -3094490
40919 -3094490 -2467291 -770592 525449 256839 -537758 149303 2211352 3420669 2890155
40910 2890155 2465369 3554926 4494133 2944622 -266358 -1812612 -25447 3292174
40902 3292174 5123243 4007835 712218 -2576011 -3664305 -2011738 869960 3168044
40894 3168044 4437038 4808289 3526615 -89967 -4664077 -7673507 -8664424 -9876255
40886 -9876255 -12878165 -15858290 -15476708 -10984972 -5459228 -2661055 -3150803 -4116193 -3081337
40877 -3081337 -782576 599098 1060504 2456083 4717996 5313940 3606518 2831941 5409248
40868 5409248 8613214 8000162 3657708 -167664 -664015 1600828 5464558 10051889
40860 10051889 12937151 11422377 6602679 2855806 2219241 2309010 837315 -1087380
40852 -1087380 -1683345 -1359102 -854596 732258 3807335 6417371 6712942 5414467 4088813
40843 4088813 3120821 3077058 5361051 9157152 10470916 7268361 3199973 2777199 5004718
40834 5004718 5835757 5161719 6350931 9279764 9075967 3170650 -4422569 -7847997 -5680675
40825 -5680675 -870583 3160700 4732576 4182068 3511704 4408514 5787648 5071610 2593099
40816 2593099 2184467 5763765 9772250 9637823 6215867 4617667 7009119 9740343
40808 9740343 8545732 4089082 462509 -357572 -121555 -598399 -808212 773921 3054832
40799 3054832 3555860 2053595 539549 -417855 -2491189 -5862993 -7477821 -5034549
40791 -5034549 -581502 2318999 3292499 4233079 5194475 4715494 3515308 3985708 5836293
40782 5836293 6113309 4378315 3891454 5929774 6864953 3836901 92645 708048 5023698
40773 5023698 7800849 7198504 6987600 9956592 13148051 11941087 6289918 319137
40765 319137 -2765726 -2804712 -625975 3192153 7049176 8283863 5989847 2668057 1556732
40756 1556732 2940662 4483062 4665722 4074279 3243296 1365242 -1771838 -4182932 -3690279
40747 -3690279 -735260 2306207 4083863 5126355 6179820 7225684 7946381 7697477
40739 7697477 5222567 81544 -5605702 -8648558 -8397416 -7182070 -6684283 -5753248 -2777810
40730 -2777810 1491300 4871829 6284710 6035531 4598183 2516269 797922 147756
40722 147756 295164 886489 2078754 3242198 2391176 -1352108 -5603577 -6994939 -5185314
40713 -5185314 -2745116 -1408165 -554480 605100 1662248 2447445 3823395 6125259
40705 6125259 8377876 9744765 10048457 8302448 3161620 -3824782 -8034967 -7178572
40697 -7178572 -4600317 -4158167 -3918015 726190 8731708 13562107 12374686 9649031
40689 9649031 9337006 8570488 3330396 -3723536 -6643044 -5026399 -3506125 -3478130 -1693602
40680 -1693602 2443269 4609173 2835802 1395411 3911299 7205866 6369306 2467537
40672 2467537 380402 1370639 2802042 3744910 5608840 7481008 5903635 357719
40664 357719 -5014272 -6619262 -5289114 -3693089 -2744211 -2125662 -1966975 -2155516 -1569567
40655 -1569567 479541 3056342 4676319 4540947 2456330 -912090 -3385740 -2758117
40647 -2758117 386220 3056960 3713675 3919126 5356480 7166035 7565852 6577227 5636373
40638 5636373 5453105 5511306 5110747 4026726 2487394 864598 -905240 -3287137 -5888556
40629 -5888556 -7027643 -5808412 -3719487 -2515321 -1683331 -312648 -44187 -2624647
40621 -2624647 -5324455 -3215249 3577691 9241640 9903346 7592855 5281846 2802534
40613 2802534 117123 -154910 2812210 4917723 2587194 -1685074 -3384417 -2827390
40605 -2827390 -3495292 -5724270 -6758942 -5610743 -3361811 161714 5465892 10006186
40597 10006186 10424487 7995295 7488245 10386050 13153899 12517593 8742130 3426249
40589 3426249 -2124407 -5696509 -4977729 -683857 3809594 6476277 7795359 8120949
40581 8120949 6998179 5033120 3277590 962270 -2810219 -5684006 -4491847 -793591
40573 -793591 663318 -908258 -1807398 -854390 -1075723 -3067862 -2998293 147979 1530105
40564 1530105 -1511904 -4074849 -1177497 4306763 6731809 6435902 7071347 7470532 3413526
40555 3413526 -3922901 -8251926 -6945431 -3546574 -1086716 1428288 4723948 6722736
40547 6722736 6297681 5321828 4902313 3249316 -526491 -3787383 -4016772 -2463281 -1659301
40538 -1659301 -1433716 78436 3014549 5796552 7561230 8496699 8486672 7315934 5810351
40529 5810351 5169933 5450623 6101754 7656208 11148542 15576410 17624593 15127777 10033753
40520 10033753 6513852 6141361 6305660 3979653 -324047 -3738625 -5122674 -5750954
40512 -5750954 -6160782 -4928910 -1467847 2229387 4129842 4749064 5704648 7238219 8713669
40503 8713669 9949131 10268507 7968111 3081563 -759874 -13548 4031683 6837489
40495 6837489 6316269 4295708 2830107 2018007 1490931 1217648 439976 -1658926 -3802050
40486 -3802050 -3535603 -725999 2204490 3883116 5241288 6584881 6199068 3099161
40478 3099161 -1131885 -4540162 -6838081 -8093312 -7432368 -4530715 -871278 1708165
40470 1708165 2502048 1397010 -1415923 -4500002 -5826533 -5190669 -4249607 -3762043 -3067503
40461 -3067503 -2742431 -4801980 -9115106 -12539984 -13067910 -11965090 -10464412 -7880984
40453 -7880984 -4973411 -5102395 -8898052 -11620013 -9826933 -7071095 -8038153 -10350875
40445 -10350875 -8535025 -3952599 -3353992 -7900182 -11305332 -10336149 -9707193 -13269414
40437 -13269414 -16934779 -15314277 -10478591 -8400476 -9887060 -10875917 -9949603 -9790658
40429 -9790658 -11482969 -12536778 -11460544 -10168496 -10410230 -11018062 -10395303 -9323156 -9470788
40420 -9470788 -10655031 -11088216 -9365241 -5302067 -1724 3936740 3600914 -1203967
40412 -1203967 -6584182 -7738859 -3767260 1555479 3996480 3036673 1382147 1201035
40404 1201035 2176792 3245102 4511505 6245913 7274377 6392063 4794229 4662764 5272017
40395 5272017 3341864 -1778122 -6218679 -6803337 -5486058 -5861038 -7543596 -7638929 -6232459
40386 -6232459 -6045631 -7056407 -6130595 -2844404 -1196259 -3489209 -6275310 -5203835
40378 -5203835 -1108851 1692929 1002813 -2275590 -6737762 -10683593 -11166647 -6653617
40370 -6653617 -324492 2604018 1012678 -1439181 -1749270 -645321 162105 583253 773972
40361 773972 -154692 -2389113 -4328505 -4726485 -4220800 -3434619 -1410548 2428805 6424220
40352 6424220 8705104 9810909 11374103 13267604 14118343 13827747 13337041 12318582 9473546
40343 9473546 5300834 2404010 2360634 3962103 5304665 6060640 6606755 6243255 3918907
40334 3918907 287311 -2422989 -2782844 -1441126 228868 1786502 3284680 3895388
40326 3895388 2373892 -856503 -3309758 -3001731 -664701 1500533 2486679 2649068 2059589
40317 2059589 676146 -156774 1165460 3400723 3002537 -1001827 -4969079 -5237787 -2760171
40308 -2760171 -985647 -961680 -1320744 -1775507 -3242083 -4927022 -4724954 -2860566 -1933610
40299 -1933610 -2519845 -1899069 1281804 3953773 2633586 -1464198 -3974410 -3005059 -773079
40290 -773079 -77788 -1343579 -3218612 -4288603 -3829185 -2231869 -1091908 -1752594 -3346565
40281 -3346565 -3356340 -806464 1977077 1902197 -835780 -2484328 -158760 4312684 6314134
40272 6314134 4143363 1100785 977366 3072638 3688481 1651758 -409551 -553719 -446874
40263 -446874 -2296572 -4996860 -5543163 -3213180 -241401 1173846 691029 -1023996 -3034219
40254 -3034219 -3880746 -2431856 343947 1832695 850561 -754357 -478089 1668927 3449847
40245 3449847 3379711 2147977 1011085 38280 -1278405 -2495428 -2524441 -1344186 -230086
40236 -230086 -12470 -267563 -772850 -2347202 -4974682 -6376373 -4579032 -1374841 -740555
40227 -740555 -3537969 -6266131 -5987695 -4023609 -3074877 -2912487 -1533843 813690 1905744
40218 1905744 1505113 1902771 3797163 4481405 1877167 -1676853 -2120966 745118 3013000
40209 3013000 2221822 613696 1288333 2974708 1502121 -3697608 -7718586 -6473324
40201 -6473324 -2494944 -1581558 -4831967 -7596104 -6612108 -4498470 -5289207 -8369497 -9695838
40192 -9695838 -7400427 -3177270 1121697 5196037 8449818 9209424 6864593 3004569
40184 3004569 -633769 -4000431 -7480657 -10008650 -9967139 -7714791 -5906879 -6678241 -8906964
40175 -8906964 -9004769 -4777792 1915463 7000357 8362107 7156435 5173776 2733357
40167 2733357 -18773 -1513651 -189405 3372303 7243051 10333163 12366730 12616409
40159 12616409 10590605 7559420 5585526 5228835 5684524 6556947 7560289 7115893 3890695
40150 3890695 -220921 -1405968 1047731 3508123 2862091 380647 -713942 398730
40142 398730 2011966 2713730 2434615 1494787 344181 -52722 1083767 3241886 4953354
40133 4953354 5213790 4353425 3852074 5256607 8567467 11816932 13224606 13454737 14256054
40124 14256054 15280992 14640107 12756814 12548156 14443766 14361144 9213045 2043896 -1568974
40115 -1568974 -710673 806734 740508 766258 2061172 2436956 -14513 -2944709 -2184130
40106 -2184130 2651036 7217598 7377526 3845096 1372674 3693600 9605980 14087822
40098 14087822 13150124 7372305 786279 -3018571 -3352302 -1881856 -686622 -698725 -1309064
40089 -1309064 -1423032 -1071793 -1492928 -3304227 -5468677 -6853001 -7953438 -9869569 -12143220
40080 -12143220 -13048780 -11892019 -9747095 -7891343 -6663547 -5970729 -5803437 -5917666 -5777427
40071 -5777427 -5037558 -3615823 -1527732 708401 2037890 2269008 2947368 5439941 8585396
40062 8585396 9979967 9373221 8710507 8690238 7767628 5420856 3843156 4664468 6137856
40053 6137856 5889791 4766000 5040769 5853124 3976448 -630851 -3500765 -1339528 3640530
40044 3640530 7036553 7698713 7323736 6339661 3684461 364147 -341871 2674103 6451125
40035 6451125 8083131 8437389 9753538 11534922 11532574 9583302 7464745 5432515 2036491
40026 2036491 -2354427 -4869540 -3927419 -1140635 1651253 4634900 7816400 9303964
40018 9303964 8210128 7102526 8622391 11169305 11188056 8846377 7864704 9710867 11572451
40009 11572451 11097507 9901261 10398974 11594529 10677905 7624352 5535070 6402320 8628600
40000 8628600 9487019 8629061 7894142 8235651 8442029 7476675 6774562 8611758 12561936
39991 12561936 15432766 15094602 12594097 9794269 6986315 4175627 2567151 2548067
39983 2548067 1944622 -945109 -3910379 -3642627 -1109772 -376743 -2243591 -3217403 -1622830
39974 -1622830 -450319 -2083606 -3968521 -2563074 1183311 3668874 3981545 3895576 3847684
39965 3847684 2685007 1131093 1894360 5495768 8719501 8564842 6046987 4826732
39957 4826732 6999547 11068925 13532432 12088912 7742551 3829438 2596578 3072202
39949 3072202 2850812 1266814 -304741 -736574 -258492 562431 1431129 1745837 915592
39940 915592 -166353 738930 4592743 9278776 11413566 9786430 6337543 3788371
39932 3788371 2986626 2939043 2950434 3737771 6029552 8880176 10386139 9767718 7716130
39923 7716130 5008606 2248687 913806 2663724 6836730 10405246 11587255 11972945
39915 11972945 13741308 16271919 17167712 15317909 11143147 5177581 -1267248 -5132224
39907 -5132224 -4225496 -610629 1284907 107512 -1354652 -766206 895115 1983759
39899 1983759 2976923 4841544 6560467 6433399 4861207 3929048 4521744 5248918 4291338
39890 4291338 1525455 -1277040 -2123850 -827839 722622 754985 -228758 -259067 1577640
39881 1577640 4636295 8307493 12353764 15690083 16865998 16204146 15459380 14765905 12254291
39872 12254291 7854531 5015983 6572707 10724380 13491899 13807417 13594320 13795209
39864 13795209 13384395 12313493 12488899 14771286 17041737 16608987 13398814 9671148
39856 9671148 7337701 6515405 6324327 6248752 6531038 7479633 8708387 9455572 9655746
39847 9655746 10056905 11052950 12219863 13419789 15296905 17895500 19940972 20676824 21300986
39838 21300986 23012960 24667234 24421781 22991316 22752786 23805208 23729644 21805864 20593079
39829 20593079 21885008 23579454 22771503 20304555 19759625 22660315 26908654 29768876
39821 29768876 30491184 29881162 28954093 28513066 28952149 30045689 31584718 34126641 38149841
39812 38149841 42543604 45227450 45712544 46073255 48817590 54468911 61665135 68938286
39804 68938286 75861086 82988235 91236269 101031246 111775145 122523034 133306609 145154116
39796 145154116 158668521 173623722 190507408 211195959 236783370 265583226 294984230
39789 294984230 324880271 357213378 391886192 425326824 454078810 477634465 495787900
39782 495787900 504940425 500131253 480698428 451464354 417952069 382675454 346623410
39775 346623410 311591422 279275366 250070875 224716964 205223522 191607420 179301456
39768 179301456 163262878 144194534 127269412 114726430 103741509 92609292 84413464
39761 84413464 81436721 79568491 72985211 62685039 55368074 53968098 54164047 51494520
39753 51494520 47284378 44647441 42253288 36434529 27994067 22478469 23189055 27213494
39745 27213494 29630388 29167342 27898137 27032437 25458055 22317906 19067555 17984469
39737 17984469 19368632 21198884 21497885 20174046 18168651 15771998 13070759 11610209
39729 11610209 13495355 17905165 20314709 17171975 10530946 5960162 6182073 9019609
39721 9019609 11681477 14259139 17661558 20589358 21143861 20280664 20918071 23634219 25594963
39712 25594963 24433841 21363601 19317165 19301810 20035899 20513590 21227781 22514691 22954959
39703 22954959 20576054 15506407 10491194 8257876 8803037 9874350 9803316 8951247 8370315
39694 8370315 8238991 8281566 8790029 10170511 11959218 13338642 14371853 15677422 16977803
39685 16977803 17079824 15503476 13198651 11330985 10151450 9399970 9008596 8824365 8211653
39676 8211653 6626578 4410141 2518824 1419568 476013 -1335874 -3851219 -5045610
39668 -5045610 -2867741 1776410 4971045 3935443 359452 -2074939 -2744469 -4158881
39660 -4158881 -7094111 -8898676 -7945014 -6681457 -7738931 -9389681 -8209186 -4723209
39652 -4723209 -2503202 -2176282 -610446 3235004 5889472 4821937 2698721 3203029
39644 3203029 5400439 5995908 5314286 6629293 10111122 12031940 10842382 9831099
39636 9831099 11721261 14140533 13414890 10317273 8544514 8966165 9021011 7245664 4855266
39627 4855266 2733250 335263 -1695634 -1287146 1219856 2248359 210134 -1414934
39619 -1414934 792388 4563807 5423534 4043447 5124714 9120646 10533162 6395930
39611 6395930 1722011 2831088 8392692 11570821 9619377 6776747 7524951 11093241
39603 11093241 13992615 14667169 13400468 10018224 4660449 -162770 -1253692 1222019
39595 1222019 3594302 3426821 2560517 3981990 6998628 7788391 4630581 277706 -1900798
39586 -1900798 -2237549 -3290014 -5254550 -5653706 -3753248 -2447269 -4204419 -7152341
39578 -7152341 -7389934 -4115218 -157775 2180545 3510136 5314391 7570947 9264781
39570 9264781 9866437 9411207 8096108 6479410 5208564 4110947 2635843 1570077
39562 1570077 2689340 5714221 7328337 5030346 780146 -1351695 -475158 563121
39554 563121 -356272 -2362702 -4313423 -6897810 -10449092 -13010548 -12850519 -11280437 -10489103
39545 -10489103 -9829059 -7218239 -3613903 -2687263 -5587466 -9163115 -10427834 -9796567
39537 -9796567 -8372505 -5252634 -292108 3070809 1569816 -2554200 -3809365 -754510
39529 -754510 2509523 2347691 -383251 -2987017 -4143982 -3228274 198039 4215597 4831639
39520 4831639 942457 -3348499 -3950649 -2098531 -1513970 -2391699 -2001454 13601 1185663
39511 1185663 875848 1283211 3134897 4113959 2916578 1574129 1942738 2821363 2837690
39502 2837690 3606775 6968578 10740423 10698753 6479930 2448784 2112999 4107659 4854601
39493 4854601 3319016 1400170 612922 430597 72315 194430 1713364 3925123 5277114
39484 5277114 5732705 6801122 8985850 10815568 11104669 10562666 10013995 8624696 5615404
39475 5615404 2363700 586832 -558855 -2920132 -5393844 -4551048 377969 5857735
39467 5857735 8327599 7942391 7088757 7186726 8043402 8646200 7627096 4580535 1696864
39458 1696864 2249096 6600818 11563195 14388439 15140467 14377738 11523949 7244450 4499665
39449 4499665 4766059 5575200 4341300 2312060 1881551 2354625 1951194 2072330 5304998
39440 5304998 10123613 11850425 8840879 4033238 320416 -2022268 -3165595 -2812596
39432 -2812596 -2200571 -3507530 -6215846 -7193797 -5355564 -3063796 -1866032 -312327
39424 -312327 2371108 3842812 2196029 -819368 -2610059 -3520375 -5331275 -7864896
39416 -7864896 -9526631 -9754782 -8758862 -6187112 -2106600 1871368 4163323 4668659 3413937
39407 3413937 -200825 -5057489 -7576668 -5796963 -2184432 233566 2335071 6234875
39399 6234875 10231948 10709209 8072081 6331845 6858527 6850792 4615417 2251104 1778020
39390 1778020 2280670 2698918 4210561 7516485 10306230 10016335 7433783 5255016 4383462
39381 4383462 3895406 3726078 5034563 7985468 10920632 12112174 11436351 10051201 8806238
39372 8806238 7128105 3722982 -1263062 -5333843 -5900503 -3107025 743090 4018216
39364 4018216 6351603 7040470 5454941 3235782 3312976 5861881 7805936 7421588 6687568
39355 6687568 7474633 8228749 6782964 4034703 2008823 208029 -3006860 -6847520
39347 -6847520 -9132593 -9900173 -10768702 -11339932 -9515897 -5253973 -1033486 1397563 2058446
39338 2058446 945575 -1597105 -2977661 -569918 3780958 5269311 2925102 879981
39330 879981 1566094 2095912 -150458 -2595531 -1743247 1044809 2363357 2804234 5363511
39321 5363511 9300697 10616677 8374312 5895674 5225185 4744086 3372302 3062752 5190274
39312 5190274 7753281 8444022 7966123 8067433 8491588 8361551 8879592 11927265 16790195
39303 16790195 20551520 21361359 19634297 16591835 13402726 11436815 11648173 13574244
39295 13574244 15979499 18271989 20416880 22097090 23155394 24241708 25666421 26241692
39287 26241692 24868270 22741317 22024595 22482748 21553043 18100703 14020980 11323484
39279 11323484 9588155 7618818 5951665 5798073 6349727 5214060 1667038 -2048418
39271 -2048418 -3228077 -1561796 1140022 3381601 5154053 6701374 7227391 5865768
39263 5865768 3605504 2775817 3973534 4812904 3081939 180664 -545633 1458436 3247283
39254 3247283 2835367 1907587 2691084 4222215 3943893 1789412 225913 632672 1867479
39245 1867479 2498094 2449238 2041859 1172146 80315 -518068 -656073 -1075289 -1412690
39236 -1412690 -56509 3244216 6196651 6736318 5702876 5217396 5498261 5147128 3875453
39227 3875453 2860503 2512644 1786341 -13117 -2183544 -3505321 -2832387 924142 7422861
39218 7422861 13372879 14707210 11131851 6554160 4178485 3461175 3047758 3753486 6089393
39209 6089393 7335404 4747651 346101 -1410095 -188778 91345 -2094207 -3577280
39201 -3577280 -2273454 -949899 -2495461 -4932817 -4721291 -2516245 -1609602 -2191590 -1484556
39192 -1484556 872612 1866023 252191 -998763 1044885 5209313 8024978 7746202
39184 7746202 5307027 2929157 2812110 5476069 8320412 7584863 2957202 -1524792
39176 -1524792 -2521662 -1514838 -2185456 -5442392 -9252656 -12008612 -13479611 -13266395 -11078475
39167 -11078475 -8409233 -7415574 -7862376 -7380310 -5115697 -2891231 -2042085 -1316831 758752
39158 758752 3144986 3546687 1384931 -1940054 -5051348 -7493717 -9019207 -9239074 -8080121
39149 -8080121 -5968383 -3703967 -2519822 -3622172 -6792029 -9773693 -10034738 -7269988
39141 -7269988 -3635918 -1506080 -1400858 -1985232 -1565911 471745 3351396 5835492 7311040
39132 7311040 7649580 6291348 2618815 -2261065 -5319668 -4512451 -1355391 728535
39124 728535 370736 -820333 -1156810 -906138 -861601 -552602 809659 2519912 2834258
39115 2834258 868938 -2841362 -7124402 -10463146 -11069429 -8201403 -3628180 -655400
39107 -655400 -1176657 -4136391 -6856975 -7223723 -4808390 -1009694 1653244 1414413 -1018350
39098 -1018350 -3153595 -3280423 -1732229 177102 1248571 438506 -2457296 -5462505
39090 -5462505 -5420423 -1598384 2858608 4263845 2123411 -1464364 -4537800 -5728259
39082 -5728259 -3682155 1251386 5545556 5651725 2652609 1103786 2962303 5377980
39074 5377980 5176279 2751095 264305 -1423718 -2264320 -1706920 -61714 491466 -1445143
39065 -1445143 -3970760 -4170918 -2031743 -52440 237508 -693346 -2109201 -3492347 -3661874
39056 -3661874 -1688030 1276517 3069495 3469340 4109495 5376091 5603577 3922870 1852999
39047 1852999 1074212 1228200 995086 107213 -713859 -877900 -212743 1004605 1788683
39038 1788683 1271906 300478 909101 3374185 5056410 3394308 -816545 -4371360 -5306279
39029 -5306279 -4445140 -3719743 -4184268 -5707034 -7572184 -8877332 -8722705 -6540806 -2637857
39020 -2637857 1444139 3625275 3144329 1618638 1384297 2693241 3447461 1885346 -1455356
39011 -1455356 -4776347 -6959957 -7860302 -7544178 -6071800 -3638350 -520442 2649088
39003 2649088 4433266 3353232 -391857 -4695473 -7477516 -8188183 -7235734 -5072568
38995 -5072568 -2398769 -140747 1581365 3567404 5942713 7501130 7467876 6810898 6715984
38986 6715984 6733589 5672326 3546183 1388358 -198598 -1090989 -918312 391491 1867479
38977 1867479 2567529 2901185 3644544 4224759 3439419 1473030 -272642 -1051065 -1050077 -193738
38967 -193738 1650024 3397560 3425539 1745318 112916 -119970 1063272 3395284 6580632
38958 6580632 9360774 10051053 8380397 5363917 1413256 -3444267 -7417338 -7724220
38950 -7724220 -4514723 -1505830 -1166082 -1580322 -122086 1921382 1215486 -2461420 -5981087
38941 -5981087 -7305641 -7287064 -6992830 -6040606 -4351807 -3229194 -3454116 -3878137 -3005805
38932 -3005805 -835443 1619714 3458876 3961291 3003595 2206454 3988056 8193376 11265215
38923 11265215 10556955 8157658 8182489 11099855 13340774 12320273 9088873 5580078
38915 5580078 2113783 -1059877 -2414090 -1611836 -1407998 -4296082 -8274868 -8900596 -5350181
38906 -5350181 -1577767 -944574 -2339112 -2731297 -1264114 863324 2827207 4481310
38898 4481310 5258762 4656099 3271831 1919718 468504 -884744 -302379 3186101 6305954
38889 6305954 3977661 -3753790 -10148519 -9467059 -4305374 -2260201 -6199178 -11373841
38881 -11373841 -12670317 -11042023 -10410001 -10962446 -9455239 -5353027 -2412229 -3027275
38873 -3027275 -4547696 -3503514 -775844 475409 102966 500683 1761891 1336692 -1254655
38864 -1254655 -3280537 -3504855 -4374473 -7473715 -9924627 -8184439 -3418127 -215468
38856 -215468 -1075422 -4451837 -7289501 -7504724 -4962213 -1848307 -1061841 -2696958 -3585763
38847 -3585763 -1841737 397303 975356 1742247 5082155 8684178 8212794 3930961 146751
38838 146751 -1106776 -1143039 -86249 3216662 6532300 5395642 303694 -2925936 -2018803
38829 -2018803 -1708125 -5385945 -9038045 -7814258 -3660327 -1142382 299877 3935663
38821 3935663 8378528 8954181 5175835 1252488 -202393 66945 1800335 5497349
38813 5497349 8785388 7674500 2388506 -2263599 -3160768 -1778313 -514348 -216918
38805 -216918 -1782169 -5727586 -9283992 -8450485 -4177028 -1862051 -3159834 -3367019 594522
38796 594522 4769097 4418598 1151156 -772010 -1600608 -4306721 -8123794 -9431033 -7963146
38787 -7963146 -6983684 -7522046 -7120498 -4706464 -2512743 -2179413 -2391794 -1476539 545720
38778 545720 3427090 7433092 11532823 13358173 12165038 9702899 7217109 3949702
38770 3949702 -239099 -3336636 -4140579 -4638499 -7077325 -10042638 -9952328 -5905269 -867374
38761 -867374 1964005 2269894 1864304 2210086 3180311 3501112 2029059 -981353 -3689995
38752 -3689995 -4017121 -1290695 3353622 7768315 9863860 8688427 5239428 1910341
38744 1910341 419580 363463 267429 -292465 -440641 217855 571201 -732921 -3511885
38735 -3511885 -6068802 -6768859 -5256025 -2425300 238227 1384973 542759 -1566356
38727 -1566356 -3769039 -5582914 -7127445 -7866212 -6495340 -2880003 788439 2153647
38719 2153647 1654334 1807400 3591242 5314851 5522453 5111938 5433991 5909432 5138043
38710 5138043 3226623 1291045 -523774 -2746728 -4886607 -5795213 -5314764 -3945899
38702 -3945899 -1510874 1892007 4276006 3707950 1714527 1879532 4654114 6596517
38694 6596517 5732695 4461062 5274769 6559403 5408893 2461629 772101 1173907 1899992
38685 1899992 2106821 2681728 3597606 3255873 993893 -1768250 -3266611 -2742416 -258438
38676 -258438 2997520 4539594 2927307 256283 103164 2963028 5998925 7209848
38668 7209848 7076534 5949934 3177647 -227839 -1406683 277719 2044058 2347191
38660 2347191 3482214 7111154 10433190 10233493 8183439 8142317 9976419 10260341 7997624
38651 7997624 5316022 2999240 -197665 -3566183 -4218703 -1877077 135882 208273 1023071
38642 1023071 4793086 9239500 10968972 10351728 10261625 11708644 13254712 13454466 11647769
38633 11647769 7524062 2109994 -1688869 -1586939 1494512 4659576 5943385 4776743
38625 4776743 1090921 -4000118 -7669070 -7783168 -5497245 -3725257 -3414019 -2898373 -603034
38616 -603034 3058438 6315871 7685119 7462006 7984281 11058527 14585269 14045410 8798340
38607 8798340 4256617 5218874 9333438 10510534 7031468 2390254 -694589 -2708645
38599 -2708645 -4125906 -4200722 -3494337 -3657053 -4016747 -2291465 526377 381922 -3162924
38590 -3162924 -4883976 -1161831 4486814 6347241 3892665 760223 -1109702 -2430319
38582 -2430319 -3271210 -2612534 -612426 1533655 3352076 4414557 3220230 -447147
38574 -447147 -3348051 -2370015 458118 157486 -4085894 -7617872 -6743447 -3149784 -751104
38565 -751104 -991834 -2879614 -5332761 -7439091 -7711900 -4917987 693184 7559284 13385250
38556 13385250 15467008 12272645 5762962 674073 45062 2305254 3971576 4246628
38548 4246628 5241201 8047202 10647655 10602548 8553244 7520376 8831787 10267310 9154704
38539 9154704 6236104 4733748 5759662 6659636 4702072 765421 -1889915 -1290307
38531 -1290307 2103819 6736021 10876826 13130725 13626860 13970795 14656985 13763356 10073470
38522 10073470 6055918 4999916 6176701 6178730 4694003 5081096 8525462 11500411 10809724
38513 10809724 7863155 5586312 3894736 1221599 -1493733 -1708779 809985 3977333
38505 3977333 6719325 9377500 10920816 8858417 2918035 -3449480 -6613270 -6479748
38497 -6479748 -5625660 -5859667 -6792231 -7061134 -5761959 -2880765 710446 3512552 4266072
38488 4266072 2962426 884895 -570400 -1142185 -1667150 -2802100 -4069638 -4451257 -3710467
38479 -3710467 -2631473 -1956085 -1664487 -1596603 -2350669 -4949662 -9338349 -13345783 -13798119
38470 -13798119 -9566270 -3508817 -123670 -574666 -1354377 823966 4185016 4252482 375297
38461 375297 -3068451 -2463202 853629 3360126 3641162 2025335 -1617605 -6798051 -10553836
38452 -10553836 -9999985 -6537529 -4605266 -5843524 -7184285 -5734397 -3093509 -2911225
38444 -2911225 -5661551 -8085271 -7407901 -4175195 -641332 2079759 4416881 6883609
38436 6883609 9285156 10967535 10919405 7986179 2300602 -3422933 -5672785 -4169156
38428 -4169156 -2797096 -5122834 -9985360 -13224169 -12876624 -10386292 -7173358 -3045396
38420 -3045396 1312701 3240264 1350434 -2061363 -3781618 -3456011 -2834996 -2590399 -1981815
38411 -1981815 -857394 103445 822512 1805953 2890349 3311432 2689555 944052 -1930821
38402 -1930821 -4795804 -5328814 -2921372 -510874 -1188273 -3761069 -4385797 -2263509 -725341
38393 -725341 -2349068 -5951313 -9306690 -11995885 -13948791 -13533579 -9378206 -2927963
38385 -2927963 2642099 5446801 5710503 4496371 2848247 1484212 221270 -1819139
38377 -1819139 -4730048 -7252982 -8308003 -8182665 -7554272 -6442655 -4967381 -3930443
38369 -3930443 -3533076 -2638358 -567812 1480917 2291246 2810498 4577945 6747211 6923685
38360 6923685 4764966 2429985 1100490 -616986 -3704132 -6059634 -4670546 346735
38352 346735 5518318 7650716 6462962 3617458 439543 -2679182 -5242302 -6055705
38344 -6055705 -4214379 -646968 1823645 725163 -3372846 -6888367 -6696793 -3523290
38336 -3523290 -1100116 -1758416 -3812533 -4072167 -2143341 -851186 -2529339 -6399885
38328 -6399885 -10089459 -12279932 -12776178 -11102461 -6779238 -869858 4120517 6248642
38320 6248642 5425540 2875520 149975 -1458512 -1523609 -675643 439328 2155754 4841432
38311 4841432 7291935 7488347 5148957 2239735 575640 88376 -150149 -493006 -943707
38302 -943707 -1594464 -2049185 -1540757 -518873 -967794 -3908288 -7448680 -8713636 -7224164
38293 -7224164 -5075754 -4105065 -4203944 -4337733 -3868756 -2530528 -211821 2485392 4049028
38284 4049028 3321657 1154193 268717 2766947 7625996 11368560 11725184 9817098 7784347
38275 7784347 5418251 1322638 -3057091 -3696823 597283 5725608 7160162 5131264
38267 5131264 2737705 1033029 -811770 -1934864 -426485 2563406 3314999 1070457
38259 1070457 -443400 1416081 4337079 4962394 3766783 2991688 2003212 -1274981 -5209732
38250 -5209732 -5089654 248103 5924494 6900939 3803569 832593 -39068 -65002 -160423
38241 -160423 398680 1462169 1046442 -1734776 -4680056 -5226472 -4091488 -4300457 -6918653
38232 -6918653 -9487808 -8968878 -4971148 277948 4054043 4803079 2825945 106120
38224 106120 -1222101 -882776 -368678 -427781 355562 3460469 7625764 9517910 7199791
38215 7199791 1987133 -3181623 -6378696 -7588332 -7811689 -7740617 -7121198 -5374437 -2862829
38206 -2862829 -954278 -279934 408073 2545932 5262171 5992969 3818496 818459 -587044
38197 -587044 -488332 -593449 -1315223 -1307165 74475 1306822 561586 -1735105 -3373275
38188 -3373275 -3325584 -3033974 -4052241 -5319791 -4171485 2665 4483742 6139244 4568595
38179 4568595 1730611 -397328 -738740 1168514 4616102 7264466 7000609 4395265
38171 4395265 1856869 268834 -1767632 -4875406 -7120205 -6695270 -4920346 -4643241
38163 -4643241 -6301103 -7502545 -6548706 -4635312 -3914465 -4577686 -4813217 -3121604 104209
38154 104209 3100297 4245234 3091701 407388 -2478306 -4416794 -4852334 -3959959 -2640267
38145 -2640267 -2112905 -3007902 -4728928 -5944190 -5713749 -3888744 -572019 4113860 9411083
38136 9411083 13705308 15632943 15228663 13402775 10530088 6421884 1698069 -1936392
38128 -1936392 -3379295 -3268199 -2695837 -1592005 535057 2881136 3880291 3356621 2643180
38119 2643180 2411468 2068056 1835044 3394146 6884173 8854472 5736981 -952949 -5309608
38110 -5309608 -3578718 1842020 5942186 6985593 7120676 8059836 8577954 6984366 4323108
38101 4323108 3432112 5268595 7743943 8535293 7776113 7140308 7228147 7128595 6182591
38092 6182591 4875798 3902294 3343952 2858309 1787158 -771553 -4727462 -7801041 -7158370
38083 -7158370 -2828176 1826782 3638770 2353013 -550684 -3790199 -5969326 -5449176
38075 -5449176 -2582140 -702232 -2620119 -6863733 -9425331 -8599491 -6012750 -3426959
38067 -3426959 -971938 1382711 2879046 3084851 2347032 796480 -1591050 -3752011
38059 -3752011 -4023541 -2339617 -548236 -105818 -620322 -903380 -307706 1110570 2730359
38050 2730359 3831995 4871725 7414104 11234297 12805630 9454241 4263551 3286987
38042 3286987 7634049 11924432 11488855 7447172 3122299 -724102 -4285212 -5485192
38034 -5485192 -2170846 3871381 8279383 8846972 6586003 3018659 -1074029 -4667294
38026 -4667294 -6531969 -6370772 -4696438 -2073677 532836 1765512 1534611 1491378 2523116
38017 2523116 3244671 2515197 1665611 2120995 2523903 845384 -1984053 -3406657 -3211416
38008 -3211416 -3231701 -3774035 -3423431 -2157965 -1711746 -2747416 -4274048 -5927422 -8296972
37999 -8296972 -10923548 -12431735 -12630967 -12019430 -9545910 -4013815 2190082 4309682
37991 4309682 1154983 -3212170 -4856623 -4142595 -3248194 -2510109 -1281768 -187552 -368777
37982 -368777 -1839270 -3940883 -5948327 -6297910 -3275577 2211895 6518139 7301593 5847525
37973 5847525 4242983 2677482 1202400 1488145 4201500 6654866 6053036 3802513
37965 3802513 3688872 6536989 9391076 9605650 7316420 4056831 1196727 -200302
37957 -200302 8073 285975 -1157523 -3963028 -5842259 -5212076 -2613375 196597 1543189
37948 1543189 737571 -1120902 -1700454 62492 2512175 3318099 2179595 405407 -1091401
37939 -1091401 -1920830 -1515869 -113707 635177 -12090 -199830 1492913 2682818 210756
37930 210756 -4161835 -5130146 -1365329 2421469 2445711 1072638 2418518 5676596 6356462
37921 6356462 2739929 -2265750 -5394594 -6388837 -6828909 -7721896 -8889878 -9394229 -8098292
37912 -8098292 -4856315 -1477585 -510364 -2522974 -5206830 -5694548 -3526547 -1045970
37904 -1045970 -962626 -3667245 -7005807 -8684545 -8507035 -7745751 -6765853 -4604070 -1230334
37895 -1230334 1281719 1125642 -583528 -1167784 -163047 12974 -2308758 -5226163 -5306624
37886 -5306624 -1791248 2542120 4700402 4490258 3663086 2938002 1147151 -2478037 -6240572
37877 -6240572 -7258376 -4755257 -1218259 169372 -1212707 -3245737 -3792771 -2723977
37869 -2723977 -1101064 616944 2557235 4081139 3922978 2206486 1121185 2404146
37861 2404146 4787092 5391315 3514102 1432743 1033195 1238912 -81830 -2773125 -4483041
37852 -4483041 -3694042 -1287371 904060 1921434 1836161 1143463 601877 1070829 2809811
37843 2809811 4975768 6138261 5430020 3254469 871380 -828149 -2079321 -3491589
37835 -3491589 -4653164 -4180411 -1438447 2453573 5801568 7883811 8722970 8049857 5624178
37826 5624178 2438498 531718 1162064 3490469 5219091 4450207 1146939 -2972823
37818 -2972823 -6085482 -7788783 -8740208 -9237403 -9197022 -9295307 -10399510 -11445294 -9899904
37809 -9899904 -5551102 -1932930 -2108226 -4560458 -5518461 -4101590 -2479724 -1807694 -1193820
37800 -1193820 -621817 -1606232 -4158845 -5966239 -5799776 -5340393 -6314203 -8059129 -9416663
37791 -9416663 -10873858 -12948004 -14270803 -13477115 -11756021 -11372293 -12443000 -13107118 -12299323
37782 -12299323 -10524409 -8237521 -5199278 -1509482 1935066 4133166 4560085 3506386
37774 3506386 2362171 2680180 4232794 5115263 4666476 4826918 7213431 10346617 11658501
37765 11658501 10905569 9330860 6700264 2152828 -2552274 -3903901 -1108878 3121714
37757 3121714 6696975 10005607 12667906 11760577 5697498 -2229849 -6807079 -6349137
37749 -6349137 -3265132 -377860 1094565 774136 -1038747 -2712866 -2625834 -1549876 -1895989
37740 -1895989 -4044985 -5226446 -3198072 228679 922156 -2599535 -7223687 -8654369
37732 -8654369 -6077901 -2766592 -2137877 -3996806 -5385404 -4723077 -3637207 -4023543 -4692886
37723 -4692886 -2751857 2043910 6376270 7498530 6657614 7039582 9278371 10728412
37715 10728412 9124789 5453467 2558774 1767850 1696700 151852 -3355723 -7052658
37707 -7052658 -8603955 -7254070 -4328199 -1832413 -878596 -1386468 -2604768 -3521175 -3467933
37698 -3467933 -3051444 -3793232 -5780656 -6417311 -3341290 1579936 3500834 659299 -3001737
37689 -3001737 -2834121 762121 3766433 4264329 3857549 3908297 3568068 2134047 574901
37680 574901 -550432 -2364297 -5140669 -6404055 -3866283 686463 2763638 438156
37672 438156 -3420584 -4500276 -1552046 2738051 4658219 3048577 360946 85743
37664 85743 2909701 5910867 5962515 3208242 390002 -587504 -280939 -239499 -1156308
37655 -1156308 -2622724 -3821822 -4230757 -4187035 -4699494 -6022225 -6580461 -4410853 -63275
37646 -63275 2886099 1194412 -4314046 -9130179 -9506040 -6190588 -3333354 -3863422 -6634983
37637 -6634983 -8298673 -7096979 -4108936 -1577710 -1222152 -3625405 -7623394 -10332486
37629 -10332486 -9519512 -6343093 -4226650 -4678244 -5966375 -6323994 -6129171 -5798519 -4051687
37620 -4051687 -430140 2385344 1441395 -2458241 -6162819 -8675898 -11373703 -14163457
37612 -14163457 -14623052 -11675448 -7630439 -5387442 -5170250 -4985631 -3275580 -521074
37604 -521074 1138189 -28195 -2912718 -3963295 -1339573 2299566 3147796 1465565
37596 1465565 779106 2445370 4325956 5054882 6006382 7897623 8905152 8094112 7680938
37587 7680938 9298029 10375901 7261040 547291 -5454736 -7701816 -6510125 -3531939
37579 -3531939 -244614 1776099 1467973 -388467 -1951476 -2615354 -3328484 -4673519 -5886540
37570 -5886540 -5932396 -4643657 -2740586 -1360393 -1354848 -2440358 -3361489 -3413557 -3305455
37561 -3305455 -4010498 -5404401 -6549960 -6605849 -5099643 -2400830 -401713 -1281318 -4711364
37552 -4711364 -7692782 -8159087 -7236272 -6813659 -6667024 -5609995 -3827584 -2168518 -654369
37543 -654369 336602 -822352 -4197039 -6303939 -4131599 44792 1415578 -514798
37535 -514798 -1720149 -217074 1308023 314274 -2039293 -3810275 -5402817 -7643016
37527 -7643016 -9443794 -9777911 -9886642 -11103443 -12065149 -10490104 -6696663 -3229222 -1689528
37518 -1689528 -1735243 -2623140 -4084935 -6009596 -8503466 -11843555 -15402955 -17386831 -16829409
37509 -16829409 -15155879 -14417911 -14400264 -12760963 -7964913 -1209152 4513366 6859049
37501 6859049 6071576 4835739 5600766 7826353 8767995 7111602 4410246 2482637 1153215
37492 1153215 -450298 -2123239 -3545266 -5446444 -8065854 -9716981 -8757778 -5981295
37484 -5981295 -3296924 -1237142 149856 -722161 -5076516 -10265772 -11370468 -6987801
37476 -6987801 -970178 2438181 3019126 3117334 3811721 4196815 3364761 1595238 -128934
37467 -128934 -1065491 -1367979 -1829757 -2459842 -1765941 1323024 5170250 6820641 5735082
37458 5735082 4195485 3653672 2942919 1024527 -889582 -1640172 -2405172 -4276639 -5143747
37449 -5143747 -2134193 3213716 5379951 1417523 -5116659 -8189493 -5976268 -2195082
37441 -2195082 -1480517 -4678744 -8638956 -9769725 -7438393 -4089596 -2351375 -2406796 -2415007
37432 -2415007 -1093435 822862 1765101 1447824 1513140 4096697 9531240 15178715 16922799
37423 16922799 12650548 4488281 -2883667 -6373012 -6717498 -6706420 -7811815 -8953326
37415 -8953326 -8246048 -5410283 -2216259 -632836 -865473 -1599911 -1997399 -2574311 -3723470
37406 -3723470 -4386081 -3375894 -1541220 -1131314 -2869584 -4991528 -5648595 -5031629 -4336613
37397 -4336613 -3684603 -2185771 480775 3491091 5492665 5153734 1883923 -2889383
37389 -2889383 -5784944 -4285290 542042 5282603 7961700 9219848 9786317 8738441
37381 8738441 5287664 942801 -1593270 -1294167 439080 1714677 2058372 2363398 3369833
37372 3369833 4327322 3382347 -228695 -4589212 -6705737 -5899984 -4519830 -4830073 -6369103
37363 -6369103 -7144687 -6294460 -4475012 -2584848 -1391610 -1679167 -3360331 -4897243 -4861038
37354 -4861038 -3661471 -2641660 -2160872 -1905835 -2228063 -3352087 -3990317 -3011901 -2057297
37345 -2057297 -3758004 -7147022 -7775389 -3472301 2517250 5560692 4654521 1949821
37337 1949821 -516609 -1643154 -749519 1326365 1897159 -504814 -3787917 -5227395
37329 -5227395 -5457336 -6767402 -8436554 -7354539 -3431551 -827773 -2528835 -6493833
37321 -6493833 -8853832 -8690036 -7719613 -7040534 -6475289 -6147413 -6526524 -7240886 -7540535
37312 -7540535 -7675364 -8220328 -8238198 -5969995 -1753526 1446549 1438963 -401207 -954824
37303 -954824 773321 3072145 4509038 5654974 7173969 7878971 6363153 3716497
37295 3716497 2520412 3073561 2675114 -525363 -4684728 -6500042 -4936182 -1354543
37287 -1354543 2801267 6652299 9131646 9657552 9224740 9025136 8360154 5880732 2538677
37278 2538677 865421 1147259 876871 -1305685 -3648055 -4392257 -4397192 -4980334 -5316342
37269 -5316342 -4178804 -2613100 -2416827 -3082455 -2763292 -1536762 -1052748 -1155830 450573
37260 450573 4664918 9308395 11735352 11344448 8800657 4633775 -171679 -3622231
37252 -3622231 -4272699 -2717964 -540325 1579298 3778142 5708117 6438692 5432185
37244 5432185 2856107 -729683 -4261518 -6248405 -6044780 -4884287 -4570433 -5129811 -4927168
37235 -4927168 -3361186 -2080439 -2608853 -3866907 -3554919 -1514067 62989 -35885 -350125
37226 -350125 634636 1778594 934248 -1677147 -3893002 -5106346 -6892877 -9619847 -10938178
37217 -10938178 -9270036 -6871320 -7020446 -9085961 -9005774 -4754249 1013298 4600797
37209 4600797 5703735 6805310 9256785 11676773 12212832 11090185 10201905 10620418 11403632
37200 11403632 11283259 10893026 12077872 14805594 16332383 14697634 11831960 11087747
37192 11087747 12155831 11159116 6606042 2684669 4527784 11658138 18614702 21608522
37184 21608522 22068111 23191646 25325133 26253969 24714715 21745179 18855195 16468664
37176 16468664 14546463 13548325 13894922 14953110 15357883 14327869 12255713 10161134
37168 10161134 9049087 9591377 11587715 13528787 13540636 11391829 9038666 8493079 9523703
37159 9523703 10194022 9360951 7767849 6805887 7129958 8522865 10162399 10851073 9952727
37150 9952727 8360392 7486105 6976898 4870852 933952 -1611492 603479 6830582
37142 6830582 13058139 16618730 17769448 16804377 12614497 5692176 136257 -252678
37134 -252678 2900844 4098625 793477 -3840699 -5685393 -4738378 -3742035 -3786307 -3847221
37125 -3847221 -3649887 -3942670 -3795631 -696009 5242626 9551036 8164075 2616855 -1862683
37116 -1862683 -2753569 -2210837 -2750513 -3875956 -4161135 -4204241 -5223847 -6090982 -4481714
37107 -4481714 -848212 1276412 -220528 -3143316 -3983286 -2460785 -1279372 -2021106
37099 -2021106 -3380196 -3716429 -3395994 -3497320 -3604178 -2500595 -394864 1192960 1578998
37090 1578998 1383279 801118 -837647 -3195523 -4316159 -3053897 -830048 341282
37082 341282 396761 224262 -649400 -3000851 -5110542 -3910635 501654 4102608 3984032
37073 3984032 1977497 1466611 2420117 2071619 -417568 -2677017 -2543712 -461271 2070260
37064 2070260 4433193 6249396 6414140 4369454 1649641 657158 1843759 3088054
37056 3088054 2193357 -545520 -2698480 -2507938 -956821 -701907 -3039672 -6528176 -8881642
37047 -8881642 -9432387 -8890142 -7410739 -4493643 -796708 1700658 2157115 2194621 3682915
37038 3682915 6097426 7148132 5304495 765655 -5005269 -9289568 -8842663 -3114669
37030 -3114669 3354889 4359734 -1197902 -7831755 -9792367 -7064607 -3746411 -2345886
37022 -2345886 -1936829 -912761 1008620 3478794 6057465 7663662 7209825 5320535
37014 5320535 4002035 4064282 4140394 2766585 154385 -2656967 -5044458 -6431532 -6044487
37005 -6044487 -4156490 -2515234 -2313733 -2483443 -1089416 2239337 6209640 9357052
36997 9357052 10552407 8948764 4960616 857163 -1024298 -471638 1148792 2920550
36989 2920550 4481793 4862974 3228686 700130 -463233 228424 1108469 1259406 2066959
36980 2066959 5028797 9296338 12346853 12423452 9895748 6915036 5789357 6737076 7309321
36971 7309321 5215792 1474598 -899203 -1118901 -1202984 -1985272 -1327585 2294229 6814451
36962 6814451 9188887 9237219 8818449 8618181 7997244 7036299 6522444 6492901 6647431 7523896
36952 7523896 9392970 10695425 9634837 6853274 4550589 3392512 2293575 801584
36944 801584 -489989 -1565910 -2727391 -2964045 -1102998 1440702 1746799 -481512 -2549543
36935 -2549543 -2899181 -2571680 -1809554 1236305 6532248 10186722 9342850 6661727 6680394
36926 6680394 9381073 10925269 9844026 8605467 8745505 8126509 4710179 515974
36918 515974 -547296 2206189 5338683 5529916 3329843 2038982 3506508 6036416
36910 6036416 6701601 4877736 2617593 2103394 4010136 7942080 12458890 14465234
36902 14465234 11197058 4298258 -313962 1062035 5110916 5715517 1687114 -2832416
36894 -2832416 -4939005 -5964693 -7132026 -6121539 -632606 6891426 11230572 10526990
36886 10526990 8044537 7643375 9392844 10497813 9449217 7951030 8561952 11219079
36878 11219079 13071791 11924730 8849259 6589022 6239029 6784170 7236463 7369900 6519561
36869 6519561 3895364 690161 -281127 1674433 3440767 1715163 -2929847 -7149916
36861 -7149916 -8851612 -8372481 -6616429 -4135911 -1775190 -358626 274645 546916 -81576
36852 -81576 -1842591 -2728206 -437730 3463537 4153760 -351908 -6030894 -7645267 -4908406
36843 -4908406 -1644867 -192382 504526 1593536 2077855 765540 -1669672 -3901433
36835 -3901433 -5853932 -8019497 -9758430 -9743513 -7879850 -5662123 -4522185 -4546509 -4957688
36826 -4957688 -5320814 -6004586 -7566161 -9695383 -10863339 -9491228 -5691131 -1308438
36818 -1308438 2136537 4803646 7049835 7476984 4287169 -1218660 -4453244 -2345923
36810 -2345923 2597794 4802199 2101716 -1970171 -2955147 -946133 283209 -1148677
36802 -1148677 -2780282 -1663610 1153657 1932847 -594355 -3602548 -4198750 -2990907
36794 -2990907 -2148111 -1474531 1155539 5845324 9707649 10488575 9037876 7079916 4589925
36785 4589925 1297690 -833129 526384 4081389 5592788 3164086 -492392 -2126732
36777 -2126732 -2071340 -2517688 -3496253 -3208764 -1644035 -1047451 -2400291 -3836002 -3650110
36768 -3650110 -3019611 -4194813 -7232822 -10206452 -11931006 -12823864 -13407131 -13560427 -13236765
36759 -13236765 -12507400 -10871988 -7974070 -5096405 -4270413 -5462583 -6356447 -5642263 -4715036
36750 -4715036 -4996962 -5439430 -4377772 -2259363 -458956 1205208 3296213 4372005
36742 4372005 2969291 1309243 3231207 8087508 10637311 8385141 5249061 5582673
36734 5582673 7880657 7718226 4546823 1831271 1802543 3676888 6308419 9117402 10692126
36725 10692126 9837167 8125880 8320049 10051586 10162554 7622290 4765291 3029249
36717 3029249 1127670 -1234456 -1575903 1182075 3979405 3883470 2523948 3217176 5733475
36708 5733475 7154502 6342810 4278123 1302952 -2342749 -4116919 -1346536 4023481
36700 4023481 6558155 4084271 203632 -987643 231721 1056934 267729 -1395220
36692 -1395220 -3002552 -3637030 -2237477 938286 3675979 4117421 2849220 1496456
36684 1496456 356438 -1110766 -2408259 -2297098 -475445 2357508 5530733 8172438
36676 8172438 8662023 6076032 2053289 -334404 258296 2516052 4493509 5176372 4099705
36667 4099705 1257963 -1885566 -2856478 -970854 1136331 213011 -3487819 -5918476
36659 -5918476 -3392131 3617383 11071110 15066058 14431572 10404784 5162933 1022802
36651 1022802 -250442 1272759 3376904 3811505 2676898 1761526 1796595 1876508 1651566
36642 1651566 2074777 3068721 2445535 -1047508 -4997794 -5886414 -3682601 -1570050 -1320998
36633 -1320998 -1456595 -535380 138743 -1444365 -4751405 -7103580 -6693874 -4129768 -1468494
36624 -1468494 -541582 -1769386 -3942788 -5525701 -6461470 -7972670 -10326681 -11983237
36616 -11983237 -11597233 -9557373 -6549534 -2076367 3885869 8914358 10174916 8157241
36608 8157241 6133754 5711308 5196713 3177881 1549610 3229532 7971174 12139297
36600 12139297 12360142 8429807 3107312 35411 1391444 6306207 11402880 13583050
36592 13583050 12473301 10040881 8387229 8467050 10274859 13174536 16142524 18508291
36584 18508291 20395012 21839465 21899214 19627608 15735755 12217491 10339944 9940882
36576 9940882 10433119 11073665 10309515 6881057 2430841 1166447 5290956 11900906 16162472
36567 16162472 16778559 16383660 17052126 17934941 17895286 18113247 20375633 24061773 26691618
36558 26691618 27041734 26133289 25211804 24347679 23543924 23833821 26038902 28978742 30246974
36549 30246974 29108481 27879029 29803680 35658541 42782709 47575595 48928006 49160107
36541 49160107 51463831 56422750 61483198 64248961 65724793 69146640 75649184 82752237
36533 82752237 88050021 92757956 99587656 108050026 114685425 118242590 121714811 127712182
36525 127712182 134194036 137134849 135740923 132152262 127010695 118915142 108577734 99920557
36517 99920557 95245379 91885000 85957132 77623318 69963097 63797796 56844818 48162757
36509 48162757 40475263 36710909 36139263 35581749 33290328 29964394 26671301 23681784
36501 23681784 21354766 20290616 19823749 17825768 13346936 8605918 6780254 8112835
36493 8112835 9822210 9881499 8940733 7888907 5838168 2452363 468325 2831695 7798539
36484 7798539 10168293 8082919 5518892 6379438 8892815 8647279 5329461 2882329
36476 2882329 3362568 4157608 2276300 -1341969 -3534253 -3130047 -1463913 381674 2762698
36467 2762698 5810406 8131691 7988999 5279318 1710769 -1025861 -2873127 -4778930
36459 -4778930 -6608834 -6715181 -4398284 -1927724 -2374278 -5354540 -6818695 -4072824
36451 -4072824 476368 2199297 33001 -2481310 -1872461 1325803 3890408 3747892
36443 3747892 1472267 -1129915 -2608208 -2308355 -512281 1485513 2267654 1781085 1383626
36434 1383626 1887667 2156770 564598 -2422598 -4280984 -3297396 -387013 2431894 4350174
36425 4350174 5733197 6747639 7337385 8016603 9170596 9702211 7933878 4096808 462167
36416 462167 -1436267 -2226702 -2709267 -2125985 265852 3248952 5086411 6168939 8305267
36407 8305267 11571402 13760595 13369717 11644259 11002384 12447614 15019590 16822706
36399 16822706 16161197 12809148 8933977 7743269 10113755 13159320 13192484 9703683
36391 9703683 5429906 2950522 2557431 3372260 4880856 6576727 7346546 6588124 5528391
36382 5528391 6158345 8730627 11262048 11811344 10454709 8604622 7190251 6266144 5822801
36373 5822801 5922883 6165667 6012359 5743608 6123552 6810231 6104216 2960938 -1462442
36364 -1462442 -4989730 -6500830 -5999159 -3371856 1438966 7083036 11111321 12321646
36356 12321646 11984210 12113846 13039581 13124138 10399672 4163454 -4316291 -12041427 -15893234
36347 -15893234 -15078176 -11969203 -9804534 -9515862 -9418361 -7966635 -5906986 -5192884 -6293556
36338 -6293556 -7298641 -5760879 -1113275 4800322 9372035 11278552 11045849 9945049
36330 9945049 8712703 7412018 6063591 4812756 3505858 1739844 -329010 -1670197
36322 -1670197 -1385471 160530 1662706 2138563 1370463 -584210 -3330436 -5524958 -5618267
36313 -5618267 -3962137 -3080541 -4584032 -6596284 -5948530 -2643086 -115382 -666892 -2726150
36304 -2726150 -3782065 -4101202 -5520326 -7783566 -8620824 -7279061 -5630729 -5303678 -5722601
36295 -5722601 -5863239 -6163335 -7312136 -8406764 -8008368 -6514392 -5915380 -7093228 -8464185
36286 -8464185 -7681635 -4136115 477520 3779850 4752827 4271041 3688188 3275480 2616038
36277 2616038 2209985 3357846 5920235 7462741 5919243 2543267 870533 2737883
36269 2737883 6279503 7928671 5661296 362095 -5034432 -7528875 -6107546 -2525494
36261 -2525494 126349 -38558 -2470537 -5152847 -6418895 -6022316 -4943737 -4218338 -3786912
36252 -3786912 -2721537 -721410 1200299 1948046 1577214 647725 -793448 -2433029 -2627259
36243 -2627259 163081 4909833 8564396 9323772 7976164 5814238 2944921 -583241
36235 -583241 -3563018 -4779875 -4411321 -3274522 -1619725 306156 1476534 1204901 462176
36226 462176 809789 2312819 3475310 2892565 177427 -4098032 -8323519 -10340750 -9321727
36217 -9321727 -6858508 -5103357 -4306555 -3410137 -2428521 -2487835 -3706643 -4857396 -5272875
36208 -5272875 -5358843 -4939439 -2956435 458891 3223427 3556985 1789648 -753882 -3230559
36199 -3230559 -4770933 -4095162 -1091524 2281104 4049779 4367107 4470225 4617392 4521581
36190 4521581 4723342 5573541 5542895 2739309 -2002616 -5544380 -6080428 -4536795 -2284544
36181 -2284544 351244 2722015 3254018 1552554 -535128 -1368599 -1643590 -2608192 -3547436
36172 -3547436 -3043402 -1843503 -2158470 -4217500 -5606321 -4390171 -1186573 2270140
36164 2270140 4860563 5663777 3687282 -427223 -3554760 -2727401 1614014 6154231
36156 6154231 8129560 7156743 4262935 769304 -1863411 -2744977 -2647116 -3198867 -4656300
36147 -4656300 -5796071 -6309925 -7386878 -8938959 -8365391 -4085638 1284472 3905521
36139 3905521 3912287 4590191 6602576 6555865 2363755 -3093517 -5643125 -4855410 -3231861
36130 -3231861 -2204283 -1374011 -452350 460051 1655996 2753555 1901839 -1586379 -4948964
36121 -4948964 -5228448 -3941231 -5069522 -8776145 -11006470 -9665347 -7012881 -4847636
36113 -4847636 -1826190 2168928 3444438 -16683 -4033277 -3836799 -1764694 -4053711
36105 -4053711 -11011954 -15866743 -13861517 -7570260 -1742193 2715441 7178702 11200463
36097 11200463 13090333 12665500 10800489 7526075 2746164 -2204620 -5689138 -7691530
36089 -7691530 -9007150 -9334632 -7781312 -4588595 -842836 2905761 6254619 7826467
36081 7826467 6320826 2629679 -551742 -1486495 -947923 -1092967 -3496423 -7986214 -12575435
36072 -12575435 -14743341 -13497289 -10040162 -6156088 -2677333 45744 1418367 1447183
36064 1447183 1264703 1468310 879984 -1434400 -3746094 -3330741 -319092 2170420 2031934
36055 2031934 545619 186915 1502581 2966400 3047100 1748403 519114 840877 2594382
36046 2594382 4064960 3940586 2623144 971678 -1050011 -3245676 -4099095 -2848438
36038 -2848438 -1557386 -2535698 -4411247 -3853950 -1015977 309699 -1366644 -2775955
36030 -2775955 -987391 2317170 3938264 3754458 3475002 2983597 1053791 -1546714 -2508760
36021 -2508760 -868515 2625383 6907156 10197692 9683844 4499968 -1820116 -4763881
36013 -4763881 -4188082 -3524167 -4306211 -4684398 -3185935 -598040 2214136 5113823 6733323
36004 6733323 5068961 1174468 -903079 546638 2457459 1613403 -1048444 -2918294
35996 -2918294 -3955446 -5733707 -8091073 -9543583 -9871745 -9841302 -9377756 -8316783 -7902195
35987 -7902195 -9098707 -10373353 -9754121 -8229950 -8131130 -8670547 -6585209 -1574390 2404342
35978 2404342 2635391 1511756 2898121 6824310 10168509 11193340 10837050 10051942 8378526
35969 8378526 5655177 3322909 2936763 4186102 5307223 5148932 4116093 3170748 2680249
35960 2680249 2591285 3057253 4031074 4498628 3251032 668174 -1395267 -2106198 -2901677
35951 -2901677 -5217690 -7986716 -8910393 -7608398 -5706785 -3964482 -1381932 2216746
35943 2216746 4662933 4068255 1920648 1627206 3880912 5155808 1984740 -4019884
35935 -4019884 -7174090 -4300381 1269136 3865382 2540379 1323748 2673379 4311653
35927 4311653 4131972 4591474 8676298 13840398 14488237 9792467 4637480 2561594 2084508
35918 2084508 1048027 235085 517993 175031 -2009854 -3850025 -3112657 -1532719 -2229178
35909 -2229178 -4843452 -6546802 -6602523 -6609491 -7069908 -6977680 -6348289 -6114197 -5883833 -4818346
35899 -4818346 -4332325 -6539309 -10027088 -10815572 -8106720 -5444038 -5002590 -4379243 -1076625
35890 -1076625 3017526 4389271 2886363 1096547 264778 -424793 -1498197 -2758488
35882 -2758488 -4671863 -7737758 -10576845 -10854906 -8447758 -5945816 -5526118 -6682515
35874 -6682515 -7531263 -7099486 -5525047 -2894149 916575 5184171 8016240 7989309 6223291
35865 6223291 5908900 8881092 13159286 15067014 13564987 11082368 10055917 10346379
35857 10346379 10534290 10002993 8802304 7017654 5469918 5674699 7749313 9524262
35849 9524262 9164562 7677787 7404880 8996208 11357424 13526468 14756131 13558545
35841 13558545 8857546 1974199 -4289005 -8502928 -11104031 -12389518 -11871372 -9740078
35833 -9740078 -7302853 -5539968 -4351894 -3346236 -2293093 -874301 917565 2362677
35825 2362677 3156375 4473395 7332975 10299272 10712142 8220798 5291786 4071861
35817 4071861 4488094 5560923 6648865 6999798 5958646 4215914 3178309 2612624 676203
35808 676203 -3136582 -6860087 -8546136 -8198775 -6625169 -4185052 -1424095 820579
35800 820579 2622840 4458572 5135743 2759763 -1490816 -3622579 -2423450 -1682469 -4478561
35791 -4478561 -8220223 -8605727 -6155805 -4901990 -5988411 -6671728 -5229088 -2981722
35783 -2981722 -1115679 1129929 4283684 7300455 9153584 9597199 8020283 3980432
35775 3980432 -646055 -2631929 -1425013 83703 -196263 -784990 610217 3578771
35767 3578771 5886075 6498284 6243053 6315304 7097387 7685250 6191543 1798560 -3129637
35758 -3129637 -4763024 -2440129 223662 -20055 -2126532 -3029686 -2177591 -1628633 -2469344
35749 -2469344 -3318266 -2423631 239231 3187574 4855866 4702847 3409065 1945158 439382
35740 439382 -1407986 -2840931 -2307464 209823 2416393 2265679 333999 -1399771 -2351675
35731 -2351675 -3784114 -6806203 -10603053 -12457860 -9743871 -3046727 2842620 3101695
35723 3101695 -1292297 -4093017 -1405875 3439545 4528508 778715 -3944991 -6601031
35715 -6601031 -7549243 -7785740 -6895358 -4613744 -2227373 -1284024 -1971418 -3251058 -3824169
35706 -3824169 -2995775 -1361909 -330601 -313703 -274885 78404 -819650 -3686274 -6150670
35697 -6150670 -5588985 -2976928 -1209177 -621842 624293 2407563 2622377 1316392 1025347
35688 1025347 2323198 2804035 1641894 1360232 3160491 3928050 449589 -5924744 -11148196
35679 -11148196 -12784827 -10546150 -5205740 622584 3196378 1932763 819177 2930634
35671 2930634 6066711 6934449 6842947 8951763 12017945 12008866 8947561 6893254 7112823
35662 7112823 6370018 2760567 -1625321 -5193286 -9186233 -13372561 -13918039 -8844369
35654 -8844369 -2247941 422555 -1149779 -3567646 -5192264 -6415363 -6195926 -2725992
35646 -2725992 2514221 4972327 2175119 -3506965 -7686644 -7853831 -4503838 -315019
35638 -315019 1627839 513952 -1095562 -314359 2095025 2623631 -139520 -3745017 -5526021
35629 -5526021 -5954734 -7227016 -9933736 -12312087 -11904944 -7268124 766375 8551873
35621 8551873 11497463 7949486 933982 -4769662 -6828322 -6040673 -3884703 -956262
35613 -956262 2301621 4824829 5590197 4534900 2486846 498113 -714651 -1152462 -1500410
35604 -1500410 -2287395 -2957324 -2303254 -155759 1827114 1672085 -659909 -3015219 -3181521
35595 -3181521 -1056547 1312306 1556230 -1123536 -5385734 -8799800 -9828868 -9098175
35587 -9098175 -8486553 -8890313 -9480088 -9413850 -9238488 -9552720 -9073653 -5720190 341345
35578 341345 6205694 9110375 8596798 5686425 1614182 -1993638 -3498378 -3110309 -3091186
35569 -3091186 -4862381 -7098848 -7813722 -6763331 -4299760 204372 6339371 10755484
35561 10755484 10639836 8312489 8722328 12420804 14791525 12834195 8754186 5450286
35553 5450286 2529666 -678691 -1860168 842947 4667427 5519661 3860457 3378551
35545 3378551 4883084 5685345 4665333 3591833 2859518 163116 -4992107 -9054161
35537 -9054161 -8973684 -6368368 -4887481 -5553364 -6993491 -8433118 -9875238 -10538111 -9617837
35528 -9617837 -7868350 -6271480 -3983226 -87424 3159723 1884619 -3963367 -9337312
35520 -9337312 -9779859 -6670802 -4930545 -6361086 -7402820 -3922895 3356028 9571622
35512 9571622 11337464 9971680 8618335 7892612 6236067 3653978 2348106 3175588
35504 3175588 4067266 3315342 2223325 2609150 3644612 3669224 3535274 4939590 6309322
35495 6309322 4133725 -1309125 -5303121 -5165425 -4098486 -6320458 -10902306 -13376003
35487 -13376003 -11955401 -9082320 -7373339 -6964510 -7087530 -7625077 -8079382 -6982305 -3869155
35478 -3869155 -786201 -334663 -2532240 -4760757 -4837078 -3189759 -1683263 -1142982 -972680
35469 -972680 -955729 -2088628 -4776845 -7036950 -6024255 -1560304 3059391 4402016 2278899
35460 2278899 -755939 -2513288 -2978478 -3507410 -5090737 -7409486 -9228026 -9771756 -9646851
35451 -9646851 -9878196 -10189383 -9322822 -7205936 -5258115 -3808241 -963938 4314448 9387707
35442 9387707 10537393 7926972 5563443 6006626 7248656 5744099 920862 -4504766
35434 -4504766 -7682760 -7938568 -6444958 -4589857 -2813995 -888990 792178 933168
35426 933168 -918816 -3107284 -3806476 -3847517 -5738060 -9722812 -12860424 -12778001 -10524098
35417 -10524098 -8607073 -7791967 -7133653 -5811586 -3506742 -107094 3526080 5499458
35409 5499458 4919768 2911856 393721 -3519450 -8968249 -12924346 -12247343 -8289047
35401 -8289047 -5316493 -4721016 -4187455 -2725215 -2534976 -4461293 -5343481 -2544466 1666832
35392 1666832 3399961 2838340 3192109 5134629 6038456 4696873 3274511 3644427 4683192
35383 4683192 4661757 4036303 4017959 3941060 2039752 -1907715 -6227038 -9031455 -9003863
35374 -9003863 -5378383 1016076 6960628 9026693 7047219 4075649 2468726 1448910
35366 1448910 -681278 -3442927 -4920800 -4781315 -4565626 -4882221 -4212720 -1494499 1449852
35357 1449852 1625155 -1376877 -4678191 -5259744 -2733743 1246130 5179404 8494438
35349 8494438 10796279 11465816 10236277 7711400 5051229 3119420 1804957 175995
35341 175995 -2359083 -4909461 -5585932 -3532943 -162819 2093720 2050028 382406 -1621922
35332 -1621922 -3172893 -3928948 -3751943 -2961016 -2374338 -2633765 -3583998 -4457460 -4485232
35323 -4485232 -3295399 -1112210 1173280 2429763 2185639 1081546 188221 -147119 -622813
35314 -622813 -2098938 -4455174 -6401102 -6475474 -4270004 -745861 2440471 3814867 2774903
35305 2774903 222351 -1443381 17871 4296108 8341912 9297121 7177843 3985386
35297 3985386 963878 -1898497 -4134667 -4529940 -3072155 -1572530 -1441619 -1983438 -1734189
35288 -1734189 -373893 1661521 4309136 7262961 9124499 8821028 7492484 7380722
35280 7380722 8835832 9769913 8282694 4790882 1389343 -86575 574844 1695782
35272 1695782 1046592 -1599106 -3666326 -2766821 35259 1651952 1279424 977904 1767806
35263 1767806 1854017 -75874 -2210972 -2213023 -713614 -57899 -760600 -1433092 -1446510 -1387143
35253 -1387143 -1175518 93229 2267411 3849873 3882893 2804354 1425618 430369 767194
35244 767194 2883016 5387820 6053131 4450551 2181311 314186 -1733154 -4343840
35236 -4343840 -6461971 -6960251 -5805483 -3182722 1006762 5929093 9668330 11425672
35228 11425672 12492475 13822592 14037150 11436594 6921957 3108724 1114026 -101682
35220 -101682 -1509529 -2756692 -3263669 -3362511 -3977466 -5690266 -8076438 -9687015 -9218334
35211 -9218334 -7151629 -5539328 -5621391 -6444381 -6352834 -4795455 -2117738 906185 2427706
35202 2427706 361086 -4444775 -7708545 -6667457 -3920167 -3551412 -4862271 -3628198
35194 -3628198 922970 4459753 3604553 139767 -2129050 -1804146 187399 2474406
35186 2474406 3565016 2637974 1324426 2303310 4984721 5567920 2971960 1221106 3331038
35177 3331038 6237585 5503833 2284316 1087543 2477026 3013626 1638664 868117 1255571
35168 1255571 -280680 -5024575 -9564437 -10471043 -8554222 -6347589 -4397997 -2430341
35160 -2430341 -1474545 -2075911 -2492676 -1378131 -393410 -1325501 -2347706 -508030 3207755
$$ [...]
##END NTUPLES=NMR SPECTRUM
##END=
