##TITLE=31Pdec_DE-73-13
 D2O, 64 sc
 7.11.2024
##JCAMPDX= 6.0         $$ Bruker NMR JCAMP-DX V2.0
##DATA TYPE= NMR SPECTRUM
##DATA CLASS= NTUPLES
##ORIGIN= UXNMR, Bruker Analytische Messtechnik GmbH
##OWNER= root
$$ XWIN-NMR		Version 3.5
$$ Thu Nov  7 16:26:00 2024 Russian Standard Time (UT+4h)  she@DPX200
##.OBSERVE FREQUENCY= 81.013821
##.OBSERVE NUCLEUS= ^31P
##.ACQUISITION MODE= SIMULTANEOUS
##.ACQUISITION SCHEME= undefined
##.AVERAGES= 64
##.DIGITISER RES= 17
##SPECTROMETER/DATA SYSTEM= spect
##.PULSE SEQUENCE= zgpg30
##.SOLVENT NAME= CDCl3
##.SHIFT REFERENCE= (INTERNAL, CDCl3, 0, 198.062)
##AUDIT TRAIL= $$ (NUMBER, WHEN, WHO, WHERE, WHAT)
$$ ##TITLE= Audit trail, XWIN-NMR		Version 3.5
$$ ##JCAMPDX= 5.01
$$ ##ORIGIN= Bruker BioSpin GmbH
$$ ##OWNER= she
$$ F:/spectra/data/she/nmr/P31/2/pdata/1/auditp.txt
$$ ##AUDIT TRAIL=  $$ (NUMBER, WHEN, WHO, WHERE, WHAT)
(   1,<2024-11-07 16:25:06.81 +0400>,<she>,<DPX200>,
      <created by zg, POWCHK disabled, PULCHK disabled
       configuration hash MD5:
       00 E9 B6 7A A2 85 ED C7 34 08 36 98 17 FE 4E 26
       data hash MD5: 32K
       69 E2 91 DE 1C 27 81 CA F9 BA 5F 55 0F A8 C9 4A>)
(   2,<2024-11-07 16:25:09.25 +0400>,<she>,<DPX200>,
      <Start of raw data processing
       efp BC_mod = 2 LB = 1.5 FT_mod = 6 PKNL = 1 PHC0 = 2297.364 PHC1 = 4.488159 SI = 64K 
       data hash MD5: 64K
       D2 C0 44 AF 8B 90 C8 BC E2 84 6A A5 65 6B A5 4C>)
(   3,<2024-11-07 16:25:31.45 +0400>,<she>,<DPX200>,
      <pk PHC0 = -0.2008596 PHC1 = 0 
       data hash MD5: 64K
       35 5C 79 48 27 C7 67 B9 E6 C0 2F DC 11 88 C9 E4>)
$$ ##END=
$$ 
$$ hash MD5
$$ 5A 47 DA F1 FE 3F 87 2B 53 D5 92 99 DF 58 F0 F0
##$RELAX= 
##$RELAX= 
##$RELAX= 
##$RELAX= 
##$RELAX= 
##$RELAX= 
##$RELAX= 
##$RELAX= 
$$ Bruker specific parameters
$$ --------------------------
##$DU= <F:/spectra>
##$EXPNO= 2
##$NAME= <P31>
##$PROCNO= 1
##$TYPE= <nmr>
##$USER= <she>
##$AMP= (0..31)
100 100 100 100 100 100 100 100 100 100 100 100 100 100 100 100 100 100 
100 100 100 100 100 100 100 100 100 100 100 100 100 100 
##$AQSEQ= 0
##$AQ_mod= 1
##$AUNM= <au_zg>
##$AUTOPOS= <>
##$BF1= 81.014009
##$BF2= 200.13
##$BF3= 200.13
##$BF4= 200.13
##$BF5= 200.13
##$BF6= 200.13
##$BF7= 200.13
##$BF8= 200.13
##$BYTORDA= 1
##$CFDGTYP= 0
##$CFRGTYP= 5
##$CHEMSTR= <none>
##$CNST= (0..31)
1 1 145 1 1 1 1 1 1 1 1 1 1 1 1 1 1 1 1 1 1 1 1 1 1 1 1 1 1 1 1 1 
##$CPDPRG= <waltz16>
##$CPDPRG1= <>
##$CPDPRG2= <waltz16>
##$CPDPRG3= <>
##$CPDPRG4= <mlev>
##$CPDPRG5= <mlev>
##$CPDPRG6= <mlev>
##$CPDPRG7= <mlev>
##$CPDPRG8= <mlev>
##$CPDPRGB= <>
##$CPDPRGT= <>
##$D= (0..31)
0 1 0 0 0 0 0 0 0 0.06 0 0.03 2e-05 3e-06 0 0 0.0002 0 0 0 0 0 0 0 0 0 
0 0 0 0 0 0 
##$DATE= 1730982306
##$DBL= (0..7)
120 120 120 11 120 120 24 19 
##$DBP= (0..7)
150 150 150 150 150 150 150 150 
##$DBP07= 0
##$DBPNAM0= <>
##$DBPNAM1= <>
##$DBPNAM2= <>
##$DBPNAM3= <>
##$DBPNAM4= <>
##$DBPNAM5= <>
##$DBPNAM6= <>
##$DBPNAM7= <>
##$DBPOAL= (0..7)
0.5 0.5 0.5 0.5 0.5 0.5 0.5 0.5 
##$DBPOFFS= (0..7)
$$ [...]
##$SUBNAM3= <"">
##$SUBNAM4= <"">
##$SUBNAM5= <"">
##$SUBNAM6= <"">
##$SUBNAM7= <"">
##$SUBNAM8= <"">
##$SUBNAM9= <"">
##$SW= 400.765351723535
##$SWIBOX= (0..15)
0 1 3 0 0 0 0 0 0 0 0 0 0 0 0 0 
##$SW_h= 32467.5324675325
##$TD= 32768
##$TD0= 1
##$TE= 0
##$TE2= 300
##$TE3= 300
##$TEG= 300
##$TL= (0..7)
0 120 53 12 22 120 120 120 
##$TP= (0..7)
150 150 150 150 150 150 150 150 
##$TP07= 0
##$TPNAME0= <>
##$TPNAME1= <>
##$TPNAME2= <>
##$TPNAME3= <>
##$TPNAME4= <>
##$TPNAME5= <>
##$TPNAME6= <>
##$TPNAME7= <>
##$TPOAL= (0..7)
0.5 0.5 0.5 0.5 0.5 0.5 0.5 0.5 
##$TPOFFS= (0..7)
0 0 0 0 0 0 0 0 
##$TUNHIN= 0
##$TUNHOUT= 0
##$TUNXOUT= 0
##$USERA1= <user>
##$USERA2= <user>
##$USERA3= <user>
##$USERA4= <user>
##$USERA5= <user>
##$V9= 5
##$VALIST= <valist>
##$VCLIST= <CCCCCCCCCCCCCCC>
##$VD= 0
##$VDLIST= <DDDDDDDDDDDDDDD>
##$VPLIST= <PPPPPPPPPPPPPPP>
##$VTLIST= <TTTTTTTTTTTTTTT>
##$WBST= 1024
##$WBSW= 4
##$XGAIN= (0..3)
0 0 0 0 
##$XL= 0
##$YL= 0
##$YMAX_a= 13510
##$YMIN_a= -19958
##$ZGOPTNS= <>
##$ZL1= 120
##$ZL2= 120
##$ZL3= 120
##$ZL4= 120
##$ABSF1= 0
##$ABSF2= 0
##$ABSG= 0
##$ABSL= 0
##$ALPHA= 0
##$AQORDER= 0
##$ASSFAC= 0
##$ASSFACI= 0
##$ASSFACX= 0
##$ASSWID= 0
##$AUNMP= <proc_1d>
##$AZFE= 0.1
##$AZFW= 0.5
##$BCFW= 0
##$BC_mod= 2
##$BYTORDP= 0
##$COROFFS= 0
##$CY= -3
##$DATMOD= 1
##$DC= 0
##$DFILT= <>
##$DTYPP= 0
##$F1P= 0
##$F2P= 0
##$FCOR= 1
##$FTSIZE= 65536
##$FT_mod= 6
##$GAMMA= 0
##$GB= 0
##$INTBC= 1
##$INTSCL= 9.790993e-09
##$ISEN= 30
##$LB= 1.5
##$LEV0= 0
##$LPBIN= 0
##$MAXI= 10000
##$MC2= 0
##$MEAN= 0
##$ME_mod= 0
##$MI= 50
##$NCOEF= 0
##$NC_proc= -7
##$NLEV= 6
##$NOISF1= 182.463
##$NOISF2= 159.3651
##$NSP= 0
##$NTH_PI= 0
##$NZP= 0
##$OFFSET= 198.0616
##$PC= 4
##$PHC0= 2297.163
##$PHC1= 4.488159
##$PH_mod= 1
##$PKNL= yes
##$PPARMOD= 0
##$PSCAL= 0
##$PSIGN= 0
##$REVERSE= no
##$SF= 81.0140089999434
##$SI= 65536
##$SIGF1= 159.3651
##$SIGF2= -187.1042
##$SINO= 113.3802
##$SIOLD= 16384
##$SREGLST= <1H.CDCl3>
##$SSB= 0
##$STSI= 65536
##$STSR= 0
##$SW_p= 32467.5324675325
##$SYMM= 0
##$S_DEV= 0
##$TDeff= 32768
##$TDoff= 0
##$TI= <>
##$TILT= no
##$TM1= 0
##$TM2= 0
##$TOPLEV= 0
##$USERP1= <user>
##$USERP2= <user>
##$USERP3= <user>
##$USERP4= <user>
##$USERP5= <user>
##$WDW= 1
##$XDIM= 65536
##$YMAX_p= 282335863
##$YMIN_p= -96798008
$$ End of Bruker specific parameters
$$ ---------------------------------
##NTUPLES= NMR SPECTRUM
##VAR_NAME=  FREQUENCY,     SPECTRUM/REAL,   SPECTRUM/IMAG
##SYMBOL=    X,             R,               I
##VAR_TYPE=  INDEPENDENT,   DEPENDENT,       DEPENDENT
##VAR_FORM=  AFFN,          ASDF,            ASDF
##VAR_DIM=   65536,         65536,           65536
##UNITS=     HZ,            ARBITRARY UNITS, ARBITRARY UNITS
##FACTOR=    0.49542278885378, 1,            1
##FIRST=     16045.7642231865, 0,            0
##LAST=      -16421.768244346, 0,            0
##MIN=       -16421.768244346, -96798008,    0
##MAX=       16045.7642231865, 282335863,    0
$$ Real data points
##PAGE= N=1
##DATA TABLE= (X++(R..R)), XYDATA
$$ [...]
38889G721318k69952m00906k54187L83445R88868J195454J184764R48477J95430
$$ 7721318 7451366 7050460 6796273 7179718 8168586 9364040 10548804 11497281 11692711
38880A1692711p31904r61758m52938j30282l70605o18720q04665j588970k648479
$$ 11692711 10960807 9999049 9546111 9415829 9045224 8426504 7621839 6032869 3384390
38871C384390k420475m67981J480984J902764J349061Q46590J31574j058884j566481
$$ 3384390 963915 495934 1976918 3879682 5228743 6075333 6206907 5148023 3581542
38862C581542m79047J102631J717540J636286J522723O23838j393125k363415
$$ 3581542 3102495 4205126 5922666 7558952 9081675 9705513 8312388 5948973
38854E948973l56560K570244K655344l0730j791659j067475l65574j646534l214773
$$ 5948973 5592413 8162657 10818001 10787271 8995612 7928137 7562563 5916029 2701256
38845B701256k766916p97576P98984J384127J229359M09180m75473k16447J027840
$$ 2701256 -65660 -863236 -64252 1319875 2549234 2958414 2482941 2266494 3294334
38836C294334J459834N46025R4091J000625J313012m40362k305974j920765m93746
$$ 3294334 4754168 5300193 5394284 6394909 7707921 7267559 4961585 3040820 2547074
38827B547074o32560j659404p21851K024298L095955R76007j559355j535147L80360
$$ 2547074 1914514 255110 -466741 1557557 4653512 5629519 4070164 2535017 2915377
38818B915377J571207J114690J63389j71624L1275K5378o31165j420135j256175
$$ 2915377 4486584 5601274 5764663 5593039 5624314 5649692 5018527 3598392 2342217
38809B342217k8868P94683J09296r73140p01170N19597Q77214K90752L81196J263549
$$ 2342217 2313349 3108032 3217328 2244188 1543018 2062615 2939829 3230581 3611777 4875326
38799D875326J072459o26295j618517m86534J112111J187173L15129L00P1337
$$ 4875326 5947785 5321490 3702973 3216439 4328550 5515723 5830852 5831152 5902489
38790E902489k21367j83829R43257J912441J176630l54172o76836L4048M6393
$$ 5902489 5681122 5497293 6440550 8352991 9529621 9175449 8498613 8532661 8579054
38781H579054o98333p17049m9346l02319j442788j406828L83657J745104J055652
$$ 8579054 7880721 7163672 7114326 6812007 5369219 3962391 4346048 6091152 7146804
38772G146804m45287r58004o68385n26939k95493M95922J059435N38278l72077
$$ 7146804 6701517 5743513 5075128 4548189 4252696 4748618 5808053 6346331 5974254
38763E974254n56756k95752m24584n69560J13862J064839Q86106m51799j446061
$$ 5974254 5417498 5121746 4697162 4127602 4241464 5306303 6192409 5740610 4294549
38754D294549j062448K47457J448137J858959J327159L23768l10181l68318n72948
$$ 4294549 3232101 3479558 4927695 6786654 8113813 8437581 8127400 7759082 7186134
38745G186134j198062j208942J64213J777562J867409M49912r66826j579241j693202
$$ 7186134 5988072 4779130 4943343 6720905 8588314 9038226 8071400 6492159 4798957
38736D798957j374832m30685M33327J95229o92716p75074P1456N37077K56864
$$ 4798957 3424125 2993440 3426767 3621996 2929280 2154206 2225662 2762739 3019603
38727C019603L05502Q81162O29109p98176j520278j58538J839047K206979R68707
$$ 3019603 3325105 4206267 4835376 4037200 2516922 2358384 4197431 6404410 7373117
38718G373117j19584l16005l70127p46664r69133p09311m10798p15830j785461
$$ 7373117 7253533 6937528 6567401 5820737 4851604 4142293 3731495 3015665 1230204
38709A230204k937695k751156m23512K493068K994736K93306k651926k690417
$$ 1230204 -1707491 -4458647 -4882159 -2389091 605645 898951 -1752975 -4443392
38701d443392m60902R98729P31371N75754J550844K075992O99841j329052j690747
$$ -4443392 -4904294 -3905565 -3174194 -2598440 -1047596 1028396 1728237 399185 -1291562
38692a291562j69572J242111J114506K85237M77668J816082K425149P97347j915019
$$ -1291562 -1461134 -219023 895483 1180720 1658388 3474470 5899619 6696966 4781947
38683D781947k917750j208499J127209J662958N23308n29223q04510q88354q47132
$$ 4781947 1864197 655698 1782907 3445865 3969173 3439950 2635440 1747086 899954
38674H99954j31750Q98209J183521Q03649Q63031J329868Q71698o25059j328490
$$ 899954 768204 1666413 2849934 3653583 4516614 5846482 6718180 6093121 4764631
38665D764631k69091Q73638K08818j501684k052852r54623K95456O00462L55267
$$ 4764631 4495540 5369178 5577996 4076312 2023460 1068837 1364293 1964755 2320022
38656B320022K94920N70057J011070J306765R61092k5450o24759q620Q32578N7415
$$ 2320022 2614942 3184999 4196069 5502834 6463926 6438476 5813717 5805097 6637675 6695090
38646F695090k180340l276226j417213J773398L053468J520445n60070r00392
$$ 6695090 4514750 1238524 -178689 1594709 4648177 6168622 5608552 4708160
38638D708160J22730N54604l20235j364936j464864p99564k297Q67975J813826
$$ 4708160 4830890 5385494 5065259 3700323 2235459 1435895 1433598 2301573 4115399
38629D115399K130096J141808n95091j749438j780387j232829n54847L90728J430448
$$ 4115399 6245495 7387303 6792212 5042774 3262387 2029558 1474711 1865439 3295887
38620C295887J696342P56756m95454p87296k7033O47177L04071p23953j319981
$$ 3295887 4992229 5748985 5253531 4466235 4439202 5086379 5390450 4666497 3346516
38611C346516r08940r0036J61842k67385o45811o33168p13264j000375n86788
$$ 3346516 2437576 2347540 2509382 2241997 1596186 963018 249754 -750621 -1337409
38602a337409R25642K018486Q75889j827965l330588k173937J97794J579105J389038
$$ -1337409 -411767 1606719 2482608 654643 -2675945 -4849882 -4652088 -3072983 -1683945
38593a683945M25703l99230l37282R61713K598349K851340J347482k10628m15787
$$ -1683945 -1258242 -1657472 -1994754 -1033041 1565308 4416648 5764130 5553502 5137715
38584E137715j39372r14833k341347k684410j514929j63194K73972k3265n06677
$$ 5137715 4998343 4083510 1742163 -942247 -2457176 -2620370 -2346398 -2369663 -2876340
38575b876340r00967q08364J21165J291748J417963J37532j314182j464941k13749
$$ -2876340 -3777307 -4585671 -4464506 -3172758 -1754795 -1617263 -2931445 -4396386 -4610135
38566d610135J201816J554006P65196j61446l17202P5746J21816l38416n13474
$$ -4610135 -3408319 -1854313 -1089117 -1250563 -1567765 -1492019 -1370203 -1708619 -2222093
38557b222093m0882L73210K07765J3301K53841K76255m71525j104576n31104P01309
$$ -2222093 -2262975 -1889765 -1682000 -1668699 -1414858 -1138603 -1610128 -2714704 -3245808 -2544499
38547b544499J268309J187190J437204J903085J538618M45822j01745J47684N5925
$$ -2544499 -1276190 -89000 1348204 3251289 4789907 5235729 5133984 5281668 5337593
38538E337593p58632j247588r21349o79065r16805o14571O79601J639125J182297
$$ 5337593 4578961 3331373 2410024 1730959 814154 199583 879184 2518309 3700606
38529C700606K34475J02714M13601J49890m65949p40544j048386j785175j776104
$$ 3700606 3935081 4037795 4451396 4601286 4135337 3394793 2346407 561232 -1214872
38520a214872J10107K390714K422077L12339j058246k94557O69216o9602j426316
$$ -1214872 -1104765 1285949 3708026 4020365 2962119 2667562 3336778 3267176 1840860
38511A840860j333416k693P82962N81794M38766O39642M04442j37822L38545K035765
$$ 1840860 507444 504751 1287713 1869507 2308273 2947915 3352357 3214535 3553080 5588845
38501E588845L063651J839581o83380k335372k440851j958857j510420p57500
$$ 5588845 8652496 10492077 9808697 7473325 5032474 3073617 1563197 805697
38493H05697L40026J089837J227593J324122J555296J190355M8r06337o83375
$$ 805697 1145723 2235560 3463153 4787275 6342571 7532926 7532974 6626637 5943262
38484E943262l14559j218865k782567k849811p64303J499904J780620K63543j096555
$$ 5943262 5628703 4409838 1627271 -1222540 -1986843 -486939 1293681 1557224 460669
38475D60669r78026J68648R63571N25596p19591j381876n47237J016762J603605
$$ 460669 -517357 -348709 614862 1140458 420867 -961009 -1508246 -491484 1112121
38466A112121O61041n59564p85247l55836m16606j134034j623858j314120m55721
$$ 1112121 1773162 1213598 428351 72515 -344091 -1478125 -3101983 -4416103 -4871824
38457d871824O09599J786527K712159K701616J565113M506j075659j298926p53320
$$ -4871824 -4262225 -2475698 236461 2938077 4503190 4507696 3432037 2133111 1379791
38448A379791K63796J141730J118198P7558j083653j409455j030371p99814q98498
$$ 1379791 1643587 2785317 3903515 3981073 2897420 1487965 457594 -342220 -1240718
38439a240718n62715N78145J662954J696851R46552M22607K73668k84852j386707
$$ -1240718 -1803433 -1225288 437666 2134517 3081069 3503676 3777344 3492492 2105785
38430B105785j949195j197736J03359O78229L85779K6785k8841p4805j58642N5030
$$ 2105785 156590 -1041146 -937787 -259558 126221 153006 124165 49360 -109282 -54252
38420e4252M45333L61029l34058q65858o02133L0338J50645l45453o08907J16529
$$ -54252 391081 752110 418052 -447806 -1049939 -1019601 -868956 -1214409 -1823316 -1706787
38410a706787J508518K376606J922912O56624k67742n44088q96536j574413j578305
$$ -1706787 -198269 2178337 4101249 4757873 4490131 3946043 3049507 1475094 -103211
38401a03211j68736J532060J588612k81211k307194k760589j598622K5543J067681
$$ -103211 -271947 1260113 2848725 2567514 260320 -2500269 -4098891 -4073348 -3005667
38392c005667J220264Q51702N05553K02976m83718j344134j266676J32189J444960
$$ -3005667 -1785403 -933701 -428148 -225172 -708890 -2053024 -3319700 -3187511 -1742551
38383a742551J298341N29767R15739K227392K501433J100352n74723j549623k242258
$$ -1742551 -444210 85557 1001296 3228688 5730121 6830473 6255750 4706127 2463869
38374B463869k549196j360830J066027K483425J687508K11294l35769n55841j265595
$$ 2463869 -85327 -1446157 -380130 2103295 3790803 4002097 3666328 3110487 1844892
38365A844892j348949J50422J550718Q11100r03018p51264J313533K419768J080656
$$ 1844892 495943 646365 2197083 3008183 2105165 1353901 2667434 5087202 6167858
38356F167858r41063j516713p84174j71060l31360q08773q47301j62743N77553
$$ 6167858 5226795 3710082 2925908 2754848 2423488 1614715 767414 604671 1182224
38347A182224L03534q84410j515772r65238n93911j306964j521138K62033K228338
$$ 1182224 1485758 601348 -914424 -1879662 -2473573 -3780537 -5301675 -5039642 -2811304
38338b811304J499765j161141k133030k88829J703538J778684R15466L89358k34990
$$ -2811304 -1311539 -2472680 -4605710 -4894539 -3191001 -1412317 -496851 -107493 -342483
38329c42483j107788j015252J67975O09343k76442l92822J402362K862377J861412
$$ -342483 -1450271 -2465523 -2297548 -1688205 -1964647 -2357469 -955107 1907270 3768682
38320C768682o2534l54309M58012L44323k26053P06751K516087K408811j42455
$$ 3768682 3706148 3351839 3809851 4154174 3928121 4634872 7150959 9559770 9417315
38311I417315k393221k158419k60683J297519J586969P11163p91318k021256k368553
$$ 9417315 7024094 4865675 4604992 5902511 7489480 8200643 7409325 5388069 3019516
38302C019516k134765j577728o5812K353105L571807J869225r42191j490277K63913
$$ 3019516 884751 -692977 -758789 1594316 5166123 7035348 6093157 4602880 4866793
38293D866793J031279o22092k178952j274815R28519K065072J943891J744225
$$ 4866793 5898072 5275980 3097028 1822213 2750732 4815804 6759695 8503920
38285H503920J630185J095786L92327j05263q62617j992108k229703p29689J122226
$$ 8503920 10134105 11229891 11622218 11516955 10654338 8662230 6432527 5702838 6825064
38276F825064J400756L53962k68988O1739L73663J98409Q1422K04937J19721p0815
$$ 6825064 8225820 8579782 8310794 8372533 8746196 8944605 9026027 9230964 9350685 9279870
38266I279870L11314J166572J497106R02724J33680j13858k4115l9438k50518
$$ 9279870 9591184 10757756 12254862 13157586 13291266 13177408 13153293 13113855 12863337
38257A2863337o60850j328955j980485k044064j289916r3649Q93532J068442K72510
$$ 12863337 12202487 10873532 8893047 6848983 5559067 5465418 6358950 7427392 7699902
38248G699902o64529l92751J175781K241865J371109l07677o48562K75250M19598
$$ 7699902 7035373 6642622 7818403 10060268 11431377 11123700 10475138 10750388 11169986
38239A1169986p86683j452336l37996J102744J037972m7486n32750k81996l06931
$$ 11169986 10383303 8930967 8592971 9695715 10733687 10686201 10153451 9871455 9564524
38230I564524o09673k56142O43366P87970k44484j191547q78095K02643O71036
$$ 9564524 8954851 8698709 9342075 10130045 9885561 8694014 7815919 8018562 8689598
38221H689598K2952r09526j002439m6112J058276J309076P48567K39613J07356
$$ 8689598 8712550 7803024 6800585 6754473 7812749 9121825 9870392 10110005 10217361
38212A0217361k38480j010058j342778o49552K45345M04340L62457R97836J522651
$$ 10217361 9978881 8968823 7626045 6976493 7221838 7626178 7988635 8986471 10509122
38203A0509122M58336j642119k502749j403549j37087p6686k83830M17629J337441
$$ 10509122 10967458 9325339 6822590 5419041 5281954 5205268 4921438 5339067 6676508
38194F676508J362565R65335J030061R06202l89632j898378j810839m26516J69466
$$ 6676508 8039073 9004408 10034469 10940671 10551039 8652661 6841822 6415306 6584772
38185F584772n90653r25192L23956J802695J655546N75j580190j952954j002343
$$ 6584772 5994119 5068927 5392883 7195578 8851124 8851699 7271509 5318555 4316212
38176D316212O96712J920615J462891l03936j383239o49757M73082M4238j446636
$$ 4316212 5012924 6933539 8396430 8092494 6709255 6059498 6532580 6576818 5130182
38167E130182j771205l33823R13985L52348r99546j011089O36266K192520K197997
$$ 5130182 3358977 3025154 3939139 4291487 3291941 2280852 2917118 5109638 7307635
38158G307635J090638L05982M56090P98177K54720j345868l003151l397605k096537
$$ 7307635 8398273 8704255 9160345 9958522 10213242 8867374 5864223 2466618 370081
38149C70081m0606J226282R45216k21528r48335n25079O50963J580301J426189
$$ 370081 329475 1555757 2500973 2279445 1331110 806031 1456994 3037295 4463484
38140D463484Q5366j533915k004565p87472R02642J356031N15823m1595N32846
$$ 4463484 4548850 3014935 1010370 222898 1125540 2481571 2997394 2955799 3488645
38131C488645J178188P19405l15128p10189m31152j78948J28285Q75854J320771
$$ 3488645 4666833 5386238 5071110 4360921 3929769 3750821 3879106 4754960 6075731
38122F075731M37726j023869j238035j69380K22031q96309j863281j154638L82194
$$ 6075731 6513457 5489588 4251553 4082173 4304204 3407895 1544614 389976 772170
38113G72170J078147P41257J57095l82830p09910j46839J269596J977436Q79992
$$ 772170 1850317 2591574 2748669 2365839 1655929 1509090 2778686 4756122 5636114
38104E636114p36382r26954L2138K88594o07813j294835r63587k75532J59486
$$ 5636114 4899732 3972778 4004916 4293510 3685697 2390862 1427275 1151743 1311229
38095A311229N22711P72057M32161k71074m49963n7570k1504n25036n08453N84389
$$ 1311229 1833940 2605997 3038158 2767084 2317121 2259551 2238047 1713011 1204558 1788947
38085A788947J780668J944700J184064L00809l10284o80349q88071j055003j143045
$$ 1788947 3569615 5514315 6698379 6999188 6688904 6008555 5120484 4065481 2922436
38076B922436p09346L65748J075990L97581q54418p74895P85727J762719Q51089
$$ 2922436 2213090 2578838 3654828 4052409 3197991 2423096 3208823 4971542 5822631
38067E822631o85798j103410n93870m03381p10878p50606k87383K46937N87879
$$ 5822631 5136833 4033423 3439553 3036172 2325294 1574688 1287305 1534242 2122121
38058B122121P11781N97470N54037J045962J628500J082567o93238k131066k201444
$$ 2122121 2833902 3431372 3985409 5031371 6659871 7742438 7049200 4918134 2716690
38049B716690j804305j842610j467859J29672J626030J350219Q6382j97666M01617
$$ 2716690 912385 -930225 -2398084 -2268412 -642382 707837 794219 596553 998170
38040I98170K69331m69604q4982J331884J517020j87862j420422l83345J472159
$$ 998170 1267501 797897 712915 2044799 3561819 3373957 1953535 1570190 3042349
38031C042349J869094Q86112K1962l49518p46073r32418l32330O13549J034925
$$ 3042349 4911443 5797555 5819517 5469999 4723926 3791508 3459178 4072727 5107652
38022E107652R85375Q83320L08806j180182k617765k579501j236983l5523L89579
$$ 5107652 6093027 6976347 7285153 6104971 3487206 907705 -329278 -364801 24778
38013B4778N39224N71612J29534l56515J22024J292243J511810J65402j213651
$$ 24778 564002 1135614 1265148 908633 1030657 2322900 3834710 4000112 2786461
38004B786461j044752K18446J088377J194873J239081J343374P73010o18383j678936
$$ 2786461 1741709 1960155 3048532 4243405 5482486 6825860 7598870 6980487 5301551
37995E301551j205260M88874J705414J129504p06581j981597j677240o99243m78253
$$ 5301551 4096291 4585165 6290579 7420083 6713502 4731905 3054665 2355422 1877169
37986A877169q75134m18728J351158K880755K526259O83214q16476r57262l45003
$$ 1877169 1002035 583307 1934465 4815220 7341479 8024693 7208217 6250955 5905952
37977E905952p504k53027p70884j161108j120904n48263K88036R05982J068498
$$ 5905952 5898448 5645421 4874537 3713429 2592525 2044262 2332298 3238280 4306778
37968D306778R49308Q27713P46063M55510l11454j324102j645326m83630J477061
$$ 4306778 5256086 6083799 6829862 7285372 6973918 5649816 4004490 3520860 4997921
37959D997921K262235Q04486j509507k373224j375284k53221l78265j161034j318497
$$ 4997921 7260156 8064642 6555135 4181911 2806627 2553406 2175141 1014107 -304390
37950c04390o54359J12612N22873O02027M22675J48927J44849M43162M94017R890
$$ -304390 -958749 -846137 -323264 278763 701438 850365 995214 1438376 1932393 1942283
37940A942283m00867j05194N23832P37171O30827P74649R28835K54819j207652
$$ 1942283 1541416 1436222 1960054 2697225 3328052 4102701 5031536 5286355 4078703
37931D078703k323151k279775j371089l03420L78720K00225p79379j319306j73454
$$ 4078703 1755552 -524223 -1895312 -2198732 -1820012 -1619787 -2399166 -3718472 -3891926
37922c891926J747263J934531k33898k134436j278089J294361K647000J954997
$$ -3891926 -2144663 -210132 -444030 -2578466 -3856555 -2562194 84806 2039803
37914B039803Q93514N84135L48423m20083j188640j592302k027879k266226j186505
$$ 2039803 2933317 3517452 3865875 3445792 2257152 664850 -1363029 -3629255 -4815760
37905d815760J122763K570381J695738j50671p17729J07697Q15513R26210J088230
$$ -4815760 -3692997 -1122616 573122 422451 -295278 -187581 627932 1554142 2642372
37896B642372R54966o85755l292123m267963k355547L38098J098696J60841j31987
$$ 2642372 3597338 2911583 -380540 -4648503 -7004050 -6665952 -5567256 -5406415 -5538402
37887e538402J036587K045007J558831M65731L94866J376843J901104R01916j010926
$$ -5538402 -4501815 -2456808 -897977 -432246 -37380 1339463 3240567 4142483 3131557
37878C131557k259868j888072m22541P41276Q11441L29668K78871P40121R14727
$$ 3131557 871689 -1016383 -1438924 -697648 113793 443461 722332 1462453 2377180
37869B377180L65937l76757n72614j09356N79953R76742P17523j14079p86855
$$ 2377180 2743117 2366360 1793746 1684390 2264343 3241085 3958608 3844529 3057674
37860C057674n93506J07368K31407l99469o86900n0137M39356l13018j536306
$$ 3057674 2464168 2571536 2802943 2403474 1716574 1666437 2105793 1792775 256469
37851B56469j670025p77416l28138p29591p24239M38850J723574J844500R03788
$$ 256469 -1413556 -2190972 -2519110 -3248701 -3972940 -3534090 -1810516 33984 937772
37842I37772k17885j076529j496572j117914k5151Q48789P92107K39897n8760
$$ 937772 719887 -356642 -1853214 -2971128 -2996279 -2147490 -1355383 -1115486 -1174246
37833a174246j43336l47237l75894K05436J062594J510039J376043P62823l63567
$$ -1174246 -1317582 -1664819 -2040713 -1835277 -772683 737356 2113399 2876222 2512655
37824B512655j536530j629652m51349L92854l49660j399101p04650J208508J783255
$$ 2512655 976125 -653527 -1104876 -712022 -1061682 -2460783 -3165433 -1956925 -173670
37815a73670J93432j622415j941956j145419j24435J039646J971809J652833L13057
$$ -173670 19762 -1602653 -3544609 -4690028 -4814463 -3774817 -1803008 -150175 162882
37806A62882k17007O93334J241946K53797n76078M10747J542753K00770k703546
$$ 162882 -54125 639209 1881155 2134952 1558874 1969621 3512374 3713144 1009598
37797A009598l724983j943385J8786K36677j54783L58571J171482J054057K47913
$$ 1009598 -2715385 -4658770 -4639984 -4403307 -4558090 -4199519 -3028037 -1973980 -1726067
37788a726067l07341m59748m01803M2009O65185O06020j73254l23999Q87903K165118
$$ -1726067 -2033408 -2493156 -2894959 -2852950 -2187765 -1581745 -1754999 -2078998 -1191095 974023
37778I74023J978038P56750l8218j70910n20453j292052j717311j282988k42589
$$ 974023 2952061 3708811 3670593 3499683 2979230 1687178 -30133 -1313121 -1555710
37769a555710P98000J102687K67526q35993o15489P93591J016682j114848l094154
$$ -1555710 -757710 344977 612503 -223490 -838979 -45388 971294 -143554 -3237708
37760c237708j988600R88733K078362O25667k50094J013106K002808P06964r35355
$$ -3237708 -5226308 -4237575 -2159213 -1533546 -1783640 -770534 1232274 1939238 1003883
37751A003883l04962J499325J509378l69074j561712j051080l42138k35829M24615
$$ 1003883 698921 2198246 3707624 3338550 1776838 725758 383620 147791 572406
37742E72406K040953K802458J323399j010657j891651j178649o21218j115846
$$ 572406 2613359 5415817 6739216 5728559 3836908 2658259 2037041 921195
37734I21195j704446j250336L5200J066482J213533P47056K44264n1567k20298
$$ 921195 -783251 -2033587 -1998387 -931905 281628 1028684 1272948 1221381 1001083
37725A001083k71243q4185K54051M53645N50926R93930J836085K294104J668939
$$ 1001083 729840 645655 899706 1353351 1904277 2898207 4734292 7028396 8697335
37716H697335L44140p88773j547999k259279k590614j699101K95274J967373K133951
$$ 8697335 9041475 8252702 6704703 4445424 1854810 155709 450983 2418356 4552307
37707D552307J077340n7431m29251J61311J323062K078199J529634l861j112560
$$ 4552307 5629647 5572216 5142965 5304276 6627338 8705537 10235171 10231310 9118750
37698I118750r67832k47213K1590k07395m35912o72019j178900j635698j463727
$$ 9118750 8150918 7903705 7925295 7717900 7281988 6609969 5431069 3795371 2331644
37689B331644p86582k66737q6706J77356O75932R45667N64331l29147j237536
$$ 2331644 1545062 1278325 1191619 1368975 2044907 2990574 3554905 3225758 1988222
37680A988222j640692j166138P9216J265594J410733M50471n47713n05434M83140
$$ 1988222 347530 -818608 -739392 526202 1936935 2387406 1839693 1334259 1817399
37671A817399J332541J250518N03409k29442q38840j554020j953933j222990K86315
$$ 1817399 3149940 4400458 4903867 4674425 3835585 2281565 327632 -895358 -609043
37662f09043Q91336j18149j066042k18800J300951R59124j124888j991486k09498
$$ -609043 282293 164144 -901898 -1120698 180253 1139377 14489 -1976997 -2186495
37653b186495J992531K131453Q15417R994j34991n69422q98263j30125R75163
$$ -2186495 -193964 1937489 2752906 2762900 2627909 2058487 1160224 1030099 2005262
37644B005262P82610m07194p92775j46166o0190r61585j249950l3095J351277
$$ 2005262 2787872 2380678 1587903 1441737 1381547 419962 -829988 -863083 488194
37635D88194J409869M14688n54592r96659o89487N42346J999566K380599J568370
$$ 488194 1898063 2312751 1758159 761500 72013 614359 2613925 4994524 6562894
37626F562894Q43555P72807M07276p54308j673357j542621j030567p72659l09892
$$ 6562894 7406449 8179256 8586532 7832224 6158867 4616246 3585679 2813020 2503128
37617B503128L39179r4663j810103k655258j107771J051785J293496K19499K91652
$$ 2503128 2842307 2747644 937541 -1717717 -2825488 -1773703 -480207 -260708 30944
37608C0944J623961J962560N83619o91970p12049n69168j162858j478787m76441
$$ 30944 1654905 3617465 4201084 3509114 2797065 2227897 1065039 -413748 -890189
37599h90189J052121J737127J465638R34949M71929J97128L52700O34976J58870
$$ -890189 161932 1899059 3364697 4299646 4771575 4968703 5321403 5956379 6115249
37590F115249j137753k033350j761828j184662j281899j487759p47223N57516
$$ 6115249 4977496 2944146 1182318 -2344 -1284243 -2772002 -3519225 -2961709
37582b961709J146581Q73607P68129J112620Q90797m40778j756533j608419j54306
$$ -2961709 -1815128 -941521 -173392 939228 1830025 1389247 -367286 -1975705 -2130011
37573b130011J087028J213091Q71780J001585J312201P26920q61618k139851j965869
$$ -2130011 -1042983 170108 1041888 2043473 3355674 4082594 3220976 1081125 -884744
37564h84744p24394L72430P03927L66700m08567j048273m79034J523095L150971
$$ -884744 -1609138 -1236708 -532781 -166081 -574648 -1622921 -2101955 -578860 2572111
37555B572111K259426o45705k591241j724160O34504K069264J844993Q13030j60707
$$ 2572111 4831537 4185832 1594591 -129569 504935 2574199 4419192 5232222 5071515
37546E071515n73977r5816Q46434J060262J98039m83955q9224K21587r59023k647766
$$ 5071515 4497538 4401722 5248156 6308418 6506457 6022502 5933278 6154865 5195842 2548076
37536B548076k629387q52226N01528M23963L18590J187346J741334O35560j083308
$$ 2548076 -81311 -933537 -432009 -8046 310544 1497890 3239224 3874784 2791476
37527B791476j454683m86211J23323m64105j499206k100987j985501r74601P57161
$$ 2791476 1336793 850582 973905 509800 -989406 -3090393 -5075894 -6050495 -5293334
37518e293334K002433J581120K36212k6447J152214J813366O38229r70400r70052
$$ -5293334 -3290901 -1709781 -1473569 -1500016 -347802 1465564 2103793 1133393 163341
37509A63341L87445J233047Q88030L15625J27044j73431q49147j294682j096390
$$ 163341 550786 1783833 2671863 2987488 3114532 2941101 2091954 797272 -299118
37500b99118n86180j6249P47312J388304J115000n7010j014500j050607o90761
$$ -299118 -885298 -901547 -154235 1234069 2349069 2292059 1277559 226952 -463809
37491d63809n23762k82139K73663O59928O67076R65393J747916J854626M72382
$$ -463809 -987571 -1269710 -996047 -336119 330957 1296350 3044266 4898892 5371274
37482E371274j233648j588466p57810j63353k09163k26987k02443p35068j431077
$$ 5371274 4137626 2549160 1791350 1627997 1418834 1191847 989404 254336 -1176741
37473a176741j150575J0596O66814L23237j556L22812O31085M65890M08428P01912
$$ -1176741 -2327316 -2316720 -1649906 -1326669 -1328225 -1005413 -374328 91562 499990 1201902
37463A201902N17559n09835j272065p04754O38443J373941Q62696n53134j948521
$$ 1201902 1719461 1209626 -62439 -767193 -128750 1245191 2107887 1554753 -393768
37454c93768k030910j88778K108848K345285J63612j879061j685582k19692M65228
$$ -393768 -2424678 -2613456 -504608 1840677 2004289 125228 -1560354 -1780046 -1314818
37445a314818K27448K22782N76039N69861L01664L22779K83358l24449p05665
$$ -1314818 -1087370 -864588 -288549 281312 582976 905755 1189113 864664 158999
37436A58999J42886J415381J478148M82569K8089M28767L54210p53997j868932
$$ 158999 301885 1717266 3195414 3677983 3706072 4134839 4489049 3735052 1866120
37427A866120k197854j984293j273472K20692J655883J437336l11899j483262
$$ 1866120 -331734 -2316027 -3589499 -3368807 -1712924 -275588 -587487 -2070749
37419b070749r20874J38769L74176K74341O18943Q31147K90952j84815K26119
$$ -2070749 -2991623 -2852854 -2478678 -2204337 -1585394 -754247 -463295 -648110 -421991
37410d21991O56133o450r35515m84686J067628J743506P60632m07282j83642J048108
$$ -421991 234142 227692 -707823 -1192509 -124881 1618625 2379257 1971975 1788333 2836441
37400B836441J538763K97274j678071k259566n33152J794557K157892M25036q84944
$$ 2836441 4375204 4672478 2994407 734841 201689 1996246 4154138 4579174 3694230
37391C694230k69080N32776o06057k585658k529334j46336J779909J333978l22485
$$ 3694230 3425150 3957926 3351869 766211 -1763123 -1909459 -129550 1204428 881943
37382H81943j229331j127132p23827j29438O73071R68519L22581k85641L05128
$$ 881943 -347388 -1474520 -2198347 -2327785 -1654714 -686195 -363614 -649255 -344127
37373c44127J511843J646049L73560p41115m34842N81216P81766p3230q75307
$$ -344127 1167716 2813765 3187325 2446210 2011368 2592584 3374350 3301120 2425813
37364B425813q96175n89769m88435k50398M79173R26614O2463j527072j939983
$$ 2425813 1529638 939869 451434 201036 680209 1606823 1669286 142214 -1797769
37355a797769n26208J041079J057968J20515m252R15113J486834J030191M05541
$$ -1797769 -2323977 -1282898 -224930 -104415 -108667 806446 2293280 3323471 3729012
37346C729012K81562L4048r38024j896733j712094n22089M39487M40722L795Q4714
$$ 3729012 4010574 4044622 3106598 1209865 -502229 -1024318 -584831 -144109 -140314 -55600
37336e5600R24347J800782J810879Q81311j29334m93287m76668p07103j021654
$$ -55600 868747 2669529 4480408 5361719 5232385 4739098 4262430 3555327 2533673
37327B533673p39033L6259L64883p6300m67364k04489J37640r8920l53843L98602
$$ 2533673 1794640 1830899 2195782 2119482 1652118 1447629 1585269 1486349 1132506 1531108
37317A531108J938189K764053J828532k63796j907897k062031j123307l45675
$$ 1531108 3469297 6233350 8061882 7798086 5890189 3828158 2704851 2359176
37309B359176l42619l48973O05448J989383K137234N35307j255914j566977o31073
$$ 2359176 2016557 1667584 2273032 4262415 6399649 6934956 5679042 4112065 3480992
37300C480992J93446M13376M71414L53595m72271j715478k127190j130944K83986
$$ 3480992 3674438 4087814 4559228 4912823 4440552 2725074 597884 -533060 -249074
37291b49074P97872L16894j49870K04528J169178J804911J337826j16559j651087
$$ -249074 548798 865692 715822 920350 2089528 3894439 5232265 5115706 3464619
37282C464619k437637k355593j676958n61377P36210J572139J480031Q35726L54362
$$ 3464619 1026982 -1328611 -3005569 -3566946 -2830736 -1258597 221434 1057160 1411522
37273A411522J21849k13695m99055j77728O59412J160859Q42029J60224k19138
$$ 1411522 1533371 1319676 820621 642893 1302305 2463164 3305193 3465417 3246279
37264C246279j64754K3508n7943o71915j459006j388243J2149J569347J663000
$$ 3246279 3081525 3105033 3047090 2375175 916169 -472074 -459925 1109422 2772422
37255B772422M26122n07784m99632n69978j159272j034122M94697J863443J353656
$$ 2772422 3198544 2690760 2191128 1621150 461878 -572244 -77547 1785896 3139552
37246C139552k35500p98056n9342M01168r6476n40952l02108j09891m26033m93996
$$ 3139552 2904052 2105996 2046654 2447822 2351346 1810394 1508286 1398395 972362 478366
37236D78366J20079M17053m50476j482362j068958N98340J722115J428250P87597
$$ 478366 598445 1015498 565022 -917340 -1986298 -1387958 334157 1762407 2550004
37227B550004Q83077R77742l20959k515826l204314j115838J823971K562107O67129
$$ 2550004 3433081 4410823 4089864 1574038 -1630276 -2746114 -922143 1639964 2307093
37218B307093j270272j094237M31022J261435R38314N49558N90849M10744l25298
$$ 2307093 1036821 -57416 373606 1635041 2573355 3122913 3713762 4124506 3799208
37209C799208r85598j051771p95255n12615M0514R77374J688710J444562K62980
$$ 3799208 2813610 1761839 966584 453969 494483 1471857 3160567 4605129 4868109
37200D868109j122905j925016j807648j004937j6140R35244J930311K659892K261045
$$ 4868109 3745204 1820188 12540 -992397 -1008537 -73293 1857018 4516910 6777955
37191F777955M84200j434707j964400j116283k00357N3829Q6858K62187J83120
$$ 6777955 7262155 5827448 3863048 2746765 2546408 2600237 2687095 2949282 3132402
37182C132402m52612j230765j596404j384580o49859L30895Q84705N84395J7414
$$ 3132402 2679790 1449025 -147379 -1531959 -2181818 -1850923 -966218 -381823 -364409
37173c64409P304K15522l13475j292161j321751j07649R22638O76410k65920q46143
$$ -364409 -357105 -141583 -455058 -1747219 -3068970 -3176619 -2253981 -1577571 -1843491 -2689634
37163b689634p32600J22388J651843K825062K208879J32203j298320j159494r19685
$$ -2689634 -3422234 -3299846 -1648003 1177059 3385938 3518141 2219821 1060327 140642
37154A40642j666901k142061j102126K56418K88218k29811M58506J896748K085420
$$ 140642 -1526259 -3668320 -4770446 -4514028 -4225810 -4455621 -3997115 -2100367 -14947
37145a4947O66695p88748j182775n77205Q71813K546345K640554K43264k339638
$$ -14947 651748 -137000 -1319775 -1896980 -1025167 1521178 4161732 4404996 2065358
37136B065358j990138O88567K002676M28695j645316j957936j242693r80690r01612
$$ 2065358 75220 763787 2766463 3195158 1549842 -408094 -1650787 -2631477 -3533089
37127c533089k44490N12562O81776N53307M05219j12149o82842k25637R39282
$$ -3533089 -3777579 -3265017 -2583241 -2029934 -1624715 -1736864 -2419706 -2645343 -1706061
37118a706061Q91320o76943j303693M42579K232999J411086o91979p63385J323726
$$ -1706061 -814741 -1491684 -2795377 -2352798 -119799 1291287 599308 -164077 1159649
37109A159649K458072J089178q47342j218667m82936k86575r82581j559386j090070
$$ 1159649 3617721 4706899 3859557 2640890 2157954 1871379 888798 -670588 -1760658
37100a760658L67772J706384J507399l86374k133988j726218M50069J934184J202088
$$ -1760658 -1392886 313498 1820897 1434523 -699465 -2425683 -1975614 -41430 1160658
37091A160658o85851j709398j180831N1968R34853J113845Q37526M50114O5966
$$ 1160658 474807 -1234591 -2415422 -2363454 -1428601 -314756 522770 972884 1038850
37082A038850l08143m94822l53906k38364o02535r96063l19999J435003K632219
$$ 1038850 730707 235885 -118021 -356385 -958920 -1954983 -2274982 -839979 1792240
37073A792240J974553K67355p55162p02663n62572r77807j599221j811350j130206
$$ 1792240 3766793 4034148 3278986 2576323 2013751 1035944 -563277 -2374627 -3504833
37064c504833O88931K916950L747621K183524l36658j485160r11286j98595k69406
$$ -3504833 -2815902 101048 3848669 6032193 5695535 4210375 3299089 3100494 2831088
37055B831088m91803l88680m69924r01209q99894j58986M20398J91460j65575
$$ 2831088 2339285 1950605 1480681 579472 -320422 -479408 -59010 132450 -33125
37046c3125J29394O35405N44759J05263J78921Q26358J244343R11048P7796p65623
$$ -33125 96269 731674 1276433 1381696 1560617 2386975 3631318 4542366 4620162 3854539
37036C854539j314204j349975p30695L35880J229257J347586O75082j48662m83739
$$ 3854539 2540335 1190360 459665 795545 2024802 3372388 4047470 3898808 3415069
37027C415069l69133k66038k04768K25508R31185J156724O61409J97318J98720
$$ 3415069 3045936 2779898 2575130 2800638 3731823 4888547 5549956 5747274 5945994
37018E945994p4834j149627j954110j093313J019053K539995K332992O72080j560170
$$ 5945994 5871160 4721533 2767423 1674110 2693163 5233158 7566150 8238230 6678060
37009F678060l130376k694335m25359J259941M92206j161019q56699J016281J394753
$$ 6678060 3547684 853349 427990 1687931 2180137 1019118 162419 1178700 2573453
37000B573453l85367j441235j69088J170920M77887o54023M9382J485997J170285
$$ 2573453 2188086 746851 577763 1748683 2226570 1572547 1621929 3107926 4278211
36991D278211m84650j091845l77009j30612o78451n51232M68849R88600Q44866
$$ 4278211 3793561 2701716 2324707 2194095 1515644 964412 1433261 2421861 3266727
36982C266727J322786K081714R83031j941635l380735j401772J362869J519115
$$ 3266727 4589513 6671227 7654258 5712623 2331888 930116 2292985 3812100
36974C812100j66717m88416Q97031J155453r14187k824515k045848N53144K228416
$$ 3812100 3645383 3156967 4053998 5209451 4295264 1470749 -575099 -21955 2206461
36965B206461J818688L27561r18336j301720o85968N14077J185018N25405p40346
$$ 2206461 4025149 4352710 3434374 2132654 1446686 1960763 3145781 3671186 2930840
36956B930840j025534J14485J399583J460062M01047n68391n76509J30555N10777
$$ 2930840 1905306 2019791 3419374 4879436 5280483 4712092 4135583 4266138 4776915
36947D776915k93118j934140k878515k022793k12127P02862L20198N296M80915
$$ 4776915 4483797 2549657 -328858 -2351651 -2563778 -1860916 -1540718 -1535422 -1054507
36938a054507O45179k85207r86332n23J602575J573915m0979r52284j36419Q79869
$$ -1054507 -409328 -694535 -1680867 -1681390 -78815 1495100 1454121 501837 365418 1245287
36928A245287P33328J80395L55154P46069K32883r59679j599767j058831L26331
$$ 1245287 1978615 2159010 2514164 3260233 3493116 2533437 933670 -125161 201170
36919B01170J831245K538713J742058l0775j116728o27088M36602O77562Q0948
$$ 201170 2032415 4571128 6313186 6282411 5165683 4538595 4975197 5652759 5733707
36910E733707n12805q09338r10725n54032L45482R90593O79827j4610j57484m5472
$$ 5733707 5220902 4411564 3500839 2946807 3292289 4282882 4962709 4948099 4790615 4745143
36900D745143o69188j901783k462729j628038O410J381896J783608J061180p1957
$$ 4745143 4075955 2174172 -288557 -1916595 -1910185 -528289 1255319 2316499 2244542
36891B244542k67907R72771K338334K203913P73223l42287l67367L0930J85700
$$ 2244542 1976635 2949406 5287740 7491653 8264876 7922589 7555222 7586152 7771852
36882G771852J64886N4654k33522l33946J79824O40277j68063j985398k913585
$$ 7771852 7936738 7991392 7757870 7423924 7603748 8244025 8075962 6090564 3176979
36873C176979j877857j30241M72256j82176o69391m771J378696K332721K103172
$$ 3176979 1299122 1168881 1641137 1458961 789570 784799 2163495 4496216 6599388
36864F599388Q97488l13670o70062j94529M53818Q14705Q14302L98002l10437
$$ 6599388 7496876 7183206 6513144 6318615 6772433 7587138 8401440 8799442 8489005
36855H489005o22749O4385J173100J390026M10160o33940p77791l74434k07698
$$ 8489005 7866256 7930641 9103741 10493767 10903927 10269987 9492196 9117762 8910064
36846H910064l43611n33529j010831j973188k698973k195736p28151K05329k00172
$$ 8910064 8566453 8032924 7022093 5048905 2349932 154196 -573955 -368626 -568798
36837e68798q26382q9811J620778K059734J94172j862028j319164J357866K861620
$$ -568798 -1395180 -1484991 135787 2195521 2389693 527665 -791499 566367 3427987
36828C427987J680306K06487R68441K694276K334685j75627j855190j115559L35316
$$ 3427987 5108293 5314780 6283221 8977497 11312182 11136555 9281365 8165806 8501122
36819H501122M63592n07098j350809j739196j741278r88984L63769J019986J46934
$$ 8501122 8964714 8457616 7106807 5367611 3626333 2637349 3001118 4021104 4168038
36810D168038j249010j653674j002029k82480J22511O27392J413009K095536K145184
$$ 4168038 2919028 1265354 263325 -19155 103356 730748 2143757 4239293 6384477
36801F384477J142723q06324k468771k217944j57331J389279N70804j511616k205282
$$ 6384477 7527200 6720876 4252105 2034161 1876830 3266109 3836913 2325297 120015
36792A20015o87880J325162K020872J343137K92965m81269r08242j001687p12584
$$ 120015 -567865 757297 2778169 4121306 4414271 3933002 3024760 2023073 1310489
36783A310489j04402N76321J013188J039648P64291L68598j15161n38749l85489
$$ 1310489 1206087 1782408 2795596 3835244 4599535 4968133 4852972 4314223 3928734
36774C928734N57405J357781P05307j217178k540811j875713R9675J704747K114419
$$ 3928734 4486139 5843920 6549227 5332049 2791238 915525 1015200 2719947 4834366
36765D834366J568796N61844l61956o16526k07330N9331l78254j076531j414279
$$ 4834366 6403162 6965006 6603050 5986524 5779194 5838525 5460271 4383740 2969461
36756B969461j503059j591911j304601l65572N20074M76024l08533j013762j348425
$$ 2969461 1466402 -125509 -1430110 -1795682 -1275608 -799584 -1108117 -2121879 -3470304
36747c470304j374570p71951N85557J745700J600845M99840j96179k3496K53843
$$ -3470304 -4844874 -5616825 -5031268 -3285568 -1684723 -1184883 -1381062 -1404558 -1150715
36738a150715J39015J0838J00041J9268l07274k09732O84375J621171J506531
$$ -1150715 -1011700 -1000862 -900821 -881553 -1188827 -1398559 -714184 906987 2413518
36729B413518K53603j012289j070222J10644J244142J133835J27551m40813k48953
$$ 2413518 2667121 1654832 584610 695254 1939396 3073231 3200782 2759969 2511016
36720B511016l34501j057294j126608K70281J668308J278213j79110n13329N77690
$$ 2511016 2176515 1119221 -7387 262894 1931202 3209415 3030305 2516976 3094666
36711C094666J267949O10198l40493p05837j025341j624385j609281n32295M53242
$$ 3094666 4362615 4972813 4632320 3926483 2901142 1276757 -332524 -864819 -411577
36702d11577K91042k74938J32558J503621K620181K597461J452582j78730j229045
$$ -411577 -120535 -395473 -262915 1240706 3860887 6458348 7910930 7732200 6503155
36693F503155q98365K03261N34662j37266k08039J120930K083950P99278j615251
$$ 6503155 5604790 5808051 6342713 6205447 5997408 7118338 9202288 10001566 8386315
36684H386315k356683q46929P10072O31986l57443r30857j037708j186310j278504
$$ 8386315 6029632 5182703 5892775 6524761 6167318 5236461 4198753 3012443 1733939
36675A733939j138703j146970j407879j198947k06317N46638J46219n22439J17003
$$ 1733939 595236 -551734 -1959613 -3158560 -3364877 -2818239 -2672020 -3194459 -3077456
36666c077456J884717K917231K188475O26106n08533j014297j014537j76772J321018
$$ -3077456 -1192739 1724492 3912967 4539073 4030540 3016243 2001706 1824934 3145952
36657C145952K036121P68917j647374l217702l130573k136017r18714N22601J866185
$$ 3145952 5182073 5950990 4303616 1085914 -2044659 -4180676 -5099390 -4576789 -2710604
36648b710604K296975J770526J233529J094398O77127j97951m30071N46399J358643
$$ -2710604 -413629 1356897 2590426 3684824 4361951 4164000 3733929 4280328 5638971
36639E638971N16888j187678j703518o97589J64991j07311n54276j37276N33363
$$ 5638971 6155859 4968181 3264663 2567074 2732065 2624754 2070478 1933202 2466565
36630B466565K92459o19268p91139L65528J749304J987018J238129R24760J530117
$$ 2466565 2759024 2139756 1348617 1714145 3463449 5450467 6688596 7613356 9143473
36621I143473J471139q19483m015979m724395j767071J907939K849467J368924
$$ 9143473 10614612 9795129 5779150 1054755 -712316 1195623 4045090 5414014
36613E414014M41008J225594J921595R86042p26971j653932j567538j041212k61079
$$ 5414014 5855022 7080616 9002211 9988253 9261282 7607350 6039812 4998600 4737521
36604D737521N99063Q35734Q5966r00347j170484p57860l52572k66607k62386
$$ 4737521 5336584 6172318 6258284 5357937 4187453 3429593 3077021 2810414 2548028
36595B548028m1213M26852P08151M4304j642241k947346k233319J43052K002807
$$ 2548028 2506815 2933667 3641818 3686122 2043881 -903465 -3136784 -2993732 -990925
36586i90925K108379J521990J635479K159483K019717J146056K20606n32922j171547
$$ -990925 1117454 2639444 4274923 6434406 8454123 9600179 9820785 9287863 8116316
36577H116316j322944p82547k65928m75228r24019p84829l78521n62602j037283
$$ 8116316 6793372 6010825 5744897 5269669 4345650 3560821 3182300 2619698 1582415
36568A582415o87159M97957J274223J073194P10136P55623N19406n37255j426158
$$ 1582415 895256 1393213 2667436 3740630 4450766 5206389 5725795 5188540 3762382
36559C762382q57770O17671R35725q34069l088845l521887j867716p7636J58753
$$ 3762382 2904612 3522283 4458008 3623939 535094 -2986793 -4854509 -4932145 -4773392
36550d773392p49129j273922q32843o0610N58230J240217K000896K217951J577654
$$ -4773392 -5522521 -6796443 -7629286 -7689896 -7131666 -5891449 -3890553 -1672602 -94948
36541i4948P73204O88094J257480J583669R73621l73327j522226j605439p13456
$$ -94948 678256 1366350 2623830 4207499 5181120 4807793 3285567 1680128 966672
36532I66672J58771L82022M75731R67034J097568p7047j693345j860937m53413
$$ 966672 1125443 1507465 1983196 2950230 4047798 3970751 2277406 416469 -36944
36523c6944P20040Q44608J108321J990604J810199m53595k809170k782855r32718
$$ -36944 683096 1527704 2636025 4626629 6436828 5983233 3174063 391208 -541510
36514e41510L06248K14166l0341O8351l468M3113R57397J893918J176303o61877
$$ -541510 -235262 -21096 -51437 16914 13446 56559 1013956 2907874 4084177 3422300
36504C422300j074319O44062K053821J127139r77864j965471j439061m73826L12452
$$ 3422300 2347981 2992043 5045864 6173003 5195139 3229668 1790607 1316781 1629233
36495A629233P11563K20329r69129j281335K39729K008701J745278k65661j582463
$$ 1629233 2340796 2561125 1591996 310661 550390 2559091 4304369 4038708 2456245
36486B456245j057542Q830L47624M70146J189016J940792J763138R58754N27894
$$ 2456245 1398703 1407533 1755157 2225303 3414319 5355111 7118249 8077003 8604897
36477H604897M90839J855j060971j763904j492122p04464o0976L33241M17272
$$ 8604897 9095736 9097591 8036620 6272716 4780594 4076130 4015154 4348395 4765667
36468D765667k23292j540087k454796j979248n39538O24077J041555J110236R40862
$$ 4765667 4542375 3002288 547492 -1431756 -1971294 -1347217 -305662 804574 1745436
36459A745436K47193o90916j139155j056500r36688m69812J084112K866749K672297
$$ 1745436 1992629 1301713 162558 -893942 -1830630 -2300442 -1216330 1650419 4322716
36450D322716K06402j745133r81114Q40977O75066j294212k047012l83289J459269
$$ 4322716 4529118 2783985 1802871 2643848 3318914 2024702 -22310 -405599 1053670
36441A053670J341571J14637j31725R04891J803304J568849N00394o36143j318623
$$ 1053670 2395241 2509878 2378153 3283044 5086348 6655197 7155591 6519448 5200825
36432E200825j245610k81365J307771K629881K443110K53668k591149l658080
$$ 5200825 3955215 3673850 4981621 7611502 10054612 10308280 7717131 4059051
36424D059051k004264O01706J860925J618155J220101J013791K30633r87941j439032
$$ 4059051 2054787 2656493 4517418 6135573 7355674 8369465 8600098 7612157 6173125
36415F173125r29796o63068j100449j175042k88181N59744M84185M6708q7699
$$ 6173125 5243329 4580261 3479812 2304770 2016589 2576333 3060518 3107226 3019527
36406C019527l44495r18068o63428J140963K933824K508684P5044j833678j433922
$$ 3019527 2675032 1756964 1093536 2234499 5168323 7677007 7752051 5918373 4484451
36397D484451M85170J830563J403785k29022j443566j125632J28672O32554l04783
$$ 4484451 4969621 6800184 8203969 7974947 6531381 5405749 5534421 6166975 5862192
36388E862192j456035j297203O2678J236244J342800O87720j2756l48423k77727
$$ 5862192 4406157 3108954 3171632 4407876 5750676 6438396 6425640 6077217 5799490
36379E799490j9863J37160J61221K53417M52076O26493Q26050J044915P34453
$$ 5799490 5779627 5916787 6078008 6331425 6783501 7409994 8236044 9280959 10015412
36370A0015412n23198j801297j491595M17385J929806J554796J24601o29678k22532
$$ 10015412 9492214 7690917 6199322 6616707 8546513 10101309 10225910 9596232 9373700
36361I373700P03019J511112J562254J50092k268587l616841k333619N48847K577527
$$ 9373700 10076719 11587831 13150085 13300177 11031590 7414749 5081130 5629977 8207504
36352H207504K580825J232535k87923j020374m01680R33429J209097k80570j765167
$$ 8207504 10788329 12020864 11732941 10712567 10310887 11244316 12453413 12172843 10407676
36343A0407676j307651L07976Q70856K41324K66943J424167K018963J120450k5339
$$ 10407676 9100025 9408001 10278857 10520181 10787124 12211291 14230254 15350704 15325365
36334A5325365l15717m51892j161340j559772p19159M75796N52613l88306j145005
$$ 15325365 15009648 14557756 13396416 11836644 11117485 11593281 12145894 11757588 10612583
36325A0612583j360467j614609j980007j813063r16446J78812J175708K315888
$$ 10612583 9252116 7637507 5657500 3844437 2927991 3106803 4282511 6598399
36317F598399L454463L644219K287009L56383l38057O01801J297949j41946k722448
$$ 6598399 10052862 13697081 15984090 16340473 16002416 16604217 17902166 17760220 15037772
36308A5037772l288597o89850K261862K374109M28068j64947J497795K684953
$$ 15037772 11749175 11059325 13321187 15695296 16123364 15958417 17456212 20141165
36300B0141165J510590j47322K31811J833505J901692j6334j600718j252812P4885
$$ 20141165 21651755 21504433 21736244 23569749 25471441 25455107 23854389 22601577 22676462
36291B2676462Q15074P45855L48105l41481j223594j436058l09960J370422K046107
$$ 22676462 23491536 24237391 24585496 24244015 23020421 21584363 21274403 22644825 24690932
36282B4690932J258291Q8693l27074j0298M15381Q26894J467044J981084J483068
$$ 24690932 25949223 26037916 25710842 25700544 26115925 26942819 28409863 30390947 31874015
36273C1874015q5939j311464p04737J440706L225200L204617J729112J40259o90410
$$ 31874015 31788076 30476612 29771875 31212581 34437781 37642398 39371510 39511769 38821359
36264C8821359o15489L71287K105062L746356M230041L603138L194017L758134
$$ 38821359 38205870 38577157 40682219 44428575 48658616 52261754 55455771 59213905
36256E9213905M039358K353693n14183j559500N73186L408799L811565K307700
$$ 59213905 63253263 65606956 65092773 63533273 64106459 67515258 71326823 73634523
36248G3634523K095107M021990N143715L173372J01000m20353K134936N014386
$$ 73634523 75729630 79751620 84895335 88068707 88169707 87749354 89884290 94898676
36240I4898676O053368N660805N155014N016471N158308N543384N999288O270874
$$ 94898676 100952044 106612849 111767863 116784334 121942642 127486026 133485314 139756188
36232A39756188O518655P053686P547500P315764O439483N826579O091326P022788
$$ 139756188 146274843 153328529 160876029 168191793 174631276 180457855 186549181 193571969
36224A93571969Q092199Q841431Q969513Q728753Q922876R747628J0081582Q853247
$$ 193571969 201664168 210505599 219475112 228203865 237126741 246874369 256955951 265809198
36216B65809198O603762M626589L156978J694757M44579j73936q33880k244975
$$ 265809198 272412960 277039549 280196527 281891284 282335863 282161927 281328047 279083072
36208B79083072l398731l165262l144175n951436j0541731j2621006j0725302
$$ 279083072 275684341 272519079 269374904 263423468 252881737 240260731 229535429
36201B29535429q519088r233592j0999159j0378683p899089o658218p132837p054691
$$ 229535429 221016341 211782749 200783590 190404907 182505818 175847600 168714763 161660072
36193A61660072n739106n014770n748154o515703o333455o147465o756170p333025
$$ 161660072 155920966 150906196 145158042 138642339 132308884 126161419 119405249 112072224
36185A12072224o948783n916044m836515l786986l112753l521507m623958m829103
$$ 112072224 105123441 99207397 94370882 90583896 87471143 83949636 79325678 74496575
36177G4496575l592155k440163k744157l689585l668595k678457j939813j814251
$$ 74496575 70904420 68464257 65720100 62030515 58361920 55683463 53743650 51929399
36169E1929399j610985j210156j394160k317120k854186k109346q18178m65174
$$ 51929399 50318414 49108258 47714098 45396978 42542792 40433446 39615268 39150094
36161C9150094j306446k041147j550260l26278K67848k14021r01764r34975m95034
$$ 39150094 37843648 35802501 34252241 33925963 34193811 33979790 33078026 32143051 31648017
36152C1648017k80664n41527j027376j454855j611409j375068j024343j129642
$$ 31648017 31367353 30825826 29798450 28343595 26732186 25357118 24332775 23203133
36144B3203133j735176k112753j787634j242510r74674m91967P80968K033551
$$ 23203133 21467957 19355204 17567570 16325060 15350386 14858419 15639387 17672938
36136A7672938J748739j08526j695837j450292J57210J428092J370283L57028
$$ 17672938 19421677 19313151 17617314 16167022 16324232 17752324 19122607 19479635
36128A9479635p23820j422007j832090k067375j925026j250131m06666J29950
$$ 19479635 18755815 17333808 15501718 13434343 11509317 10259186 9852520 9982470
36120I982470N76779J441380K192157J496483n61155j751933m94641J551651J426430
$$ 9982470 10559249 12000629 14192786 15689269 15128114 13376181 12881540 14433191 15859621
36111A5859621r94962k700592j577248R87705K177586J036901j125743k542440
$$ 15859621 14864659 12164067 10586819 11574524 13752110 14789011 13663268 11120828
36103A1120828k287361n64314J375731K038750J123857j12517l45548L66675J011696
$$ 11120828 8833467 8269153 9644884 11683634 12807491 12694974 12349426 12716101 13727797
36094A3727797J024952P34923O89275R84606J160818O01434p39469j976107k052496
$$ 13727797 14752749 15487672 16176947 17161553 18322371 18923805 18184336 16208229 14155733
36085A4155733r55844K35030N71131O8804o53727j000212o42342J80545N12454
$$ 14155733 13199889 13434919 14006050 14074854 13421127 12420915 11778573 11959118 12471572
36076A2471572m27643j995999k506803j193761Q40610J936147J529894K61188
$$ 12471572 12043929 10047930 7541127 6347366 7187976 9124123 10654017 10915205
36068A0915205q60575j031035p7484J218674J713276J124735J93680m59526q71009
$$ 10915205 10054630 9023595 8946111 10164785 11878061 13002796 13196476 12736950 11865941
36059A1865941j009546n79444L6608k29173j466847k173798j291705K8288p9988
$$ 11865941 10856395 10276951 10313559 10084386 8617539 6443741 5152036 5180324 5100336
36050E100336j511789k300434j210540R16751K412259K425836J228575l38204
$$ 5100336 3588547 1288113 77573 994324 3406583 5832419 7060994 6722790
36042F722790j469431j862157j655252q31654P85302K537615K770992P35565j818482
$$ 6722790 5253359 3391202 1735950 904296 1689598 4227213 6998205 7733770 5915288
36033E915288k277103m06094J315495R58786m51064o10227P96733J706352N42216
$$ 5915288 3638185 3232091 4547586 5506372 5055308 4445081 5241814 6948166 7490382
36024G490382j548050k038848k90918J479572R64301j221742k342604j138307
$$ 7490382 5942332 3903484 3612566 5092138 6056439 4834697 2492093 1353786
36016A353786P43331J291502P09014M39568P35865O79986P3243k74035j05850
$$ 1353786 2097117 3388619 4097633 4537201 5273066 5953052 6026295 5752260 5646410
36007E646410j95409r90160j854438j990270j278102J0076J497606K471026K185892
$$ 5646410 5451001 4460841 2606403 616133 -661969 -651893 845713 3316739 5502631
35998E502631P56063q36444j752013j745557p75437Q67519K053211J639039J05500
$$ 5502631 6258694 5422250 3670237 1924680 1149243 2016762 4069973 5709012 5814512
35989E814512p95375m47251j78233r95315j812230j077948P84916J933202J594194
$$ 5814512 5019137 4571886 4393653 3398338 1586108 508160 1293076 3226278 4820472
35980D820472P16230L11423K85061K6020o33735j242971j154566k17732P81166
$$ 4820472 5536702 5848125 6133186 6159206 5525471 4282500 3127934 2910202 3691368
35971C691368Q66501L13694M70159J582400J955034L91945j633638j914937q13037
$$ 3691368 4557869 4871563 5341722 6924122 8879156 9271101 7637463 5722526 4909489
35962D909489n34997j470032j669252k83845R62344P25962K01379P82485J509699
$$ 4909489 4374492 2904460 1235208 951363 1913707 2639669 2841048 3623533 5133232
35953E133232Q89639k04520J18249J348137J109837r95249k580655k016909n69945
$$ 5133232 6022871 5818351 5936600 7284737 8394574 7399325 4818670 2801761 2231816
35944B231816k3594n4237N73170J533968J411394M1586j185838j300866p96181
$$ 2231816 2208222 2153985 2727155 4261123 5672517 5714103 4528265 3227399 2431218
35935B431218n44241o68620q51602j015051j151950r00780P9678J327210J696634
$$ 2431218 1886977 1218357 366755 -648296 -1800246 -2701026 -2621348 -1294138 402496
35926D02496O04035j081217j857072j312123n09465m52814p82506n17725M17957
$$ 402496 1006531 -74686 -1931758 -3243881 -3753346 -4206160 -4988666 -5506391 -5088434
35917e088434J187069J284123R85636O80003N27420O99106J151033J242543M64541
$$ -5088434 -3901365 -2617242 -1631606 -951603 -424183 274923 1425956 2668499 3133040
35908C133040n19277n70295J83832M45993k95046j145126j365097j184982o94360
$$ 3133040 2613763 2043468 2227300 2673293 2378247 1233121 -131976 -1316958 -2011318
35899b011318N39206K096990K554399J631386R20807J325600J431009k6238j677943
$$ -2011318 -1472112 624878 3179277 4810663 5731470 7057070 8488079 8461841 6783898
35890F783898j541896k27387K12433l05436k01775N82901M90037n68584p91588
$$ 6783898 5242002 5014615 5227048 4921612 4719837 5302738 5792775 5224191 4432603
35881D432603K97077P81778m89462j886906j459021K81227J372299R58891k89469
$$ 4432603 4729680 5511458 5021996 3135090 1676069 1957296 3329595 4288486 3999017
35872C999017j278759j156773J02029J154682M96846j285201j891833n03120J080304
$$ 3999017 2720258 1563485 1665514 2820196 3317042 2031841 140008 -363112 717192
35863G17192J260804P27957N87126L52817n74446j150013l39302Q40556R18367
$$ 717192 1977996 2705953 3293079 3645896 3071450 1921437 1582135 2422691 3341058
35854C341058L95909N09657P41461m8632r36613j13867J661495J630392p62868
$$ 3341058 3736967 4246624 4988085 4939453 4002840 3888973 5550468 7180860 6417992
35845F417992k871540k661152j167278k59063n9370K20357N83206O91681P34767
$$ 6417992 3546452 885300 -281978 -541041 -600411 -380054 203152 894833 1629600
35836A629600O87676j91156j992792l228583k425758m2320K087646K647900J552324
$$ 1629600 2317276 2126120 133328 -3095255 -5521013 -5563333 -3475687 -827787 724537
35827G24537m02865j802559j364008N83417J989410J392679k44924r68167m43670
$$ 724537 321672 -1480887 -2844895 -2261478 -272068 1120611 875687 -92480 -536150
35818e36150R3528O6882K03015Q32514R79342j84385j908817k687549k002472
$$ -536150 -442622 -375740 -172725 659789 1639131 1454746 -454071 -3141620 -5144092
35809e144092n77265P41259J635563K003231J736647J004406K64218k27802n63829
$$ -5144092 -5721357 -4980098 -3344535 -1341304 395343 1399749 1663967 1436165 872336
35800H72336p12690m09784K08353M71000K05382K67932J186361J849798Q77145
$$ 872336 159646 -250138 -41785 429215 634597 902529 2088890 3938688 4815833
35791D815833r39924j244231M80792J843659Q17485j460225k523905j929472j026839
$$ 4815833 3875909 2631678 3112470 4956129 5773614 4313389 1789484 -139988 -1166827
35782a166827l33546P39328J864855J689846R2545j243871j112707j88558M45471
$$ -1166827 -1500373 -761045 1103810 2793656 2886201 1642330 529623 341065 786536
35773G86536Q00416J254426J525586J253199O75848k8844j137944k320256k210713
$$ 786536 1586952 2841378 4366964 5620163 6296011 6267167 5129223 2808967 598254
35764E98254j91535K135852K541535Q73798r95402j729481j790005j979333j913353
$$ 598254 406719 2542571 5084106 5957904 4962502 3233021 1443016 -536317 -2449670
35755b449670p06684J373556K782809K328921N05647j043768j215864l11775P00447
$$ -2449670 -3156354 -1782798 1000011 3328932 3834579 2790811 1574947 1263172 1963619
35746A963619J284380J428009J100014K29271q59775j519559j381506o21474K86809
$$ 1963619 3247999 4676008 5776022 6005293 5145518 3625959 2244453 1622979 1909788
35737A909788Q07582N66670k25518p56693m78639J65558K96148l43839j272424
$$ 1909788 2717370 3284040 3058522 2301829 1823190 1988748 2284896 1941057 668633
35728F68633j841007j492672l9386J679924K151966J120146L43935J144279K050491
$$ 668633 -1172374 -2665046 -2704432 -1024508 1127458 2247604 2591539 3735818 5786309
35719E786309P89815j870390k663630m73933J936903J791012j53244j254909o04081
$$ 5786309 6576124 4705734 2042104 1568171 3505074 5296086 5142842 3887933 3283852
35710C283852N52728R21087K85276p48088j091943k8259J485178J417514n39066
$$ 3283852 3836580 4757667 5042943 4294855 3202912 3174653 4659831 6077345 5538279
35701E538279k096080j523781k82637p40753k368239k430441p5044K451013K887670
$$ 5538279 3442199 1918418 1635781 895028 -1473211 -3903652 -3978696 -1527683 1359987
35692A359987J502724O4140l52343R8355P28666R21177N04189j38603n26545n57775
$$ 1359987 2862711 2926851 2574508 2672863 3401529 4322706 4826895 4688292 4161747 3603972
35682C603972l27310J04207M18879J50092m29942l38394N41778R13219M6628q10721
$$ 3603972 3276662 3380869 3799748 3949840 3519898 3181504 3723282 4636501 4683129 3872408
35672C872408l81437L66986k53284j631965j590814J40810J493411J292209O78545
$$ 3872408 3490971 3857957 3604673 1972708 381894 522704 2016115 3308324 3986869
35663C986869P26463P66067L7916q28206j140047j356803j765804j482578k28441
$$ 3986869 4713332 5479399 5517315 4689109 3549062 2192259 426455 -1056123 -1284564
35654a284564L23608j132506k877989k040097J189805L387363K309411l75800
$$ -1284564 -960956 -2093462 -4971451 -7011548 -5821743 -2434380 -124969 -500769
35646e00769j610595p33236N22262R00890R29155J418367K056065K094836J580030
$$ -500769 -2111364 -2844600 -2322338 -1421448 -492293 926074 2982139 5076975 6657005
35637F657005J037349L93986p91837k095623k296636j090302J47957J5003j090701
$$ 6657005 7694354 8088340 7296503 5200880 2904244 1813942 1961899 1976902 886201
35628H86201j580223p38644O38143J478961J502978J033447M25760j18848n07093
$$ 886201 -694022 -1432666 -794523 684438 2187416 3220863 3646623 3527775 3020682
35619C020682o16600j88989P79701J448285O95689j231117k467650j765155k30340
$$ 3020682 2404082 2215093 2994794 4443079 5138768 3907651 1440001 -325154 -555494
35610e55494K20082n30079j041263o69805j31241J06809M15536Q78783J025871
$$ -555494 -335412 -865491 -1906754 -2576559 -2707800 -2600991 -2185455 -1306672 -280801
35601b80801R02386J048311J223109O14723m17686m40602O97627J287068L56150
$$ -280801 621585 1669896 2893005 3507728 3090042 2649440 3347067 4634135 4990285
35592D990285p64190o05688J61688N1741p76286r95668l37299K57680L62104M91966
$$ 4990285 4226095 3620407 3782095 3833836 3057550 2061882 1724583 1982263 2344367 2836333
35582B836333Q73977J006918O03371N7326k47829m93137j084932k018773k586367
$$ 2836333 3710310 4717228 5320599 5377925 5130096 4636959 3552027 1533254 -1053113
35573a053113j774701N51584K827060L003420R88639r82513r76128M73802J455524
$$ -1053113 -2827814 -2276230 550830 3554250 4542889 3560376 2584248 3058050 4513574
35564D513574J025333l53662j817615k519221j792406j9497J233181R58866K238
$$ 4513574 5538907 5185245 3367630 848409 -943997 -963494 269687 1228553 1230791
35555A230791l13545j0068K30723N63026J229909J251940j47296j460919n90263
$$ 1230791 917246 907178 1137901 1700927 2930836 4182776 4035480 2574561 1984298
35546A984298J614370K090436J40797j414949n87965Q85263N86223q93175j445263
$$ 1984298 3598668 5689104 5829901 4414952 3826987 4712250 5298473 4405298 2960035
35537B960035r61284q81035j247579p87077M21019P77078j69237j002244q31991
$$ 2960035 1998751 1117716 -129863 -916940 -495921 281157 111920 -890324 -1722315
35528a722315m89938o67413o36651J89184R40393P42726K48754L77864N61326
$$ -1722315 -2212253 -2879666 -3516317 -3327133 -2386740 -1644014 -1395260 -1017396 -456070
35519d56070j87252j173400p80464Q93780J916775J276157K02455J90445J009266
$$ -456070 -643322 -1816722 -2597186 -1703406 213369 1489526 1691981 1882426 2891692
35510B891692J445767R90571n7118j312654k232727k031712o77611N08941K43451
$$ 2891692 4337459 5328030 5270912 3958258 1725531 -306181 -983792 -474851 -231400
35501b31400j033243j751340j227353j57615O94726J269144J624935J551518J035708
$$ -231400 -1264643 -3015983 -4243336 -4400951 -3706225 -2437081 -812146 739372 1775080
35492A775080M56693J03667l0234K0596J59373O6259l16754l75046L34554J099520
$$ 1775080 2231773 2335440 2305206 2325802 2485175 2551434 2234680 1859634 2194188 3293708
35482C293708Q87053n4394n89000n28698o48396q57723j25431J300873J509098
$$ 3293708 4180761 4126367 3537367 3008669 2360273 1502550 1377119 2677992 4187090
35473D187090j62121j538976n37344J637157K143218N57533q30193n74024J48761
$$ 4187090 4024969 2485993 1948649 3585806 5729024 6286557 5456364 4882340 5031101
35464E031101k24319j312042j637308p75157L29253P14646L05233l79725q53129
$$ 5031101 4806782 3494740 1857432 1082275 1411528 2126174 2431407 2051682 1198553
35455A198553r03247n15457J50706O30134L11014q23100j738389j299571K36240
$$ 1198553 295306 -220151 -69445 560689 871703 48603 -1689786 -2989357 -2753117
35446b753117J395333J342356P06174K46225k15125q40165q63115K30462J384630
$$ -2753117 -1357784 -15428 690746 936971 721846 -118319 -981434 -750972 633658
35437F33658J114335m75205j961800k486067k180382j147049N56177K011339J963805
$$ 633658 1747993 1272788 -689012 -3175079 -5355461 -6502510 -5946333 -3934994 -1971189
35428a971189N25289p44425p26653J67294Q96889Q69402N3483j023920j297926
$$ -1971189 -1445900 -2190325 -2916978 -2749684 -1852795 -983393 -929910 -1953830 -3251756
35419c251756j47582J506149K005567R79244l25782p55546l17894M37716R78116
$$ -3251756 -3399338 -1893189 112378 1091622 765840 10294 -307600 130116 1108232
35410A108232O73915o42593j864595j627362l04204M02071N4080J3167R61290
$$ 1108232 1782147 1139554 -725041 -2352403 -2656607 -2254536 -2200456 -2187289 -1225999
35401a225999J768746J650067J486073J717223Q72378j884723m322410l676276
$$ -1225999 542747 2192814 3678887 5396110 6268488 4383765 61355 -3614921
35393c614921p07084J287139J090019N83487J035266J109745l83226k022133j761673
$$ -3614921 -4322005 -3034866 -1944847 -1361360 -326094 783651 400425 -1621708 -3383381
35384c383381J0835J167172Q13033n6521m78674n06673k35020O66140J879423
$$ -3383381 -3372546 -2205374 -1392341 -1448862 -1927536 -2434209 -2669229 -2003089 -123666
35375a23666K025767K65721k207127l195434j941067J53477J299366J181159P99176
$$ -123666 1902101 2167822 -39305 -3234739 -5175806 -5022329 -3722963 -2541804 -1742628
35366a742628R96204J622182J946248J494714N21551j79275q5673L39666J30865
$$ -1742628 -746424 875758 2822006 4316720 4838271 4658996 4573323 4912989 5043854
35357E043854p90413j292569n86595N26860P74236K48121J2828J80314k09377
$$ 5043854 4253441 2960872 2374277 2901137 3675373 3923494 3936322 4116636 3907259
35348C907259j270671j727939q79967J93876K75407k20956j94038K77362K56713
$$ 3907259 2636588 908649 28682 222558 497965 277009 82971 360333 617046
35339F17046l87331q69212p54837k27363O77903J925081K656389J793777l00893
$$ 617046 229715 -639497 -1394334 -1621697 -943794 981287 3637676 5431453 5130560
35330E130560j881099j922650j199829p89468m85237N05457J974085K780933K288373
$$ 5130560 3249461 1326811 126982 -662486 -1147723 -642266 1331819 4112752 6401125
35321F401125R97222j73107p03200o59812n67459j046818k094244k724126j857907
$$ 6401125 7398347 7225240 6522040 5862228 5294769 4247951 2153707 -570419 -2428326
35312b428326K71234K054174K128446P60741o57981j175888r18440l92311J94658
$$ -2428326 -2157092 -102918 2025528 2786269 2128288 952400 33960 -358351 -163693
35303a63693P31905Q49100K79610n20258n96617M02980J540354J378442l40948
$$ -163693 568212 1417312 1696922 1176664 580047 983027 2523381 3901823 3560875
35294C560875k061842j952129j32378J267325P02581p80321r96494L81651J570858
$$ 3560875 1499033 -453096 -585474 681851 1384432 604111 -392383 -10732 1560126
35285A560126J391739O99893N55638M94743k28570r08100m72958M45630K57642
$$ 1560126 2951865 3651758 4207396 4702139 4473569 3565469 3092511 3538141 3795783
35276C795783j081390j967191j522746n13137K54131Q90282J414272J236629K65321
$$ 3795783 2714393 747202 -775544 -1288681 -1034550 -144268 1270004 2506633 2771954
35267B771954o22364p47055k73256N72069J687376K241537J180097q66421j807700
$$ 2771954 2149590 1402535 1129279 1701348 3388724 5630261 6810358 5943937 4136237
35258D136237r92783j69265n46128q13325L57715J672289J244302j08880j55221
$$ 4136237 3143454 2974189 2428061 1614736 1972451 3644740 4889042 4780162 4624941
35249D624941R59636R03536j022516k819068k870393j825540q24415Q9679R67989
$$ 4624941 5584577 6488113 5465597 2646529 -223864 -2049404 -2873819 -2784140 -1816151
35240a816151J193895P31852O35024J317510J688409J001833J99658K23246K69228
$$ -1816151 -622256 109596 744620 2062130 3750539 4752372 4952030 5175276 5444504
35231E444504p82143k165787k144383o39457O45034O19405m7483k71116J56040
$$ 5444504 4662361 2496574 352191 -287266 357768 977173 929690 658574 814614
35222H14614Q67760J514379J673100R66806k76944j058112q27630j80542o2629
$$ 814614 1682374 3196753 4869853 5836659 5559715 4501603 3673973 3493431 3430802
35213C430802o01998j089704r14691j71131N95303R71086R48685P45776M62797
$$ 3430802 2828804 1739100 824409 653278 1248581 2219667 3168352 3914128 4376925
35204D376925P854o06072j037429r02818k75196L08353L88218j6411n45598q09672
$$ 4376925 4384779 3778707 2741278 1838460 1563264 1871617 2259835 2243424 1697826 888154
35194H88154n32628K72027J079657J171559N40100J53584P65019J695847J584009
$$ 888154 355526 627553 1707210 2878769 3418869 3572453 4337472 6033319 7617328
35185G617328L02728q26408r72695q61441j294362j708366j251002l67270M8929
$$ 7617328 7920056 7093648 6120953 5259512 3965150 2256784 1005782 638512 687441
35176F87441L58973J361795K253671J451186n35941j271135l181J042268K4063
$$ 687441 1046414 2408209 4661880 6113066 5577125 4305990 4302809 5345077 5369140
35167E369140j858813k509603j952879j429690r68047O5661J079379J096521P36898
$$ 5369140 3510327 1000724 -952155 -2381845 -3349892 -3284231 -2204852 -1108331 -371433
35158c71433J217329J971176J493247J27884l72688J05364l9867j024718j170749
$$ -371433 845896 2817072 4310319 4438203 4065515 4170879 4131012 3106294 1935545
35149A935545r9084K16594j275907k752310k310636o93297M21831J007634J684639
$$ 1935545 1836461 2053055 777148 -1975162 -4285798 -4979095 -4557264 -3549630 -1864991
35140a864991J731859L01732j463482j739702p45116m6758L18869J732798M029537
$$ -1864991 -133132 168600 -1294882 -3034584 -3779700 -3826458 -3507589 -1774791 2254746
35131B254746M898148K887251o19343l125839l491342k153098j61921J229161
$$ 2254746 7152894 10040145 9420802 6294963 2803621 650523 488602 1717763
35123A717763J040969l95123j420152q37567O19205J197697K32688j193029j572022
$$ 1717763 2758732 2363609 943457 105890 725095 1922792 2155480 962451 -609571
35114f09571n44490Q61526J345646O39439l05298m44886K35753R43471J161630
$$ -609571 -1154061 -292535 1053111 1692550 1387252 942366 1178119 2121590 3283220
35105C283220J040392P98247L36435l67006r50582j052891p14350j84983L56831
$$ 3283220 4323612 5121859 5458294 5091288 4140706 3087815 2373465 2188482 2545313
35096B545313O51437K87599p66069j737434j669361n16045P58109J248132R02042
$$ 2545313 3196750 3484349 2718280 980846 -688515 -1204560 -446451 801681 1703723
35087A703723J68050o11879j124600r41643q2815O19827M69947j8422J06331N53198
$$ 1703723 1871773 1259894 135294 -806349 -889164 -269337 200610 182188 288519 841717
35077H41717J08953j206225j775658q49186J07218k91136j024780l50983J133859
$$ 841717 950670 -255555 -2031213 -2880399 -2773181 -3064317 -4089097 -4440080 -3306221
35068c306221J227621m05453j674330j196281L7782P14642R98789J305514R78787
$$ -3306221 -2078600 -2484053 -4158383 -5354664 -5316882 -4602240 -3603451 -2297937 -1319150
35059a319150l84450j469335o82004J488480K842985J996718l66972k531891l262934
$$ -1319150 -1703600 -3172935 -3854939 -2366459 476526 2473244 2106272 -425619 -3688553
35050c688553k437798q19349P11603J826290K536623K608231J900378J117678
$$ -3688553 -6126351 -6945700 -6234097 -4407807 -1871184 737047 2637425 3755103
35042C755103J136664J488126P57447j156778k494081j936491k44620J071906
$$ 3755103 4891767 6379893 7137340 5980562 3486481 1549990 1305370 2377276
35034B377276J499217J224377M21696k72141J15796J286181J518689K17285q93999
$$ 2377276 3876493 5100870 5522566 5250425 5366221 6652402 8171091 8388376 7494377
35025G494377m85554P7286r84514k687106k696284r96511K77939J91585j87805
$$ 7494377 7008823 7086109 6101595 3414489 718205 -278306 -367 191218 3413
35016C413j54157k22959m83391j93101O34051J033374P68307N41660L98086k95276
$$ 3413 -150744 -373703 -857094 -1050195 -416144 617230 1385537 1927197 2325283 2030007
35006B030007j112782p77886N05360R09608j96315j180972p40943J90495J47375
$$ 2030007 917225 139339 644699 1554307 1357992 177020 -563923 -373428 -226053
34997b26053p40751j378888j248651m14775Q93606J949419J879672R66605M33859
$$ -226053 -966804 -2345692 -3594343 -4009118 -3115512 -1166093 713579 1680184 2114043
34988B114043N09629J74695p01999q37079M9873L24429q00968j598713o11242
$$ 2114043 2623672 2798367 2096368 1259289 1309162 1633591 832623 -766090 -1377332
34979a377332P41737M58755o68289m43844J027655J699192J129479R72377J843101
$$ -1377332 -635595 -176840 -845129 -1288973 -261318 1437874 2567353 3539730 5382831
34970E382831K205810J008322o27264j226774r20368o99517r04608j222122j277927
$$ 5382831 7588641 8596963 7969699 6742925 5822557 5123040 4218432 2996310 1718383
34961A718383p03734N19863J456403R91300m08344r03310J51363J073579K22514
$$ 1718383 1014649 1534512 2990915 3982215 3573871 2670561 2821924 3895503 4118017
34952D118017j548992k074329q73270M18389M93635l2696J61779J201521J963938
$$ 4118017 2569025 494696 -378574 39815 533450 500754 662533 1864054 3827992
34943C827992J564274L21829p58192j115130j032739r92344r22785l77844N89132
$$ 3827992 5392266 5714095 4955903 3840773 2808034 1815690 892905 515061 1104193
34934A104193J135973N36126p76145j477107q33138L53513O26096l17194j110034
$$ 1104193 2240166 2776292 2000147 523040 -310098 43415 669511 352317 -757717
34925g57717l37616J558315K548477J365278q54061j727162l07653J866296K554303
$$ -757717 -1095333 462982 3011459 4376737 3522676 1795514 1487861 3354157 5908460
34916E908460J273520m15197r41558m66830k75041q60934j346240q73171Q8309
$$ 5908460 7181980 6766783 5825225 5358395 5083354 4222420 2876180 2003009 2091318
34907B091318K92662o94114j870693j754260J14140K471719L266464J748112m69831
$$ 2091318 2383980 1689866 -180827 -1935087 -1820947 650772 3917236 5665348 5195517
34898E195517j165780k79644K07251o24659j283358n80914M2062j161841k819891
$$ 5195517 4029737 3750093 3957344 3332685 2049327 1468413 1510475 348634 -2471257
34889b471257j944231J430107L808528K957379O38361m20035j60615k65192j175931
$$ -2471257 -4415488 -2985381 823147 3780526 4418887 3998852 3838237 3573045 2397114
34880B397114j859379j663033q19001L94641J680493K242810J383200n41586k380844
$$ 2397114 537735 -1125298 -1944299 -1549658 130835 2373645 3756845 3215259 834415
34871H34415l092877k086201M75157L106836L746218J989166k13654r66908o33861
$$ 834415 -2258462 -4344663 -3869506 -762670 2983548 4972714 4759060 3792152 3158291
34862C158291o41264j131803j242770r73934j113147j564827j283710K6342J313513
$$ 3158291 2517027 1385224 142454 -831480 -1944627 -3509454 -4793164 -4766822 -3453309
34853c453309J465615M37330q72110j273425j46069J684570K384117J174378n72418
$$ -3453309 -1987694 -1550364 -2422474 -3695899 -3841968 -2157398 226719 1401097 828679
34844H28679j101561m58969O2367q5431m79332q57371j139181q18127L08093J243279
$$ 828679 -272882 -731851 -669484 -754915 -1234247 -2091618 -3230799 -4048926 -3740833 -2497554
34834b497554R90969J74450K7847L24043o003o64481l70458P34723J134640M94287
$$ -2497554 -1506585 -1332135 -1304288 -980245 -986248 -1650729 -2021187 -1286464 -151824 342463
34824C42463J35767O69843J166060J124125J218429J432362N62553j425888k554390
$$ 342463 478230 1148073 2314133 3438258 4656687 6089049 6651602 5225714 2671324
34815B671324j645453k04195R823l45614K23766J142454O79067q79106j259480
$$ 2671324 1025871 821676 831499 485885 709651 1852105 2531172 1652066 392586
34806C92586M03217K062504J412969j086801k794569k084006j33831P13350j07282
$$ 392586 795803 2858307 4271276 3184475 389906 -1694100 -1827931 -1114581 -1221863
34797a221863q47244J869J577224J940855Q00510l88659p24255p40062r28641
$$ -1221863 -2069107 -2067238 -490014 1450841 2251351 1862692 1138437 398375 -530266
34788e30266r05364m26751Q3340M34538Q58072R95206J11690j276953j524186
$$ -530266 -1435630 -1862381 -1779041 -1344503 -486431 508775 620465 -656488 -2180674
34779b180674j76087J307779J719138J380199P05621n48040j711155j069828J282181
$$ -2180674 -2356761 -1048982 670156 2050355 2755976 2207936 496781 -573047 709134
34770G09134K574051J168376p34295m29382J050990P88596j216311k182119r33395
$$ 709134 3283185 4451561 3717266 3287884 4338874 5127470 3911159 1729040 795645
34761G95645Q36914J654837J830959J595103K49507k016505l530857l255429j957221
$$ 795645 1632559 3287396 5118355 6713458 6962965 4946460 1415603 -1839826 -3797047
34752c797047o87669L96661J220312J365133J043577J087433J469984J227938
$$ -3797047 -4484716 -4088055 -2867743 -1502610 -459033 628400 2098384 3326322
34744C326322K57117l46267k12440l06479r31451q36455O49599K089803J798788
$$ 3326322 3583439 3237172 3024732 2718253 1786802 950347 1599946 3689749 5488537
34735E488537J11743j373965j876445j649288r89846j67777K79735J61421L9925
$$ 5488537 5600280 4226315 2349870 700582 -289264 -457041 -177306 -15885 24040
34726B4040L04450M68847O5690n11127p88995j050350j563584j737285r41413
$$ 24040 328490 797337 863027 351900 -437095 -1487445 -3051029 -4788314 -5729727
34717e729727M44761J594615K198568K172479J256323k20217j044268o25155K5196
$$ -5729727 -5284966 -3690351 -1491783 680696 1937019 1716802 672534 47379 72575
34708G2575q4025k28030O98226J944477J769898J89012r59533p42014k35334n33506
$$ 72575 -11450 -239480 458746 2403223 4173121 4362133 3402600 2660586 2425252 1891746
34698A891746j160959j179993p52082p08600j139535j145837M9554J937463K805795
$$ 1891746 730787 -449206 -1201288 -1909888 -3049423 -4195260 -4145706 -2208243 597552
34689E97552J506713p09724j204883M61013J362950p23567l403802k500467J706639
$$ 597552 2104265 1394541 189658 650671 2013621 1290054 -2113748 -4614215 -2907576
34680b907576M381177K858086Q0923l35453P12957L64550r76448p33104P36999
$$ -2907576 1473601 4331687 4412610 4077157 4790114 5154664 4178216 3445112 4182111
34671D182111K60630k714359m562524k648977R37399K625115J982977R36487J53918
$$ 4182111 4442741 1728382 -2834142 -5483119 -4545720 -1920605 62372 998859 1152777
34662A152777j156234k658774k715047r80422P61955R27302l1648o54183l06686
$$ 1152777 -3457 -2662231 -5377278 -6357700 -5595745 -4668443 -4700091 -5354274 -5660960
34653e660960O05230J489895J973332J851150J178374L17466l22057n28447k89623
$$ -5660960 -5055730 -3565835 -1592503 258647 1437021 1754487 1432430 903983 614360
34644F14360K34736P18185Q18045L78347m66436j212120j144908j07679Q92010
$$ 614360 849096 1567281 2385326 2763673 2297237 1085117 -59791 -167470 724540
34635G24540O36195n17432q41944K11640R43827K4048j073538j32714K078849
$$ 724540 1360735 843303 1359 212999 1156826 1180874 107336 -25378 2053471
34626B053471K561359N83900j106467m25730J027585P04514r29436j339766P4589
$$ 2053471 4614830 5198730 4092263 3666533 4694118 5398632 4469196 3129430 3204019
34617C204019J200748M47627j094755j366199n8771J193435R38850l75696r66022
$$ 3204019 4404767 4852394 3757639 2391440 2332669 3526104 4464954 4089258 3123236
34608C123236Q3447J534630J448765k67247j724241j618842p67711n16012q28569
$$ 3123236 3206683 4741313 6190078 5922831 4198590 2579748 1812037 1296025 467456
34599D67456r46029q79679r58913o95583M22900J531360J335730K20467j38120
$$ 467456 -478573 -1358252 -2317165 -3012748 -2589848 -1058488 277242 497709 359589
34590C59589P40027J522524J129513J8630r45126j582453j830111j296794j67046
$$ 359589 1099616 2622140 3751653 3770283 2825157 1242704 -587407 -1884201 -2051247
34581b051247L93285l58164j519209j589349m40137N32925K46495o63533o46530
$$ -2051247 -1657962 -2016126 -3535335 -5124684 -5564821 -5031896 -4785401 -5448934 -6095464
34572f095464O81021J816153J248279l17946p14014O01155J627784P52286q83257
$$ -6095464 -5414443 -3598290 -2350011 -2667957 -3381971 -2780816 -1153032 -400746 -1284003
34563a284003j304578p07810o35414j072695o75139M92651Q90555K72666J13623
$$ -1284003 -2588581 -3296391 -3931805 -5004500 -5679639 -5186988 -4296433 -4023767 -3910144
34554c910144Q20694R13182j97875r16753j26337R63064J056262R31750J666586
$$ -3910144 -3089450 -2176268 -2374143 -3290896 -3417233 -2454169 -1397907 -466157 1200429
34545A200429K401003J825375N86022J92248M83269J24996j075901k136776k560680
$$ 1200429 3601432 5426807 6012829 6205077 6688346 6813342 5737441 3600665 1039985
34536A039985k399445j369431L72238J299053K90576j248731j101843L93406R67286
$$ 1039985 -1359460 -2728891 -2356653 -1057600 -767024 -2015755 -3117598 -2724192 -1756906
34527a756906J85394J5687J276857K114491J073133n08847o83328J68481L05924
$$ -1756906 -1571512 -1555825 -278968 1835523 2908656 2399809 1716481 1884962 2190886
34518B190886n04670q53968l9057R31890Q23010k82684j228761j134761k38734
$$ 2190886 1686216 832248 793191 1725081 2548091 2265407 1036646 -98115 -336849
34509c36849N30549O48035L70566j6924o99946j590687j790184p49798N19737
$$ -336849 193700 841735 1212301 1195377 495431 -1095256 -2885440 -3635238 -3115501
34500c115501N90166l01755o06485K30360J227532J656122J795071J646541O04861
$$ -3115501 -2525335 -2827090 -3433575 -3203215 -1975683 -319561 1475510 3122051 3726912
34491C726912r75021j545103o32530J86412k80303r02953k03462J010349Q53355
$$ 3726912 2751891 1206788 574258 760670 480367 -422586 -626048 384301 1237656
34482A237656n86026j394920p43016K52986O31101P57013R71900O76708m26476
$$ 1237656 651630 -743290 -1486306 -1233320 -602219 154794 1126694 1803402 1376926
34473A376926j388451j277481n85838m12538p47533n34508O82053J957622J992239
$$ 1376926 -11525 -1289006 -1874844 -2287382 -3034915 -3569423 -2887370 -929748 1062491
34464A062491O11090r73120j314654j78735J180849J360209L69015n24331n39726
$$ 1062491 1673581 700461 -614193 -792928 387921 1748130 2117145 1592814 1053088
34455A053088l22666o93460j102687l25646J433855K311532J179376o33278r43141
$$ 1053088 730422 36962 -1065725 -1391371 42484 2354016 3533392 2900114 1956973
34446A956973M67118J722484J400597M1509j072458j455796j176891j93181J093200
$$ 1956973 2424091 4146575 5547172 5588681 4516223 3060427 1883536 1690355 2783555
34437B783555J449824K45063j171388q62760R89611K094739J049942q44709j378245
$$ 2783555 4233379 4478442 3307054 2444294 3433905 5528644 6578586 5733877 4355632
34428D355632j77227J117845J001140k62596j122883n52527P28297J007157l02604
$$ 4355632 4178405 5296250 6297390 6034794 4911911 4359384 5087681 6094838 5792234
34419E792234j762707j701274m44196K29578l51257r95150o57765O4256P2619
$$ 5792234 4029527 2328253 1884057 2113635 1762378 767228 109463 173719 246338
34410B46338n96165j070213r13261l80777J10171K07331k29242p72599p16399
$$ 246338 -349827 -1420040 -2333301 -2714078 -2603907 -2396576 -2625818 -3398417 -4114816
34401d114816o2300L79952K07003J7941M12869J167860J800353K090750J677933
$$ -4114816 -4177116 -3797164 -3590161 -3572220 -3159351 -1991491 -191138 1899612 3577545
34392C577545K66852j248389j290482q8561k1253k040408l421669j339012K471102
$$ 3577545 3844397 2596008 1305526 1216965 1195712 -844696 -4266365 -5605377 -3134275
34383c134275L488904O29575k270713j877583L94228J061939m86139j779635j034332
$$ -3134275 354629 984204 -1286509 -3164092 -2769864 -1707925 -2194064 -3973699 -5008031
34374e008031Q14003J764663J103158j92621p20032p4456Q12840P92714r4923
$$ -5008031 -4194028 -2429365 -1326207 -1518828 -2238860 -2313316 -1500476 -707762 -802685
34365h02685p22708l95442L27976N26871M9522n40400o64673j29896P25166J120031
$$ -802685 -1525393 -1920835 -1592859 -1065988 -1016466 -1556866 -2221539 -2351435 -1626269 -506238
34355e06238N66314l78892o60568j01968M37344L58420j3848j98966j04911L86515
$$ -506238 60076 -318816 -979384 -1081352 -644008 -285588 -299436 -498402 -603313 -216798
34345b16798J364053K112370J530509j76963j392379j293995r01631j078701r29688
$$ -216798 1147255 3259625 4790134 4613171 3220792 1926797 1025166 -53535 -983223
34336i83223M58736J939683J763969L09122n52174l32584k08336o06460n71466
$$ -983223 -524487 1415196 3179165 3488287 2936113 2603529 2395193 1788733 1217267
34327A217267K39445Q62956P94732O43385M80238n17353j914866j602646R70196
$$ 1217267 1456712 2319668 3114400 3757785 4238023 3720670 1805804 203158 1173354
34318A173354K988000J772889j226650k377393j032271m9195j137608k455672
$$ 1173354 4161354 5934243 4707593 2330200 1297929 1248734 111126 -2344546
34310b344546j814864K125P46719M264q23425r51603q17112n99612J49222J238821
$$ -2344546 -4159410 -4157285 -3410566 -3406302 -4229727 -5181330 -5998442 -6598054 -6448832 -5210011
34300e210011J613706Q76511J4600O0643Q10060J421120J594928J461839Q19665
$$ -5210011 -3596305 -2719794 -2705194 -2644551 -1834491 -413371 1181557 2643396 3463061
34291C463061o06430k232659k767116j619620K51673J271450R01631Q2374k374
$$ 3463061 2856631 623972 -2143144 -3762764 -3511091 -2239641 -1338010 -1255636 -1258010
34282a258010O73860J099033O62668j4870j7113M99137N31915k21774p88507j98081
$$ -1258010 -584150 514883 1177551 1162681 1145568 1644705 2176620 1954846 1166339 968258
34272I68258J192094K092510J689877K96817j121468j702282j227160l20385M1113
$$ 968258 2160352 4252862 5942739 6239556 5118088 3415806 2188646 1868261 1909374
34263A909374m71380j191190j329336q68859k73097K76804Q34694J221457J234646
$$ 1909374 1437994 246804 -1082532 -1951391 -2224488 -1947684 -1112990 108467 1343113
34254A343113J109692J136698R96359J73417j069252j859836j848521j461691
$$ 1343113 2452805 3589503 4585862 4759279 3690027 1830191 -18330 -1480021
34246a480021j033615m69900J36691L79346K40955J66575K26797K3722l28274
$$ -1480021 -2513636 -2983536 -2846845 -2467499 -2226544 -2059969 -1833172 -1809450 -2137724
34237b137724q6955Q09689J299128P15704j62913m17617m45204r97438j462085
$$ -2137724 -2224679 -1414990 -115862 599842 436929 19312 -425892 -1423330 -2885415
34228b885415n24684J654603L266512L020425J439524k06871j267323j655271
$$ -2885415 -3410099 -1755496 1511016 4531441 5970965 5764094 4496771 2841500
34220B841500j346941n54472J07050J52648l04669q39520j153992j094928o38035
$$ 2841500 1494559 940087 1047137 1199785 895116 55596 -1098396 -2193324 -2831359
34211b831359n4618K56010K70724L63154P28218J147620J381982J359836R34253
$$ -2831359 -2885977 -2629967 -2359243 -1996089 -1267871 -120251 1261731 2621567 3555820
34202C555820J5901r17339j093684n19373j25582m15657o19025J49576J401576
$$ 3555820 3571721 2654382 1560698 1041325 915743 500086 -118939 30637 1432213
34193A432213J798013R49485j47677n08453k64019j71906n89353j208036j427306
$$ 1432213 3230226 4179711 4032034 3523581 3259562 3087656 2498303 1290267 -137039
34184a37039q02806M94829J495826J166318l44209j574617j293569J04404J174472
$$ -137039 -939845 -445016 1050810 2217128 1872919 298302 -995267 -890863 283609
34175B83609J114954L20735n30202j127932j198545m41604P17366J079507J43385
$$ 283609 1398563 1719298 1189096 61164 -1137381 -1578985 -861619 217888 361273
34166C61273r18764o93469M10559O76942l76674j268624p78073L47733P66516
$$ 361273 -557491 -1250960 -840401 -163459 -540133 -1808757 -2586830 -2239097 -1472581
34157a472581N84603P62271J111058M67492j085042j666895r947K500421L156469
$$ -1472581 -887978 -125707 985351 1452843 367801 -1299094 -1309041 1191380 4347849
34148D347849J050820j846353k816150j210325J045968J641501L12163j126114
$$ 4347849 5398669 3552316 736166 -474159 571809 2213310 2525473 1399359
34140A399359j041678K42623J173001Q93604j31525j045465j361977q95298K77508
$$ 1399359 357681 600304 1773305 2666909 2535384 1489919 127942 -767356 -489848
34131d89848J574249K145596J569499Q4717j700476k928343k675138q05774J467102
$$ -489848 1084401 3229997 4799496 4884213 3183737 255394 -2419744 -3225518 -1758416
34122a758416K672392K647006K194543J439037j82344k212698l018203j960392
$$ -1758416 913976 3560982 5755525 7194562 7012218 4799520 1781317 -179075
34114a79075l76107M04116O68967R30282L86976j524053l103584k086495R20465
$$ -179075 -555182 -151066 517901 1448183 1835159 311106 -2792478 -4878973 -3958508
34105c958508K784382J880631q4826q63891n12579l79729o70783n52801K8415
$$ -3958508 -1174126 706505 621679 -242212 -754791 -1134520 -1805303 -2358104 -2329689
34096b329689J89397l28620p00080l59425J70465K44058J58255O00464J424672
$$ -2329689 -2140292 -2468912 -3168992 -3528417 -3357952 -3113894 -2955639 -2355175 -930503
34087i30503J703193R66181k10849r82944j068144o01311K27137R30369P20437
$$ -930503 772690 1738871 1528022 545078 -523066 -1124377 -897240 33129 753566
34078G53566m94621j507026j105947K64393J121672R95750O44720L62397l18292
$$ 753566 258945 -1248081 -2354028 -2089635 -967963 27787 672507 1034904 716612
34069G16612j005986m28330J196865J692190J07299j473166j081250q9208q80962
$$ 716612 -289374 -717704 479161 2171351 2278650 805484 -275766 -364974 -1245936
34060a245936k643848k466081l9912J883753J832467J313138J548733J525197
$$ -1245936 -3889784 -6355865 -6395777 -4512024 -2679557 -1366419 182314 1707511
34052A707511N06775k35176J38835K51133r06758j714829n29420J167387P90140
$$ 1707511 2214286 1979110 2117945 2369078 1462320 -252509 -781929 385458 1175598
34043A175598j321693k482638j622855k38974L10284K14575j2757j48568L57767
$$ 1175598 -146095 -2628733 -4251588 -4490562 -4180278 -3965703 -3978460 -4127028 -3769261
34034c769261J727936K601131J407285r13639j665679k31705J011570L52195q18585
$$ -3769261 -2041325 559806 1967091 1053452 -612227 -843932 167638 519833 -298752
34025b98752m90860Q44334J272400M89167n4811M23075R92407M20077j300021
$$ -298752 -789612 54722 1327122 1816289 1761478 2184553 3176960 3597037 2297016
34016B297016k871009k696666k97790K765646L854320J833912j552103l441724
$$ 2297016 -573993 -3270659 -3568449 -802803 3051517 4885429 3333326 -108398
34008a08398k709352o10267R51217J079265J37595p79086o00227P68759K053123
$$ -108398 -2817750 -3428017 -2476800 -1397535 -1259940 -2039026 -2639253 -1870494 182629
33999A82629J723879k02056j897185j662289J11419J408160R64939m30001j271944
$$ 182629 1906508 1704452 -192733 -1855022 -1743603 -335443 629496 199495 -1072449
33990a072449j257592j076315q09718J03741J248344J174066k97152j208779k06019
$$ -1072449 -2330041 -3406356 -4216074 -4112333 -2863989 -1689923 -1987075 -3195854 -3401873
33981c401873J153972O34861j059042j187549P55547K133718J037035j136738
$$ -3401873 -2247901 -1613040 -2672082 -3859631 -3104084 -970366 66669 -1070069
33973a070069j991814j238293j92813M47086Q73195J072601P93903J93473l43979
$$ -1070069 -3061883 -4300176 -4492989 -4045903 -3172708 -2100107 -1306204 -1112731 -1456710
33964a456710o31183m77700K06733P40699J65879j082019j291140R319J114247
$$ -1456710 -2087893 -2565593 -2358860 -1618161 -1452282 -2534301 -3825441 -3816122 -2701875
33955b701875P59425Q9827N30072J231315O90757k68416L48083K097005K291647
$$ -2701875 -1942450 -1852623 -1322551 -91236 599521 331105 679188 2776193 5067840
33946E067840M1508k243857k139617j54617J524083J780893J034614N036q95756
$$ 5067840 5109348 2865491 725874 571257 2095340 3876233 4910847 4915883 4020127
33937D020127j414055j441650j050718m19345O2325o5618n24342j62281J391521
$$ 4020127 2606072 1164422 113704 -305641 -243316 -308934 -833276 -995557 395964
33928C95964K487845J330080j159939k097948m76896J495592J502800l9874j153618
$$ 395964 2883809 4213889 3053950 956002 479106 1974698 3477498 3437624 2284006
33919B284006r49082j0189Q39900J022186J79746j311349k317521k176053j389339
$$ 2284006 1334924 1324735 2164635 3186821 3366567 2055218 -262303 -2438356 -3827695
33910c827695n51405N29692J853419K356475J229308n33994j190683n26066J31591
$$ -3827695 -4379100 -3849408 -1995989 360486 1589794 1055800 -134883 -660949 -529358
33901e29358m572l11098p2797M50024O55360M58900M3007o28897j490189j953270
$$ -529358 -533930 -845028 -917825 -467801 187559 646459 689466 60569 -1429620 -3382890
33891c382890j434691k37850N98695N08481J05356L74218J383934K271431K416619
$$ -3382890 -4817581 -5055431 -4456736 -3948255 -3842899 -3468681 -2084747 186684 2603303
33882B603303J999614J280093J24805j288479k065423j644041o74484p1884K16297
$$ 2603303 4602917 5883010 6007815 4719336 2653913 1009872 335388 263504 479801
33873D79801O14991P90782K85648l48265m20430m92901j257156j660073l27708
$$ 479801 1094792 1885574 2171222 1822957 1402527 909626 -347530 -2007603 -2335311
33864b335311J486359J068507j369589k409116n04768J606022J288909L8254N94704
$$ -2335311 -848952 219555 -1150034 -3559150 -4063918 -2457896 -1168987 -1130733 -536029
33855e36029K217475J959832n42758k668873k756462j699495o63060K95263J034075
$$ -536029 1681446 3641278 3098520 429647 -2326815 -4026310 -4689370 -4394107 -3360032
33846c360032R18566J33269k61603j828O2007m49694r01019q58087n70537j52585
$$ -3360032 -2441466 -2308197 -2569800 -2571628 -2509621 -2959315 -3860334 -4718421 -5288958 -5441543
33836e441543M77192Q84209O35770L77879R92277J911317J883630J204304J305970
$$ -5441543 -4964351 -4080142 -3444372 -3066493 -2074216 -162899 1720731 2925035 4231005
33827D231005K154820K123035P44219m83738o00704m84060q96437j161333p61205
$$ 4231005 6385825 8508860 9253079 8769341 8168637 7684577 6788140 5626807 4865602
33818D865602n06789r91300j389344r18598j66736P2712K0550K6023k30796p10988
$$ 4865602 4358813 3367513 1978169 1059571 892835 965547 986097 1012120 781324 70336
33808G0336n27605N55555J469302J555371J403396J066335o18908l488975m802128
$$ 70336 -457269 98286 1567588 3122959 4526355 5592690 4973782 1484807 -3317321
33799c317321k630280R37842K273289R36405k97388M61549K201333K865232J534887
$$ -3317321 -5947601 -5009759 -2736470 -1800065 -2097453 -1635904 565429 3430661 4965548
33790D965548j041109k852734k147155K98403J470873O4073j379928k60141J849525
$$ 4965548 3924439 1071705 -1075450 -777047 693826 757899 -622029 -882170 967355
33781I67355J667175l99431j015556L87133P74737j055490k247395p01507J390421
$$ 967355 2634530 2235099 1219543 1606676 2381413 1325923 -921472 -1622979 -232558
33772b32558J148716o09912j226672l78542L23412M44778P44610J032090N42221
$$ -232558 916158 306246 -920426 -1298968 -975556 -530778 213832 1245922 1788143
33763A788143j16613K53779J021110L41268j803092l278042k808875j456536n84021
$$ 1788143 1671530 1925309 2946419 3287687 1484595 -1793447 -4602322 -6058858 -6642879
33754f642879k7925Q80350J766049J730098P58523j85110k04788P39048J786750
$$ -6642879 -6670804 -5790454 -4024405 -2294307 -1535784 -1720894 -1925682 -1186634 600116
33745F00116J810271N07037j053846j408478k63457J299980K061365J588792J52797
$$ 600116 2410387 2917424 1863578 455100 191643 1491623 3552988 5141780 5294577
33736E294577j491775k248062j466123J67029J211007J148556P60461O15882J46909
$$ 5294577 3802802 1554740 88617 255646 1466653 2615209 3375670 3991552 4138461
33727D138461j122031k232245j763524Q8477J462681J095135j54209n28261L76974
$$ 4138461 3016430 784185 -979339 -890862 571819 1666954 1512745 984484 1361458
33718A361458J273283R78556j42304q28241n42031Q3424K61338k0299j88662J47690
$$ 1361458 2634741 3613297 3470993 2642752 2100721 2184145 2445483 2425184 2236522 2384212
33708B384212P50776Q76514p7030j714563k614279j780007r0773N39137l33355
$$ 2384212 3134988 4011502 3934472 2219909 -394370 -2174377 -2265150 -1726013 -2059368
33699b059368r98300k1168J598838J763076J85992j281902j115344K34669J272500
$$ -2059368 -3057668 -3078836 -1479998 283078 469070 -812832 -1928176 -1693507 -421007
33690d21007J088938j54083j561430k089184j454334n57152l05790j52490J078676
$$ -421007 667931 513848 -1047582 -3136766 -4591100 -5148252 -5454042 -5606532 -4527856
33681d527856K868135L076884J028927j030805q59735O22502Q37126n73599j483447
$$ -4527856 -1659721 1417163 2446090 1415285 555550 1178052 2015178 1441579 -41868
33672d1868p85706P5516k50544q38161k92483P37266O43512l56865m84933P18985
$$ -41868 -827574 -752058 -1002602 -1840763 -2133246 -1395980 -752468 -1109333 -1594266 -875281
33662h75281J698443J475529J137263J698802J985834L51513k274110l073728
$$ -875281 823162 2298691 3435954 5134756 7120590 7472103 5197993 2124265
33654B124265j194923R46643R94438k91149o70842K6455k1293j305434j939763
$$ 2124265 929342 1875985 2870423 2579274 1908432 1934887 1913594 608160 -1331603
33645a331603o72305Q88109N46733j145089j724695n39906M14482k76575j297556
$$ -1331603 -2003908 -1115799 -569066 -1714155 -3438850 -3978756 -3564274 -3840849 -5138405
33636e138405p81429P70747J352055N25828j04697N03935J340982J004383k94764
$$ -5138405 -5919834 -5149087 -3797032 -3271204 -3375901 -2871966 -1530984 -526601 -821365
33627h21365j215068j071242l15174L55034N90935K98148l53909q43139p53207
$$ -821365 -2036433 -3107675 -3422849 -3067815 -2476880 -2178732 -2532641 -3375780 -4128987
33618d128987l25689j00701p0386K26792P14351N95339m35359j359511r11262
$$ -4128987 -4454676 -4555377 -4625763 -4398971 -3684620 -3089281 -3524640 -4884151 -5795413
33609e795413O97775J842230J423959J75386l43163L56347J317735J477016P56205
$$ -5795413 -5097638 -3255408 -1831449 -1656063 -1999226 -1642879 -325144 1151872 1908077
33600A908077k26026r13269r92861l66182N57646Q97223K05193q61808j316128
$$ 1908077 1682051 768782 -224079 -590261 -32615 864608 1069801 207993 -1108135
33591a108135j059913o92110l32095M31744J387076J577631P83875J63516O71046
$$ -1108135 -2168048 -2860158 -3192253 -2760509 -1373433 204198 988073 1151589 1822635
33582A822635J561094J383303L5596j133823j150055n15931m10327j331502k611236
$$ 1822635 3383729 4767032 4802628 3668805 2518750 2002819 1592492 260990 -2350246
33573b350246k966928j677302M91069J832768J536305N23340N085j25010o24629
$$ -2350246 -5317174 -6994476 -6503407 -4670639 -3134334 -2610994 -2605909 -2730919 -3355548
33564c355548j253388j014455J88407J347944J768806J561594Q13097m21898j266833
$$ -3355548 -4608936 -5623391 -5434984 -4087040 -2318234 -756640 56457 -365441 -1632274
33555a632274o84902O95385J026871P6498j64196J280256K347991Q92031j766123
$$ -1632274 -2317176 -1621791 -594920 -518422 -682618 597638 2945629 3837660 2071537
33546B071537k506947r16338L61326j90820q65288K98094K390696K960121J333925
$$ 2071537 -435410 -1351748 -990422 -1181242 -2046530 -1748436 642260 3602381 4936306
33537D936306q70646k007584j829133q68598K86036Q55424J24113j474469k208253
$$ 4936306 4065660 2058076 228943 -639655 -353619 501805 625918 -848551 -3056804
33528c056804q69324J492552K547796J461565k09635p27660k80491p5398k44615
$$ -3056804 -3926128 -2433576 114220 1575785 1366150 638490 357999 282601 37986
$$ [...]
##END NTUPLES=NMR SPECTRUM
##END=
