##TITLE=31Pdec_DE-73-1
 D2O, 64 sc
 7.11.2024
##JCAMPDX= 6.0         $$ Bruker NMR JCAMP-DX V2.0
##DATA TYPE= NMR SPECTRUM
##DATA CLASS= NTUPLES
##ORIGIN= UXNMR, Bruker Analytische Messtechnik GmbH
##OWNER= root
$$ XWIN-NMR		Version 3.5
$$ Thu Nov  7 13:52:31 2024 Russian Standard Time (UT+4h)  she@DPX200
##.OBSERVE FREQUENCY= 81.013821
##.OBSERVE NUCLEUS= ^31P
##.ACQUISITION MODE= SIMULTANEOUS
##.ACQUISITION SCHEME= undefined
##.AVERAGES= 64
##.DIGITISER RES= 17
##SPECTROMETER/DATA SYSTEM= spect
##.PULSE SEQUENCE= zgpg30
##.SOLVENT NAME= D2O
##.SHIFT REFERENCE= (INTERNAL, D2O, 0, 198.062)
##AUDIT TRAIL= $$ (NUMBER, WHEN, WHO, WHERE, WHAT)
$$ ##TITLE= Audit trail, XWIN-NMR		Version 3.5
$$ ##JCAMPDX= 5.01
$$ ##ORIGIN= Bruker BioSpin GmbH
$$ ##OWNER= she
$$ F:/spectra/data/she/nmr/P31/2/pdata/1/auditp.txt
$$ ##AUDIT TRAIL=  $$ (NUMBER, WHEN, WHO, WHERE, WHAT)
(   1,<2024-11-07 13:51:42.35 +0400>,<she>,<DPX200>,
      <created by zg, POWCHK disabled, PULCHK disabled
       configuration hash MD5:
       00 E9 B6 7A A2 85 ED C7 34 08 36 98 17 FE 4E 26
       data hash MD5: 32K
       35 23 07 AA 25 72 09 5A 74 62 4C 3B 94 85 6D BE>)
(   2,<2024-11-07 13:51:44.73 +0400>,<she>,<DPX200>,
      <Start of raw data processing
       efp BC_mod = 2 LB = 1.5 FT_mod = 6 PKNL = 1 PHC0 = 2412.875 PHC1 = -275.9117 SI = 64K 
       data hash MD5: 64K
       9F 43 EF 2F B6 74 5D 24 30 1D B5 2F CF A4 45 15>)
(   3,<2024-11-07 13:51:59.68 +0400>,<she>,<DPX200>,
      <pk PHC0 = -9.091164 PHC1 = 0 
       data hash MD5: 64K
       6D 25 F3 11 CA 5C 0C 1E 78 18 6E DC 28 D4 F1 53>)
(   4,<2024-11-07 13:52:02.89 +0400>,<she>,<DPX200>,
      <abs ABSG = 5 
       data hash MD5: 64K
       37 E7 84 CB BB ED 8A FA 65 49 93 81 86 27 11 6F>)
$$ ##END=
$$ 
$$ hash MD5
$$ AB C1 9B 46 6A 35 D1 A9 CC 1C CD 53 E3 3F E5 BF
##$RELAX= 
##$RELAX= 
##$RELAX= 
##$RELAX= 
##$RELAX= 
##$RELAX= 
##$RELAX= 
##$RELAX= 
$$ Bruker specific parameters
$$ --------------------------
##$DU= <F:/spectra>
##$EXPNO= 2
##$NAME= <P31>
##$PROCNO= 1
##$TYPE= <nmr>
##$USER= <she>
##$AMP= (0..31)
100 100 100 100 100 100 100 100 100 100 100 100 100 100 100 100 100 100 
100 100 100 100 100 100 100 100 100 100 100 100 100 100 
##$AQSEQ= 0
##$AQ_mod= 1
##$AUNM= <au_zg>
##$AUTOPOS= <>
##$BF1= 81.014009
##$BF2= 200.13
##$BF3= 200.13
##$BF4= 200.13
##$BF5= 200.13
##$BF6= 200.13
##$BF7= 200.13
##$BF8= 200.13
##$BYTORDA= 1
##$CFDGTYP= 0
##$CFRGTYP= 5
##$CHEMSTR= <none>
##$CNST= (0..31)
1 1 145 1 1 1 1 1 1 1 1 1 1 1 1 1 1 1 1 1 1 1 1 1 1 1 1 1 1 1 1 1 
##$CPDPRG= <waltz16>
##$CPDPRG1= <>
##$CPDPRG2= <waltz16>
##$CPDPRG3= <>
##$CPDPRG4= <mlev>
##$CPDPRG5= <mlev>
##$CPDPRG6= <mlev>
##$CPDPRG7= <mlev>
##$CPDPRG8= <mlev>
##$CPDPRGB= <>
##$CPDPRGT= <>
##$D= (0..31)
0 1 0 0 0 0 0 0 0 0.06 0 0.03 2e-05 3e-06 0 0 0.0002 0 0 0 0 0 0 0 0 0 
0 0 0 0 0 0 
##$DATE= 1730973101
##$DBL= (0..7)
120 120 120 11 120 120 24 19 
##$DBP= (0..7)
150 150 150 150 150 150 150 150 
##$DBP07= 0
##$DBPNAM0= <>
##$DBPNAM1= <>
##$DBPNAM2= <>
$$ [...]
##$SUBNAM3= <"">
##$SUBNAM4= <"">
##$SUBNAM5= <"">
##$SUBNAM6= <"">
##$SUBNAM7= <"">
##$SUBNAM8= <"">
##$SUBNAM9= <"">
##$SW= 400.765351723535
##$SWIBOX= (0..15)
0 1 3 0 0 0 0 0 0 0 0 0 0 0 0 0 
##$SW_h= 32467.5324675325
##$TD= 32768
##$TD0= 1
##$TE= 0
##$TE2= 300
##$TE3= 300
##$TEG= 300
##$TL= (0..7)
0 120 53 12 22 120 120 120 
##$TP= (0..7)
150 150 150 150 150 150 150 150 
##$TP07= 0
##$TPNAME0= <>
##$TPNAME1= <>
##$TPNAME2= <>
##$TPNAME3= <>
##$TPNAME4= <>
##$TPNAME5= <>
##$TPNAME6= <>
##$TPNAME7= <>
##$TPOAL= (0..7)
0.5 0.5 0.5 0.5 0.5 0.5 0.5 0.5 
##$TPOFFS= (0..7)
0 0 0 0 0 0 0 0 
##$TUNHIN= 0
##$TUNHOUT= 0
##$TUNXOUT= 0
##$USERA1= <user>
##$USERA2= <user>
##$USERA3= <user>
##$USERA4= <user>
##$USERA5= <user>
##$V9= 5
##$VALIST= <valist>
##$VCLIST= <CCCCCCCCCCCCCCC>
##$VD= 0
##$VDLIST= <DDDDDDDDDDDDDDD>
##$VPLIST= <PPPPPPPPPPPPPPP>
##$VTLIST= <TTTTTTTTTTTTTTT>
##$WBST= 1024
##$WBSW= 4
##$XGAIN= (0..3)
0 0 0 0 
##$XL= 0
##$YL= 0
##$YMAX_a= 17596
##$YMIN_a= -20080
##$ZGOPTNS= <>
##$ZL1= 120
##$ZL2= 120
##$ZL3= 120
##$ZL4= 120
##$ABSF1= 198.0616
##$ABSF2= -202.7028
##$ABSG= 5
##$ABSL= 3
##$ALPHA= 0
##$AQORDER= 0
##$ASSFAC= 0
##$ASSFACI= 0
##$ASSFACX= 0
##$ASSWID= 0
##$AUNMP= <proc_1d>
##$AZFE= 0.1
##$AZFW= 0.5
##$BCFW= 0
##$BC_mod= 2
##$BYTORDP= 0
##$COROFFS= 0
##$CY= -3
##$DATMOD= 1
##$DC= 0
##$DFILT= <>
##$DTYPP= 0
##$F1P= 0
##$F2P= 0
##$FCOR= 1
##$FTSIZE= 65536
##$FT_mod= 6
##$GAMMA= 0
##$GB= 0
##$INTBC= 1
##$INTSCL= 9.790993e-09
##$ISEN= 30
##$LB= 1.5
##$LEV0= 0
##$LPBIN= 0
##$MAXI= 10000
##$MC2= 0
##$MEAN= 0
##$ME_mod= 0
##$MI= 50
##$NCOEF= 0
##$NC_proc= -8
##$NLEV= 6
##$NOISF1= 182.463
##$NOISF2= 159.3651
##$NSP= 0
##$NTH_PI= 0
##$NZP= 0
##$OFFSET= 198.0616
##$PC= 4
##$PHC0= 2403.784
##$PHC1= -275.9117
##$PH_mod= 1
##$PKNL= yes
##$PPARMOD= 0
##$PSCAL= 0
##$PSIGN= 0
##$REVERSE= no
##$SF= 81.0140089999434
##$SI= 65536
##$SIGF1= 159.3651
##$SIGF2= -187.1042
##$SINO= 113.3802
##$SIOLD= 16384
##$SREGLST= <1H.CDCl3>
##$SSB= 0
##$STSI= 65536
##$STSR= 0
##$SW_p= 32467.5324675325
##$SYMM= 0
##$S_DEV= 0
##$TDeff= 32768
##$TDoff= 0
##$TI= <>
##$TILT= no
##$TM1= 0
##$TM2= 0
##$TOPLEV= 0
##$USERP1= <user>
##$USERP2= <user>
##$USERP3= <user>
##$USERP4= <user>
##$USERP5= <user>
##$WDW= 1
##$XDIM= 65536
##$YMAX_p= 404771107
##$YMIN_p= -84822405
$$ End of Bruker specific parameters
$$ ---------------------------------
##NTUPLES= NMR SPECTRUM
##VAR_NAME=  FREQUENCY,     SPECTRUM/REAL,   SPECTRUM/IMAG
##SYMBOL=    X,             R,               I
##VAR_TYPE=  INDEPENDENT,   DEPENDENT,       DEPENDENT
##VAR_FORM=  AFFN,          ASDF,            ASDF
##VAR_DIM=   65536,         65536,           65536
##UNITS=     HZ,            ARBITRARY UNITS, ARBITRARY UNITS
##FACTOR=    0.49542278885378, 1,            1
##FIRST=     16045.7642231865, 0,            0
##LAST=      -16421.768244346, 0,            0
##MIN=       -16421.768244346, -84822405,    0
##MAX=       16045.7642231865, 404771107,    0
$$ Real data points
##PAGE= N=1
##DATA TABLE= (X++(R..R)), XYDATA
$$ [...]
##PAGE= N=2
##DATA TABLE= (X++(I..I)), XYDATA
7453b15126k705758l061843m50950L017961L167567o16741m254607m004661o62884
7444i787042K155341K307035L83007k141498m152743m481985k108558K257856
7436a5568587N771754N919070L273885P92818K71712N80205j18251j543884j835349
7427b456627k62883J911531L071098K537108M48772k164978l193438j158717K289002
7418A020868L388572Q29528k359670k856071j296346m99414q92211n27197R04268
7409b287673J253068l20679j594335o69232J092641J266652j31510j253520j364324
7400d008912j163400q66511n791J064655J283122N24277m88798j868290m218001
7391i747649o284877n242452o28811L866600M560782K579213K143729M469077
$$ plain form
7453 -215126 -2920884 -5982727 -6433677 -3415716 -248149 -864890 -5119497 -9124158 -9787042
7444 -9787042 -7631701 -5324666 -4941659 -7083157 -11235900 -15717885 -17826443 -15568587
7436 -15568587 -9796833 -3877763 -603878 188940 460652 1040857 922606 -621278 -2456627
7427 -2456627 -2719510 -807979 2263119 4800227 5248999 3084021 -109417 -1268134 1020868
7418 1020868 4409440 5238968 2879298 23227 -1273119 -1772533 -2664744 -3191941 -2287673
7409 -2287673 -1034605 -1355284 -2949619 -3618851 -2526210 -1259558 -1391068 -2644588 -4008912
7400 -4008912 -5172312 -6038823 -6044614 -4979959 -3696837 -3172560 -3661358 -5529648 -9747649
7391 -9747649 -16032526 -21274978 -21903789 -18037189 -13476407 -10897194 -8753465 -4284388
7383d284388O022753L606552j093941l661417k273526R06103K870663K479536
7375D572335L90027j834318k402080p58888J248508J185844o23066j279238N54652
7366A053776K670544K623772J057045k5692n39643j553506k561498k222542j084977
7357e82721q17282j129991l35322J177123J161436n21596j488864j087419j459847
7348e084483k984209k489833J479042N065788M202052O75866q09097K57664L84998
7339F97788j521840k467015m54598K525559L652209K567517N72502j099269j462562
7330C010291l98397L66310r95072l355945l604960r43727K228217L907560M118087
7321D332364K707787r09605m798931n083067j391731J713594J071133o79107J54555
$$ plain form
7383 -4284388 1738365 5344917 4250976 589559 -1683967 -777864 2092799 4572335
7375 4572335 4962362 3128044 725964 -32924 1215584 2401428 1778362 499124 1053776
7366 1053776 3724320 6348092 7405137 7379445 6839802 5286296 2724798 502256 -582721
7357 -582721 -1400003 -2529994 -2865316 -1688193 -526757 -1048353 -2537217 -3624636 -5084483
7348 -5084483 -8068692 -10558525 -9079483 -4013695 188357 864223 55126 312790 697788
7339 697788 -824052 -3291067 -3745665 -1220106 2432103 4999620 5572122 4472853 3010291
7330 3010291 2611894 2978204 1983132 -1372813 -4977773 -5921500 -3693283 214277 4332364
7321 4332364 7040151 6130546 1331615 -3751452 -5143183 -3429589 -2358456 -3037563 -2883008
7312b883008K460571K883256J497741O80235L46345j073387k252913m94291K855061
7303D019610L464427Q00415r87979Q7525R31861r11115l146708l022544j792736
7294e57244j571735j077170J487785L822808K399209j361304k482196Q4670J847979
7285B592802k85809l403241l109474J85717K366978J514606j72349j14486J398920
7276I73664K408223K122517J340716P42929P2630q76880j532969j459045j303710
7267B488075j869841k607427k235308q06135K70795N52493J212265K526251K602100
7258B133268L83625j636465l47678L010836L806281K16216m414578o346462n672732
7249h867689m055431j142147L621280P462297O634958K182732m52410J345799
$$ plain form
7312 -2883008 -422437 2460819 3958560 4638795 4985140 3911753 1658840 1164549 4019610
7303 4019610 7484037 8284452 7296473 7383998 8315859 7404744 4258036 1235492 -557244
7294 -557244 -2128979 -3206149 -1718364 2104444 4503653 3142349 660153 744823 2592802
7285 2592802 2306993 -1096248 -4205722 -4020005 -1653027 -138421 -310770 -425256 973664
7276 973664 3381887 5504404 6845120 7588049 7660679 6783799 5250830 3791785 2488075
7267 2488075 618234 -1989193 -4224501 -5030636 -4759841 -4207348 -2995083 -468832 2133268
7258 2133268 2516893 880428 532750 3543586 7349867 7566083 3151505 -3194957 -8867689
7249 -8867689 -12923120 -14065267 -10443987 -2981690 3653268 5836000 5383590 6729389
7241F729389L805495K392095j655356l288896o94585K751752L305782Q75994k214100
7232A2007570m102914m021666j968726P36144J714421j42405l085453m302401
7224c165430k895188l04299J571518J730146K71483j458506j432066Q61599L047352
7215a773391K393101k51333j044846J610118M428469L391285r20307m200488l903665
7206b71057j615946L4604N29177N97246N6298j731570l956146m630174l043950
7197a4031518r41418o40448k276675l427664j735640K234387N318059N296901
7189a0204016L503245K978250M442176N498768L978315N78488k373873l362399
7181E038954k138319O71772L230698L333069J211546O1993J772872L568703J606946
$$ plain form
7241 6729389 10534884 12926979 11271623 7982727 7288142 10039894 13345676 14221670 12007570
7232 12007570 7904656 3882990 1914264 2650408 4364829 4222424 1136971 -3165430
7224 -3165430 -6060618 -6364917 -4793399 -3063253 -2791770 -4250276 -5682342 -4820743 -1773391
7215 -1773391 619710 368377 -676469 933649 5362118 8753403 7833096 3632608 -271057
7206 -271057 -1887003 -1852399 -1323222 -725976 -669678 -2401248 -6357394 -10987568 -14031518
7197 -14031518 -14972936 -15613384 -17890059 -21317723 -23053363 -20818976 -15500917 -10204016
7189 -10204016 -6700771 -3722521 719655 6218423 10196738 10775226 8401353 5038954
7181 5038954 2900635 3572407 6803105 10136174 11347720 11409713 13182585 16751288 18358234
7172A8358234l138211n954415n037277l298990k958864k299024L66804K967028
7164i94715K700978L91708j082153j035165q99525j133349q67832N5876Q46323
7155b017854R50083k4515k322845m468645l623694L47539L387046K606770P81885
7146d384230J823280M054487K916138j021144k492269O1960K340772J515186J46066
7137D960246P40810J516574M34647r34067p97348o56076k095466l319738k274557
7128b424975l95921J6914m69327m04884l88107q40463J20909K979909M124355
7119B318410J134462k160423r05566K920686L457479R2441k308965j489448o2149
7110B996927L46139J251734K728552K235966m37569k024369j285451j001882k576889
$$ plain form
7172 18358234 15220023 9265608 4228331 929341 -2029523 -4328547 -3961743 -994715
7164 -994715 1706263 2097971 1015818 -19347 -918872 -2052221 -2920053 -2864177 -2017854
7155 -2017854 -1067771 -1092286 -3415131 -7883776 -11507470 -11159931 -7772885 -5166115 -4384230
7146 -4384230 -2560950 1493537 4409675 3388531 896262 958222 3298994 4814180 4960246
7137 4960246 5701056 7217630 7652277 6718210 5920862 5264786 3169320 -150418 -2424975
7128 -2424975 -2820896 -2803982 -3273309 -3678193 -4066300 -4906763 -4785854 -1805945 2318410
7119 2318410 3452872 1292449 386883 3307569 6765048 6857489 4548524 3059076 2996927
7110 2996927 3343066 4594800 7323352 9559318 9121749 7097380 5811929 4810047 2233158
7101B233158l262797j182885J122122R84875k24743j34028O99280Q40292J012453
7092B087727K042120K359634O08332j464919j630265o63795m67864p38842l43083
7083A789045m0574p99292j167512M32039K226338J283340j789342l609722k877501
7074d553181j341194k60900R63329K400123K589414P27778j943023l452932k657311
7065g527897K84643L620426M687572K577091j84679k68910K352892M490359L694646
7056A3726143N99918k521723m010474l604656k312647j668143k216310k787196
7048d795088j922723L09126K458599L067069J539047j288078k985335j474724
7040e092107K024028L658991J628703j637642l210587l279046l163614k184141
$$ plain form
7101 2233158 -1029639 -2212524 -1090402 -105527 -330270 -464298 234982 1075274 2087727
7092 2087727 4129847 6489481 7097813 5632894 4002629 3338834 2870970 2132128 1789045
7083 1789045 1748471 949179 -218333 213706 2440044 3723384 1934042 -1675680 -4553181
7074 -4553181 -5894375 -6155275 -5191946 -2791823 -202409 525369 -1417654 -4870586 -7527897
7065 -7527897 -7243254 -3622828 1064744 3641835 3457156 3188246 5541138 10031497 13726143
7056 13726143 14326061 11804338 7793864 4189208 1876561 208418 -2007892 -4795088
7048 -4795088 -6717811 -6408685 -3950086 -883017 656030 -632048 -3617383 -5092107
7040 -5092107 -3068079 590912 2219615 581973 -2628614 -5907660 -9071274 -11255415
7032a1255415N84163L208246K877020J15215j884097j470629M53049K651284M059448
7023f61716L171500L0901k128100o00541K305993K270485l26043j189795M97724
7014C370408O67347k439189m765859k776765Q93111J579854o12773j833598m06291
7005f323755J760934K727579K512512J873498J354078J413298J897040J671676
6997H886860O7455j801419k354676j624831q44105m79576J26937J415984K797942
6988F190571L041539J153387k487800n561603n444725k190797J011437J218423
6980c069568j128324l184766l034638j088105J234434L016715L980941L919125
6972F45814K566166J85227j957821k381776j015979N60156R73666M45708j56215
$$ plain form
7032 -11255415 -10671252 -7463006 -4585986 -4470771 -6354868 -7825497 -7372448 -4721164 -661716
7023 -661716 2509784 2540685 412585 -187956 2118037 4388522 4062479 2872684 3370408
7014 3370408 4037755 1598566 -3167293 -5944058 -5050947 -3471093 -4083866 -5917464 -6323755
7005 -6323755 -4562821 -1835242 677270 2550768 3904846 5318144 7215184 8886860
6997 8886860 8954315 7152896 4798220 3173389 2329284 1849708 1976645 3392629 6190571
6988 6190571 9232110 10385497 7897697 2336094 -3108631 -5299428 -4287991 -3069568
6980 -3069568 -4197892 -7382658 -10417296 -11505401 -10270967 -7254252 -3273311 645814
6972 645814 3211980 3397207 1439386 -942390 -1958369 -1398213 -424547 21161 -135054
6963a35054n51956n54645K75747J352074J059921m73601o48356J406899K301165
6954D032194o28154m010718k687692K151285M453771K467248M39831N61836k52599
6945F527002l345533m502764r65994L213081L459573J645966J589445J784486
6937I405262j128901m742146l800062O53759K110218j306954m148326k392994
6929e350144R87015J698508N61939R25794K873040L495895J417142j593873k957210
6920B058106j843863J36708M12831j550486l010230j310654J895657K248401j276926
6911b240456m685874m304523j233398J079916J499296J326002J281846P97774
6903f479417j13797l30730O50571J726874J602063O21411M48351J850273L498970
$$ plain form
6963 -135054 -687010 -1241655 -965908 386166 1446087 972486 324130 1731029 4032194
6954 4032194 3404040 -606678 -3294370 -1143085 3310686 5777934 6217765 6779601 6527002
6945 6527002 3181469 -1321295 -2287289 925792 4385365 6031331 7620776 9405262
6937 9405262 8276361 3534215 -265847 387912 2498130 1191176 -2957150 -5350144
6929 -5350144 -4363129 -2664621 -2102682 -1176888 1696152 5192047 6609189 5015316 2058106
6920 2058106 214243 350951 763782 -786704 -3796934 -5107588 -3211931 -963530 -2240456
6911 -2240456 -6926330 -11230853 -12464251 -11384335 -9885039 -8559037 -7277191 -6479417
6903 -6479417 -6593214 -6923944 -6273373 -4546499 -2944436 -2323025 -1874674 -24401 3474569
6894C474569L641207K444475J412870O84306j106813l707320m348046j647258
6886H47990J546506J547748j268680l439832l262729j988018q11555M73263J847255
6877d508052K611907K787850K948564K759244J664554N66285M61752j4884k763868
6868F513352o183517o305315k382235J877079L412290L004752K365571J305901
6860C607878m54100j423188m44058J225045J739431J081901K75412l45860q59893
6851D402568r95128m87975P92604K982438M988789M063448n80589m654350l423347
6842G088458Q44654J274847l086463n380472j955328J411493j029181n256299
6834f088291l890255J737687L643109n24575m751861m109975l37367K783056L839523
$$ plain form
6894 3474569 7115776 9560251 10973121 11657427 10550614 6843294 2495248 847990
6886 847990 2394496 3942244 2673564 -766268 -4028997 -6017015 -6828570 -6355307 -4508052
6877 -4508052 -1896145 891705 3840269 6599513 8264067 8830352 9292104 9277220 6513352
6868 6513352 329835 -5975480 -8357715 -6480636 -3068346 -63594 2301977 3607878
6860 3607878 3153778 1730590 1286532 2511577 4251008 5332909 5608321 5262461 4402568
6851 4402568 3407440 2919465 3712069 6694507 11683296 15746744 15166155 10511805 7088458
6842 7088458 7933112 9207959 6121496 741024 -1214304 197189 -831992 -6088291
6834 -6088291 -9978546 -8240859 -4597750 -5122325 -9874186 -13984161 -14321528 -11538472 -7698949
6825g698949K440128j246679m100162k088149L528774O576057M413483J407235
6817C231738J646012K950680J615489j017780j257853M11687L16153k171827l745681
6808A978618k346827K91629J636955J155230l80344k126624k987661j898443P74553
6799c902914L030892L152578J506774J24776M79772J718384J558739n84277k264717
6790D820007j188986J143240J406435l09503n71115J453775K057421r26074l918151
6781C967049k976209l07400p95420l921479m464527q56377K536396K494126J383934
6772b939907K311040L921557L140478K22278k191805l123722l261699k336389
6764d258169L10114L187463L657318J520317o86340j051141K9452J442507K467403
$$ plain form
6825 -7698949 -5258821 -6505500 -10605662 -12693811 -9165037 -2588980 1824503 3231738
6817 3231738 4877750 7828430 9443919 8426139 7168286 7579973 7896126 5724299 1978618
6808 1978618 -368209 -76580 1560375 2715605 2335261 208637 -2779024 -4677467 -3902914
6799 -3902914 -872022 2280556 3787330 3912106 4391878 6110262 7669001 7084724 4820007
6790 4820007 3631021 4774261 6180696 5871193 5300078 6753853 8811274 7885200 3967049
6781 3967049 990840 683440 -111980 -4033459 -8497986 -9354363 -6817967 -4323841 -2939907
6772 -2939907 -628867 3292690 6433168 6655446 4463641 1339919 -1921780 -4258169
6764 -4258169 -3948055 -760592 2896726 4417043 3730703 2679562 2709014 4151521 6618924
6755F618924K152406q5348k587172k434758M99569K489976P21175k426350k260287
6746B688135J666937M574177K667864j942468m215086k553473K19895J750563
6738D856544K876674M302774L616397j182852o762219p258443k268679K056266
6730B36462J429593j026248m68952K049898K072458m99929j495580L13552J488519
6721D099773J07648j389330j166269j077336k370895k666937l96203J625522Q06399
6712b427628n59517L76819J277395j315852m588327k722337L230159N725776J970597
6703I67085j916652n69519K810370K397524j212655l039632j823987p20222j201196
6694d308884j280858J08224J124602L56177r31957j112691n47432l96668o62392
$$ plain form
6755 6618924 8771330 8685982 6098810 3664052 4163621 6653597 7374772 4948422 2688135
6746 2688135 4355072 8929249 11597113 9654645 5439559 2886086 3105981 4856544
6738 4856544 7733218 12035992 15652389 14469537 7707318 448875 -1819804 236462
6730 236462 1666055 639807 170855 2220753 4293211 3793282 2297702 2611254 4099773
6721 4099773 4207421 2818091 1651822 574486 -1796409 -4463346 -4859549 -3234027 -2427628
6712 -2427628 -2987145 -2610326 -1332931 -2648783 -7237110 -9959447 -6729288 -1003512 967085
6703 967085 -949567 -1519086 1291284 3688808 2476153 -563479 -2387466 -3107688 -4308884
6694 -4308884 -5589742 -5481518 -4356916 -4000739 -4932696 -6045387 -6592819 -6989487 -7651879
6685g651879o24410k75796k60984o96155p21798N47639K608453L497973J935131
6676a641826n81752j091731J116928L581865M003729K753270J124411q39189l119072
6667E306633m256335l320605j777726j028590K54617L352088N628343L479156
6659G637581j453079l552002j269264P18478r39952l102324j630659J680471K045248
6650A34498o24250j748419P62301L787489M041743K108991J38995j333834k398080
6641D869434k137479l66637P75490m67555k318908j774404M95778O45390k447540
6632b726431m767964k365589L139956O538102N359992J917788m18253n38098R27164
6623G066667K965456L968576K099268k383177o105444n595139j199476L149182
$$ plain form
6685 -7651879 -8276289 -8552085 -8813069 -9509224 -10231022 -9683383 -7074930 -3576957 -1641826
6676 -1641826 -2223578 -3315309 -2198381 1383484 5387213 8140483 9264894 8425705 5306633
6667 5306633 1050298 -2270307 -4048033 -5076623 -4822006 -1469918 4158425 7637581
6659 7637581 6184502 2632500 1363236 2081714 1141762 -1960562 -3591221 -1910750 134498
6650 134498 -489752 -2238171 -1475870 2311619 6353362 8462353 8601348 7267514 4869434
6641 4869434 2731955 2365318 3140808 2673253 354345 -1420059 -924281 -278891 -2726431
6632 -2726431 -7494395 -9859984 -6720028 -181926 5178066 7095854 6677601 6139503 7066667
6623 7066667 10032123 14000699 16099967 13716790 7611346 2016207 816731 3965913
6615C965913M143975K228201L08521N2231J98942j266274l889153m884888k882190
6606b024722j53839K59881j367193k225397j209757J52592R73851K216726L820386
6597D42528L683070J211732q48099l55534R05647M96321m20871N22132K103147
6588G740073J257306j251187j373595J701885L797889J822425j955024l558199
6580H181573k402946o51677K93199L66529n80365k539830m335393m432833k482802
6571h584545O52165L698366N288511M520710J901564j040227l340545m828141
6563a732142m955908l172219o52950L98204k15894l85634Q69057J914594J448435
6554f484457N08991J41522m51350j523088j033006K047410M635119K978723j767724
$$ plain form
6615 3965913 8109888 10338089 10646610 10698841 10897783 9631509 5742356 857468 -2024722
6606 -2024722 -2178561 -1918680 -3285873 -5511270 -6721027 -6568435 -5594584 -3377858 442528
6597 442528 4125598 5337330 4489231 4133697 5039344 5535665 5114794 5636926 7740073
6588 7740073 8997379 7746192 6372597 8074482 11872371 13694796 11739772 8181573
6580 8181573 5778627 5126950 5420149 5786678 5206313 2666483 -1668910 -6101743 -8584545
6571 -8584545 -7932380 -4234014 1054497 5575207 7476771 6436544 3095999 -1732142
6563 -1732142 -6688050 -9860269 -10513219 -10115015 -10330909 -10716543 -9847486 -7932892 -6484457
6554 -6484457 -5975466 -5833944 -6285294 -7808382 -8841388 -6793978 -2158859 819864 -947860
6545i47860m507349k513929J794911M465322M220833K744739K274295L166531
6537A0697493L206635R7697m700428o513927l517222j5855p68208l935675l744374
6528i193864P50760M317604L452344R39456O77823K004641K055298Q23077M93865
6519F321004J420057J907868J254539M24223N6220j22280j26941K68718N00851
6510A1904259k36972j443904j649027m08614R91162Q79644j272895m264307n603366
6501a104020l447284R85813L893463L005621L15545p91329j77997n74106k925973
6492h20267m628753l073468R35885M303284M869895K688932o90625l186313l348347
6483b949777j664478k51626n08261j497451j225298R41224L629343M783897L303321
$$ plain form
6545 -947860 -5455209 -7969138 -6174227 -1708905 2511928 5256667 7530962 10697493
6537 10697493 13904128 14001825 9301397 2787470 -729752 -745607 -1513815 -5449490 -9193864
6528 -9193864 -8443104 -4125500 -673156 266300 944123 2948764 5004062 5827139 6321004
6519 6321004 7741061 9648929 10903468 11327691 11383911 11261631 11134690 11403408 11904259
6510 11904259 11667287 10223383 8574356 8165742 9156904 10036548 8763653 4499346 -1104020
6501 -1104020 -4551304 -3565491 327972 3333593 3649138 2857809 2679812 2105706 -820267
6492 -820267 -5449020 -8522488 -7586603 -3283319 1586576 4275508 3584883 398570 -2949777
6483 -2949777 -4614255 -4865881 -5374142 -6871593 -8096891 -7155667 -3526324 1257573 4560894
6474D560894l2829k897471l331580j703973j32036J59261j57851l06149n50933
6465d392667p90460J67301K429968L738388K375831Q4770l25589O64869K01161
6456D153572k041362l097131j419043O66767M79252j499657l063867l115722j607781
6447a0544972J252452M040456M295951J579941j313786j999207j476635j449045
6439e614845r00252J670042M376292L978377R38405j149982q39276k0071O0565
6430B499255K30024L91395j090627l825555m692298k343577N74754J420300R57015
6421e879314R57563J227911J146785J454400K077878Q44480k738006m956608k734360
6412h599271J032499J161384k026342l196902j06595L455699L838960K342344
$$ plain form
6474 4560894 4528065 1630594 -1700986 -3404959 -3536995 -3377734 -3535585 -3841734 -4392667
6465 -4392667 -5183127 -5015826 -2585858 1152530 3528361 3613131 3287542 3952411 4153572
6456 4153572 2112210 -984921 -2403964 -1737197 -1257945 -2757602 -5821469 -8937191 -10544972
6447 -10544972 -9292520 -5252064 -956113 623828 -689958 -2689165 -4165800 -5614845
6439 -5614845 -6515097 -4845055 -468763 3509614 4448019 3298037 2458761 2438690 2499255
6430 2499255 2729279 3120674 2030047 -1795508 -6487806 -8831383 -8256629 -6836329 -5879314
6421 -5879314 -4921751 -3693840 -2547055 -1092655 985223 1829703 -908303 -5864911 -8599271
6412 -8599271 -7566772 -6405388 -8431730 -11628632 -11735227 -8279528 -4440568 -2098224
6404b098224J722551J428801n14187l027959k932346J71717K985228K990522J583572
6395B309675J501264K558383J800911k195771o814014q107032n174719o69581
6387a4790884K538077L642102K942859O75148k205506l667464k555830j7721K221041
6378a1218178L930696N272010M870105J419715l082824m355583j009051L156848
6370a016262L463527o7062k984022j983138J310757K794336J068165j327166j764672
6361e05537p13057L1250M86215J549630K049620m8285l475272m193588j181438
6352f000462J630296J047577q68005n59450J464471K143819R97817J14950J33955
6343A04968k41201j203732j499315r55416o16660n42253O2831R10086J212238
$$ plain form
6404 -2098224 -375673 1053128 538941 -2489018 -5421364 -5249647 -2264419 726103 2309675
6395 2309675 3810939 6369322 8170233 5974462 -839552 -8946584 -14121303 -14790884
6387 -14790884 -12252807 -8610705 -5667846 -4992698 -7198204 -10865668 -13421498 -13439219 -11218178
6378 -11218178 -7287482 -2015472 2854633 4274348 1191524 -3164059 -4173110 -1016262
6370 -1016262 2447265 2380203 -603819 -2586957 -1276200 1518136 2586301 1259135 -505537
6361 -505537 -1218594 -1187344 -701129 848501 2898121 2849836 -625436 -4819024 -6000462
6352 -6000462 -4370166 -3322589 -4190594 -4750044 -3285573 -1141754 -143937 -28987 104968
6343 104968 -136233 -1339965 -2839280 -3794696 -4411356 -4953609 -4890778 -3980692 -2768454
6334b768454J484329K171603J558526j677796m765539l655710P56776L392703
6326c503562K169672J31581k51210l55563j470615j928520m93396R79952P87568
6317c934093K06447O10452O43328r99239k428206j120678K103142M196134L672808
6308B950095J388927j032305j991456p53992J138007J060711j079547k663229
6300i82789k543722k280068k088794L61756M896622O867937L656600p07459j540285
6291E639798n89043k131843m881994l779509J425225N250104M222293O60946j734271
6282D081706j923777o49931Q69720R67796o83604j521015N32434K957371J784517
6273F415217j940867l484116j947481j306544l336306m783743l157079n03464
$$ plain form
6334 -2768454 -1284125 887478 2446004 768208 -3997331 -7653041 -6896265 -3503562
6326 -3503562 -1333890 -1202309 -1453519 -1809082 -3279697 -5208217 -5701613 -4721661 -3934093
6317 -3934093 -3727646 -3117194 -2473866 -3473105 -5901311 -7021989 -4918847 -722713 2950095
6308 2950095 4339022 3306717 1315261 561269 1699276 2759987 1680440 -982789
6300 -982789 -3526511 -5806579 -7895373 -7533617 -2636995 4230942 7887542 7180083 5639798
6291 5639798 5050755 2918912 -1963082 -5742591 -4317366 932738 5155031 5815977 4081706
6282 4081706 2157929 1507998 2377718 3345514 2661910 1140895 1673329 4630700 6415217
6273 6415217 4474350 990234 -957247 -2263791 -5600097 -10383840 -13540919 -14044383
6265a4044383P01575J171956K050021K403259J782516J662309K122120P83337
6257a367290k614756m420481k531306J71474P92816Q10306J963143J962864r94741
6248f227971l096823l7072N223914N974384J670403j850661j610859o17261j083974
6239a655920q16863J449577K533555m2142l342078l030436O09582L831856M443700
6230C980831K752756n24905m133695n444316l009320O61782J759150K78734k96579
6221c975562J592952L385441K386497n41422k661389k875302j908095l31377J613107
6212c315150K780771J734953j041332k975179k236665K1423J034084k98742k182256
6203f478093k032333N37543L084405K861131k4335k472928j915649N84160J885640
$$ plain form
6265 -14044383 -13342808 -12170852 -10120831 -7717572 -5935056 -4272747 -2150627 -1367290
6257 -1367290 -3982046 -8402527 -10933833 -10762359 -9969543 -9159237 -7196094 -5233230 -6227971
6248 -6227971 -9324794 -9361866 -4137952 1836432 3506835 1656174 45315 -571946 -1655920
6239 -1655920 -2472783 -1023206 1510349 1468207 -1873871 -4904307 -4294725 -462869 3980831
6230 3980831 6733587 6208682 2074987 -3369329 -6378649 -5716867 -3957717 -3678983 -3975562
6221 -3975562 -2382610 1002831 3389328 2847906 186517 -2688785 -4596880 -4928257 -3315150
6212 -3315150 -534379 1200574 159242 -2815937 -5052602 -5031179 -3997095 -4295837 -6478093
6203 -6478093 -8510426 -7972883 -4888478 -2027347 -2051682 -4524610 -6440259 -5856099 -3970459
6194c970459J165566Q96891K708757M280050K429282j775110l676206j028499
6186A030272K985588L762363O41197l029793m055317k196769N71618K174881J753243
6177C637283j09657j940684k369947r82386J342190K764296J825314q57290k823934
6168D85185k618145j626496j677697j782258K62040L380352L630737n8610l878021
6159c882913m615635l897048m221274l842972K19307N955027Q089031N705256
6151d91221L302018L473835L286531l8480m068498n008223l501014k808669l191587
6142i045308k133475O71577K432537J540852m94434j938695k764429k872048j214571
6133a5817994J843550L675502K752498J006604Q89281J706293J182296o05174
$$ plain form
6194 -3970459 -2804893 -1908002 800755 5080805 7510087 5734977 2058771 1030272
6186 1030272 4015860 7778223 8419420 5389627 1334310 -862459 -290841 1884040 3637283
6177 3637283 3527626 1586942 -783005 -1765391 -423201 2341095 4166409 3309119 485185
6168 485185 -2132960 -3759456 -5437153 -7219411 -6957371 -3577019 53718 -4892 -3882913
6159 -3882913 -8498548 -12395596 -16616870 -20459842 -20240535 -14285508 -6196477 -491221
6151 -491221 2810797 6284632 9571163 9532683 5464185 455962 -3045052 -5853721 -9045308
6142 -9045308 -11178783 -10507206 -8074669 -6533817 -7028251 -8966946 -11731375 -14603423 -15817994
6133 -15817994 -13974444 -10298942 -7546444 -6539840 -5650559 -3944266 -2761970 -3367144
6125c367144j574840j246260j032882r37424Q43255L975254M656410N06110n088015
6116c265536o237367j611496L996617N216007J528744l075589m485058j988756
6108i922434J714748L448424K576129R77204J83742k51526r27717p80569J147988
6099a834011L242766K948728M76440j455112j489719p81942j19840J210689K795405
6090D993404K306736q22059l421261k655390j68593M77335r41123j579193k35889
6081b046033J324470J719083J672802J805022J284246j98964j195615o46763K29507
6072C947755l22730j952079k708902j713799j49177L20194o17983j708626j475759
6063f381106J28609J502467J260941J49765K13492J954295L433297K802318P89107
$$ plain form
6125 -3367144 -4941984 -6188244 -7221126 -8158550 -7315295 -3340041 1316369 1822479 -3265536
6116 -3265536 -9502903 -11114399 -7117782 -1901775 -373031 -3448620 -7933678 -9922434
6108 -9922434 -8207686 -4759262 -2183133 -1205929 -1022187 -1273713 -2201430 -2981999 -1834011
6099 -1834011 1408755 4357483 4833923 3378811 1889092 1107150 987310 2197999 4993404
6090 4993404 7300140 6478081 3056820 401430 232837 710172 -230951 -1810144 -2046033
6081 -2046033 -721563 997520 2670322 4475344 5759590 5560626 4365011 3718248 3947755
6072 3947755 3625025 1672946 -1035956 -2749755 -2898932 -2578738 -3196721 -4905347 -6381106
6063 -6381106 -6252497 -4750030 -3489089 -3339324 -3125832 -1171537 2261760 5064078 5853185
6054E853185l05710M47503J745214K024277J268284M89392J64181r6407o16254
6045A0973665j244088k007371l275269m661527m627313k365752M80748J625809
6037e101098J437742K243417L944478L139921j609779o188994n657645j136018
6029h927976J573707j36680k787481k366026N88116K865088K808848Q95849j678220
6020g164775l108007j615342J969145L913933K055379r12329j047337J207984
6012d701349J951656k15244k384691j944613r9761M90741n10091j336815q31363
6003i581530O49645K357515L756242M155607K912132M25857j581595j399673Q17850
5994B512050K784787K230092n55743k886586k644620m47429J430610J434929m23947
$$ plain form
6054 5853185 5547475 5994978 7740192 9764469 11032753 11522145 11686326 11589919 10973665
6045 10973665 9729577 7722206 4446937 -214590 -4841903 -7207655 -6726907 -5101098
6037 -5101098 -3663356 -1419939 2524539 5664460 4054681 -2134313 -7791958 -8927976
6029 -8927976 -7354269 -7490949 -10278430 -12644456 -12056340 -9191252 -6382404 -5486555 -7164775
6020 -7164775 -10272782 -11888124 -9918979 -6005046 -3949667 -4861996 -5909333 -4701349
6012 -4701349 -2749693 -2964937 -5349628 -7294241 -7394002 -6903261 -7413352 -8750167 -9581530
6003 -9581530 -8931885 -6574370 -2818128 1337479 4249611 4675468 3093873 1694200 2512050
5994 2512050 5296837 7526929 6971186 4084600 1439980 992551 2423161 3858090 3434143
5985C434143k954638m171326k545185Q46355K587988R39204j575616j568578M20957
5976d586696J240510L51058K11211J406755J335597j025990k764597j589077M44630
5967d976599M93255n23236j86061Q16216J24945j674560j868638l75183K65694
5958g904167m79081n15343M65144Q7022j965044k308508Q72205M337541M329458
5949c080773J855835L31381J33113q75591k653804k645137j17815K353970K446228
5940b252593Q37724k83652K73841K144702L755227K945990j003319n450705o212339
5931e245124k207713L003743N188426L814131J564152N56627M08128k30437j424727
5922E427206j843879p13895P41433O29955q17860j134370P87341K397895P45155
$$ plain form
5985 3434143 479505 -3691821 -6237006 -5390651 -2802663 -1863459 -3439075 -5007653 -4586696
5976 -4586696 -3346186 -2995128 -2783917 -1377162 -41565 -1067555 -3832152 -5421229 -4976599
5967 -4976599 -4483344 -5006580 -5192641 -4376425 -4251480 -5926040 -7794678 -8169861 -7904167
5958 -7904167 -8383248 -8898591 -8433447 -8346425 -10311469 -12619977 -11747772 -7410231 -3080773
5949 -3080773 -1224938 -893557 -760444 -1636035 -4289839 -6934976 -7052791 -4698821 -2252593
5940 -2252593 -1414869 -1698521 -1424680 720022 4475249 7421239 6417920 967215 -5245124
5931 -5245124 -7452837 -4449094 739332 4553463 6117615 6674242 7082370 6851933 5427206
5922 5427206 3583327 2869432 3610865 4240820 3422960 2288590 3075931 5473826 6218981
5913F218981k799365l692467l11095L671209M031055J017659j798970k050298
5905D286709l00247J549371J903820K61906k206666l392832k605222j424640j227540
5896c155341j106447J85870J484798P38573j324235j722132L27367K007279R51461
5887a612807j376385j892145r3546J701252J683873M97867j86450J39541N34818
5878f03982M5422j018181j451697q43089l43590r97307j727604m95589K283639
5869e151978L384681J138964j463250l06434L959009O269979L688461j052036
5861A0467396l652291l437134k455855j442128L51232K195673K040043p5502j525601
5852B465833p92200P40883J523964J831501J818157L84088k044462k353207P44105
$$ plain form
5913 6218981 3419616 -272851 -583946 3087263 7118318 8135977 6337007 4286709
5905 4286709 3986462 5535833 7439653 7701559 5494893 2102061 -503161 -1927801 -3155341
5896 -3155341 -4261788 -4075918 -2591120 -1852547 -3176782 -4898914 -4571547 -2564268 -1612807
5887 -1612807 -2989192 -4881337 -4974883 -3273631 -1589758 -1091891 -1278341 -1138800 -603982
5878 -603982 -558560 -1576741 -3028438 -3871527 -4215117 -5212424 -6940028 -7435617 -5151978
5869 -5151978 -1767297 -628333 -2091583 -2398017 1560992 7830971 11519432 10467396
5861 10467396 6815105 3377971 922116 -520012 -168780 2026893 4066936 3991434 2465833
5852 2465833 1673633 2414516 3938480 5769981 7588138 7972226 5927764 3574557 4318662
5843D318662L333542J175409l563844m749274r26431K954746K892499M35679j417767
5834D453221k612987l901434l906213j477661J481583K517109K003328J390793
5826e2261K03156k181269l694906k101778R09460J739543J56874r73467o07865
5817f602513m08015r06270o99062J73021j05555j314486r18121J239059J977011
5808g564931L33029j01446K719930M798301J946439k738849k573499K722400O297532
5799E838906M026634q1239n63807J635697J664944j438021l812658l079553j486100
5790B704803j668643k523095j614118L38459M45613j423053j842567J096300M440200
5781d6101M092611M04122k379340j812507M8277J59298j394936k174569r90871
$$ plain form
5843 4318662 7652204 8827613 5263769 514495 -411936 2542810 5435309 5870988 4453221
5834 4453221 1840234 -2061200 -5967413 -7445074 -5963491 -3446382 -1443054 -52261
5826 -52261 150895 -2030374 -5725280 -7827058 -6917598 -5178055 -5021181 -5994648 -6602513
5817 -6602513 -7010528 -7916798 -8615860 -8442839 -8548394 -9862880 -10781001 -9541942 -7564931
5808 -7564931 -7231902 -7333348 -4613418 184883 2131322 -607527 -3181026 -458626 5838906
5799 5838906 9865540 9784301 9220494 10856191 12521135 11083114 7270456 4190903 2704803
5790 2704803 1036160 -1486935 -3101053 -2762594 -2316981 -3740034 -5582601 -4486301 -46101
5781 -46101 4046510 4450632 2071292 258785 307062 466360 -928576 -3103145 -4094016
5772d094016J002354K461020L405588M117763L772449J484857j626975k975143
5764G547897j735412k70438j011106k918621l139056j741411j883542m460167
5756i611856n735144k607972K244508L821038J952894J138131L452134N564958
5748B18691L915757l66598l460881l415025r89698K028917L491488J598869k879626
5739A41894o189090n374136j759473J013943J602258J729472K925464M596158
5731a313510N416713M860671K954102p97k815419l697337k085376K95752R74955
5722D589754o98230k864050l104185j015677J286867J421931o02001k399792j941459
5713e326842K76301K076222K096326R27404L8788J23784N89071M76416k23692
$$ plain form
5772 -4094016 -3091662 -630642 2774946 6892709 10665158 12150015 10523040 7547897
5764 7547897 5812485 5542047 4530941 1612320 -1526736 -3268147 -5151689 -9611856
5756 -9611856 -15347000 -17954972 -15710464 -11889426 -9936532 -8798401 -5346267 218691
5748 218691 4134448 3767850 306969 -3108056 -4097754 -2068837 1422651 3021520 141894
5739 141894 -6047196 -11421332 -13180805 -12166862 -10564604 -8835132 -5909668 -1313510
5731 -1313510 4103203 8963874 11917976 11917179 9101760 5404423 3319047 3614799 4589754
5722 4589754 3891524 1027474 -2076711 -3092388 -1805521 -383590 -985591 -3385383 -5326842
5713 -5326842 -5050541 -2974319 -877993 49411 88199 211983 801054 1277470 1053778
5704A053778l73169R24598K882870L520576J785024j165574l056442k760152j342552
5695A468957p96775j682496k336319j018506J396828K111331J34241k136955k084000
5686d943694k76893Q09816M12260j51073j37294k85916j052923j749123j706475
5677i081315r65983K01813J258790J255276J19608n30111M16070J331851M2178
5668e951823k445899l079278j244762P97950J769510K414450K655066J380223
5660c704563l76477M0974K163140K269806m10018j749108N74879K805003J100323
5651B713959k000216j605121J789101L478896J873106j59986o41072p73148j643178
5642C032341k237716j522053p8491Q11104K33418j725838l089295j182542L392763
$$ plain form
5704 1053778 680609 1605207 4488077 8008653 9793677 8628103 5571661 2811509 1468957
5695 1468957 672182 -1010314 -3346633 -4365139 -2968311 -856980 -722739 -2859694 -4943694
5686 -4943694 -5220587 -4410771 -3998511 -4149584 -4286878 -4572794 -5625717 -7374840 -9081315
5677 -9081315 -10047298 -9845485 -8586695 -7331419 -7211811 -7741922 -7325852 -5994001 -5951823
5668 -5951823 -8397722 -11477000 -12721762 -11923812 -10154302 -7739852 -5084786 -3704563
5660 -3704563 -4081040 -4040066 -1876926 392880 -17138 -1766246 -1191367 1613636 2713959
5651 2713959 713743 -891378 897723 4376619 6249725 6089739 5448667 4675519 3032341
5642 3032341 794625 -727428 -805919 5185 238603 -1487235 -4576530 -5759072 -2366309
5633b366309N893583L134514j876344m065425l019621j801253r95232J180155
5625c915932L793971L591799P27305r00087M5257M26526j466181k603469j40149
5616d40960L945068N688734L944532K42436l639583n941811n142613k091725l5793
5607c471715o04685j532751j78117K435293L150606J055364j601170k319243q70219
5598c936637Q44808R01560m95263j343418q59616p47295j844609j529557K278652
5589f731375O184388N071143J91579k074927j63956K86632l659099o439154k749930
5580a0084699L196302L488755j636999m564209j628190K824419M023336K582833
5572a798452J090351k72458j991533k474300k02018L082193M067635K151987k0051
$$ plain form
5633 -2366309 3527274 6661788 4785444 720019 -2299602 -4100855 -5096087 -3915932
5625 -3915932 -121961 3469838 4197143 3297056 3342313 3768839 2302658 -300811 -440960
5616 -440960 3504108 9192842 13137374 13379810 9740227 3798416 -1344197 -3435922 -3471715
5607 -3471715 -4076400 -5609151 -5787268 -3351975 -201369 853995 -747175 -3066418 -3936637
5598 -3936637 -3091829 -2190269 -2685532 -4028950 -4888566 -5635861 -7480470 -9010027 -6731375
5589 -6731375 -546987 4524156 4715735 2640808 2476852 2763484 -895615 -7334769 -10084699
5580 -10084699 -6888397 -3399642 -5036641 -9600850 -11229040 -8404621 -4381285 -1798452
5572 -1798452 -708101 -980559 -2972092 -5446392 -5648410 -2566217 1501418 3653405 3633354
5563C633354k60103N29798P8739j832388k925729j561350R21130K089611J785915
5554B458977J861411K878210L221531J843800k10607j716100k685514l092865
5546D558843k373982j275427j868010m218837n304027l047201O59643K872445
5538i996553L319637L030126J662893q62890k192856n71180J423738Q2339l282124
5529g386870l505143R40248N479270N451960J469773k491282l751636k251056
5521f044736O81606L221907L940665L034430J973285J498267R69978m2802q01363
5512H431237n28123M93647J339900J205587k67092k506150l951500l496471j882610
5503a161575p04115l79901k77181l42370r94797j602323q51836J104688K426757
$$ plain form
5563 3633354 3373251 3903049 3981788 2149400 -776329 -2337679 -1416549 673062 2458977
5554 2458977 4320388 7198598 10420129 12263929 12053322 10337222 7651708 4558843
5546 4558843 2184861 909434 -958576 -5177413 -10481440 -13528641 -12868998 -9996553
5538 -9996553 -6676916 -3646790 -1983897 -2846787 -5039643 -5610823 -4187085 -4104746 -7386870
5529 -7386870 -10892013 -9951765 -4472495 979465 2449238 -42044 -3793680 -6044736
5521 -6044736 -5363130 -2141223 1799442 4833872 6807157 8305424 9275402 9232600 8431237
5512 8431237 7903114 8396761 9736661 10942248 10675156 8169006 4217506 721035 -1161575
5503 -1161575 -1865690 -2245591 -2522772 -2865142 -3859939 -5462262 -6314098 -5209410 -2782653
5494b782653J977336P18877K42673Q40656J465224J021618m65361j677356j303716
5485C7298K72163J453369J863410K645302L521779J992303k383175n216161k310454
5476A875834L805299O363030L133572j324715k713838k125579k488953l610082
5468B914568l456416j922851n64173o9154k23123j104411k326459k307823k98385
5459i358227J893970K121410Q77672J37799K42809K17206L71182J806385L467722
5450A777928K677810o19108k899654j878341O1655n03057k771187l115112r42952
5441h212018M06691q08958j880451k64260K027413J873820O93755K335426O087670
5432B259088O673148K203094k417298k372869O03810J896817J027472R10936K060587
$$ plain form
5494 -2782653 -805317 -86440 156233 996889 2462113 3483731 3018370 1341014 37298
5485 37298 309461 1762830 3626240 6271542 9793321 11785624 9402449 4186288 1875834
5476 1875834 5681133 12044163 15177735 13853020 11139182 9013603 6524650 2914568
5468 2914568 -541848 -2464699 -3028872 -3098026 -3321149 -4425560 -6752019 -9059842 -9358227
5459 -9358227 -7464257 -5342847 -4465175 -4327376 -4084567 -3867361 -3496179 -1689794 1777928
5450 1777928 4455738 3836630 936976 -941365 -879710 -1382767 -4153954 -7269066 -8212018
5441 -8212018 -7805327 -8614285 -10494736 -10758996 -8731583 -6857763 -6164008 -3828582 2259088
5432 2259088 8932236 11135330 8718032 6345163 6948973 8845790 9873262 10784198 12844785
5423A2844785K050719J77212j447516j670426j661615k014716j681110n51368
5415F045965j79392r51802j147292J00596J267548R68315j64194j175143k145121
5406B619480k713018j578619R59414K080164l9665l393209m680186l328374j204562
5397a1278575M14088J577286K232085K067293J502719J332439J570002J662334
5389A079671J331835K90286j935946m606770n283196k656823Q41784J594834j86789
5380i531114o54759J799529L739581J813055j620258j437288K469656M483600
5372A062002J447361k362061j420131K782233M032419O09180k849190k947021
5364C54792j741837j514247m55781K837100M823351J949406k687248l187998J14895
$$ plain form
5423 12844785 14895504 15072716 13625200 11954774 10293159 8278443 6597333 6045965
5415 6045965 5866573 4914771 3767479 3868075 5135623 6103938 5939744 4764601 2619480
5406 2619480 -93538 -1672157 -712743 1367421 1327756 -2065453 -6745639 -10074013 -11278575
5397 -11278575 -10864487 -9287201 -7055116 -4987823 -3485104 -2152665 -582663 1079671
5389 1079671 2411506 2701792 765846 -3840924 -9124120 -11780943 -10939159 -9344325 -9531114
5380 -9531114 -10185873 -8386344 -4646763 -2833708 -4453966 -5891254 -3421598 1062002
5372 1062002 2509363 147302 -1272829 1509404 5541823 6151003 3301813 354792
5364 354792 -1387045 -2901292 -3357073 -519973 4303378 6252784 3565536 377538 492433
5355D92433J341737j442626l459109j281969J930467K132779P97572J628137L772694
5346E912115K846699k079161o343355n366040k29671L739732L205930L41513m65045
5337A562717J444324K317783k97956l769259m308025k362798r42211l75482J169324
5328e561583K959462K249390l93471j194859N04160R05083j649713l614925k245093
5319h041549K6738N11892J147493M097417O192370L231522k393129m184931r77715
5310c89892J678164K25015j922022l14105L473010M093071o6830m948148o290747
5301d462484m406652k363232j242004M42948K985454M064519K430952N26002R40269
5292a084228K153887J079296j429695j594585J127959L125294K343103Q11502
$$ plain form
5355 492433 1834170 391544 -3067565 -4349534 -2419067 -286288 511284 2139421 5912115
5346 5912115 8758814 6679653 336298 -5029742 -5259413 -1519681 1686249 2027762 1562717
5337 1562717 3007041 5324824 5026868 1257609 -3050416 -5413214 -6355425 -6730907 -5561583
5328 -5561583 -2602121 -352731 -746202 -1941061 -1436901 -531818 -2181531 -5796456 -8041549
5319 -8041549 -8014811 -7502919 -6355426 -2258009 3934361 7165883 4772754 587823 -389892
5310 -389892 1288272 1513287 -408735 -722840 2750170 6843241 6776411 1828263 -4462484
5301 -4462484 -8869136 -11232368 -12474372 -12031424 -9045970 -4981451 -2550499 -2024497 -1084228
5292 -1084228 1069659 2148955 719260 -875325 252634 3377928 5721031 6532533
5284F532533M46796K87249o56276j453009j609005j840170j391967J292780M102009
5275E710940K554889k503998m302833l54850K846977k4175m223811k522552L186559
5266C67146N462132L115499J203785J036878j277325o218686q694497o060693
5258a1065761j751624R76926L064893N258593N214837J924764j378951j754087
5250D89590n39819k20975m61182J19028Q85295N35572m36627p56549k91495N59339
5240a17823J786681K861563K593245J000674k98231m36450l17159n35157j91406
5231F345937J235818K517923K189766K11922k399047m392081m671907l339126
5223b300795k179780k428703k502864j78874L395002M648381K622940J70383l71505
$$ plain form
5284 6532533 6979329 7266578 6610302 5157293 3548288 1708118 316151 1608931 5710940
5275 5710940 8265829 5761831 1458998 1104148 3951125 3926950 -296861 -2819413 367146
5266 367146 5829278 8944777 10148562 11185440 9908115 3689429 -5005068 -11065761
5258 -11065761 -12817385 -11840459 -8775566 -3516973 1697864 3622628 2243677 489590
5250 489590 -50229 -271204 -732386 -613358 271937 807509 370882 -385667 -677162 -117823
5240 -117823 1668858 4530421 7123666 8124340 7826109 7389659 7072500 6537343 6345937
5231 6345937 7581755 10099678 12289444 12501366 10102319 5710238 1038331 -2300795
5223 -2300795 -4480575 -6909278 -9412142 -9591016 -6196014 -1547633 1075307 1245690 874185
5214H74185J03029r6791q76705j317247j156275l70595J018180K184199K180355
5205B542335J473687J028139L02359j428471k365745j36576L566300M082319L71340
5196I435687l126018k660272O6383J129684m54828k827095m251815m012884k110056
5187h811214K83954J484441J465619J804056K817198K804215R09236j427514k706163
5178a376172k850987j754423J087132M434083N389038L022344k77006k225008
5170E449001l109579l700042l257755j283720Q27933J474348O07193j051892k649499
5161f694012k543243M33426M267750N150010K609100L33040O44734J353609j98417
5152E355997l104470n000828n325508m251147j176496L164948N579984M152143
$$ plain form
5214 874185 977214 880423 3718 -1313529 -2469804 -2840399 -1822219 361980 2542335
5205 2542335 4016022 5044161 5346520 3918049 1552304 1415728 4982028 9064347 9435687
5196 9435687 6309669 3649397 3715780 4845464 4390636 1563541 -2688274 -6701158 -8811214
5187 -8811214 -8527260 -7042819 -5577200 -3773144 -955946 1848269 2757505 1329991 -1376172
5178 -1376172 -4227159 -5981582 -4894450 -460367 4928671 7951015 7674009 5449001
5170 5449001 2339422 -1360620 -4618375 -5902095 -5074162 -3599814 -2992621 -4044513 -6694012
5161 -6694012 -9237255 -8803829 -4536079 613931 3223031 3556071 4200805 5554414 5355997
5152 5355997 2251527 -2749301 -8074809 -12325956 -13502452 -10337504 -4757520 -605377
5144f05377J158127j88737o291l75270j579480k266278j937949j019660L75178
5135f445737J974975K944162L287977L943375M309716K096775k693473o179657
5127C238113n237499j650554N55932J19303j045536o98400J979395N559004O293931
5118I113689J659522m944353o677671k167311K244348J623781q45984j4472K916305
5109B907854L364047J190659k06733l10075j203883k365099j375355R23633J260938
5100D185986m73165j408903j117310j800135l109543k031314J389890L237399
5092a127095J875991K88050O58796J010884n77531k243796j515672P29304K154891
5083A253822K547152K931181K838085J056462j730938l185893k047312N71168
$$ plain form
5144 -605377 552750 364013 357722 -17548 -1597028 -3863306 -5801255 -6820915 -6445737
5135 -6445737 -4470762 -1526600 1761377 5704752 10014468 12111243 9417770 3238113
5127 3238113 -1999386 -3649940 -3094008 -2974705 -4020241 -4718641 -2739246 2819758 9113689
5118 9113689 10773211 5828858 -848813 -3016124 -771776 852005 6021 -8451 2907854
5109 2907854 6271901 7462560 7255827 6945752 5741869 3376770 2001415 2925048 4185986
5100 4185986 3712821 2303918 1186608 -613527 -3723070 -5754384 -4364494 -1127095
5092 -1127095 748896 1036946 1695742 2706626 2129095 -114701 -1630373 -901069 1253822
5083 1253822 3800974 6732155 9570240 10626702 8895764 5709871 3662559 4233727
5075D233727K469811K324460O34733r80127j652346k140846l205332l722947j844911
5066c883778K008919M809596M198427J243549p89947j97210J165466J21673l493602
5057E183093n803089l466343J540071L983738K122861l72288R461K043666K467914
5048G709084P94002q64437j117724k45543J084722K174361K081305L67987k394392
5039I589365n127028o266305l980465J261204N001506L284559j273023k324306
5031A65507Q85885K457857m98089l366093k171067Q4053k67313p39238J989432
5022a459066M872701L372483j92668l05639K382643K549955n76293k511974j302862
5013F829280M10721Q63515R27346O32338p14960j352270P37377L062363J556631
$$ plain form
5075 4233727 6703538 9027998 9662731 8682604 7030258 4889412 1684080 -2038867 -3883778
5066 -3883778 -1874859 2934737 7133164 8376713 7586766 7389556 8555022 8676695 5183093
5057 5183093 -619996 -4086339 -2546268 1437470 3560331 3188043 3197504 5241170 7709084
5048 7709084 8503086 7638649 6520925 6275382 7360104 9534465 11615770 11983757 9589365
5039 9589365 4462337 -1803968 -5784433 -4523229 478277 3762836 2489813 165507
5031 165507 1051392 3509249 3011160 -354933 -2526000 -2441947 -2709260 -3448498 -1459066
5022 -1459066 3413635 6786118 6593450 6287811 8670454 11220409 10644116 8132142 6829280
5013 6829280 7240001 8103516 9030862 9663200 8948240 7595970 8333347 11395710 12952341
5004A2952341k262275k870662O45544L387090K390484n1137j479537k318602k853796
4995G539450k033097l44427K90713L9218O41165J551185Q64901m65624j35589
4986G947895M95584j656516m905552m297831J62400K980015J734958J22736R86284
4977C569973K081352R20738j053591j410281p8665J752346K881364J807883j436390
4968I034729l565282j967213O78499K19519k019530j605488J097014J791931J25018
4959C789197j81018J326506J404772k4673K17882J663118N98691k222550j874947
4950D696978K002114M277025K925968J094029Q1854j823904l160539m96605L640239
4941A3237159L134771q06649r96559K659677K529370k467107l941207J143647
$$ plain form
5004 12952341 10690066 7819404 8464948 11852038 14242522 14191385 12711848 10393246 7539450
4995 7539450 5506353 5161926 5452639 5491857 6133022 7684207 8549108 8083484 7947895
4986 7947895 8443479 6786963 1881411 -2416420 -2254020 725995 2460953 2583689 3569973
4977 3569973 5651325 6572063 5518472 4108191 4029526 5781872 8663236 10471119 9034729
4968 9034729 5469447 3502234 4180733 4400252 2380722 775234 1872248 3664179 3789197
4959 3789197 3608179 4934685 6339457 6314784 6532666 8195784 8794475 6571925 4696978
4950 4696978 6699092 10976117 13902085 14996114 15077968 13254064 10093525 9596920 13237159
4941 13237159 16371930 15565281 14568722 17228399 19757769 17290662 13349455 14493102
4933A4493102M753126J696182k342430k415452k670210o323721p896480l128201
4925c834084K720522M061676L794300N674253O474678L206935j748M27587Q19838
4916B3343957j899363l641549j250475R28224p01316k238517j71888K251590K338572
4907A8959235K703618L509911K41108n564715n192247J858421M616552o24776
4899B0507107l144377K636249O596650J905786k257458J204460L599898j822415
4891B9225900n829909j458305J753846k515735k913858O840670J2033796L780458
4883D0916863j545852P076943J1387934j240400q007547Q431522K0637087M233616
4875H1890166p755887J8046338L1114025m3777882j66210702j96157382q0268598
$$ plain form
4933 14493102 19246228 20942410 18599980 16184528 13514318 7190597 -705883 -3834084
4925 -3834084 -1113562 2948114 6742414 12416667 18891345 22098280 22096532 22524119 23343957
4916 23343957 21444594 17803045 16552570 17480794 16779478 14540961 14369073 16620663 18959235
4907 18959235 21662853 25172764 25413872 19849157 14656910 16515331 21131883 20507107
4899 20507107 17362730 19998979 26595629 28501415 26243957 27448417 31048315 29225900
4891 29225900 23395991 21937686 23691532 21175797 18261939 25102609 37136405 40916863
4883 40916863 39371011 46447954 57835888 56595488 48587941 57019463 77656550 81890166
4875 81890166 74134279 92180617 123294642 79516760 -86693942 -282851324 -363119922
4868c63119922O4477702J04021003N1061916J0205315J9324334K9829907J3117044
4861g1082701j481467O179489J4214794O565516m43996M574509P002605j880568
4853c6351819p416827p50865M877567O32526k197192L985461Q135188K549498
4845b6536463k213351K481371P735730M497526p44383m5370J511685k571692p228108
4836b3113055n493820o9298L847455O789840Q690388N322169j940133l965228
4828i931682J658760N200552O88211m274612k169111K212930J755778r31604m65867
4819f256645J096592j61551j769213l74173J240357k9545j241998M84019J964916
4810e047241L00926j342521k93076J16675k350108l295851K52473L242629J093777
$$ plain form
4868 -363119922 -298642220 -194621217 -143559301 -133353986 -114029652 -84199745 -71082701
4861 -71082701 -72564168 -66384679 -52169885 -45604369 -46048365 -41473856 -34471251 -36351819
4853 -36351819 -43768646 -44519511 -39641944 -39009418 -41206610 -37221149 -29085961 -26536463
4845 -26536463 -28749814 -26268443 -18532713 -14035187 -14779570 -14824940 -13313255 -15884947 -23113055
4836 -23113055 -28606875 -28676173 -24828718 -18038878 -9348490 -4026321 -5966454 -9931682
4828 -9931682 -8272922 -3072370 -2384159 -6658771 -8827882 -6614952 -4859174 -5790778 -6256645
4819 -6256645 -5160053 -5321604 -7090817 -7464990 -6224633 -6254178 -7496176 -7012157 -5047241
4810 -5047241 -4746315 -6088836 -6381912 -6265237 -8615345 -11911196 -11658723 -8416094 -7322317
4801g322317j817445K97559M556484M735697J639333L03557R83200M22343j269440
4792B528971j864515k110257l440971l798391j621634n29994l766884p183742
4784b1787417m456924K986145P696729O364080K487201N6010j82742J073173K647660
4775c116085K588972M57577j070299J49639K190659K191879Q73049M64577K44861
4766D974829j930528n062842n773725l056128N98321K390487J629873k66276r48370
4757g444359N24507J982138O94875k310566l449269k179840j451022k038105j201397
4748a6873038J671922L140997J526606j97644L22787J470307J922420L052771
4740c962872M385461K339194l063968o027161l617471p82053j980300l743202
$$ plain form
4801 -7322317 -9139762 -8842203 -4285719 449978 2089311 2392868 3376068 3798411 2528971
4792 2528971 664456 -1445801 -4886772 -8685163 -10306797 -10836791 -14603675 -21787417
4784 -21787417 -26244341 -23258196 -15561467 -9197387 -6710186 -6654176 -6836918 -5763745 -3116085
4775 -3116085 -527113 -69536 -1139835 -990196 1200463 3392342 4265391 4729968 4974829
4766 4974829 3044301 -2018541 -7792266 -10848394 -10250073 -7859586 -6229713 -6495989 -7444359
4757 -7444359 -6919852 -4937714 -4242839 -6553405 -10002674 -12182514 -13633536 -15671641 -16873038
4748 -16873038 -15201116 -12060119 -10533513 -10731157 -10408370 -8938063 -7015643 -3962872
4740 -3962872 422589 2761783 -302185 -6329346 -9946817 -10728870 -12709170 -16452372
4732a6452372j489598J807198R85552j660595q9150M914057O810436L664613J70270
4723a339589l49619M14719L72924j39351o61620j368819j339792K70457J751623
4714b389067J022477o12724n11680O54018J97186j671362k249312r40346L11580
4705f189230N33572K67790m98655j674030j536687P73151K684325J696327j81110
4696d124547M75439K465343J569404k622402n945493n500216k390704J110614
4688a4962562L546205L751198J768219j083M85098J802277J566449O63246J480100
4679I9147L267535L205384J107161q81997k339463m176231n008902k467947J959613
4670e235700L729084J381810j749709k461846j091829M02233R46625N71512K49389
$$ plain form
4732 -16452372 -17941970 -16134772 -15149220 -16809815 -16898965 -11984908 -5174472 -1509859 -1339589
4723 -1339589 -1689208 -1274489 -901565 -1040916 -1702536 -3071355 -4411147 -4140690 -2389067
4714 -2389067 -1366590 -1979314 -2490994 -1836976 -1639790 -3311152 -5560464 -6500810 -6189230
4705 -6189230 -5655658 -5387868 -5886523 -7560553 -9097240 -8324089 -5639764 -3943437 -4124547
4696 -4124547 -3649108 -1183765 385639 -2236763 -8182256 -13682472 -16073176 -14962562
4688 -14962562 -11416357 -7665159 -5896940 -5898023 -5412925 -3610648 -2044199 -1380953 99147
4679 99147 3366682 6572066 7679227 6797230 4457767 281536 -4727366 -7195313 -5235700
4670 -5235700 -1506616 -124806 -1874515 -4336361 -5428190 -5025957 -4079332 -3507820 -3258431
4661c258431J237116K859580K315740j178242m148076l586789j469936j008492
4653h237530j089980R84410L627778L264988Q18135J26301J012902k341k633752
4644b129089k888966n17964j6337k918398m980638k971454Q91778L365294M376669
4635g789105M632795L291769M27223j648710j599579p10337m6169Q83692J617354
4626i41067M26827k184669l026385o82300K434981L466051J867186j400650m265174
4617d305200l369831K428981Q383807Q263093K777677j328954j089309m32629
4609A1327635k147659l108745n83871K357198J885985n36910j478475j382790
4601F332368k674362m550430l965924m94634L113532M425162L197890P71402r09481
$$ plain form
4661 -3258431 -2021315 838265 3154005 1975763 -2172313 -5759102 -7229038 -8237530
4653 -8237530 -9327510 -8343100 -4715322 -1450334 -632199 -505898 507004 504663 -2129089
4644 -2129089 -5018055 -5536019 -5552356 -8470754 -13451392 -16422846 -15531068 -12165774 -7789105
4635 -7789105 -3156310 135459 562682 -1086028 -2685607 -3395944 -3442113 -2558421 -941067
4626 -941067 -514240 -2698909 -5725294 -6407594 -3972613 -506562 1360624 -40026 -4305200
4617 -4305200 -7675031 -5246050 3137757 11400850 14178527 12849573 11760264 11327635
4609 11327635 9179976 6071231 5487360 7844558 9730543 9193633 7715158 6332368
4601 6332368 3658006 -892424 -4858348 -5352982 -2239450 2185712 5383602 6155004 5245523
4592E245523q19013j53640n67335j203859j29413J539196P64048j886128k403099
4583C86280p3129Q84482j690677m143145k842039P00003L379907M847953N280762
4574F730397L188597j047659l509536k274455p33138j718382k528845j56240K607137
4565E57876J478960k144502l659064k277053m16518J465648M012044N015782K046398
4556F079571k276910l097176n37440J024472P4410q97669q58431j366272k043162
4547c898607k13389L919833O329110M738988J342577j204584k958379m618553
4539C436996n483216m895547l352851j301194J048972K440970J529231o67042
4531g243681j691877j078682l49931J75508J566215L212017K833000J91642k096387
$$ plain form
4592 5245523 4426510 4272870 3705535 2501676 2372263 3911459 4675507 2789379 386280
4583 386280 313151 1197633 -493044 -4636189 -7478228 -6778225 -3398318 1449635 6730397
4574 6730397 9918994 8871335 5361799 3087344 2354206 635824 -1893021 -2049261 557876
4565 557876 2036836 -107666 -3766730 -6043783 -6460301 -4994653 -982609 4033173 6079571
4556 6079571 3802661 705485 168045 1192517 1266927 369258 -489173 -1855445 -3898607
4547 -3898607 -4111996 -192163 6136947 10875935 12218512 11013928 8055549 3436996
4539 3436996 -2046220 -6941767 -10294618 -11595812 -10546840 -8105870 -6576639 -7243681
4531 -7243681 -8935558 -10014240 -10364171 -10188663 -8622448 -5410431 -2577431 -2385789 -4482176
4522d482176k190998q90532N75523J821587J902862j96213k680397j758096K946122
4513d952318O521017M551483j092196m507160k756755J317059K904641M73952
4505B459723k966102l412030m62726K214825J418696j732802l731128l257904
4497i469448j774177m07816R94927J798904N66908j926832k188936J769574P134850
4488c502046Q834187M831420k009759o835423o903660l229434J039546L455602
4480d319567L484378J751629n23421j459203Q0874K249997J554308k169589m389050
4471c739644j691265L065463M320762J067974k714672l939952l135404j503329
4463h270067J028709L893433M935583K874212q87864l779758m295698k641726
$$ plain form
4522 -4482176 -6673174 -7563706 -6988183 -5166596 -3263734 -3459947 -6140344 -7898440 -4952318
4513 -4952318 1568699 6120182 5027986 520826 -2235929 -918870 1985771 2459723
4505 2459723 -506379 -3918409 -4381135 -2166310 -747614 -2480416 -6211544 -9469448
4497 -9469448 -11243625 -11651441 -10656514 -8857610 -8290702 -10217534 -12406470 -10636896 -3502046
4488 -3502046 5332141 10163561 8153802 1318379 -5585281 -8814715 -7775169 -4319567
4480 -4319567 -835189 916440 393019 -1066184 -985310 1264687 2818995 649406 -3739644
4471 -3739644 -5430909 -2365446 1955316 3023290 308618 -3631334 -6766738 -8270067
4463 -8270067 -7241358 -3347925 1587658 4461870 3574006 -205752 -4501450 -7143176
4455g143176m21327N17440J32879M26550K335043L780793K854842J241647J466345
4446E191036K227185M17790k996446l701937q62715J468925R53364L77562K196311
4437E271075L741985J324908l545170n744064l208495R90003K926948J889576
4429C646766o7566j099061j316608j765104k251345j353374Q71320J843698j10663
4420a601937k665431k277672R19893L757033M606223M055508J901024k314994
4412F379647n876744m734818K90742L663170K824448J084050J040792L74722k623360
4403B422649m375077j561550K524517K562356n81989j921879q26256j211362l648234
4394f616825l672766M76047L938208K133311k278058l053385J148962N570600
$$ plain form
4455 -7143176 -7564503 -7047063 -6914184 -6487634 -4152591 -371798 2483044 3724691 5191036
4446 5191036 7418221 7836011 4839565 1137628 274913 1743838 2697202 3074764 5271075
4437 5271075 9013060 10337968 6792798 1048734 -2159761 -1169758 1757190 3646766
4429 3646766 3579200 2480139 1163531 -601573 -2852918 -4206292 -3334972 -1491274 -1601937
4420 -1601937 -4267368 -6545040 -5625147 -1868114 2738109 6793617 8694641 6379647
4412 6379647 502903 -4231915 -3941173 -278003 2546445 3630495 4671287 5046009 2422649
4403 2422649 -1952428 -3513978 -989461 1572895 990906 -930973 -1757229 -2968591 -6616825
4394 -6616825 -10289591 -9813544 -5875336 -3742025 -6020083 -9073468 -7924506 -2353906
4386b353906N922199L009432L57792l82500k63584n14138r86875j198502j470425
4377B119493k134856k458229j594167k29087J01520o79729j025650k46256K87970
4368e858991p87956k660481l227951j628228Q45832K134705J450881R8319K9951
4359i603919J305967J833406M59051r42406j94401J514234J269372q11185j553500
4350f723381K46351J880491Q73927j607620k909179k261916n83035J255674K620573
4341g208115L050427K920782K840268K219386L73918j169732m09524J053886m80674
4332C190622m434352n509629j541371K700741K528908p49k94410J530109K245014
4323D14883J615731J791388K286055O82265k397315l772006l007688k860614m102412
$$ plain form
4386 -2353906 3568293 6577725 6935517 6553017 6289433 5775295 4788420 3589918 2119493
4377 2119493 -15363 -2473592 -4067759 -4296846 -4195326 -4875055 -5900705 -6146961 -5858991
4368 -5858991 -6646947 -9307428 -12535379 -14163607 -13317775 -11183070 -9732189 -9633870 -9603919
4359 -9603919 -8297952 -6464546 -6005495 -6947901 -7142302 -5628068 -4358696 -5169881 -6723381
4350 -6723381 -6477030 -4596539 -3722612 -5330232 -8239411 -10501327 -11084362 -9828688 -7208115
4341 -7208115 -4157688 -1236906 1603362 3822748 4196666 3026934 2617410 3671296 3190622
4332 3190622 -1243730 -6753359 -8294730 -5593989 -3065081 -3065830 -3360240 -1830131 414883
4323 414883 2030614 3822002 6108057 6790322 4393007 621001 -2386687 -5247301 -9349713
4314i349713l937698n06379M236536P096840O705311L643983j63400k080493j095857
4305D549130M92009j03942k152142k756807j531484p47527j115138r02488M47187
4296c821202J191641M48169o20932j485003k952939m263129k771210J779473N472828
4287g022304M804102J087809j593413j299271N84299J800936J274947m83144j819988
4278b666027j328107N27380J755713J138524n35836j638473j258744L66601K065479
4269a573490K500990J573353O28233M14095k31010k347182m622220m979088l418883
4260a2055202j370281O77805K650996L208467J360758j106671j675179p14289
4252i023596j20658M88386K530827M376272K961735p18715k396357j170385o11203
$$ plain form
4314 -9349713 -13287411 -13793790 -9557254 -2460414 4244897 7888880 7725480 5644987 4549130
4305 4549130 5041139 4937197 2785055 28248 -1503236 -2250763 -3365901 -4268389 -3821202
4296 -3821202 -2629561 -2181392 -2802324 -4287327 -7240266 -11503395 -14274605 -12495132 -7022304
4287 -7022304 -2218202 -1130393 -2723806 -4023077 -3438778 -1637842 -362895 -846039 -2666027
4278 -2666027 -3994134 -3466754 -1711041 -572517 -1108353 -2746826 -4005570 -3638969 -1573490
4269 -1573490 927500 2500853 3129086 3543181 3312171 964989 -3657231 -8636319 -12055202
4260 -12055202 -13425483 -12747678 -10096682 -6888215 -5527457 -6634128 -8309307 -9023596
4252 -9023596 -9144254 -8655868 -6125041 -1748769 1212966 494251 -1902106 -3072491 -3683694
4243c683694k335053l354519j459174J357435K863682L646337M014812K235518
4235C285344j463565l321708j580197K96963p55440k396862j313256R31914R62839
4226e353968l71156J29243K059641K111578l53211k668074l174887k563782j489314
4217a1673930n3373R40019J017680J452781L058065L894531K036415q11908j538428
4208a678148m5612J689628L297510N082638N000547R88895m373058n883935k432388
4199A646077J978423L787973K877691K64770l269309n901925n709901l529836
4191g856037j995713j604314o56485J112645K161743K308566K827050L318127
4183c84418J954275r13034k724564k546578j820031j338652o92229l94872j083651
$$ plain form
4243 -3683694 -6018747 -9373266 -10832440 -9475005 -6611323 -2964986 1049826 3285344
4235 3285344 1821779 -1499929 -3080126 -2783163 -3538603 -5935465 -7248721 -6316807 -5353968
4226 -5353968 -5725124 -5595881 -3536240 -1424662 -1777873 -4445947 -7620834 -10184616 -11673930
4217 -11673930 -11727303 -10787284 -9769604 -8316823 -5258758 -1364227 672188 -139720 -1678148
4208 -1678148 -1723760 -34132 3263378 8346016 13346563 14335458 9962400 4078465 1646077
4199 1646077 3624500 7412473 10290164 10554934 7285625 1383700 -4326201 -7856037
4191 -7856037 -9851750 -11456064 -12112549 -10999904 -8838161 -6529595 -3702545 -384418
4183 -384418 1569857 656823 -2067741 -4614319 -6434350 -7773002 -8465231 -8860103 -9943754
4174i943754j105150J277698L943537L444423O90747p16349r14424k769233n021048
4165a1113553l187262K294905N731509M832286K731782P97082k411461m166942
4157d491654M13286P088739M746023o556810j2235401m972050L109764J29997
4149a2768106p146285q924012j3299930l0591978m5070729k8797670J5025010
4142a31573700M7770357M3031504J7648766L196322N000950O420367M20455l789919
4134a1874898n61976M196071N248538M483782L468446M44333l339290l416037
4126a351031q8928J284758n67192j157027P30736L90695l707799n904533k541950
4117a2912271J460699L98846l015568k159032K992903N772531K232352m025949
$$ plain form
4174 -9943754 -11048904 -9771206 -5827669 -2383246 -1692499 -2408848 -3323272 -6092505 -11113553
4165 -11113553 -14300815 -12005910 -6274401 -1442115 1289667 2086749 -324712 -4491654
4157 -4491654 -4078368 3010371 7756394 1199584 -11035817 -16007867 -12898103 -12768106
4149 -12768106 -19914391 -28838403 -42138333 -72730311 -117801040 -146598710 -131573700
4142 -131573700 -83803343 -40771839 -23123073 -19926751 -14925801 -8505434 -8084979 -11874898
4134 -11874898 -12436874 -8240803 -2992265 1491517 4959963 5404296 2065006 -1351031
4126 -1351031 -1439959 -155201 -722393 -1879420 -1148684 -757989 -4465788 -10370321 -12912271
4117 -12912271 -11451572 -11052726 -14068294 -16227326 -13234423 -7461892 -5229540 -9255489
4109i255489o778452m002889Q58686L021883J369558n48883R00524M502353N859518
4100d073191L657867J150402P35629N90313j407285l577631l144492q56468K35064
4091f689792o24645j440344r63515K8697P83060J513126K010387J335648l60522
4082d407900j177900K56381K496927K449251q56205m431383m344688n20132K942422
4073g593227K913034R40364K52011Q62377M03114j316467k023105j028235l9329
4064f629463L88216J558673L023394K185653r47088k505524n24505J653269N83069
4055a214306j976323k337195o03389O48689J021689J576994J405411p02132k465347
4046d645909n34986L810456N620016K889884j512400m447268n306113m241670
$$ plain form
4109 -9255489 -16033941 -20036830 -19178144 -16156261 -14786703 -15335586 -14435062 -9932709 -4073191
4100 -4073191 -415324 735078 1470707 2061020 653735 -2923896 -6068388 -6924856 -6689792
4091 -6689792 -7314437 -8754781 -9718296 -9689599 -8906539 -7393413 -5383026 -4047378 -4407900
4082 -4407900 -5585800 -5329419 -2832492 -383241 -1239446 -5670829 -10015517 -10535649 -7593227
4073 -7593227 -4680193 -3739829 -3487818 -2625441 -2222327 -3538794 -5561899 -6590134 -6629463
4064 -6629463 -6241247 -4682574 -1659180 526473 -420615 -2926139 -3450644 -1797375 -1214306
4055 -1214306 -3190629 -5527824 -6131213 -5482524 -4460835 -2883841 -1478430 -2180562 -4645909
4046 -4645909 -5180895 -1370439 4249577 7139461 5627061 1179793 -4126320 -8367990
4038h367990j474555J210143J788677J158034J624171K449097J059558j321861
4030a874726l53862M105172O702768M644600J761486J591199J627302j301475
4022A6902464m518038l793309p91758k17645j713080j024780J690808J545262
4014H079924k277332l906082K98480N443973M715142j190979n608747m986394
4006E67985k122267p90071j047227r02417J05629P82080M42002l31291o72373
3997c967950k03580R28319K015115J977439L93835j641946k423482j485845J81304
3988d226791J779073L336650M279940L015100o05904l657385l103854J35361K317937
3979C270127J903415R05988Q65780L96362j742871l635121k703398J90696J640518
$$ plain form
4038 -8367990 -9842545 -8632402 -6843725 -5685691 -4061520 -1612423 -552865 -1874726
4030 -1874726 -2228588 1876584 8579352 13223952 14985438 16576637 18203939 16902464
4022 16902464 12384426 8591117 7799359 7581714 5868634 4843854 6534662 8079924
4014 8079924 5802592 1896510 2194990 7638963 12354105 11163126 5554379 567985
4006 567985 -1554282 -2344353 -3391580 -4293997 -4188368 -3406288 -2964286 -3295577 -3967950
3997 -3967950 -4171530 -3243211 -1228096 749343 1143178 -498768 -2922250 -4408095 -4226791
3988 -4226791 -2447718 888932 5168872 8183972 7578068 3920683 816829 952190 3270127
3979 3270127 5173542 6079530 6945310 7341672 5598801 1963680 -739718 -549022 1091496
3970A091496J79372k170424k735241j007069J415476K558753J734792J75149k78448
3961I63856N14465R25256K91520O7382J004100J103372j327493m061871l481436
3952d000849j15662J753831L83349r64438P13842L386461K954558q15721m142648
3943h47277m398267k847682j898143j741242r34497R00759K573894L298902L628350
3934b265203L847171K873393K59828j701135l32024K934862L364361n06266m071531
3925D403456k962462N04445J041413j268478j521509J283355J964188k277964
3917A166444o358193m447968J264229M063038K595472J584104L407172M814762
3909H089060L101204L72971o96682j222443l162273n193789m953170l108902j758571
$$ plain form
3970 1091496 1270868 -899556 -3634797 -4641866 -3226390 -667637 1067155 1242304 963856
3961 963856 1478321 2403577 2695097 2762479 3766579 4869951 3542458 -519413 -4000849
3952 -4000849 -4116511 -2362680 -1979331 -2943769 -2229927 1156534 4111092 3295371 -847277
3943 -847277 -5245544 -8093226 -9991369 -11732611 -12667108 -11766349 -9192455 -5893553 -2265203
3934 -2265203 1581968 4455361 4715189 3014054 2682030 5616892 8981253 8474987 4403456
3925 4403456 1440994 1945439 2986852 1718374 196865 1480220 3444408 1166444
3917 1166444 -5191749 -9639717 -8375488 -4312450 -1716978 -132874 3274298 8089060
3909 8089060 11190264 11563235 10866553 9644110 6481837 1288048 -3665122 -6774024 -8532595
3900h532595n90377J648768L233881J290051k779948l994976o58082L268466L891577
3891c223235K036053N08559m7325l11209Q942J084236J614671Q87252K75148N63531
3881C396623O7365k071023l230668j215145J544756J627489M15971J584839M293477
3872F413684M286704J177743j194629j928731m252501q046701p742737j057567
3864a2344735N764643N907363R09079k962749l576528l098935k247423p7904J991061
3855i736128J305292j302296k353852j016113L72005O57537Q83736J245135Q70501
3846i074183M97659J607246K986196J974934q40765k100118r66816J40733M19216
3837e355898J749892L992968L981667J061318q36288P74699K813551J688200r55986
$$ plain form
3900 -8532595 -9122972 -7474204 -4240323 -2950272 -5730220 -9725196 -10383278 -7114812 -3223235
3891 -3223235 -1187182 -678623 -725948 -1037157 -1028215 56021 1670692 2557944 2833092 3396623
3881 3396623 3463988 1392965 -1837703 -3052848 -1508092 119397 535368 2120207 6413684
3872 6413684 10700388 11878131 10683502 8754771 4502270 -3544431 -11287168 -12344735
3864 -12344735 -6580092 -672729 236350 -2726399 -6302927 -9401862 -11649285 -11727189 -9736128
3855 -9736128 -8430836 -9733132 -12086984 -13103097 -12731092 -12073555 -11189819 -9944684 -9074183
3846 -9074183 -8576524 -6969278 -3983082 -2008148 -2848913 -4949031 -5915847 -5775114 -5355898
3837 -5355898 -3606006 386962 4368629 5429947 4593659 5368358 8181909 9870109 8914123
3828H914123j295797L66186M53967j969962l933955l081932n72388J018536Q42681
3819G41459K34109Q04450K319165K608432K96511k761005l388574j362437L49427
3810a58463j26963j492260k042784j798337r70306P28693K011030N70072k476998
3801e756316k336487K470852O341709L677073k975028o338270m131399n93071
3793i640937P28434P01419R54961J136113R49349J212608J621460O67238j084735
3784b754090r02895J484441K443709l12307l932295m503183k570695j504691j954050
3775a4506056j396047J243883L770556M060787K714229J416612O05398n6625m13831
3766b561094m20884q86773k061959k283891J15666L793877N236483K986938o69637
$$ plain form
3828 8914123 7618326 7984512 8438479 6468517 2534562 -547370 -1119758 -101222 741459
3819 741459 975568 1780018 4099183 6707615 7004126 4243121 854547 -507890 -158463
3810 -158463 -285426 -1777686 -3820470 -5618807 -6589113 -5860420 -3849390 -3279318 -5756316
3801 -5756316 -8092803 -5621951 719758 4396831 1421803 -4916467 -9047866 -9640937
3793 -9640937 -8912503 -8211084 -7256123 -6120010 -5170661 -3958053 -2336593 -1669355 -2754090
3784 -2754090 -3656985 -2172544 271165 -41142 -3973437 -8476620 -11047315 -12552006 -14506056
3775 -14506056 -15902103 -14658220 -10887664 -6826877 -4112648 -2696036 -2090638 -2147263 -2561094
3766 -2561094 -2981978 -3868751 -5930710 -8214601 -8098935 -4305058 931425 3918363 3248726
3757C248726k788442k684508r23829K298748N809123O451696K457395l003957
3749A0864952m714962j802205J556799J938572K23146j190638j600764j225933
3741D048967l4012J099904N57584j126254j074811J429757K933701O34616l267414
3732E202038m802436l588637j816926J05231L027734N312172L780065j381453
3724E837788n924651o331531l001375J336788M023318L419940P8779k790192k267155
3715e618291P10042K713990K407025J329809N52428l77670j009346J85218K684594
3706C577799L599868J742110n59743j039142m90569o74454j419372j604069j307123
3697A825305j191410j026962l71265L37271O36014R70671J702462K245301K137139
$$ plain form
3757 3248726 460284 -2224224 -3148053 -849305 4959818 11411514 13868909 10864952
3749 10864952 6149990 4347785 5904584 7843156 8066302 6875664 5274900 4048967
3741 4048967 4014955 5114859 5672443 4546189 3471378 4901135 7834836 8469452 5202038
3732 5202038 399602 -3189035 -5005961 -4900730 -1872996 3439176 7219241 5837788
3724 5837788 -86863 -6418394 -9419769 -8082981 -4059663 -639723 -560944 -3351136 -5618291
3715 -5618291 -4908249 -2194259 212766 1542575 2095003 1717333 707987 893205 3577799
3706 3577799 7177667 8919777 8360034 7320892 6830323 6155869 4736497 3132428 1825305
3697 1825305 633895 -393067 -764332 -427061 208953 1179624 2882086 5127387 7264526
3688G264526J799242J327710p4669k315161l494969k313991k93856Q5440j250407
3679G33865k156119j454114k65954l096m29052m05521K35273N19395l5056n70078
3669c830457l73006m46332j992603l449857j467479L953618P752076N730577M08897
3660F285434k235255p12954J107180O95875j6484P54269J177446o57404k912136
3651C485971k605775k8335K045819K089605N77723j592973l317688l182442j216649
3642c744744L86201K17739p506J715104L821894L008836o29707l203805k087934
3633e23922R68395K461396J088008j647500l413115k889837n92858J510879J796726
3624a241828P07789J35221R38191J800699R77638j299056k805737j841016O64285
$$ plain form
3688 7264526 9063768 10391478 10316809 8001648 4506679 2192688 1898832 1984272 733865
3679 733865 -1422254 -2876368 -3142322 -3145418 -3574470 -3979991 -3744718 -3225323 -3260379 -3830457
3669 -3830457 -4203463 -4649795 -6642398 -10092255 -11559734 -7606116 145960 5876537 6285434
3660 6285434 4050179 3337225 4444405 5140280 5123796 5878065 7055511 6398107 3485971
3651 3485971 880196 851861 2897680 4987285 5565008 3972035 654347 -2528095 -3744744
3642 -3744744 -3358543 -3140804 -3148310 -1433206 2388688 5397524 4767817 1564012 -523922
3633 -523922 444473 2905869 3993877 2346377 -1066738 -3956575 -4549433 -3038554 -1241828
3624 -1241828 -534039 -398818 539373 2340072 3317710 2018654 -787083 -2628099 -1963814
3615a963814K109734J249077o03045j717373k069467k251652j564326Q26125L560419
3606b424322M316693L188867K327748K126995O71471k316526m084059k952458
3598H54409j088417j124250k258109j993151N0753K339039L864692M136233K239962
3589G021161j568744m482069l936410j134510M86585k63236j454484j092869R34203
3580e490373L473067M886863L864858J179547k19113J254305L178958K207659
3572A4335771j187177l606581l628524k893266k495986j413183P85295K283622
3564B179971J395467r95944k481375j776784J35941R25113q87913l978488n105225
3555a0589237k864998L95605J652115R62895M45926P57422Q88868O48635Q92675
$$ plain form
3615 -1963814 145920 1394997 791952 -925421 -2994888 -5246540 -6810866 -5984741 -2424322
3606 -2424322 1892371 5081238 7408986 9535981 10207452 7890926 3806867 854409
3598 854409 -234008 -1358258 -3616367 -5609518 -5558765 -3219726 644966 4781199 7021161
3589 7021161 5452417 970348 -2966062 -4100572 -3613987 -3877223 -5331707 -6424576 -5490373
3580 -5490373 -2017306 2869557 6734415 7913962 7694849 8949154 12128112 14335771
3572 14335771 13148594 9542013 5913489 3020223 524237 -888946 -103651 2179971
3564 2179971 3575438 2579494 98119 -1678665 -1542724 -617611 -1505524 -5484012 -10589237
3555 -10589237 -13454235 -13058630 -11406515 -10443620 -9997694 -9240272 -8351404 -7702769 -6810094
3546f810094J652317K167517K373899K449034J692622l1494q82189L51503J504141
3537D467256O2184k291391k063105J735n1513k370703k525330J115001M359226
3528G03360L764680J587641J181880J535369J19189k045203k332285j322630j536022
3519A655979k743684k499884o39322N05587L51889J120423L919395O447358N814433
3510A3932174K034340k284207m683398m523832k603478O287K473815L768048K625935
3501A0745684r35374m441139m922446k371090K04680N11464p78398j824116j809795
3492e620530p71356P85629J348041l86530k836668k491370J169576M278167L828534
3483f96507J620961O49284L57704j162049k520847q78053K549106L240682o6744
$$ plain form
3546 -6810094 -5157777 -2990260 -616361 1832673 3525295 3493801 2611612 2963115 4467256
3537 4467256 4529440 2238049 174944 176679 125166 -2245537 -4770867 -3655866 703360
3528 703360 4468040 6055681 7237561 8772930 8892119 6846916 4514631 3192001 1655979
3519 1655979 -1087705 -3587589 -4226911 -3721324 -3369435 -2249012 1670383 8117741 13932174
3510 13932174 15966514 13682307 8998909 4475077 1871599 1877886 4351701 8119749 10745684
3501 10745684 9810310 5369171 446725 -1924365 -1719685 -1208221 -1986619 -3810735 -5620530
3492 -5620530 -6391886 -5606257 -4258216 -4644746 -7481414 -9972784 -8803208 -4525041 -696507
3483 -696507 924454 1573738 1931442 769393 -1751454 -2629507 -80401 3160281 3093537
3474C093537l392525l065969r3846K352644L088462K773548J709948l9049j363788
3465E062962r36012P60841J506972j83434l134172m392578k196576J974037M696019
3456C158059M097409J505707o13701j445587j845252k429379k804607k424355
3448b801706j321946n7135O25886L89113j91297k47586J53239L12781M50511J458350
3438a229790K767426K395182P8026j621627q12938R42193J169226J30021k58422
3429C559297K27569L18996j38829k51616j32604n54246j033310n42489K85538
3420A738306n0736j274573j775207j371649j188375j004589N19342K741043K978764
3411A312326M39034k167991k171379l25277O42938k76113j296815j30066L013024
$$ plain form
3474 3093537 -298988 -3364957 -3458803 -1106159 1982303 4755851 6465799 6426750 5062962
3465 5062962 4126950 4887791 6394763 6211329 3077157 -1315421 -3511997 -1537960 3158059
3456 3158059 7255468 8761175 8147474 6701887 4856635 2427256 -377351 -2801706
3448 -2801706 -4123652 -4180787 -3554901 -3165788 -3357085 -3604671 -3451432 -3138651 -2688140 -1229790
3438 -1229790 1537636 3932818 4010844 2389217 1576279 2518472 3687698 3817719 3559297
3429 3559297 3786866 4105862 3967033 3715417 3582813 3028567 1995257 1452768 1738306
3420 1738306 1687570 412997 -1362210 -2733859 -3922234 -4926823 -4407481 -1666438 1312326
3411 1312326 1751360 -416631 -2588010 -2913287 -2270349 -2546462 -3843277 -3973343 -960319
3402i60319M815027K200594l223529n868962k828750K127912L606369J590670
3394A459012m6780k89213j512996l822769m092719j575937L81852p3651m75588
3385a0048789J023836K184745J044897j25523J218385L158565K447042l880p22726
3376A76552Q78255K344985K274129J298226Q2043p35723M4778J909031J557234
3367I829510k422312n755713l738443J266409K825141J37117j319828O68251J497087
3358B987219j798117m720827k371572K354916L142001j07405j885629m7278J720223
3349g26469P69355n24307M54794K054817J516598k84516n72685N23288L05801
3340C516676j844470l356974k577098j274439j607053k616238j925523J65812
$$ plain form
3402 -960319 3854708 6055302 2831773 -3037189 -5865939 -3738027 -131658 1459012
3394 1459012 1412232 1123019 -389977 -4212746 -8305465 -9881402 -9499550 -9573201 -10048789
3385 -10048789 -9024953 -6840208 -5795311 -5920834 -4702449 -1543884 903158 899278 176552
3376 176552 1054807 3399792 5673921 6972147 7054190 6318467 6363245 8272276 9829510
3367 9829510 7407198 1651485 -2086958 -820549 2004592 2141709 821881 1490132 2987219
3358 2987219 1189102 -3531725 -5903297 -3548381 -406380 -513785 -2399414 -2446692 -726469
3349 -726469 42886 -481421 -26627 2028190 3544788 3260272 2687587 3210875 3516676
3340 3516676 1672206 -1684768 -4261866 -5536305 -7143358 -9759596 -11685119 -11519307
3332a1519307R52396j77883j57505L338268P710849Q065389L451950j913208l955209
3323E795740l005212j772331j239052o04757J16507J09773m7714J061098K616667
3314C030719J833660j518669l573948j525669J870169J984803r03336k250341
3306a052612l51151J335953P8578j836437j201997P69040O85530j190696j168692
3297c932484K141266N619546N723331K401932j677299l929047l413918j320172
3289A613155l10153j888571m270181m449929k253633k31182M59880J344399L133259
3280f852956L827979J913120q87650j954706j065844M36634J965398L181062K919245
3271C482282J009580k70513Q26323K260619Q53548k570924l923462j647969J414839
$$ plain form
3332 -11519307 -10566911 -10744794 -10902299 -7564031 146818 8212207 11664157 9750949 5795740
3323 5795740 2790528 1018197 -220855 -825612 -709105 -599332 -647046 414052 3030719
3314 3030719 4864379 3345710 -228238 -1753907 116262 2101065 1197729 -1052612
3306 -1052612 -1403763 -67810 10768 -1825669 -3027666 -2258626 -1573096 -2763792 -3932484
3297 -3932484 -1791218 3828328 9551659 11953591 10276292 6347245 2933327 1613155
3289 1613155 1303002 -585569 -4855750 -9305679 -11559312 -11790494 -11330614 -9986215 -6852956
3280 -6852956 -3024977 -1111857 -1999507 -3954213 -5020057 -4583423 -2618025 563037 3482282
3271 3482282 4491862 4221349 5047672 7308291 8161839 5590915 1667453 19484 1434323
3262A434323K451326J909577J334037Q41695K34830P7904j09887k291216o245322
3253c62733p733216l493902L351986O483038M429008J688734J557410J966238
3245G886563J37419k419315k658482j115066n79444j217587r17087K29642r8429
3236g51786j855506k155690l42186N59115q56895j699147j271J324531n36393
3227f315228k760877j106369K681687L124678m40082l149731k380989o92290j94091
3218a1233292N56665K247922K525846O77401M4386K471941M335294J986152k106822
3209A505493k987941o06101R03644j16000j232309m40977J431594K825615L034528
3200D317546J800318k82720j415119q75012p68648k989493n478898m562330l55247
$$ plain form
3262 1434323 3885649 5795226 7129263 7970958 8205788 8283692 8173805 5882589 -362733
3253 -362733 -8095949 -11589851 -8237865 -1754827 2674181 4362915 5920325 7886563
3245 7886563 8023982 5604667 2946185 1831119 1251675 34088 -882999 -653357 -751786
3236 -751786 -2607292 -4762982 -5105168 -4546053 -5402948 -7102095 -7103366 -5778835 -6315228
3227 -6315228 -9076105 -10182474 -7500787 -4376109 -4816191 -7965922 -10346911 -11039201 -11233292
3218 -11233292 -10676627 -8428705 -5902859 -5225458 -5181072 -2709131 1626163 3612315 1505493
3209 1505493 -1482448 -2088549 -1184905 -1300905 -2533214 -2974191 -1542597 1283018 4317546
3200 4317546 6117864 5835144 4420025 3545013 2776365 -213128 -5692026 -10254356 -10609603
3191a0609603L327284M116439K985627J213177j058811k768025j855935J409116
3183c240731L597540K163033j320607l138712j534592J837330L716657K347493
3175D427411n66429j566740K02802J792590Q94119o89886m81730M8345j901803
3166B158679m770567m213233k9376L157201K623627N51352n89537j307758k270212
3157d689824k269282r53259j25662m61069j65469J402989K162670J110382J49296
3148c839228K41928l72105j827901q16208L600124O466823L535310j923851l641472
3139A423420j114207J108886R19613J38531l57593j614044k844374j709430J086666
3130b962532J966413J72614q65106Q11721K520391J336081j523950k922942k001943
$$ plain form
3191 -10609603 -7282319 -3165880 -180253 1032924 -25887 -2793912 -4649847 -3240731
3183 -3240731 356809 2519842 1199235 -1939477 -3474069 -1636739 2079918 4427411
3175 4427411 3860982 2294242 2497044 4289634 5183753 4493867 4012137 4060482 2158679
3166 2158679 -2611888 -6825121 -6854497 -3697296 -1073669 -522317 -1111854 -2419612 -4689824
3157 -4689824 -6959106 -7912365 -8038027 -8499096 -8664565 -7261576 -5098906 -3988524 -3839228
3148 -3839228 -3597300 -3969405 -5797306 -6613514 -3013390 3453433 6988743 5064892 1423420
3139 1423420 309213 1418099 2337712 2476243 2118650 504606 -2339768 -4049198 -2962532
3130 -2962532 -996119 -823505 -1688611 -876890 1643501 2979582 1455632 -1467310 -3469253
3121c469253n2379J841325K941134K204568l01199k240046j284321J762048L736067
3112E137944K997355J136239M11467O98908J51116j570233k437962j205318J63829
3103E483345r06202l514795m375819k760120j305043j415750j283964J92552J136607
3094h749189N60937R08841L580296N321584L180796O6552K83869J896261k49381
3085F800566m987619n405484J13098M253923J122498n256558o822005k069093
3077a2250674L424210M717885J983460j476657k685691j032963J326071J770387
3069d223972O24343N65185K032167K041487r20863l849781l462931q95891O34899
3060g455357O25907O47325P69303J6711q75877n19002J74374o87075k314965k133953
$$ plain form
3121 -3469253 -3521632 -1680307 1260827 3465395 3164196 924150 -360171 1401877 5137944
3112 5137944 8135299 9271538 9683005 10381913 10533029 8962796 6524834 5319516 5483345
3103 5483345 4577143 1062348 -3313471 -6073591 -7378634 -8794384 -10078348 -9885796 -8749189
3094 -8749189 -8188252 -7279411 -3699115 1622469 4803265 4869817 5153686 7049947 6800566
3085 6800566 1812947 -3592537 -3479439 774484 1896982 -3359576 -10181581 -12250674
3077 -12250674 -8826464 -4108579 -2125119 -3601776 -6287467 -7320430 -5994359 -4223972
3069 -4223972 -3599629 -3034444 -1002277 1039210 118347 -3731434 -7194365 -8090256 -7455357
3060 -7455357 -6829450 -6182125 -5412822 -5396111 -6271988 -6790990 -6616616 -7303691 -9618656 -11752609
3050a1752609K914J672452J845825J789019J859277P66648j269385j886950l65577
3041g338386Q65888J34872o42338R27831L822052N075616L732461J217486j066889
3032F728593k372028j779196Q23076L213908K593076q03417l620748l336034p51337
3023F95893J832563L203314L199445J787765l57808j471959n87008P18234M8676
3014I069115k565583m732547m971496m183960l464865k305081j17748J899432
3006a1372733K114872J007019P01923K016217L301058K588110M4982k170470k216196
2997c985218m99829Q07343M03919l76323N99697K828099L275695N73699k723034
2988I04048l463500j897000m54319J28431J000589K199433K168680M75374j212467
$$ plain form
3050 -11752609 -11749695 -10077243 -8231418 -6442399 -4583122 -3816474 -5085859 -6972809 -7338386
3041 -7338386 -6472498 -6337626 -6979964 -6052133 -2230081 2845535 6577996 7795482 6728593
3032 6728593 4356565 2577369 3400445 6614353 9207429 8404012 4783264 1447230 695893
3023 695893 2528456 5731770 8931215 10718980 10361172 8889213 8302205 9020439 9069115
3014 9069115 6503532 1770985 -3200511 -7384471 -10849336 -13154417 -13272165 -11372733
3006 -11372733 -9257861 -8250842 -7548919 -5532702 -2231644 356466 401448 -1769022 -3985218
2997 -3985218 -4485047 -3677704 -3273785 -3650108 -3050411 -222312 3053383 3627082 904048
2988 904048 -2559452 -4456452 -4910771 -4782340 -3781751 -1582318 586362 1061736 -150731
2979a50731j404539m06739P04004J294116J144282N19791L75354J358034K754849
2970F188421L362960K691036L70519l894029p995191p441938j044252N408699
2962b353775N547055J100597j050273M26408K18614l424194m975882j132506L041230
2953b602726K348102r1929J193683M226938K977578k162704m742669k241532J032804
2944f2455J350499j4757p94420j086840j152614L7785K331600L588440K695811
2935F893049Q83911o88518k134742l119655k488741k41820K138518L457473L184633
2926G884108R07328k302960l316494q05124J717876M09474k799793l142261q21637
2917b269483l40325k412987k740182L60471L273880L644077L536817L811629J556519
$$ plain form
2979 -150731 -1555270 -1962009 -1258005 36111 1180393 1700184 2075538 3433572 6188421
2970 6188421 9551381 12242417 12612936 8718907 723716 -6718222 -7762474 -2353775
2962 -2353775 3193280 4293877 3243604 3670012 3888626 464432 -4511450 -5643956 -2602726
2953 -2602726 -254624 -346553 847130 5074068 8051646 5888942 1146273 -1095259 -62455
2944 -62455 1288044 1273287 478867 -607973 -1760587 -1722802 608798 4197238 6893049
2935 6893049 7776960 7088442 4953700 1834045 -654696 -896516 1242002 4699475 7884108
2926 7884108 8791436 6488476 3171982 2366858 4084734 4494208 1694415 -1447846 -2269483
2917 -2269483 -2609808 -5022795 -7762977 -7402506 -4128626 -484549 3052268 6863897 8420416
2908H420416l527581o060950k687105K125482K729434L57450n53787p4822r40657
2899b12120k042313j48758L464092M197994J495724l74312Q05960K171740N69404
2890I927411l047031n074493l148146J536627M559817K190070l634143o558365
2882c248253l971711n75838q04173j828689Q89198M805907L897847j091744l590459
2873e517915j776741m42573j547747q70497L347515N702841J845981m161330n496530
2864h916996j680971K403863L665309K888734J766522J248819J384165O30893
2856C390338k635218o341678n630039K26395N404817N078008J844099Q51605J904477
2847D092804J285185j059908j765651m34166l34817k523590l977490k520446J96075
$$ plain form
2908 8420416 4892835 -1168115 -3855220 -1729738 999696 1357146 803359 728537 -212120
2899 -212120 -2254433 -2403191 1060901 5258895 6754619 6380307 7186267 9358007 9927411
2890 9927411 6880380 1805887 -1342259 194368 4754185 6944255 3310112 -3248253
2882 -3248253 -7219964 -7795802 -8599975 -10428664 -9539466 -4733559 -835712 -1927456 -5517915
2873 -5517915 -7294656 -7737229 -9284976 -10155473 -6807958 -1105117 740864 -3420466 -8916996
2864 -8916996 -10597967 -8194104 -4528795 -1640061 126461 1375280 2759445 3390338
2856 3390338 755120 -5586558 -11216597 -10990202 -5585385 -507377 1336722 2188327 4092804
2847 4092804 5377989 4318081 2552430 2118264 1783447 -740143 -4717633 -7238079 -7042004
2838g042004J692566J511818K28451j436129j696105J101590N195514O111709
2830E667410K211182k750035m271625k399267n72748p48640j770941j862312p93517
2821g290493N03721J184174R20404k20228j731657k597752j908837j01676Q87412
2812a0354932j52200j460297K7146M279374P390465O381423K884885L44076n66002
2803H773938j346719k142142j873253j022966j083358j574500p97950N44208m6624
2794e69366k210709k330267R37057M047176L395297M0110k477872k753050j793081
2785c714705o61084q3547p96330k171437k018545K25978J850497P81326o65816
2776g253663R12661M212045M481034M58411l583784l623084p38964J216032N08115
$$ plain form
2838 -7042004 -5349438 -3837620 -3609169 -5045298 -6741403 -5639813 -444299 5667410
2830 5667410 7878592 5128557 856932 -1542335 -2115083 -2863723 -4634664 -6496976 -7290493
2821 -7290493 -6786772 -5602598 -4682194 -4902422 -6634079 -9231831 -11140668 -11242344 -10354932
2812 -10354932 -10507132 -11967429 -11940283 -7660909 -270444 6110979 8995864 9339940 8773938
2803 8773938 7427219 5285077 3411824 2388858 1305500 -269000 -1066950 -522742 -569366
2794 -569366 -2780075 -5110342 -4173285 -126109 3269188 3309298 831426 -1921624 -3714705
2785 -3714705 -4375789 -4459336 -5255666 -7427103 -9445648 -9219670 -7369173 -6587847 -7253663
2776 -7253663 -6341002 -2128957 2352077 2810488 -773296 -4396380 -5135344 -3919312 -3411197
2767c411197j523690k730771j753574J434936M969668N814569K600380k390017
2759C010304n154545l955579p09110J548546J821205J406937J465286J281752
2751G14796m00770k852278l551248j340997J888978L579291L356213K259160M61436
2742D114581k123979l823449k568162O07120K170099R52477k33812Q47631K308525
2733B251031J362092r67337j347757O19707J777032J53004k344242k878816j402030
2724b777316j54654n20506j533947j238893J014601L625118M246372K449778K42089
2715E352642o81166j161839k670123m130060k977169O56474L275825K336849p89202
2706g87769l149082l598815k648187q37449J009017J476057M50375L9280J569599
$$ plain form
2767 -3411197 -4934887 -7665658 -9419232 -7984296 -3014628 2799941 5400321 3010304
2759 3010304 -2144241 -6099820 -6808930 -5260384 -3439179 -2032242 -566956 714796
2751 714796 314026 -2538252 -6089500 -7430497 -5541519 -1962228 1393985 3653145 4114581
2742 4114581 1990602 -1832847 -4401009 -3793889 -1623790 -671313 -905125 -57494 2251031
2733 2251031 3613123 2645786 1298029 1917736 3694768 3847772 1503530 -1375286 -2777316
2724 -2777316 -2931970 -3452476 -4986423 -6225316 -5210715 -1585597 2660775 5110553 5352642
2715 5352642 4671476 3509637 839514 -3290546 -6267715 -5611241 -2335416 1433 -787769
2706 -787769 -3936851 -7535666 -10183853 -11021302 -10012285 -8536228 -8085853 -8046573 -6476974
2697f476974K960003J602009j161817j566136Q65898K575823J543394J40925P68262
2688A251387J750140L40899k307723k588182n1166J787197O59729j293198r27653
2679a378570J365818K462284Q96525j520432k494821j998724j470401j398241
2671e536562r82879J73129J428162K402249L639849N233034N803632L957987K27819
2662A6346420l321968m903486l822632o52755K297506K175868q84967k879302
2654D354684j094593J375438j2540l526234l063539J804612L920323o15979n672098
2645b529926m066042J475731K892645p22075k728811o0661K947282K856333K085903
2636B150379K938816K916276o6193k766276j638511Q48166j9798l427634m182456
$$ plain form
2697 -6476974 -3516971 -1914962 -3076779 -4642915 -3777017 -1201194 342200 483125 1251387
2688 1251387 3001527 3342426 1034703 -1553479 -1604645 182552 842281 -450917 -1378570
2679 -1378570 -12752 2449532 3346057 1825625 -669196 -2667920 -4138321 -5536562
2671 -5536562 -6519441 -6346312 -4918150 -2515901 1123948 6356982 12160614 16118601 16346420
2662 16346420 13024452 8120966 4298334 3645579 5943085 8118953 7233986 4354684
2654 4354684 3260091 4635529 4622989 1096755 -1966784 -162172 3758151 3142172 -2529926
2645 -2529926 -6595968 -5120237 -2227592 -2949667 -5678478 -5739139 -2791857 64476 2150379
2636 2150379 5089195 8005471 7939278 5173002 3534491 4382657 4362859 935225 -3247231
2627c247231p36797K671208K287315m88398j839728m13291J879979K601387J281327
2618C995771m66428r80336m11290L9848K13846P07402Q30187o14189k299389j369823
2608c54401J611547K479887J9559j509674O49635K606831J08329l853367l524945
2599a766599J95561J451474q72904k166570o76977N7112j460789j799466N85134
2590f454024J933771j68945k262317q95394J811571K534026K212309K746952K406621
2581C864570l88331k294070K03037L921542K969942k021426m793058k939290m93624
2572a970708p16150j950527j928749j266129q28990K71984K062985K544703J101401
2563b680180K7091P77636J588612Q25611o8405O08185J369361k70397l561208
$$ plain form
2627 -3247231 -3984028 -1312820 974495 486097 -1353631 -1766922 113057 2714444 3995771
2618 3995771 3529343 2549007 2137717 2177565 2391411 3098813 3929000 3314811 1015422 -354401
2608 -354401 1257146 3737033 3756592 2246918 2896553 5503384 5611713 1758346 -1766599
2599 -1766599 -1571038 -119564 -992468 -3159038 -3836015 -3778903 -5239692 -7039158 -6454024
2590 -6454024 -4520253 -4689198 -6951515 -7846909 -6035338 -3501312 -1289003 1457949 3864570
2581 3864570 3476239 1182169 1385206 5306748 8276690 6255264 1462206 -1477084 -1970708
2572 -1970708 -2686858 -4637385 -6566134 -7832263 -8661253 -8389269 -6326284 -3781581 -2680180
2563 -2680180 -2653089 -1875453 -286841 538770 470365 1078550 2447911 2177514 -1383694
2554a383694n124289l252542L29316K698945K383701J63214j665727j122715J569701
2545e404090M129487M493587K526188l35118k146834j430271J449470L888444
2537G170863L592772J428494j05246q79804k811217n388815n236414j653882J078186
2528b805063k91761k754605j559130K249591L364487M41616k005113o33946K103054
2519a890870K306413K16852j302927j602829k315932l540186l144052k63927K918479
2510h618979L878304K600028P26994p11819j419803q85026R14134K516497K538460
2501A538790J800270J872903J961134N9783k714872k669916L13765J337387k002142
2492A497102m756396j821343L384090L625814o82781k121971J579639L981238
$$ plain form
2554 -1383694 -6507983 -9760525 -9431209 -6732264 -4348563 -4185349 -5851076 -6973791 -5404090
2545 -5404090 -1274603 3218984 5745172 5410054 3263220 1832949 3282419 7170863
2537 7170863 10763635 12192129 12086883 11207079 8395862 3007047 -2229367 -3883249 -2805063
2528 -2805063 -3096824 -5851429 -7410559 -5160968 -1796481 -1354865 -3359978 -3993924 -1890870
2519 -1890870 415543 632395 -670532 -2273361 -4589293 -8129479 -11273531 -11537458 -8618979
2510 -8618979 -4740675 -2140647 -1413653 -2125472 -3545275 -4430301 -3516167 -999670 1538790
2501 1538790 3339060 5211963 7173097 7232880 4518008 1848092 2161857 3499244 1497102
2492 1497102 -3259294 -5080637 -1696547 1929267 1246486 -875485 704154 4685392
2484D685392Q80285k766870j420869J896028J136825k725501m046502j935290
2476d296502l02773r7976J438591M042452L834393N59195q40819J898179M269142
2467A0503882J810200l232594n526084l890975j491679p92099j410374j871674
2459e901397j104592J112331L596200M403488L055456J068869m04877j829436
2451C996042l283272l204595o82921K531041L904795K901961P21199j387417k357654
2442C139179j396221O67533J456982P31j640984j261386K60097M46437j091359
2433E81009k502813k648207k168331j665713n84739J574353L882878M398562J992526
2424B859525j997420m225643k514166J388550L597742K781048J188435N85934
$$ plain form
2484 4685392 5565677 2798807 1377938 3273966 4410791 1685290 -2361212 -4296502
2476 -4296502 -4599275 -4697251 -3258660 783792 4618185 5177380 4336561 6234740 10503882
2467 10503882 12314082 9081488 3555404 -335571 -1827250 -2619349 -4029723 -5901397
2459 -5901397 -7005989 -5893658 -2297458 2106030 5161486 6230355 5825478 3996042
2451 3996042 712770 -2491825 -3174746 -643705 3261090 6163051 6884250 5496833 3139179
2442 3139179 1742958 2410491 3867473 3868204 2227220 965834 1225931 1672368 581009
2433 581009 -1921804 -4570011 -6738342 -8404055 -8988794 -7414441 -3531563 866999 2859525
2424 2859525 862105 -3363538 -5877704 -4489154 -891412 1889636 3078071 3664005
2416C664005k44460k484548m340332l638960j512116n54833n53089P03032K907618
2407f053683L052869K56353k340757j814803P33618K210297J676923P15016O49887
2398i14280J144270J302075Q65518J51201m22699n35029j93121J8120o37415j930004
2388a151364k297215m70519K376054L266088J094584j431168j108952J283827
2380A561335K073721P7927j781916r70712J210547K163416J682949J086313M56821
2371G560401r00613k410690k854236k296447j533057m13929J460056L139858L245898
2362D997241J885869K15796r92284j058401P29267L182436L135626k23239l000894
2353H871417j812602O55221m17827l915203m026613M60612L818877J917314k044449
$$ plain form
2416 3664005 3419545 934997 -3405335 -7044295 -8556411 -9111244 -9664333 -8961301 -6053683
2407 -6053683 -3000814 -2744461 -5085218 -6900021 -6166403 -3956106 -2279183 -1564167 -914280
2398 -914280 229990 1532065 2397583 2548784 2126085 1591056 1397935 1416055 778640 -1151364
2388 -1151364 -3448579 -3919098 -1543044 1723044 2817628 1386460 277508 1561335
2380 1561335 3635056 3712983 1931067 960355 2170902 4334318 6017267 7103580 7560401
2371 7560401 6659788 4249098 1394862 -901585 -2434642 -2848571 -1388515 1751343 4997241
2362 4997241 6883110 7098906 6106622 5048221 5777488 8959924 12095550 11872311 8871417
2353 8871417 7058815 7714036 7296209 3381006 -645607 -184995 3633882 5551196 3506747
2344C506747l044430j210970Q4618j94348p40947j126199j481756o35220K112579
2335b729926M551712L984958J211599p03070q28989p54558j247456j512521j588437
2326C83312k531887l816794l179742K9538L303183L776647J301061j845841l160549
2317e741072j560662J814224M060391L065253N7217j565597k62478K149702L380176
2308E397154L279595K589953Q95074k216183m937804m596237j333917J568589
2300F46224J698601J53528p25004n44803k49509K00921J244889J691711J19837
2291D236395j796089o15949L254127M628962M52940n124794n768648j288516K587864
2282E66292J955883j286066l197590k325784J18087K017688J617396r04591k830631
$$ plain form
2344 3506747 462317 -748653 -664035 -858383 -1599330 -2725529 -4207285 -4842505 -2729926
2335 -2729926 1821786 5806744 7018343 6315273 5486284 4731726 3484270 1971749 383312
2326 383312 -2148575 -5965369 -9145111 -9115573 -5812390 -2035743 -734682 -2580523 -5741072
2317 -5741072 -7301734 -5487510 -1427119 1638134 1695351 129754 -132724 2016978 5397154
2308 5397154 8676749 11266702 12161776 9945593 5007789 411552 -922365 646224
2300 646224 2344825 2498353 1773349 1228546 979037 1179958 2424847 4116558 4236395
2291 4236395 2440306 1824357 5078484 9707446 10160386 5035592 -733056 -2021572 566292
2282 566292 2522175 1236109 -1961481 -4287265 -4169178 -2151490 -534094 -1438685 -4269316
2273d269316j839043O52566J464542N34965O68476K524565L631579K977722K568888
2264H914944L151662K468091k72791k162657j448559r02756l080558n479035m303305
$$ plain form
2273 -4269316 -6108359 -5455793 -3991251 -3456286 -2787810 -263245 3368334 6346056 8914944
2264 8914944 12066606 14534697 14261906 12099249 10650690 9747934 6667376 1188341 -3114964
$$ [...]
##END NTUPLES=NMR SPECTRUM
##END=
