##TITLE=31Pdec_DE-71R_oil2
 CDCl3, 64 sc
 29.10.2024
##JCAMPDX= 6.0         $$ Bruker NMR JCAMP-DX V2.0
##DATA TYPE= NMR SPECTRUM
##DATA CLASS= NTUPLES
##ORIGIN= UXNMR, Bruker Analytische Messtechnik GmbH
##OWNER= root
$$ XWIN-NMR		Version 3.5
$$ Tue Oct 29 16:16:02 2024 Russian Standard Time (UT+4h)  she@DPX200
##.OBSERVE FREQUENCY= 81.013821
##.OBSERVE NUCLEUS= ^31P
##.ACQUISITION MODE= SIMULTANEOUS
##.ACQUISITION SCHEME= undefined
##.AVERAGES= 64
##.DIGITISER RES= 17
##SPECTROMETER/DATA SYSTEM= spect
##.PULSE SEQUENCE= zgpg30
##.SOLVENT NAME= CDCl3
##.SHIFT REFERENCE= (INTERNAL, CDCl3, 0, 198.062)
##AUDIT TRAIL= $$ (NUMBER, WHEN, WHO, WHERE, WHAT)
$$ ##TITLE= Audit trail, XWIN-NMR		Version 3.5
$$ ##JCAMPDX= 5.01
$$ ##ORIGIN= Bruker BioSpin GmbH
$$ ##OWNER= she
$$ F:/spectra/data/she/nmr/P31/2/pdata/1/auditp.txt
$$ ##AUDIT TRAIL=  $$ (NUMBER, WHEN, WHO, WHERE, WHAT)
(   1,<2024-10-29 16:13:32.46 +0400>,<she>,<DPX200>,
      <created by zg, POWCHK disabled, PULCHK disabled
       configuration hash MD5:
       00 E9 B6 7A A2 85 ED C7 34 08 36 98 17 FE 4E 26
       data hash MD5: 32K
       D0 C2 8B AE A6 D9 9B F6 A5 EE D4 CE 20 00 2D 6A>)
(   2,<2024-10-29 16:13:34.76 +0400>,<she>,<DPX200>,
      <Start of raw data processing
       efp BC_mod = 2 LB = 1.5 FT_mod = 6 PKNL = 1 PHC0 = 2644.146 PHC1 = 105.688 SI = 64K 
       data hash MD5: 64K
       AB 1C E2 B8 17 3B D6 6A FC 5B 98 41 39 70 22 0A>)
(   3,<2024-10-29 16:14:19.51 +0400>,<she>,<DPX200>,
      <pk PHC0 = -28.08798 PHC1 = 108.0001 
       data hash MD5: 64K
       4E 97 BE 43 9D F5 CE E1 55 97 50 10 09 9C 64 17>)
(   4,<2024-10-29 16:14:43.89 +0400>,<she>,<DPX200>,
      <pk PHC0 = -158.6184 PHC1 = 391.0003 
       data hash MD5: 64K
       F2 62 D1 4E E2 99 2A FB B6 CB 78 21 88 B6 CA 09>)
(   5,<2024-10-29 16:15:27.40 +0400>,<she>,<DPX200>,
      <pk PHC0 = -66.15886 PHC1 = 79.40001 
       data hash MD5: 64K
       CB 6A 06 4C 52 2E C6 CC BC E1 AD E4 D4 00 00 7A>)
$$ ##END=
$$ 
$$ hash MD5
$$ 2B 26 2A 72 60 E2 5E 19 61 7C F3 2D 73 EA 3F B5
##$RELAX= 
##$RELAX= 
##$RELAX= 
##$RELAX= 
##$RELAX= 
##$RELAX= 
##$RELAX= 
##$RELAX= 
$$ Bruker specific parameters
$$ --------------------------
##$DU= <F:/spectra>
##$EXPNO= 2
##$NAME= <P31>
##$PROCNO= 1
##$TYPE= <nmr>
##$USER= <she>
##$AMP= (0..31)
100 100 100 100 100 100 100 100 100 100 100 100 100 100 100 100 100 100 
100 100 100 100 100 100 100 100 100 100 100 100 100 100 
##$AQSEQ= 0
##$AQ_mod= 1
##$AUNM= <au_zg>
##$AUTOPOS= <>
##$BF1= 81.014009
##$BF2= 200.13
##$BF3= 200.13
##$BF4= 200.13
##$BF5= 200.13
##$BF6= 200.13
##$BF7= 200.13
##$BF8= 200.13
##$BYTORDA= 1
##$CFDGTYP= 0
##$CFRGTYP= 5
##$CHEMSTR= <none>
##$CNST= (0..31)
1 1 145 1 1 1 1 1 1 1 1 1 1 1 1 1 1 1 1 1 1 1 1 1 1 1 1 1 1 1 1 1 
##$CPDPRG= <waltz16>
##$CPDPRG1= <>
##$CPDPRG2= <waltz16>
##$CPDPRG3= <>
##$CPDPRG4= <mlev>
##$CPDPRG5= <mlev>
##$CPDPRG6= <mlev>
##$CPDPRG7= <mlev>
##$CPDPRG8= <mlev>
##$CPDPRGB= <>
##$CPDPRGT= <>
##$D= (0..31)
$$ [...]
##$SUBNAM3= <"">
##$SUBNAM4= <"">
##$SUBNAM5= <"">
##$SUBNAM6= <"">
##$SUBNAM7= <"">
##$SUBNAM8= <"">
##$SUBNAM9= <"">
##$SW= 400.765351723535
##$SWIBOX= (0..15)
0 1 3 0 0 0 0 0 0 0 0 0 0 0 0 0 
##$SW_h= 32467.5324675325
##$TD= 32768
##$TD0= 1
##$TE= 0
##$TE2= 300
##$TE3= 300
##$TEG= 300
##$TL= (0..7)
0 120 53 12 22 120 120 120 
##$TP= (0..7)
150 150 150 150 150 150 150 150 
##$TP07= 0
##$TPNAME0= <>
##$TPNAME1= <>
##$TPNAME2= <>
##$TPNAME3= <>
##$TPNAME4= <>
##$TPNAME5= <>
##$TPNAME6= <>
##$TPNAME7= <>
##$TPOAL= (0..7)
0.5 0.5 0.5 0.5 0.5 0.5 0.5 0.5 
##$TPOFFS= (0..7)
0 0 0 0 0 0 0 0 
##$TUNHIN= 0
##$TUNHOUT= 0
##$TUNXOUT= 0
##$USERA1= <user>
##$USERA2= <user>
##$USERA3= <user>
##$USERA4= <user>
##$USERA5= <user>
##$V9= 5
##$VALIST= <valist>
##$VCLIST= <CCCCCCCCCCCCCCC>
##$VD= 0
##$VDLIST= <DDDDDDDDDDDDDDD>
##$VPLIST= <PPPPPPPPPPPPPPP>
##$VTLIST= <TTTTTTTTTTTTTTT>
##$WBST= 1024
##$WBSW= 4
##$XGAIN= (0..3)
0 0 0 0 
##$XL= 0
##$YL= 0
##$YMAX_a= 10274
##$YMIN_a= -5068
##$ZGOPTNS= <>
##$ZL1= 120
##$ZL2= 120
##$ZL3= 120
##$ZL4= 120
##$ABSF1= 0
##$ABSF2= 0
##$ABSG= 0
##$ABSL= 0
##$ALPHA= 0
##$AQORDER= 0
##$ASSFAC= 0
##$ASSFACI= 0
##$ASSFACX= 0
##$ASSWID= 0
##$AUNMP= <proc_1d>
##$AZFE= 0.1
##$AZFW= 0.5
##$BCFW= 0
##$BC_mod= 2
##$BYTORDP= 0
##$COROFFS= 0
##$CY= -3
##$DATMOD= 1
##$DC= 0
##$DFILT= <>
##$DTYPP= 0
##$F1P= 0
##$F2P= 0
##$FCOR= 1
##$FTSIZE= 65536
##$FT_mod= 6
##$GAMMA= 0
##$GB= 0
##$INTBC= 1
##$INTSCL= 9.790993e-09
##$ISEN= 30
##$LB= 1.5
##$LEV0= 0
##$LPBIN= 0
##$MAXI= 10000
##$MC2= 0
##$MEAN= 0
##$ME_mod= 0
##$MI= 50
##$NCOEF= 0
##$NC_proc= -8
##$NLEV= 6
##$NOISF1= 182.463
##$NOISF2= 159.3651
##$NSP= 0
##$NTH_PI= 0
##$NZP= 0
##$OFFSET= 198.0616
##$PC= 4
##$PHC0= 2391.281
##$PHC1= 684.0884
##$PH_mod= 1
##$PKNL= yes
##$PPARMOD= 0
##$PSCAL= 0
##$PSIGN= 0
##$REVERSE= no
##$SF= 81.0140089999434
##$SI= 65536
##$SIGF1= 159.3651
##$SIGF2= -187.1042
##$SINO= 113.3802
##$SIOLD= 16384
##$SREGLST= <1H.CDCl3>
##$SSB= 0
##$STSI= 65536
##$STSR= 0
##$SW_p= 32467.5324675325
##$SYMM= 0
##$S_DEV= 0
##$TDeff= 32768
##$TDoff= 0
##$TI= <>
##$TILT= no
##$TM1= 0
##$TM2= 0
##$TOPLEV= 0
##$USERP1= <user>
##$USERP2= <user>
##$USERP3= <user>
##$USERP4= <user>
##$USERP5= <user>
##$WDW= 1
##$XDIM= 65536
##$YMAX_p= 171136600
##$YMIN_p= -351431690
$$ End of Bruker specific parameters
$$ ---------------------------------
##NTUPLES= NMR SPECTRUM
##VAR_NAME=  FREQUENCY,     SPECTRUM/REAL,   SPECTRUM/IMAG
##SYMBOL=    X,             R,               I
##VAR_TYPE=  INDEPENDENT,   DEPENDENT,       DEPENDENT
##VAR_FORM=  AFFN,          ASDF,            ASDF
##VAR_DIM=   65536,         65536,           65536
##UNITS=     HZ,            ARBITRARY UNITS, ARBITRARY UNITS
##FACTOR=    0.49542278885378, 1,            1
##FIRST=     16045.7642231865, 0,            0
##LAST=      -16421.768244346, 0,            0
##MIN=       -16421.768244346, -351431690,   0
##MAX=       16045.7642231865, 171136600,    0
$$ Real data points
##PAGE= N=1
##DATA TABLE= (X++(R..R)), XYDATA
$$ [...]
##PAGE= N=2
##DATA TABLE= (X++(I..I)), XYDATA
7482C502201k688385n134396l285448J401330L396953M06585k744969o34989M868621
$$ 3502201 813816 -4320580 -7606028 -6204698 -2807745 -2401160 -5146129 -5781118 -912497
7473i12497P151148L810093j131602l538875l492082k695043j446437J40509Q48776
$$ -912497 6238651 10048744 8917142 5378267 1886185 -808858 -2255295 -2114786 -1266010
7464a266010L09563J64368J430495K434249J210595j436141l066750k712895j264689
$$ -1266010 -956447 -792079 638416 3072665 4283260 2847119 -219631 -2932526 -4197215
7455d197215J77577P89994k3409j467488j202900J734814M743505M447540J024886
$$ -4197215 -4019638 -3229644 -3253053 -4720541 -5923441 -4188627 554878 5002418 6027304
7446F027304k369768l869531m106765l529481j504249J349421K732230J817735
$$ 6027304 3657536 -211995 -4318760 -7848241 -9352490 -8003069 -5270839 -3453104
7438c453104O06025P88422J336431Q11065P5860N78855J502995J139966P7951
$$ -3453104 -2847079 -2058657 -722226 88839 164699 743554 2246549 3386515 3464466
7429C464466K58319J289270O93917j774795l045088j301421R16485M14167j688908
$$ 3464466 3722785 5012055 5705972 3931177 886089 -415332 501153 915320 -773588
7420g73588j638640J020889K463445J77165l371457m391255k831918j305625m56934
$$ -773588 -2412228 -1391339 1072106 1249271 -2122186 -6513441 -9345359 -10650984 -11107918
7411a1107918J339932L945685M588718K130314o68276r51754M40090J140527J154290
$$ -11107918 -9767986 -5822301 -1233583 896731 228455 -723299 -283209 857318 2011608
7402B011608J773998K138370L63930k420122k784870j50863K101568J624133J05162
$$ 2011608 3785606 5923976 6287906 3867784 1082914 932051 3033619 4657752 4762914
7393D762914j20985M70057M72517K71719M98093j5875k012154l396730k103415
$$ 4762914 4641929 5111986 5584503 5856222 6354315 6338440 4326286 929556 -1173859
7384a173859P4227j16112k116383k383749j54776J545758J113280N69631J180226
$$ -1173859 -1099632 -1215744 -3332127 -5715876 -5870652 -4324894 -3211614 -2641983 -1461757
7375a461757P36431k244767m703352k819354K164981N271449M096431Q21261j603755
$$ -1461757 -725326 -2970093 -7673445 -10492799 -8327818 -3056369 1040062 1861323 257568
7366B57568k322975j566887L42549K194426K362496J014859J6525j07690j039620
$$ 257568 -2065407 -3632294 -3289745 -1095319 1267177 2282036 2298561 2190871 1151251
7357A151251l406485m851058l233123q2530J410933P60674J42705O78561J367219
$$ 1151251 -2255234 -7106292 -10339415 -10421945 -9011012 -8250338 -8107633 -7429072 -6061853
7348f061853J596947K028553K514298J769292Q8505j98657J457300K074684m28070
$$ -6061853 -4464906 -2436353 77945 1847237 1935742 1737085 3194385 5269069 4840999
7339D840999l185344k049803J905495L400311M98971k731724k397586j46850O1762
$$ 4840999 1655655 -394148 1511347 4911658 5410629 2678905 281319 134469 196231
7330A96231j966848k989005j486189O86649J660454J738066J640296R58563m02230
$$ 196231 -1770617 -4759622 -6245811 -5559162 -3898708 -2160642 -520346 438217 35987
7321C5987r72315M00690K253235J784385j512515m687628m340154k87336M229394
$$ 35987 -936328 -535638 1717597 3501982 1989467 -2698161 -7038315 -7325651 -3096257
7312c096257N820309M040123J245947j14939L20150J056107M70833j764122m413375
$$ -3096257 2724052 6764175 8010122 7895183 8215333 9271440 9742273 7978151 3564776
7303C564776n575337m279044j419743J192619K621256L021370K354413L07064
$$ 3564776 -2010561 -6289605 -7709348 -6516729 -3895473 -874103 1480310 1787374
7295A787374k125713k693398p85776J138165Q17307k32278J142431M467953N528763
$$ 1787374 -338339 -3031737 -3817513 -2679348 -1862041 -2094319 -951888 3516065 9044828
7286I044828K302422j744571k150798O69137K399305O43503k679012m519702l958911
$$ 9044828 11347250 9602679 7451881 8121018 10520323 11163826 8484814 3965112 6201
7277F201j844649P47910K561140K146881n69087l249883l083269J37460L678540
$$ 6201 -1838448 -1090538 1470602 3617483 3048396 -201487 -3284756 -3147296 531244
7268E31244M679343K708091l92471k399683k273797o18752Q74430Q18402o00176
$$ 531244 5210587 7918678 7526207 5126524 2852727 2233975 3108405 3926807 3326631
7259C326631j933074k207369j872842j709179j473704m48516J043965J732364
$$ 3326631 1393557 -813812 -2686654 -4395833 -5869537 -6318053 -5274088 -3541724
7251c541724J128038K72487L39914J114685J412430P32942k9699L48481J795340
$$ -3541724 -2413686 -2141199 -1801285 -686600 725830 1458772 1429073 1777554 3572894
7242C572894K698002J725314k36298r74099j73152l04701k921936n447308m195172
$$ 3572894 6270896 7996210 7759912 6785813 6612661 6307960 3386024 -2061284 -6256456
7233f256456q6279J882542l92865k955340j533310K341461L940164K211205M93593
$$ -6256456 -6342735 -4460193 -4853058 -7808398 -9341708 -7000247 -3060083 -848878 -355285
7224c55285J004016K135284J755902L46446k84750M63499J679252J877616p4591
$$ -355285 648731 2784015 4539917 4886363 4601613 5065112 6744364 8621980 8547389
7215H547389l504460n352892l010987J896677M658490L095710k8446j114248o1869
$$ 8547389 5042929 -309963 -3320950 -1424273 3234217 6329927 6301481 5187233 5125364
7206E125364R00828P63483J82679l39693q11013r03148k04954J003445J988456
$$ 5125364 6026192 6789675 6972354 6632661 5821648 4918500 4713546 5716991 7705447
7197G705447K026181M55554k409808m213508k462518J726071M075146K510462
$$ 7705447 9731628 10187182 7777374 3563866 1101348 2827419 6902565 9413027
7189I413027m20241j930661k678369l638498k665749J848915O347015N907255
$$ 9413027 8992786 7062125 4383756 745258 -1920491 -71576 6275439 12182694
7181A2182694J387815j975941k243193j956407k097076o98263J751719J578599
$$ 12182694 13570509 11594568 9351375 7394968 5297892 4599629 6351348 7929947
7173G929947j392834k247153R27912L010522Q7525l542786k215025J539657J152545
$$ 7929947 6537113 4289960 5217872 8228394 8315919 4773133 2558108 4097765 5250310
7164E250310k932043l953412J25247L719542K778820R4973p62986q38382j837795
$$ 5250310 2318267 -1635145 -1509898 2209644 4988464 5083437 4320451 3482069 1644274
7155A644274j803791J131011M312258M163545J651861J13272l06823j808221l890543
$$ 1644274 -159517 971494 5283752 9447297 11099158 11212430 10905607 9097386 5206843
7146E206843l602382o66840J577496J001830o74899r62507K49270J638804K449729
$$ 5206843 1604461 937621 2515117 3516947 2842048 1879541 2128811 3767615 6217344
7137F217344K412563J257321o39426k181873k736883k456818j360084M93298J820859
$$ 6217344 8629907 9887228 9247802 7065929 4329046 1872228 512144 1005442 2826301
7128B826301J018084j157064j777949K25021K054182P81675k274311l128192n49249
$$ 2826301 3844385 2687321 909372 1134393 3188575 3970250 1695939 -1432253 -1981502
7119a981502K381999K539245O80640j00008J161413K004832j5237l702396n179161
$$ -1981502 400497 2939742 3620382 3520374 4681787 6686619 6671382 2968986 -2210175
7110b210175k503229J746319L317571J119060j954519k822924j397557M00422
$$ -2210175 -4713404 -2967085 350486 1469546 -484973 -3307897 -4705454 -4305032
7102d305032J254391R63191n04578k745024m044308k562951J090789L775317L205974
$$ -4305032 -3050641 -2087450 -2592028 -5337052 -9381360 -11944311 -10853522 -7078205 -3872231
7093c872231O53937p20722K46765J700739J646334N73023M05257J622642K625517
$$ -3872231 -3218294 -3939016 -3692251 -1991512 -345178 227845 633102 2255744 4881261
7084D881261J902234j84170k003361k244971o87327J669125K826119J253335k047664
$$ 4881261 6783495 6599325 4595964 2350993 1663666 3332791 6158910 7412245 5364581
7075E364581l971575k923626r95477r44530j908803n62711L459633O045952L787976
$$ 5364581 1393006 -1530620 -2526097 -3470627 -5379430 -5942141 -2482508 3563444 7351420
7066G351420j381318m623078m013119j881989r31460j138902q42721O65707K431517
$$ 7351420 5970102 1347024 -2666095 -4548084 -5479544 -6618446 -7461167 -6795460 -4363943
7057d363943K999499J788945k96756j476101p42460J029963K090797J848436J204222
$$ -4363943 -1364444 424501 127745 -1348356 -2090816 -1060853 1029944 2878380 4082602
7048D082602Q38998K26430j011062j721664n80325J384146J284821j835186n086113
$$ 4082602 4921600 5148030 4136968 2415304 1834979 3219125 4503946 2668760 -2417353
7039b417353n110463k528391r49397j738612k303150l88594K526231L953738M218741
$$ -2417353 -7527816 -10056207 -11005604 -12744216 -15047366 -15435960 -12909729 -8955991 -4737250
7030d737250M807991M622196J522231k969691m453569j741450J417940J942943
$$ -4737250 70741 4692937 6215168 3245477 -1208092 -2949542 -1531602 411341
7022D11341J330399J977850K708370R55921k527504m267635k563489R73526L743384
$$ 411341 1741740 3719590 6427960 7383881 4856377 588742 -1974747 -1001221 2742163
7013B742163M117929J882439j343496k744346j087660J698616L037152K729467
$$ 2742163 6860092 8742531 7399035 4654689 3567029 5265645 8302797 11032264
7005A1032264K022254J104942m33491j893177k407951k500331k555412j193738
$$ 11032264 13054518 14159460 13725969 11832792 9424841 6924510 4369098 3175360
6997C175360K131325M344090K058893k976226n374960l063538O20118K042202
$$ 3175360 5306685 9650775 11709668 8733442 3358482 294944 915062 2957264
6989B957264J241872K21345K54344J617063L434676L425359L87331l086160l416029
$$ 2957264 4199136 4420481 4674825 6291888 9726564 13151923 13539254 10453094 7037065
6980G037065j378766r02000k503610k531638J83401J961395N31213j228919o32218
$$ 7037065 5658299 4756299 2252689 -278949 -95548 1865847 2397060 1168141 535923
6971E35923L14505p11724j682076k00591J440566L5184k517193k105906O90850
$$ 535923 850428 138704 -1543372 -1743963 -303397 -268213 -2785406 -4891312 -4200462
6962d200462J802065M35822m87034O8375K63662j90740M93302J972703J687488
$$ -4200462 -2398397 -1962575 -2449609 -2381234 -2117572 -2308312 -1815010 157693 1845181
6953A845181k52451m89423K038157L939765K353128j252793l787861m113654k572462
$$ 1845181 1592730 1103307 3141464 7081229 9434357 8181564 4393703 280049 -2292413
6944b292413J74028K418969K165732p521j175815j49988J179139J364317J293566
$$ -2292413 -2118385 300584 2466316 2458795 1282980 1132992 2312131 3676448 4970014
6935D970014J492482P59028r69071j528717j55433Q32172j8569p39682L20581
$$ 4970014 6462496 7221524 6252453 4723736 4568303 5400475 5381906 4642224 4962805
6926D962805J307023K56050j202208q22784J81731k74357q29960Q27764K942611
$$ 4962805 6269828 6525878 5323670 4500886 4682617 4408260 3578300 4406064 7348675
6917G348675J893190j525089k906523j195460O6069q57059j139737J135210L146846
$$ 7348675 9241865 7716776 4810253 3614793 3680862 2823803 1684066 2819276 5966122
6908E966122J856633r22746j298308J004322K935077K770754J459623O8595j284840
$$ 5966122 7822755 6900009 5601701 6606023 9541100 12311854 13771477 13840072 12555232
6899A2555232k117117j698802p84479j159448k933188l985716k758865j77530
$$ 12555232 10438115 8739313 7954834 6795386 3862198 -123518 -2882383 -3059913
6891c059913J874769K617084K043219n9867l255639n431674m462625r82488J965689
$$ -3059913 -1185144 1431940 3475159 3415292 159653 -5272021 -9734646 -10717134 -8751445
6882h751445K476968J743968J797837K498156K072834J7870k132418l031510l091098
$$ -8751445 -6274477 -4530509 -2732672 -234516 1838318 1856188 -276230 -3307740 -6398838
6873f398838l207972l075312j863647K8494J212466J309108J503159K565150L304519
$$ -6398838 -9606810 -12682122 -14545769 -14517275 -13304809 -11995701 -10492542 -7927392 -4622873
6864d622873K102134m12293j609063j61546K129148K740666J667364P88190O01260
$$ -4622873 -2520739 -2933032 -4542095 -4703641 -2574493 166173 1833537 2621727 3222987
6855C222987l53706k505231l760442k254424P95721K450227J466633q22027k303401
$$ 3222987 2869281 364050 -3396392 -5650816 -4855095 -2404868 -938235 -1760262 -4063663
6846d063663j703747P06204K880594K429198n20127l011442l066085k162287k089127
$$ -4063663 -5767410 -5061206 -2180612 248586 -271541 -3282983 -6349068 -8511355 -10600482
6837a0600482j400757J897596N706217N941901K769069M41010P23121R79611k70940
$$ -10600482 -12001239 -10103643 -4397426 1544475 4313544 4754554 5477675 6457286 6186346
6828F186346p25386P45503J171532j366078l730424k728166o37691j216965k957935
$$ 6186346 5460960 6206463 7377995 6011917 2281493 -446673 -1084364 -2301329 -5259264
6819e259264j549441K555248M490204K502842J8745k95243J00805o68210j830934
$$ -5259264 -6808705 -4253457 236747 2739589 2758334 2463091 2563896 1895686 64752
6810F4752k182868k074017j668385j41694J914391K076251k91948k505668k312332
$$ 64752 -2118116 -4192133 -5860518 -6002212 -4087821 -2011570 -2303518 -4809186 -7121518
6801g121518q68484k65742l00765L34512J492310K202771K438911K492999J874457
$$ -7121518 -7990002 -8255744 -8556509 -8221997 -6729687 -4526916 -2088005 404994 2279451
6792B279451L83050r69707j457362j653369j730118n99697J607593K235717l76166
$$ 2279451 2662501 1692794 235432 -1417937 -3148055 -3747752 -2140159 95558 -280608
6783b80608l671398l885713j189374J007092J180074J037137J729380J813859
$$ -280608 -3952006 -7837719 -9027093 -8020001 -6839927 -5802790 -4073410 -2259551
6775b259551J5707k275531k706625q72156J532774K613191J691847l38525j574182
$$ -2259551 -2243844 -4519375 -7226000 -8098156 -6565382 -3952191 -2260344 -2598869 -4173051
6766d173051p50474J325058K673592K520144J753444R40308o21356l098044m714261
$$ -4173051 -4923525 -3598467 -924875 1595269 3348713 4289021 3667665 569621 -4144640
6757d144640l614486n97259J472800J063065m50940j065182q61033j302624k402096
$$ -4144640 -7759126 -8356385 -6883585 -5820520 -6271460 -7336642 -8197675 -9500299 -11902395
6748a1902395k244841J66903K974634L564585J839525L6367k83359M61950J430385
$$ -11902395 -14147236 -13980333 -11005699 -7441114 -5601589 -5565222 -5848581 -5386631 -3956246
6739c956246K461088L213746K809159J139557o21481j475006j478679p80497P22213
$$ -3956246 -1495158 1718588 4527747 5667304 5045823 3570817 2092138 1311641 2033854
6730B033854K126561J716116m68437j960039j182813K15570M0250j096704j231150
$$ 2033854 4160415 5876531 5408094 3448055 2265242 2480812 2521062 1424358 193208
6721A93208m00229J657J20589J063376K096620J439492l56573q78340J14091K08169
$$ 193208 -207021 -205364 -84775 978601 3075221 4514713 4158140 3279800 3393891 3602060
6711C602060j492410k784635k075261q35371q11551j247277o10515J032164L037622
$$ 3602060 2109650 -674985 -2750246 -3585617 -4397168 -5644445 -6254960 -5222796 -2185174
6702b185174N423987P211284N764070L14758n531480p494931n651177l274798
$$ -2185174 3238813 10450097 16214167 16528925 10997445 3502514 -2148663 -5423461
6694e423461j923138o54619O72858P59118k72786l81152J263677L032444L418340
$$ -5423461 -7346599 -8001218 -7328360 -6569242 -6842028 -7223180 -5959503 -2927059 491281
6685D91281K657321J139833j349224l749528l575368m08568K446114J911280p09792
$$ 491281 3148602 4288435 2939211 -810317 -4385685 -4794253 -2348139 -436859 -1146651
6676a146651j783153m81109O79111K8457j180499j349336q47915n98755j02290
$$ -1146651 -2929804 -3410913 -2731802 -2703345 -3883844 -5233180 -6081095 -6679850 -6782140
6667f782140J507327L429265L915455K685374J112822J2j326494l227447m482870
$$ -6782140 -5274813 -1845548 2069907 4755281 5868103 5868115 4541621 1314174 -3168696
6658c168696l888018k162200r24320l39827O47495J945390K055257O79645k24844
$$ -3168696 -7056714 -9218914 -10143234 -10483061 -9835566 -7890176 -5834919 -5155274 -5380118
6649e380118Q39593K581019K844971J806154J350378J854134J716454K21702j129479
$$ -5380118 -4540525 -1959506 885465 2691619 4041997 5896131 7612585 7834287 6704808
6640F704808q79761K86316O10767o04186k679514m425790m593911k440969J152653
$$ 6704808 5825047 6111363 6722130 6117944 3438430 -987360 -5581271 -8022240 -6869587
6631f869587L786962L763985J863477J71451m04703n76392r57429j034756k09870
$$ -6869587 -3082625 681360 2544837 2716288 2311585 1735193 777764 -256992 -466862
6622d66862Q23746N45715j332300k831885j707908J362793K915785J040717j703790
$$ -466862 356884 902599 -429701 -3261586 -4969494 -3606701 -690916 349801 -1353989
6613a353989j609014Q76056J865376j01414k165317j967589r86526j174089j434458
$$ -1353989 -2963003 -2086947 -221571 -322985 -2488302 -4455891 -5442417 -6616506 -8050964
6604h050964l02062N73171p33223k174104o76710J948917J040147l150072n063887
$$ -8050964 -8353026 -7779855 -8513078 -10687182 -11363892 -9414975 -8374828 -11524900 -16588787
6595a6588787k378748L67966p28371k654851p46883L381897M246538R76618j704675
$$ -16588787 -18967535 -18599569 -19327940 -21982791 -22729674 -19347777 -15101239 -14124621 -15829296
6586a5829296o64657J959113K890999J803820J45291j064871r08214J376026M439494
$$ -15829296 -16493953 -14534840 -11643841 -9840021 -9694730 -10759601 -11667815 -10291789 -5852295
6577e852295N065975K100196j498105k221643k87918J396319J412071R14866J013969
$$ -5852295 -786320 1313876 -184229 -2405872 -2693790 -1297471 114600 1029466 2043435
6568B043435J119114L09036j027031j657175j015172K94224J269307J430860R46288
$$ 2043435 3162549 3471585 2444554 787379 -227793 66431 1335738 2766598 3712886
6559C712886J06793q81362j459031p34764J327101L158055L023695J053646j164003
$$ 3712886 3819679 2938317 1479286 744522 2071623 5229678 8253373 9307019 8143016
6550H143016k721542l677304l398226q51861K691435L600394L59497l638343m129501
$$ 8143016 5421474 1744170 -1654056 -2505917 185518 3785912 4145409 507066 -3622435
6541c622435j627064k42491j408094k088147M9494K834462K940714Q26985l04469
$$ -3622435 -5249499 -5491990 -6900084 -8988231 -8938737 -6104275 -3163561 -2336576 -2641045
6532b641045N59985J105140m22426k504269k501988q2578K674169L843266L238381
$$ -2641045 -2081060 -975920 -1398346 -3902615 -6404603 -6487181 -3813012 30254 3268635
6523C268635J713085j00713k031361l801907m694079l987560j823210M94728J433537
$$ 3268635 4981720 4881007 2849646 -952261 -5646340 -9633900 -11457110 -10962382 -9528845
6514i528845P15658l22070j73957J084712J885976J166975j46245k37136J102933
$$ -9528845 -8813187 -9135257 -9309214 -8224502 -6338526 -5171551 -5317796 -5554932 -4451999
6505d451999J949173Q11968r69066o79747J900163L599679J796822j837742l161934
$$ -4451999 -2502826 -1690858 -2659924 -3339671 -1439508 2160171 3956993 2119251 -1042683
6496a042683q50348J895896J507378j454185l115191j002364L200543N603283
$$ -1042683 -1893031 2865 1510243 56058 -3059133 -4061497 -860954 4742329
6488D742329M079065Q6741l082103l539849k139554p42642J8607M88021L00139
$$ 4742329 8821394 8908135 5826032 2286183 146629 -596013 -577406 -89385 210754
6479B10754j264141l188644l132351q89384O16604n18873j918212l06590L206301
$$ 210754 -1053387 -4242031 -7374382 -8263766 -7647162 -8166035 -10084247 -10390837 -7184536
6470g184536M447128K322635J49777L96039J580988J714605J487874J880200J492268
$$ -7184536 -2737408 -414773 -264996 131043 1712031 3426636 4914510 6794710 8286978
6461H286978q34952k953080k275306j49680K41511o61154M50479L568616M304229
$$ 8286978 7452026 4498946 2223640 2073960 2315471 1654317 2104796 5673412 9977641
6452I977641M06330m373970n290286k715278n18930l27720m87615K39200R88509
$$ 9977641 10383971 6010001 719715 -1995563 -2514493 -2842213 -3329828 -3090628 -2102119
6443b102119Q17067J1112j010815k218470k955731k113651L4704J617089J502537
$$ -2102119 -1285052 -1273940 -2284755 -4503225 -7458956 -9572607 -9537903 -7920814 -6418277
6434f418277N49556k43971j336239l062175l791880j755388J773330L368279J831054
$$ -6418277 -5868721 -6112692 -7448931 -10511106 -14302986 -16058374 -14285044 -10916765 -9085711
6425i085711m12992j059771q50208j149511p27102K177769N656568N558322J479145
$$ -9085711 -9498703 -10558474 -11408682 -12558193 -13285295 -11107526 -5450958 107364 1586509
6416A586509k029152j593074O11292P19159j165072k049500r59039N49567J692388
$$ 1586509 -442643 -2035717 -1424425 -705266 -1870338 -3919838 -4878877 -4329310 -2636922
6407b636922K794555K815869K68437l115203l405935k80524J739630l41902l592958
$$ -2636922 157633 2973502 3241939 126736 -3279199 -3559723 -1820093 -2161995 -5754953
6398e754953l574269m48942K342509L431674M050475M373353K971954q3369k526509
$$ -5754953 -9329222 -9778164 -7435655 -4003981 46494 4419847 7391801 7308432 4781923
6389D781923k735847j130848J297968L625736M191242J739799k153856m191518
$$ 4781923 2046076 915228 2213196 5838932 10030174 11769973 9616117 5424599
6381E424599l487273k248560j765084o27503J774495L098111J754131J31315R86721
$$ 5424599 1937326 -311234 -2076318 -2703821 -929326 2168785 3922916 4054231 5040952
6372E040952K609922J384298j968983l055872p79525Q27463q74642k904716j587043
$$ 5040952 7650874 9035172 7066189 4010317 3230792 4058255 3183613 278897 -1308146
6363a308146J586540K554068R88372P1970R92836J606636N75225p60151j260376
$$ -1308146 278394 2832462 3820834 3892804 4885640 6492276 7067501 6307350 5046974
6354E046974j539903j728930p74828P51667K48606k664468m407989k432423O21460
$$ 5046974 3507071 1778141 1003313 1754980 2003586 -660882 -5068871 -7501294 -6879834
6345f879834Q04330j170705j443508Q00966K569569K183810J429267K026837L058639
$$ -6879834 -6075504 -7246209 -8689717 -7888751 -5319182 -3135372 -1706105 320732 3379371
6336C379371K844315J026321j849969m658294n309939k593952J142908J919650
$$ 3379371 6223686 7250007 5400038 741744 -4568195 -7162147 -6019239 -4099589
6328d099589m89786j950768Q7673K993002L113141R12764m73572O503N37891m89518
$$ -4099589 -4589375 -6540143 -6452470 -3459468 -346327 566437 92865 99368 637259 147741
6318A47741k525175l559582j919589J816367M491355L594486Q75185K40236J829805
$$ 147741 -2377434 -5937016 -7856605 -6040238 -1548883 2045603 2920788 3161024 4990829
6309D990829J751906j230976l087162j026370J678786J070683j128834j183132
$$ 4990829 6742735 5511759 2424597 1398227 3077013 4147696 3018862 1835730
6301A835730j15160j238121l288079k324226P69378J349289o35374l53620K822326
$$ 1835730 1720570 482449 -2805630 -5129856 -4360478 -3011189 -3646563 -4000183 -1177857
6292a177857L164062j744386n897289l777313J168695K396354L54709L72863L041171
$$ -1177857 1986205 241819 -5655470 -9432783 -8264088 -5867734 -5513025 -5140162 -2098991
6283b098991L586671M66446j830480j30015K427269J590608j379423j945418N86523
$$ -2098991 1487680 1954126 123646 -6369 2420900 4011508 2632085 686667 1273190
6274A273190J985104n88591m200557l997269q309K564569K53888l918048m480673
$$ 1273190 3258294 2669703 -1530854 -5528123 -5536432 -2971863 -2717975 -6636023 -11116696
6265a1116696p37701K871499L195526J920789J822575K450572J634769o35481
$$ -11116696 -11854397 -8982898 -5787372 -3866583 -2044008 406564 2041333 1405852
6257A405852k257790k070896q72637J60390M88451K0645o98987m33350J363663
$$ 1405852 -851938 -2922834 -3795471 -3635081 -3146630 -3125985 -3824972 -4258322 -2894659
6248b894659L378153L804764K603529J214446K45552j165027l388698m911658
$$ -2894659 483494 4288258 6891787 8106233 8351785 7186758 3798060 -1113598
6240a113598l855749o15884J951555J634766j74298J03165L289207N440598K566940
$$ -1113598 -4969347 -5585231 -3633676 -1998910 -2173208 -2070043 1219164 6659762 9226702
6231I226702l595865p112082n143524r49434J196314J229624J596379K659186
$$ 9226702 5630837 -1481245 -6624769 -7574203 -6377889 -5148265 -3551886 -892700
6223h92700K551663O23984j493371k203648j584265o13451N7959M56384J035051
$$ -892700 1658963 2282947 789576 -1414072 -2998337 -3611788 -3553829 -3097445 -2062394
6214b062394J912997K233577J141176m44331n42308Q06223J054495j047350l129720
$$ -2062394 -149397 2084180 3225356 2781025 2238717 3044940 4099435 3052085 -77635
6205g7635k572224m99193N3144j171299j568143R4039K034034K345910J325980
$$ -77635 -2649859 -3149052 -3095908 -4267207 -5835350 -5741311 -3707277 -1361367 -35387
6196c5387L00891j87665l46667m71506q36533j416346j543804n76553J192335
$$ -35387 265504 77839 -268828 -740334 -1576867 -2993213 -4537017 -5113570 -3921235
6187c921235K963308M291672M657098L013788p11742m188888m561503j838569
$$ -3921235 -957927 3333745 7990843 11004631 10292889 6104001 1542498 -296071
6179b96071J032666J579016L1464j792751k425219j452072L52266J309884L68233
$$ -296071 736595 2315611 2347075 554324 -1870895 -3322967 -2970701 -1660817 -1292584
6170a292584j460626k179395j317269k18324J89734N53385J613986K697982K384985
$$ -1292584 -2753210 -4932605 -6249874 -6468198 -6278464 -5725079 -4111093 -1413111 971874
6161I71874K43436k372306l123054p60196L014432M453499J645967k880687m618595
$$ 971874 1215310 -1156996 -4280050 -5040246 -2025814 2427685 4073652 1192965 -3425630
6152c425630j992831K193736M033831K242867j185924l071007j872342Q97097
$$ -3425630 -5418461 -3224725 809106 3051973 1866049 -1204958 -3077300 -2180203
6144b180203K364049J683548O84657O20365J66057j791274l354885k285070j29499
$$ -2180203 183846 1867394 2552051 3172416 3338473 1547199 -1807686 -4092756 -4222255
6135d222255l63338k835120l610765q97055K223155K415326P48836O37360K775793
$$ -4222255 -4585593 -7420713 -11031478 -11928533 -9705378 -7290052 -6541216 -5903856 -3128063
6126c128063M336129K799369r06193l443087k891461j087911j294396l485048
$$ -3128063 1208066 4007435 3101242 -341845 -3233306 -4321217 -5615613 -9100661
6118i100661l869103l77061L635422L818343J133050L7461J414118J736275o30895
$$ -9100661 -12969764 -13346825 -9711403 -5893060 -4760010 -4722549 -3308431 -1572156 -2203051
6109b203051k889049k701911j405119o26208L60061J838746K068973R78887J608055
$$ -2203051 -5092100 -7794011 -9199130 -9825338 -9465277 -7626531 -5557558 -4578671 -2970616
6100b970616M751541N939213J819131l659922m316763p01894J305223m84481k550318
$$ -2970616 1780925 7720138 9539269 5879347 1562584 860690 2165913 1681432 -868886
6091h68886k399772j665449j496586j69733K555374L252912M8804l467005k988565
$$ -868886 -3268658 -4934107 -6430693 -6600426 -4045052 -792140 -743336 -4210341 -7198906
6082g198906L79201K328990J835725J439269J868337P15434k665816m657745k081889
$$ -7198906 -6819705 -4490715 -2654990 -1215721 652616 1368050 -1297766 -5955511 -8037400
6073h037400K839668N009390L039057N57206P56853K239628J711591j005694k918341
$$ -8037400 -5197732 -188342 2850715 3407921 4164774 6404402 8115993 7110299 4191958
6064D191958k195429k48275Q41815R02658O43169k58897k296003m187860l719497
$$ 4191958 1996529 1748254 2590069 3492727 4135896 3876999 1580996 -2606864 -6326361
6055f326361o65687K492380L266214J723209j28254q42838p24881p63507j165817
$$ -6326361 -6992048 -4499668 -1233454 489755 361501 -481337 -1206218 -1969725 -3135542
6046c135542j325527q71292j06069O41558J415655J998836J554762l14055k518568
$$ -3135542 -4461069 -5332361 -5438430 -4796872 -3381217 -1382381 172381 -141674 -2660242
6037b660242l348811k251648m1366K371032M493258N609724M755751J764222k151998
$$ -2660242 -6009053 -8260701 -8302067 -5931035 -1437777 4171947 8927698 10691920 8539922
6028H539922n004744n104328k217274J655918L465101K218644K75159L05327J756880
$$ 8539922 3535178 -1569150 -3786424 -2130506 1334595 3553239 3828398 4133725 5890605
6019E890605J972601J29048j920686k342138r12709J597097L522349K507897j650456
$$ 5890605 7863206 7992254 6071568 3729430 2816721 4413818 7936167 10444064 8793608
6010H793608m973804l535035M50527Q53415l452889o458521l574827K067228M649624
$$ 8793608 3819804 284769 735296 1588711 -1864178 -8322699 -11897526 -9830298 -5180674
6001e180674L141821L47779k130857l887184l232774P58306N108059N853020L202275
$$ -5180674 -2038853 -1691074 -3821931 -7709115 -10941889 -10183583 -5075524 777496 3979771
5992C979771L70058j475114l308460m424293k908091K47799J685931P84078M41189
$$ 3979771 4349829 2874715 -433745 -4858038 -7766129 -7518330 -5832399 -5048321 -4607132
5983d607132K051698L302481K197966J09494q01588p18715j071621k104401k923537
$$ -4607132 -2555434 747047 2945013 3054507 2252919 1534204 462583 -1641818 -4565355
5974d565355k713356j135370J226235K457227Q78542k543769m716253l601660
$$ -4565355 -7278711 -8414081 -7187846 -4730619 -3852077 -6395846 -11112099 -14713759
5966a4713759K58819M967006Q271041P922295L552092j680529l731415k359712
$$ -14713759 -14454940 -9487934 -1216893 6705402 10257494 8576965 4845550 2485838
5958B485838r63586j487003k113356p97413J534599K738218K375439J337229N6254
$$ 2485838 1522252 35249 -2078107 -2875520 -1340921 1397297 3772736 5109965 5166219
5949E166219j386496k357473k160663r90887K42553P18399L15269q6092O32885
$$ 5166219 3779723 1422250 -738413 -1729300 -1486747 -768348 -453079 -539171 93714
5940I3714K044194K106795O0110j942146j906815j199043k049547l275864k039654
$$ 93714 2137908 4244703 4304813 2362667 455852 -743191 -2792738 -6068602 -8108256
5931h108256Q86296J749836j25950j168677N72314K466334J952375N00045O16483
$$ -8108256 -7221960 -5472124 -5598074 -6766751 -6194437 -3728103 -1775728 -1275683 -659200
5922f59200J856486K302981J732005R69120n1184j488241k406137k149080j554902
$$ -659200 1197286 3500267 5232272 6201392 6150208 4661967 2255830 106750 -1448152
5913a448152j488468j606587j524011j487767j148382K85055K000684K090394
$$ -1448152 -2936620 -4543207 -6067218 -7554985 -8703367 -8418312 -6417628 -4327234
5905d327234P39876J41640N88727K055j768287k146234p46932n86582k192225
$$ -4327234 -3587358 -3445718 -2856991 -2854936 -4623223 -6769457 -7516389 -8102971 -10295196
5896a0295196j480096L052178N974005K659355k776938l238997O38816K142330
$$ -10295196 -11775292 -8723114 -2749109 -89754 -2866692 -6105689 -5466873 -3324543
5888c324543p65217l141289j488202J747842L214759K950386K027400L00514j614663
$$ -3324543 -4089760 -7231049 -8719251 -6971409 -3756650 -806264 1221136 1521650 -93013
5879i3013j680938L87948K127147J951751J197231J290104J417928L91928j298696
$$ -93013 -1773951 -1386003 741144 2692895 3890126 5180230 6598158 6990086 5691390
5870E691390k514644k778668j774584O04361K997142L201433Q05432k280822m196958
$$ 5691390 3176746 398078 -1376506 -772145 2224997 5426430 6231862 3951040 -245918
5861b45918m465718l099169m82186J725555J729586N43j268162j107704l36885
$$ -245918 -4711636 -7810805 -8292991 -6567436 -4837850 -4837307 -6105469 -7213173 -7550058
5852g550058M40844J175810J174784R9139m19004Q89130J691800j071522n398713
$$ -7550058 -7109214 -5933404 -4758620 -4659481 -5078485 -4189355 -2497555 -3569077 -8967790
5843h967790n832827j451051K506929K444902J057136J786063L165806K120995
$$ -8967790 -14800617 -16251668 -13744739 -11299837 -10242701 -8456638 -5290832 -3169837
5835c169837o73362k458279k672877k084331k01447K849240M275706K356656J29786
$$ -3169837 -3843199 -6301478 -8974355 -11058686 -11260133 -8410893 -4135187 -1778531 -1648745
5826a648745J163372L481585K453160j476294l250051j304301J97640j573126
$$ -1648745 -485373 2996212 5449372 3973078 723027 -581274 -383634 -1956760
5818a956760l774117k941444l13654R34474P33204R74789J393417K44585j799447
$$ -1956760 -5730877 -8672321 -8985975 -8051501 -7318297 -6343508 -4950091 -4705506 -6504953
5809f504953j913130N24510K663945K123832O5034q27983J64577J726565K765007
$$ -6504953 -8418083 -7893573 -5229628 -3105796 -3040762 -3868745 -3704168 -1977603 787404
5800G87404L045848K188509J8004j896565j068695K421479M785365K607151k697984
$$ 787404 3833252 6021761 6039765 4143200 3074505 5495984 10281349 12888500 10190516
5791A0190516o350799n842603l177209j389104j000723q56450n58928m17398r2751
$$ 10190516 3839717 -2002886 -5180095 -6569199 -7569922 -8426372 -8985300 -9402698 -9495449
5782i495449R48106K085198K165767J374811J231064K534750M201798M406444
$$ -9495449 -8547343 -6462145 -4296378 -2921567 -1690503 844247 5046045 9452489
5774I452489K412511p67834l169255l438232j989031n39148l61397j293783k471415
$$ 9452489 11865000 11097166 7927911 4489679 2500648 1961500 1600103 306320 -2165095
5765b165095l235073k969039j080478J912242M033852L851951K445639K028324
$$ -2165095 -5400168 -8369207 -9449685 -7537443 -3503591 348360 2793999 4822323
5757D822323K704508K192132o62377l588014l499495o84767J328146K85064j961311
$$ 4822323 7526831 9718963 9056586 5468572 1969077 1284310 2612456 2897520 936209
5748I36209k079723L72002K675761K589095N95755j571775k945700l231427k328859
$$ 936209 -1143514 -771512 1904249 4493344 5089099 3517324 571624 -2659803 -4988662
5739d988662j066450j077416k569041l321618j456689J720875L310516K438945
$$ -4988662 -6055112 -7132528 -9701569 -13023187 -14479876 -12759001 -9448485 -7009540
5731g009540N36622j153831k196575j736309P80708L701335M418166K746894Q09482
$$ -7009540 -6472918 -7626749 -9823324 -11559633 -10778925 -7077590 -2659424 87470 896952
5722H96952m93093k202771m124594l999197j109692J919631K531024J323176K86901
$$ 896952 403859 -1798912 -5923506 -9922703 -11032395 -9112764 -6581740 -5258564 -4971663
5713d971663L656O2329K67570m184j594755l332470k429900J181925L573036K112461
$$ -4971663 -4968007 -4905678 -4638108 -4642292 -6237047 -9569517 -11999417 -10817492 -7244456 -5131995
5703e131995o02137q67234O99771J323737J295936K659629M176345K573087j385256
$$ -5131995 -5734132 -6601366 -5901595 -4577858 -3281922 -622293 3554052 6127139 4741883
5694D741883k926095l40527K197513O54923l344592n172909l016526R84459L800204
$$ 4741883 1815788 1475261 3672774 4327697 983105 -4189804 -7206330 -6221871 -2421667
5685b421667L999523K204173K43638p22178j407702k762221l687983k436514K2929
$$ -2421667 1577856 3782029 4025667 3303489 1895787 -866434 -4554417 -6990931 -6968002
5676f968002P87116n03035j012495M95752J439336j54236j950719p90099K266890
$$ -6968002 -6180886 -6683921 -7696416 -7200664 -5761328 -5915564 -7866283 -8656382 -6389492
5667f389492L514607J998227K07517j41210l9428o43200j352554j284017p81171
$$ -6389492 -2874885 -876658 -669141 -810351 -849779 -1492979 -2845533 -4129550 -4910721
5658d910721m00994K81802J716882L038114K842745J088591p02826j306086j186508
$$ -4910721 -5311715 -5029913 -3313031 -274917 2567828 3656419 2953593 1647507 460999
5649D60999j509162k122544j511802Q76872L232447L374934J680234O45745J483256
$$ 460999 -1048163 -3170707 -4682509 -3805637 -573190 2801744 4481978 5127723 6610979
5640F610979K527507J617304r86191k895041k306528J54290K036840J329139j514422
$$ 6610979 9138486 10755790 9769599 6874558 4568030 4722320 6759160 8088299 6573877
5631F573877l852104l655035j755825n61031j007603k023569k577945k524644
$$ 6573877 2721773 -933262 -2689087 -3250118 -4257721 -6281290 -8859235 -11383879
5623a1383879j515191Q08755L130308L204196J200823J27259J618094L481633
$$ -11383879 -12899070 -12090315 -8960007 -5755811 -4554988 -4427729 -2809635 671998
5615F71998L234953J985096K239256L359640K302224j548588n143001n680741
$$ 671998 3906951 5892047 8131303 11490943 13793167 12244579 7101578 1420837
5607A420837l566631j031133L45284K38331o98052j143864k96659J014487J437779
$$ 1420837 -2145794 -3176927 -2831643 -2593312 -3291364 -4435228 -4731887 -3717400 -2279621
5598b279621J129589J276975J831740J508173Q1060j182708j577924j522189q83871
$$ -2279621 -1150032 126943 1958683 3466856 3547916 2365208 787284 -734905 -1618776
5589a618776R65542K957086K785756N49440p81219L4397L62523j664064l370161
$$ -1618776 -653234 2303852 5089608 5639048 4857829 4892226 5254749 3590685 220524
5580B20524j718424J218780J284478p92637m83808K747531M106216J148775k297354
$$ 220524 -1497900 -279120 1005358 212721 -271087 2476444 6582660 7731435 5434081
5571E434081k448914j303670k340880m036816k416169J909423M158020K293048
$$ 5434081 2985167 1681497 -659383 -4696199 -7112368 -5202945 -1044925 1248123
5563A248123p84402k098347j788582q78614N26031J729962J309361j99523k74908
$$ 1248123 463721 -1634626 -3423208 -4301822 -3775791 -2045829 -736468 -935991 -1210899
5554a210899J579952K564215R29138j083500o81781J437282K728742K460911J400345
$$ -1210899 369053 2933268 3862406 2778906 2097125 3534407 6263149 8724060 10124405
5545A0124405l46137k645701l955265l134366j475540p07109l77950M52882P01798
$$ 10124405 9778268 7132567 3177302 42936 -1432604 -2139713 -2517663 -2064781 -1362983
5536a362983o04427j407630M76443K823957J684536j990602l134561k87952K346333
$$ -1362983 -1967410 -3375040 -2898597 -74640 1609896 -380706 -3515267 -3803219 -1456886
5527a456886J839772P00070J699008K843454R86795k619519m129000k546480q1780
$$ -1456886 382886 1082956 2781964 5625418 6612213 3992694 -136306 -2682786 -2764566
5518b764566J507094J960112J136586n42522j203074L17256K269545K373249J298264
$$ -2764566 -1257472 702640 1839226 1296704 93630 410886 2680431 5053680 6351944
5509F351944J064333J097576p34130l622641m054765j084863J933644K066026
$$ 6351944 7416277 8513853 7779723 4157082 102317 -982546 951098 3017124
5501C017124M86167q1816O74433J159714P44162P5353o83315k019741l504318
$$ 3017124 3503291 3421475 4095908 5255622 5999784 6075137 5391822 3372081 -132237
5492a32237l496797j055031K406961M077368K607989l70826k204946k377158k487197
$$ -132237 -3629034 -4684065 -2277104 1800264 4408253 4037427 1832481 -544677 -3031874
5483c031874l030330k202065Q61613L536700K684816q04965k902142j538076J468084
$$ -3031874 -6062204 -8264269 -7402656 -3865956 -1181140 -1986105 -4888247 -6426323 -4958239
5474d958239L513400L894386L051627J398402k38387p28278q0515M43377J35592
$$ -4958239 -1444839 2449547 5501174 6899576 6661189 5932911 5852396 6295773 6431365
5465F431365m70754r10876j290185j282327l29389Q16887N41693j154410k389090
$$ 6431365 5960611 5049735 3759550 2477223 2147834 2964721 3506414 2352004 -37086
5456c7086k137897j438671j315237j399164j209760q04563L64774K842086M723428
$$ -37086 -2174983 -3613654 -4928891 -6328055 -7537815 -8342378 -7977604 -5135518 -412090
5447d12090K798457k417245n816137m048908k5781J520128L89466l59896J74203
$$ -412090 2386367 -30878 -5847015 -9895923 -9921704 -8401576 -8012110 -8372006 -8197803
5438h197803M88860M89503J477392K801468K368497N88498K49147J964787L052090
$$ -8197803 -7708943 -7219440 -5742048 -2940580 -572083 16415 265562 2230349 5282439
5429E282439J783919k26895j008028r60664j289753j854108j920952j456688p07013
$$ 5282439 7066358 6839463 5831435 4870771 3581018 1726910 -194042 -1650730 -2357743
5420b357743J24791L58774l75961p28608Q70457L096298K698736p79382l897941
$$ -2357743 -2232952 -1874178 -2250139 -2978747 -2108290 988008 3686744 2907362 -990579
5411i90579l878674j657133O90865K725047M276269M076920J851424m36171j348424
$$ -990579 -4869253 -6526386 -5835521 -3110474 1165795 5242715 7094139 6657968 5309544
5402E309544j820607k480294j747280J104179L639124L805859L271887M034634
$$ 5309544 3488937 1008643 -738637 365542 4004666 7810525 11082412 15117046
5394A5117046M217377J229773k890733l921548k082068j427773l086166m015423
$$ 15117046 19334423 20564196 17673463 13751915 11669847 10242074 7155908 3140485
5386C140485k785564j637963j650553o02068K359917M173713K651399K84841K14968
$$ 3140485 354921 -1283042 -2933595 -3535663 -1175746 2997967 5649366 5934207 6149175
5377F149175J225933J32504k779864m101615k175207J124294L028366K271104
$$ 6149175 7375108 7507612 4727748 626133 -1549074 -424780 2603586 4874690
5369D874690n73763l351052l477692m88880K943005L736486J578274j522938l750465
$$ 4874690 4300927 949875 -2527817 -3016697 -73692 3662794 5241068 3718130 -32335
5360c2335m297662k852817N975K473760K994694J764708O135j416022j933294
$$ -32335 -4329997 -7182814 -7176839 -4703079 -1708385 56323 62458 -1353564 -3286858
5351c286858j161447N1207j11189j735355k228347J71900L280001L499816N57522
$$ -3286858 -4448305 -4397098 -4508287 -6243642 -8471989 -8300089 -5020088 -1520272 -962750
5342i62750k492703l390829k617568j506757n32909L03605R36721J355729J418139
$$ -962750 -3455453 -6846282 -9463850 -10970607 -11503516 -11199911 -10263190 -8907461 -7489322
5333g489322Q85993L63049J145288K990326L416850R57289k247804l285930k621608
$$ -7489322 -6603329 -6240280 -5094992 -2104666 1312184 2269473 21669 -3264261 -5885869
5324e885869k680538l274341j833442J858340M572767M079821J802617n4320j401650
$$ -5885869 -8566407 -11840748 -13674190 -11815850 -7243083 -3163262 -1360645 -1414965 -2816615
5315b816615k777934l207885j629392P58249J528715J39038j269960m11405K286623
$$ -2816615 -5594549 -8802434 -10431826 -9673577 -8144862 -8005824 -9275784 -9687189 -7400566
5306g400566L821676K104990j012513j717674M56931J717912j47125j951045k29683
$$ -7400566 -3578890 -1473900 -2486413 -4204087 -3747156 -2029244 -2176369 -4127414 -4357097
5297d357097K441456J031865l362347m287017K36969M414786L285565m89438j643043
$$ -4357097 -1915641 -883776 -4246123 -8533140 -8296171 -3881385 -595820 -1085258 -2728301
5288b728301Q9677J298047P57596j31875p20637j162655o42983J040668J607779
$$ -2728301 -2638624 -1340577 -582981 -714856 -1435493 -2598148 -3241131 -2200463 -592684
5279e92684n45829k699655j080249L166807N226031L433540Q51081j22579o19789
$$ -592684 -1138513 -3838168 -4918417 -1751610 3474421 6907961 7759042 7636463 7016674
5270G016674j793357k260900r51851M92958M34325R1817J252157K723666J737131
$$ 7016674 5223317 2962417 2010566 2503524 2937849 3029666 4281823 7005489 8742620
5261H742620j733300m425226l772750p62755J678480J952807P24776o38184j503134
$$ 8742620 7009320 2584094 -1188656 -1951411 -272931 1679876 2404652 1766468 263334
5252B63334j806814j360417j22572J048295Q66269p58496k230589k003043l92788
$$ 263334 -1543480 -2903897 -3026469 -1978174 -1111905 -1870401 -4100990 -6104033 -6496821
5243f496821R33881R76518K17703m69482j007743j866883k931518l155255j742212
$$ -6496821 -5562940 -4586422 -4368719 -4838201 -5845944 -7712827 -10644345 -13799600 -15541812
5234a5541812M74966J580155Q50319k82218k00119Q34709J609243J980229K393244
$$ -15541812 -15066846 -13486691 -12636372 -12918590 -13118709 -12284000 -10674757 -8694528 -6301284
5225f301284K238820Q57055k80787R77082L676845M176781J074574k887369m783998
$$ -6301284 -4062464 -3205409 -3486196 -2509114 1167731 5344512 6419086 3531717 -1252281
5216a252281m664145l490582r33392K616735M407614K474226j242452l389087
$$ -1252281 -5916426 -9407008 -10340400 -7723665 -3316051 -841825 -2084277 -5473364
5208e473364l326830k502310j430096k4913N16094p85866k215113j327166J201766
$$ -5473364 -8800194 -11302504 -12732600 -12757513 -12241419 -13027285 -15242398 -16569564 -15367798
5199a5367798K480806J729476R50358J449212K266631K173491J067077o14795
$$ -15367798 -12886992 -11157516 -10207158 -8757946 -6491315 -4317824 -3250747 -3865542
5191c865542k029166j869841n0829J265398M18492r34374k60585J646882K015861
$$ -3865542 -5894708 -7764549 -7815378 -6549980 -6131488 -7065862 -7326447 -5679565 -3663704
5182c663704Q48195O86677J841414J765777k57309j643098r55158l38535j686034
$$ -3663704 -2815509 -2128832 -287418 1478359 1221050 -422048 -1377206 -1715741 -3401775
5173c401775l264672k372782O45023L088485L308884J866761K15746o78683r89887
$$ -3401775 -6666447 -9039229 -8394206 -5305721 -1996837 -130076 85670 -593013 -1582900
5164a582900j637792k686189k729221j020279R52473J889428L089319N548205
$$ -1582900 -3220692 -5906881 -8636102 -9656381 -8703908 -6814480 -3725161 1823044
5156A823044O387784K534976k982482l822837K36267K413659r07788m885844m015008
$$ 1823044 8210828 10745804 7763322 3940485 4176752 6590411 5682623 796779 -3218229
5147c218229J412K107498J298773k09556j629371k794497j713829K248471N169230
$$ -3218229 -3216817 -1109319 189454 -20102 -1649473 -4443970 -6157799 -3909328 1259902
5138A259902L384770n64699j725868m47965p50885k506491j669962J842895L046031
$$ 1259902 4644672 4079973 2354105 1906140 1155255 -1351236 -3021198 -1178303 1867728
5129A867728m5185l098287k422615j36053L74252l15458k12596Q4673m78455l23045
$$ 1867728 1822543 -1275744 -3698359 -3834412 -3460160 -3775618 -3988214 -3903541 -4381996 -4705041
5119d705041J914183L797928K283796j176961k617480j511442p97630j496981
$$ -4705041 -2790858 1007070 3290866 2113905 -503575 -2015017 -2812647 -4309628
5111d309628j411382M05540J728158R94683j44792R3528O34692j36812j048668
$$ -4309628 -5721010 -5315470 -3587312 -2592629 -2737421 -2643893 -2009201 -2146013 -3194681
5102c194681K40369L296894N049242L601898p051l654374n833233n491948k276515
$$ -3194681 -2954312 342582 5391824 8993722 8986671 5332297 -500936 -5992884 -8269399
5093h269399K206692M832871L835937O86401j499383r67944J431063L276833K633302
$$ -8269399 -6062707 -1229836 2606101 3292502 1793119 825175 2256238 5533071 8166373
5084H166373j73680k661327k759739j115588J42729M66040R99202J893819J914308
$$ 8166373 7992693 5331366 2571627 1456039 1598768 2064808 3064010 4957829 6872137
5075F872137J153342J456682L008482L203093O88974k068560k600109k333594
$$ 6872137 8025479 9482161 12490643 15693736 16382710 14314150 11714041 9380447
5067I380447l679235n351833m351564j286193L31500l80319p90280M74356J660524
$$ 9380447 5701212 349379 -4002185 -5288378 -4956878 -5337197 -6127477 -5653121 -3992597
5058c992597J436198P90855L47103j020752l461873m759169l249777n8062K807323
$$ -3992597 -2556399 -1765544 -1418441 -2439193 -5901066 -10660235 -13910012 -13968074 -11160751
5049a1160751M629171N267878M346706K306151N25395n19935j583613k613014
$$ -11160751 -6531580 -1263702 3083004 5389155 5914550 5394615 3811002 1197988
5041A197988k354931o04807J122679J736942J492355N77493r56943j799870o35247
$$ 1197988 -1156943 -1761750 -639071 1097871 2590226 3167719 2210776 410906 -224341
5032b24341J052282N69800j301019r52903J926572L119616M71076k505648k208647
$$ -224341 827941 1397741 96722 -856181 1070391 4190007 4661083 2155435 -53212
5023e3212k92763j30763j161957o64673J074593J361144k98743j643540j230986
$$ -53212 -345975 -476738 -1638695 -2303368 -1228775 132369 -166374 -1809914 -3040900
5014c040900Q5384R69670R50271K48753n01580q97612j587236l138238l973351
$$ -3040900 -2955516 -1985846 -1035575 -786822 -1288402 -2186014 -3773250 -6911488 -10884839
5005a0884839j819762K222718M047236K193240M8182P04334K658000K734400N18008
$$ -10884839 -12704601 -10481883 -6434647 -4241407 -4193225 -3488891 -830891 1903509 2421517
4996B421517k322944m531397n012577k789661O85536J914779J23478j198140M85775
$$ 2421517 98573 -4432824 -9445401 -12235062 -11549526 -9634747 -9511269 -10709409 -10223634
4987a0223634L162605L966701K939171Q27013k869284o816185p023385k621324
$$ -10223634 -7061029 -3094328 -155157 671856 -2197428 -9013613 -16036998 -18658322
4979a8658322J490444J489649O9272R71657K471341J378097m35701O28903L135807
$$ -18658322 -17167878 -15678229 -15608957 -14637300 -12165959 -10787862 -11223563 -10594660 -7458853
4970g458853L198522J396464J140134K045275Q62148k261505l929858k990352
$$ -7458853 -4260331 -2863867 -1723733 321542 1183690 -1077815 -5007673 -7998025
4962g998025j115147R08893L004115L444493J101532j615146k186040k070749
$$ -7998025 -9113172 -8204279 -5200164 -1755671 -654139 -2269285 -4455325 -6526074
4954f526074l157773l221799k7016L164782K021963j593717k656486o52532J541648
$$ -6526074 -9683847 -12905646 -12932662 -9767880 -7745917 -9339634 -11996120 -12648652 -11107004
4945a1107004L346069M858232L160513k635727o298866k498789L467742K902455
$$ -11107004 -7760935 -2902703 257810 -2377917 -8676783 -11175572 -7707830 -4805375
4937d805375k407270l543894N10632K156788j222067l959795l036188j869538
$$ -4805375 -7212645 -10756539 -10245907 -8089119 -9311186 -13270981 -16307169 -18176707
4929a8176707j837175J50185L840508M616509K057081Q33745J718043N32194k726637
$$ -18176707 -20013882 -19863697 -16023189 -11406680 -9349599 -8515854 -6797811 -6265617 -8992254
4920h992254k894198P48222K897204J629652M10345j49977k948214o046335l993398
$$ -8992254 -11886452 -11138230 -8241026 -6611374 -6201029 -6351006 -9299220 -15345555 -19338953
4911a9338953J451231K580819j194272k722738m99604m47831k973059j532310
$$ -19338953 -17887722 -15306903 -16501175 -19223913 -19723517 -20171348 -23144407 -24676717
4903b4676717L566993L754862k243406n377503k373116o02612l069446l437598
$$ -24676717 -21109724 -17354862 -19598268 -24975771 -27348887 -27951499 -31020945 -34458543
4895c4458543k29802m18063m407664l833773J226833P30531n055730l828590M717548
$$ -34458543 -34688345 -35106408 -39514072 -43347845 -42121012 -41390481 -46446211 -50274801 -45557253
4886d5557253N641455l491002o689157j96254p86866j1821329j3082219l65985
$$ -45557253 -39915798 -43406800 -50095957 -50292211 -51079077 -62900406 -75982625 -76348610
4878g6348610R38733j6540626k2407223p594838j5911636o6272575q7567951n512567
$$ -76348610 -75409877 -91950503 -114357726 -121952564 -137864200 -204136775 -291704726 -297217293
4870b97217293J28329547J79222719J03711311P21666l0922505q410705m38906
$$ -297217293 -168887746 10334973 114046284 114767950 83845445 75434740 74995834
4863G4995834j6161808j8215078j850495L958968n596155p511530K652935N707908
$$ 74995834 58834026 40618948 38768453 42727421 37131266 29619736 32272671 37980579
4855C7980579k790611o726349j529664M61n290705o044886J16068K830311M7253
$$ 37980579 35189968 28463619 26933955 26934416 21643711 15598825 15714893 18545204 18592457
4846A8592457O57124N076710L993546k367377l375082K147797L708722j457378
$$ 18592457 19249581 24326291 28319837 25952460 22577378 24725175 28433897 26976519
4838B6976519m280928j231374P12173j178691j153726K010154K319274p88466
$$ 26976519 22695591 21464217 22176390 20997699 19843973 21854127 24173401 23384935
4830B3384935r52914J926029O82716m865640o254758j435154J744673q9112r25259
$$ 23384935 22432021 24358050 25040766 20175126 13920368 12485214 14229887 14140775 13215516
4821A3215516J937990K834365q18456l675323k913705k549804l797418k013385
$$ 13215516 15153506 17987871 17169415 13494092 10580387 8030583 4233165 2219780
4813B219780L127004N147569K185481L33892J895177J146311l913207o508851
$$ 2219780 5346784 10494353 12679834 13013726 14908903 16055214 12142007 5633156
4805E633156k977760O18737n05505j987557M10038K828706J270501q22435J91188
$$ 5633156 2655396 3274133 2768628 781071 1191109 4019815 5290316 4467881 4659069
4796D659069R31059j981817m566662k323763J536673J786913j8350P01510L280540
$$ 4659069 5590128 3608311 -958351 -3282114 -1745441 41472 23122 724632 4005172
4787D005172L827821K216990J322853J858097K490688K602248J580008j554310
$$ 4005172 7832993 10049983 11372836 13230933 15721621 18323869 19903877 18349567
4779A8349567n103040n107064j333362J539000J122280N14765J537005P80692
$$ 18349567 13246527 8139463 6806101 8345101 9467381 9982146 11519151 12299843
4771A2299843l610938o979867m913408k01907J901628J212615O71413P65103O42028
$$ 12299843 8688905 1709038 -3204370 -3406277 -1504649 -292034 379379 1144482 1786510
4762A786510J411476L812857N427373M042880J116556j033161k297814k762926
$$ 1786510 3197986 7010843 12438216 16481096 17597652 16564491 14266677 11503751
4754A1503751j751341j014325l641597p315015n168873K924349P258652K057918
$$ 11503751 9752410 8738085 5096488 -2218527 -7387400 -4463051 2795601 4853519
4746D853519m817146l378012L419203N156111J93259l438103j393977K193400
$$ 4853519 36373 -3341639 77564 5233675 5426934 1988831 594854 2788254
4738B788254L187922K434494J296454q04992k912207k340719N46931K101839R63851
$$ 2788254 5976176 8410670 9707124 8902132 5989925 3649206 4196137 6297976 7261827
4729G261827m18447n18339o71964j475696j384893n3053N36779n14923j510871
$$ 7261827 6843380 6325041 5653077 4177381 2792488 2739435 3276214 2761291 1250420
4720A250420j077900J6687P30442J048229Q58513k38058j477194j245445O84049
$$ 1250420 172520 189207 919649 1967878 2826391 2588333 1111139 -134306 549743
4711E49743K702964L235700J884568q01611l398389m114371k515275o4869J794879
$$ 549743 3252707 6488407 8372975 7571364 4172975 58604 -2456671 -2521540 -726661
4702g26661K743159K269582k37274l004473k679218M60278J650920j217415l427704
$$ -726661 2016498 4286080 4048806 1044333 -1634885 -1174607 476313 -741102 -4168806
4693d168806m19400M556491N025783J009535j859207j590845j719625l710395
$$ -4168806 -4588206 -31715 4994068 6003603 4144396 2553551 833926 -2876469
4685b876469l852236J84101M683194M808942J013896k254761k252717n3760J809623
$$ -2876469 -6728705 -6544604 -1861410 2947532 3961428 1706667 -546050 -599810 1209813
4676A209813J969289Q40834l94810j222036j932441k336946j586751K9698P34728
$$ 1209813 3179102 4019936 3625126 2403090 470649 -1866297 -3453048 -3423350 -2688622
4667b688622m6139m19431Q77241K068555J286666K4358P68760K648544K671300
$$ -2688622 -2734761 -3154192 -2276951 -208396 1078270 1102628 1871388 4519932 7191232
4658G191232M67778j348143j179954J1964R29653J125202J91764j788845l121555
$$ 7191232 7659010 6310867 5130913 5142877 6072530 7197732 7389496 5600651 2479096
4649B479096k074143M57779J770195P18914j267547k128786q37883K043564M269965
$$ 2479096 404953 862732 2632927 3351841 2084294 -44492 -882375 1161189 5431154
4640E431154L622263R10852m57556Q19255K032005R04633r80806j546250j799147
$$ 5431154 9053417 9964269 9506713 10325968 12357973 13262606 12281800 10735550 8936403
4631H936403k934570l078854p84746J263518M81872o09151J221174L258400Q31536
$$ 8936403 6001833 2922979 2138233 3401751 3883623 3274472 4495646 7754046 8585582
4622H585582l930655m407059l7263K655099M25136k241360j169673J148494M72594
$$ 8585582 4654927 247868 210605 2865704 3290840 1049480 -120193 1028301 1500895
4613A500895k559154m163657k667322O52472L624468M320082K345466N2955J72184
$$ 1500895 -1058259 -5221916 -7889238 -7236766 -3612298 707784 3053250 3106205 3278389
4604C278389J869578J973283J40983p79649J45367N19919p80987j540404q0093
$$ 3278389 5147967 7121250 7262233 6482584 6627951 7147870 6366883 4826479 4746386
4595D746386K224260L476302L158837R54804k723897m732980k101030K423232
$$ 4746386 6970646 10446948 13605785 14560589 11836692 7103712 5002682 7425914
4587G425914K639337k111871n507693l658851l86180j64513j209039K13998K962933
$$ 7425914 10065251 7953380 2445687 -1213164 -1599344 -1763857 -2972896 -2758898 204035
4578B04035L336331J246092m35269o79376o12388o13189l10194p5317k1332Q45887
$$ 204035 3540366 4786458 4351189 3671813 3059425 2446236 2136042 2060725 2039393 2885280
4568B885280K447939K772047J151284k01819k5996l09073k236332l194642j099535
$$ 2885280 5333219 8105266 9256550 9054731 9028735 8719662 6483330 3288688 2189153
4559B189153J387340Q00980j539356j933548k14711Q40559M01186j13088l41899
$$ 2189153 3576493 4377473 2838117 904569 689858 1530417 1931603 1818515 1476616
4550A476616p98657n20314J331101K553391N32595k868178l087748M87735L460669
$$ 1476616 677959 157645 1488746 4042137 4574732 1706554 -1381194 -893459 2567210
4541B567210K591187k38972j273765L93851K551841K777254P09526j822230k653057
$$ 2567210 5158397 4919425 3645660 4039511 6591352 9368606 10078132 8255902 5602845
4532E602845j504549J38147J323879K282745K558148R11271j919244l075896j815989
$$ 5602845 4098296 4236443 5560322 7843067 10401215 11312486 9393242 6317346 4501357
4523D501357j076044k692927m019960k166388J091444K060630O06552o80603q84981
$$ 4501357 3425313 732386 -3287574 -5453962 -4362518 -2301888 -1695336 -2375939 -3260920
4514c260920o29931P27272L738996N941935M339572P2200l023281l616688l015592
$$ -3260920 -3890851 -3163579 575417 6517352 10856924 10929124 7905843 4289155 1273563
4505A273563j354805J929431M557686L212369r05822k883873j103247Q76932L55906
$$ 1273563 -81242 1848189 6405875 9618244 8712422 5828549 4725302 5602234 5958140
4496E958140r30540q22930l09654q71213j513772r12507l6702k57630p29055P8636
$$ 5958140 5027600 4204670 3895016 3023803 1510031 597524 560822 303192 -425863 -347227
4486c47227J531772J583586k33266k064050j878669L08203K338962K120576J15307
$$ -347227 1184545 2768131 2534865 470815 -1407854 -1099651 1239311 3359887 3475194
4477C475194j110321l06201Q74778P83323M25617J242624K030238Q29929j446926
$$ 3475194 2364873 2058672 2933450 3716773 4142390 5385014 7415252 8245181 6798255
4468F798255k379883k010042k107758k252878m11392K746417L920625K007918
$$ 6798255 4418372 2408330 300572 -1952306 -2363698 382719 4303344 6311262
4460F311262n58066j752783j892138j155235J160984L868972L853773M06071l164430
$$ 6311262 5753196 4000413 2108275 953040 2114024 5982996 9836769 10242840 7078410
4451G078410l713206j773263J33440M29816r81369k741144k171250J904572O161168
$$ 7078410 3365204 1591941 1725381 2155197 1173828 -1567316 -3738566 -1833994 4327174
4442D327174N772250R37924l064062l099148j563646j286577j238270L62755K265309
$$ 4327174 10099424 11037348 7973286 4874138 3310492 2023915 785645 1148400 3413709
4433C413709K351415R56679m17802j415206j891289j159029L7077m54150k358510
$$ 3413709 5765124 6721803 6304001 4888795 2997506 1838477 1875554 1421404 -937106
4424i37106k264303J084592M023589L119996k6915k008527k487445k572185j421131
$$ -937106 -3201409 -2116817 1906772 5026768 4999853 2991326 503881 -2068304 -3489435
4415c489435J545153L556168J908178j350658k263410q91204k24616n89800K94624
$$ -3489435 -1944282 1611886 3520064 2169406 -94004 -985208 -1209824 -1799624 -1505000
4406a505000K353523K761595O75283j430807j512425N0884K169681L770285L162620
$$ -1505000 848523 3610118 4285401 2854594 1342169 1393053 3562734 7333019 10495639
4397A0495639r5103l037267k378678N40945J497073k24308j305890m33163j99202
$$ 10495639 10400536 7363269 4984591 5525536 7022609 6798301 5492411 5059248 4860046
4388D860046j803848k425373j33629K449297K255040M90875J71856J255188J448864
$$ 4860046 3056198 630825 497196 2946493 5201533 5692408 5864264 7119452 8568316
4379H568316L22239n19508n47604q05627j588072k004158j915192k282922l200263
$$ 8568316 8890555 8371047 7823443 7017816 5429744 3425586 1510394 -772528 -3972791
4370c972791l201163j264798J473887K776548J712225m32017j567191q92505N20999
$$ -3972791 -7173954 -8438752 -6964865 -4188317 -2476092 -2908109 -4475300 -5367805 -4846806
4361d846806J114459M64295o03776j054803m25442R70609K115565K034324J007509
$$ -4846806 -3732347 -3268052 -3871828 -4926631 -5352073 -4381464 -2265899 -231575 775934
4352G75934M41090Q83647R93806n21467k748580l663061k756441j121841N31462
$$ 775934 1217024 2100671 3094477 2573010 -175570 -3838631 -6595072 -7716913 -7185451
4343g185451K272275L690975M055418L695427L544790L270478J557201j609219
$$ -7185451 -4913176 -1222201 2833217 6528644 10073434 13343912 14901113 13291894
4335A3291894m587243o112147o026546m108333l97184L034268L208084K03816
$$ 13291894 8704651 2592504 -3434042 -7542375 -7939559 -4905291 -1697207 -1493391
4327a493391k235945j443175Q25352J416725K97812j62748Q04712J568648R75659
$$ -1493391 -3729336 -5172511 -4347159 -2930434 -2632622 -2795370 -1990658 -422010 553649
4318E53649j21923n44365m56340p68249j729085k610783k460055j068441N79495
$$ 553649 431726 -112639 -568979 -1337228 -3066313 -5677096 -8137151 -9205592 -8626097
4309h626097J006772k46137j904399k019519K03961L502950N316170L908561L57032
$$ -8626097 -7619325 -7865462 -9769861 -11789380 -11585419 -8082469 -2766299 1142262 1499294
4300A499294k030346j216190J069012J609437P3487q09610M43940J900670J357991
$$ 1499294 -531052 -1747242 -678230 931207 1004694 195084 639024 2539694 3897685
4291C897685m19926j313582j164637j423444k337650k566886j392130M02158J891998
$$ 3897685 3477759 2164177 999540 -423904 -2761554 -5328440 -6720570 -6318412 -4426414
4282d426414K843423L059926K206191O52618m80351n70471k05786m03420j537096
$$ -4426414 -1582991 1476935 3683126 4335744 3855393 3284922 3079136 2675716 1138620
4273A138620l075479l949562l247240j076056J230236K214249J694075P92600
$$ 1138620 -1936859 -5886421 -9133661 -10209717 -8979481 -6765232 -5071157 -4278557
4265d278557N90415J011612J106456L71706l10061N29533K813947M178571K454918
$$ -4278557 -3688142 -2676530 -1570074 -1198368 -1508429 -978896 1835051 6013622 8468540
4256H468540j306137l734273l274839j780055j328383j351914l92820R40258J025011
$$ 8468540 7162403 3428130 153291 -1626764 -2955147 -4307061 -4699881 -3759623 -2734612
4247b734612L34019R07805K727275L101268N21853k817445l698733j839933K44352
$$ -2734612 -2400593 -1492788 1234487 4335755 4857608 2040163 -1658570 -3498503 -3254151
4238c254151O52256o7637l95773P3164N48896M39235R0879L6282n992p75890k055831
$$ -3254151 -2601895 -2669532 -3065305 -2992141 -2443245 -2004010 -1913131 -1876849 -1882841 -2658731 -4714562
4227d714562k290508k98871K817932M258139K391436j273661l463128k570635
$$ -4714562 -7005070 -7303941 -4486009 -227870 2163566 889905 -2573223 -5143858
4219e143858l78058Q9924j682882k958610j296575K031043L497747J878743l01541
$$ -5143858 -5521916 -5431992 -7114874 -10073484 -11370059 -9339016 -5841269 -3962526 -4264067
4210d264067k25742J863182L553298L197258R51348j996527m066211m013085k163021
$$ -4264067 -4489809 -2626627 926671 4123929 5075277 3078750 -987461 -5000546 -7163567
4201g163567k64516P09787J594550K956507L453537J801166r72097l102916m569211
$$ -7163567 -7428083 -6718296 -5123746 -2167239 1286298 3087464 2115367 -987549 -5556760
4192e556760n671889m602957J63755N675443O734619K995976j4733J488465M526169
$$ -5556760 -11228649 -15831606 -15667851 -9992408 -3257789 -261813 -276546 1211919 5738088
4183E738088M340240J198064j191781j765047k442551l341769k067855J501739
$$ 5738088 10078328 11276392 10084611 8319564 5877013 2535244 467389 1969128
4175A969128L513916J267461k423963k573184J396927M928031M182214M72863
$$ 1969128 5483044 6750505 4326542 1753358 3150285 8078316 12260530 12733393
4167A2733393k096699j880532q12835q02164j163812m66949P54495Q03021n13222
$$ 12733393 10636694 8756162 7943327 7141163 5977351 5510402 6264897 7067918 6554696
4158F554696j753061k021735j664791j044488k64629J12423k30403l27970M85582
$$ 6554696 4801635 2779900 1115109 70621 -194008 -81585 -311988 -639958 -154376
4149a54376P30923q03460j834616P0358J446342l662556j2657733j3913911k202710
$$ -154376 576547 -226913 -2061529 -1991171 -544829 -4207385 -16865118 -30779029 -32981739
4140c2981739J1546733J3230828M147915k223804R1030L341628N95699l785008
$$ -32981739 -21435006 -8204178 -4056263 -6280067 -6189037 -2847409 -2251710 -6036718
4132f036718k948026J294875K855813J467457J174438K084836Q27653k261493
$$ -6036718 -8984744 -7689869 -4834056 -3366599 -2192161 -107325 720328 -1541165
4124a541165l070431p19325J118214N38304o5742R46529J494274r9012j746415
$$ -1541165 -4611596 -5330921 -4212707 -3674403 -3740145 -2793616 -1299342 -1398354 -3144769
4115c144769r29201J246705J910479O47138m66066r2087R72393J240202J84407
$$ -3144769 -4073970 -2827265 -916786 -269648 -735714 -827801 144592 1384794 1569201
4106A569201j277282j410584N72330K959757K754656p48386m386820m206930L5513
$$ 1569201 291919 -1118665 -546335 2413422 5168078 4419692 32872 -4174058 -4138545
4097d138545M253954M249460L24499k881983j644935K314904L890921J116158
$$ -4138545 115409 4364869 4689368 1807385 162450 2477354 6368275 7484433
4089G484433k458286k844002p84198K33581p10165j552294j167869n66461l76830
$$ 7484433 5026147 2182145 1397947 1631528 921363 -630931 -1798800 -2365261 -2742091
4080b742091r5145k6488j161706k691365k367155M1187K253517K993313L154008
$$ -2742091 -2837236 -2863724 -4025430 -6716795 -9083950 -9042763 -6789246 -3795933 -641925
4071f41925K834654O69911k477907k816794R14907M461736L668617M64429m63372
$$ -641925 2192729 2862640 384733 -2432061 -1517154 2944582 6613199 7077628 6614256
4062F614256J063678J191696j094165k295838l02422K140140J741367n60578j630633
$$ 6614256 7677934 8869630 7775465 5479627 5177205 7317345 9058712 8498134 6867501
4053F867501j076958j328410l240265m232340j834078K375367M113189J641624
$$ 6867501 5790543 4462133 1221868 -3010472 -4844550 -2469183 1644006 3285630
4045C285630j903416k375032L39208K734285K478616O16255j058999k333720l283437
$$ 3285630 1382214 -992818 -653610 2080675 4559291 5175546 4116547 1782827 -1500610
4036a500610k891549p21548J471396J576829k64178k183457k848302k175027q60326
$$ -1500610 -4392159 -5113707 -3642311 -2065482 -2329660 -4513117 -7361419 -9536446 -10396772
4027a0396772j34617p08666j228828L63524L077617L158303k25403k721936j029019
$$ -10396772 -10531389 -11240055 -12468883 -12105359 -9027742 -5869439 -6094842 -8816778 -9845797
4018i845797J728904R24768j836234j256768K639910M128588R41774k082509o61238
$$ -9845797 -8116893 -7192125 -9028359 -10285127 -7645217 -3516629 -2574855 -4657364 -5318602
4009e318602K566409K536364r41116l818056l439847n85629K426462L298514J036185
$$ -5318602 -2752193 -215829 -1156945 -4975001 -8414848 -9000477 -6574015 -3275501 -2239316
4000b239316k286757k825492K7898K075395R0026l173854k913864O94337L284089
$$ -2239316 -4526073 -7351565 -7323667 -5248272 -5158246 -8332100 -11245964 -10551627 -7267538
3991g267538L034792K322652K586225J873503j030532l550168k781381K14054
$$ -7267538 -4232746 -1910094 676131 2549634 1519102 -2031066 -4812447 -4598393
3983d598393J998029J301219k36063j026147j036415n57790M91879J646946J874636
$$ -4598393 -2600364 -1299145 -1535208 -2561355 -3597770 -4155560 -3663681 -2016735 -142099
3974a42099J135431P02394J193268J556331J078203J050552K593832L766972J498104
$$ -142099 993332 1695726 2888994 4445325 5523528 6574080 9167912 12934884 14432988
3965A4432988l518027o662099n150084j385566R50019J479201J495226M67381
$$ 14432988 10914961 4252862 -897222 -2282788 -1332769 146432 1641658 2109039
3957B109039k203095l849418j504271K509539K821209q05357k614704K63559L164727
$$ 2109039 -94056 -3943474 -5447745 -2938206 -116997 -922354 -3537058 -3273499 -108772
3948a08772J190802l173648m092704j064269J351142J013182M73461J771675L308156
$$ -108772 1082030 -2091618 -6184322 -7248591 -5897449 -4884267 -4410806 -2639131 669025
3939F69025L100577J973598J794008K436238K071737l29537l585745n035865k805656
$$ 669025 3769602 5743200 7537208 9973446 12045183 11715646 8129901 3094036 288380
3930B88380J969116N517415M879585P28078l674890n448295l557203R65626M925070
$$ 288380 2257496 7774911 12654496 13382574 9707684 4259389 702186 1667812 6592882
3921F592882M813281P03362l079893l129379j154564o48759j368358o89857R61741
$$ 6592882 11406163 12109525 9029632 5900253 4745689 4096930 2728572 2038715 3000456
3912C000456N22513k083016l255946j431136P15556J043843R13717J585971J533241
$$ 3000456 3522969 1439953 -1815993 -3247129 -2531573 -1487730 -574013 1011958 2545199
3903B545199k22792j548227q01076J02267o60851j096106R04736K772186Q33631
$$ 2545199 2322407 774180 -26896 75371 -585480 -1681586 -776850 1995336 2828967
3894B828967k956980l031782J342537M636617K949208j078867k859816j653095
$$ 2828967 -128013 -3159795 -1817258 2819359 5768567 4689700 1829884 176789
3886A76789K90038J317701Q66628j105162k916260j717346K306696M511090J523909
$$ 176789 466827 1784528 2651156 1545994 -1370266 -3087612 -780916 3730174 5254083
3877E254083l423462m388537p84755K325683J718093l05664n33664O99227J544212
$$ 5254083 1830621 -2557916 -3342671 -1016988 701105 395441 -138223 561004 2105216
3868B105216J980574K596145K364361M78913j203596n11322J268097R79709j506592
$$ 2105216 4085790 6681935 9046296 9525209 8321613 7810291 9078388 10058097 8551505
3859H551505l090522k277737j144763j577956k365728j712411m84175p33346k162019
$$ 8551505 5460983 3183246 2038483 460527 -1905201 -3617612 -4101787 -4835133 -6997152
3850f997152k286533K9198K838554L365085J284869p49245q7905K444144L004633
$$ -6997152 -9283685 -9254487 -6415933 -3050848 -1765979 -2515224 -2603129 -158985 2845648
3841B845648l69929m376447m062066N50346M193493L255702P7739j067825L76064
$$ 2845648 2475719 -1900728 -5962794 -5412448 -1218955 2036747 2114486 1046661 1422725
3832A422725J837753J801890Q28707k69275q31481L4272J958169K446490j08147
$$ 1422725 3260478 5062368 5891075 5621800 4790319 4824591 6782760 9229250 9121103
3823I121103l468038m118719k039401k62000k75018p60006o78257o26731q46165
$$ 9121103 5653065 1534346 -505055 -767055 -1042073 -1802079 -2480336 -3107067 -3953232
3814c953232o15734j53690o94704k126571k738098j753870r5532J477848K782548
$$ -3953232 -4568966 -4722656 -5417360 -7543931 -10282029 -12035899 -12131431 -10653583 -7871035
3805g871035K941864J390246K0043J177638L416874K832505r12690l856907l904286
$$ -7871035 -4929171 -3538925 -3518882 -2341244 1075630 3908135 2995445 -861462 -4765748
3796d765748l297660l406254j976244J667415L536873J129447j517260J94641
$$ -4765748 -8063408 -11469662 -13445906 -11778491 -8241618 -7112171 -8629431 -8434790
3788h434790L802927L741577L89930j049939O36663J510646Q1383l53467J704640
$$ -8434790 -4631863 -890286 -500356 -1550295 -913632 597014 678397 324930 2029570
3779B029570K824177N10759k516292k761575r22707M15450R02978J388313J380963
$$ 2029570 4853747 5364506 2848214 86639 -836068 -420618 482360 1870673 3251636
3770C251636L33247o58205q31922j327165k553193k469472j52271J465978k09272
$$ 3251636 3584883 2926678 2094756 767591 -1785602 -4255074 -4407345 -2941367 -3150639
3761c150639k683365j836299J384004K312763R6912r86121J453203M115568L293491
$$ -3150639 -5834004 -7670303 -6286299 -3973536 -3876624 -4862745 -3409542 706026 3999517
3752C999517L37058r95379j78941J82976j247860l137980l918472l173891p87300
$$ 3999517 4336575 3341196 3162255 3345231 2097371 -1040609 -4959081 -8132972 -8920272
3743h920272K962620O099377N883197K149403j646286k017788N67059K431762
$$ -8920272 -5957652 141725 6024922 8174325 6528039 4510251 5077310 7509072
3735G509072J123297k051315m095427l834137k487379j328201k07665J138271
$$ 7509072 8632369 6581054 2485627 -1348510 -3835889 -5164090 -5371755 -4233484
3727d233484J631332J92193j885134j771059J036934L250895J623028k615738
$$ -4233484 -2602152 -2409959 -4295093 -6066152 -5029218 -1778323 -155295 -2771033
3719b771033m869122k597727J976766M898683M696049K799639J072446K97572
$$ -2771033 -7640155 -10237882 -8261116 -3362433 1333616 4133255 5205701 5503273
3711E503273N33484J519633K516824K560343J178878j351011m191545n960090
$$ 5503273 6036757 7556390 10073214 12633557 13812435 12461424 8269879 2309789
3703B309789n098619j268681L556418O240363N116735J255447k704076m521721
$$ 2309789 -2788830 -4057511 -501093 5739270 10856005 12111452 9407376 4885655
3695D885655l601717j265238K76305J23730k63705P24152J968743Q61576k302076
$$ 4885655 1283938 18700 295005 418735 155030 879182 2847925 3709501 1407425
3686A407425l616241p66951L136610L370744o7743k841355k425713o18879L97504
$$ 1407425 -2208816 -2975767 160843 3531587 3463844 622489 -1803224 -2422103 -2024599
3677b024599R78043J549043O12386k100522l224760k35193L455273K399936k428213
$$ -2024599 -1046556 502487 1114873 -985649 -4210409 -4445602 -990329 1409607 -1018606
3668a018606m187786j91679L861436K532501j174227r45359K846058M251778J478850
$$ -1018606 -5206392 -5398071 -1536635 995866 -178361 -1123720 1722338 5974116 7452966
3659G452966q82453O8983J321961Q84j654773p63012R72478N72785r16438q31661
$$ 7452966 6570513 6639496 7961457 7962341 6307568 5544556 6517034 7089819 6173381 5341720
3649E341720j15842j409438l607741l287395p47278L46026p05469n45575K240628
$$ 5341720 5225878 3816440 208699 -3078696 -3825974 -3479948 -4185417 -4730992 -2490364
3640b490364M622963M049944J917541M83277j39841k76726N62717J481368J92293
$$ -2490364 2132599 6182543 8100084 8583361 8443520 8166794 8729511 10210879 10403172
3631A0403172k828065l700906r79750J408730r6591l355267m256830k739110j315289
$$ 10403172 7575107 3874201 2894451 4303181 4206590 851323 -3405507 -6144617 -7459906
3622g459906l05538J199521J782472k45443k639609j749812J512380K767722Q92821
$$ -7459906 -7765444 -6565923 -4783451 -5028894 -7668503 -9418315 -7905935 -5138213 -4245392
3613d245392q37878m75890J58626m38858r18162Q9661J784352K962527L290534
$$ -4245392 -5083270 -5559160 -5400534 -5839392 -6757554 -6667893 -4883541 -1921014 1369520
3604A369520K247746l90679k739520k591606j144670j354546k529332j127547
$$ 1369520 3617266 3226587 487067 -2104539 -3249209 -4603755 -7133087 -8260634
3596h260634K351789K707787j569895m668722j871103L081470L769800N58809
$$ -8260634 -5908845 -3201058 -4770953 -9439675 -11310778 -8229308 -4459508 -3900699
3588c900699j220562q2215O23642l95566l94378J825506L355061J893975p19691
$$ -3900699 -5121261 -5203476 -4579834 -4975400 -5369778 -3544272 -189211 1704764 985073
3579I85073j603045o41701O08112J598449K546101L088196K787088J979004J094219
$$ 985073 -617972 -1259673 -651561 946888 3492989 6581185 9368273 11347277 12441496
3570A2441496J18429n86309j94928R98814J187113o43723k984448l579760k273314
$$ 12441496 12559925 11973616 11778688 12777502 13964615 13320892 10336444 6756684 4483370
3561D483370q97104o94799j046725q51934k16005j89666j167967k182098k047612
$$ 4483370 3586266 2891467 1844742 992808 776803 587137 -580830 -2762928 -4810540
3552d810540q75402J50981M96397R80247K309881L609197L266802J006113j629721
$$ -4810540 -5685942 -5534961 -5038564 -4058317 -1748436 1860761 5127563 6133676 4503955
3543D503955k813628k011973k89063N02857o93569k678975k671428M83627M157242
$$ 4503955 1690327 -321646 -610709 -107852 -801421 -3480396 -6151824 -5668197 -1510955
3534a510955M461650J063582k127012j852801L75283N96263k011426l964205k196085
$$ -1510955 2950695 4014277 1887265 34464 409747 1006010 -1005416 -4969621 -7165706
3525g165706J943574M590222L959208J446734r84859k431764k284982k76815K025269
$$ -7165706 -5222132 -631910 3327298 4774032 3789173 1357409 -927573 -1204388 820881
3516H20881K002226n41271k707431k663696k078483k388520j481049K343778N440779
$$ 820881 2823107 2281836 -425595 -3089291 -5167774 -7556294 -9037343 -6693565 -1252786
3507a252786K945990k965020m670883J49889M961041L826701p48850k929809k019350
$$ -1252786 1693204 -1271816 -5942699 -5792810 -831769 2994932 2246082 -683727 -2703077
3498b703077j245180j434017j100281p80467k041867l243175j341364K430729
$$ -2703077 -3948257 -5382274 -6482555 -7263022 -9304889 -12548064 -13889428 -11458699
3490a1458699L584430J344714j29947J559595L623871L052132J084670M19092
$$ -11458699 -7874269 -6529555 -6659502 -5099907 -1476036 1576096 2660766 3079858
3482C079858J047839J397738J319506J481196J356604k4447k263954m012600m425338
$$ 3079858 4127697 5525435 6844941 8326137 9682741 9658294 7394340 3381740 -1043598
3473a043598l431508j627325l11947j94341J22184K409479N350724N359970J589432
$$ -1043598 -4475106 -6102431 -6414378 -6608719 -6486535 -4077056 1273668 6633638 8223070
3464H223070k560956l987946l172757j700641L21170K437543K628223N59873p75129
$$ 8223070 5662114 1674168 -1498589 -3199230 -2878060 -440517 2187706 2747579 1972450
3455A972450L79857J163219j153639l746462k204300J928385K892308o04325l807148
$$ 1972450 2352307 3515526 2361887 -1384575 -3588875 -1660490 1231818 627493 -3179655
3446c179655l438634j558733n46457P14315L127918M246226K247841k46767n4279
$$ -3179655 -6618289 -8177022 -8723479 -8009164 -4881246 -635020 1612821 1366054 1311775
3437A311775J350371M03884k477402l527562j575885N94191Q64298J49179m01889
$$ 1311775 2662146 3066030 588628 -2938934 -4514819 -3920628 -3056330 -2907151 -3309040
3428c309040j159533j819488o00489K489210M138187J878650k034189l433560
$$ -3309040 -4468573 -6288061 -6888550 -4399340 -261153 1617497 -416692 -3850252
3420c850252j718379J83188O32546J018058K398082L358225K558964J180199R49022
$$ -3850252 -5568631 -5385443 -4752897 -3734839 -1336757 2021468 4580432 5760631 6709653
3411F709653J261294M29397j077143j023494R71705K396742J152992j728986l708672
$$ 6709653 7970947 8400344 7323201 6299707 7271412 9668154 10821146 9092160 5383488
3402E383488l895790l360817k978040k311163o96792J439568K725693K145404
$$ 5383488 1487698 -1873119 -4851159 -7162322 -7859114 -6419546 -3693853 -1548449
3394a548449K01949j261096p96614R64464J859478O41329j656667l060459k723118
$$ -1548449 -1346500 -2607596 -3404210 -2439746 -580268 61061 -1595606 -4656065 -7379183
3385g379183j309113n5958N1487j035203j960734j112866R75601J589029m67415
$$ -7379183 -8688296 -8744254 -8692767 -9727970 -11688704 -12801570 -11825969 -10236940 -10704355
3376a0704355k440010j128799K057769K650074j07915j589228J439884N572475
$$ -10704355 -13144365 -14273164 -12215395 -9565321 -9673236 -11262464 -9822580 -4250105
3368d250105N336145R07132k544568k355592j096679j345474j794532n20088J105964
$$ -4250105 1086040 1993172 -551396 -2906988 -4003667 -5349141 -7143673 -7663761 -6557797
3359f557797P36832p14936m21974J693432K814503J690020L12766M76282J168291
$$ -6557797 -5820965 -6535901 -6957875 -5264443 -2449940 -759920 -447154 29128 1197419
3350A197419O68092o14320r53931J18990J425787J736476Q27998n87622j406537
$$ 1197419 1865511 1251191 297260 416250 1842037 3578513 4406511 3818889 2412352
3341B412352j140423o65747j126819j936112j255015J013288K414351J272239
$$ 2412352 1271929 606182 -520637 -2456749 -3711764 -2698476 -284125 988114
3333I88114p57829j122748q2499P4317j232014k159762j349044N06951K281446
$$ 988114 230285 -892463 -974962 -900645 -2132659 -4292421 -5641465 -5134514 -2853068
3324b853068L789489M833522M256711J098133l596192o738006n457922j03773
$$ -2853068 936421 5769943 10026654 11124787 7528595 790589 -4667333 -4771106
3316d771106N031798N344533R65708l274686l818196k240613j486767r08556J528877
$$ -4771106 260692 5605225 6570933 3296247 -521949 -2762562 -4249329 -5157885 -3629008
3307c629008M018116K654691j852367m107152j717713J445000J506360j90048
$$ -3629008 389108 3043799 1191432 -2915720 -4633433 -3188433 -1682073 -1872121
3299a872121q22950j113390k836663m259256k421965J633534L999480L422408
$$ -1872121 -2695071 -3808461 -6645124 -10904380 -13326345 -11692811 -7693331 -4270923
3291d270923K079143J437160Q55863J01458o8204O8291m42916q43233L15466J771569
$$ -4270923 -2191780 -754620 101243 202701 134497 202788 -240128 -1083361 -767895 1003674
3281A003674O66956k430183l336838m24679K530994J769490j150794k083956o7744
$$ 1003674 1670630 -759553 -4096391 -4521070 -1990076 -220586 -1371380 -3455336 -3523080
3272c523080K499373L849220M007562K838571o6919l462900m792742l076120P408
$$ -3523080 -1023707 2825513 6833075 9671646 9604727 6141827 1349085 -1727035 -1719627
3263a719627K238350K866689K387801J560212R79857P15254J31787j206048k505016
$$ -1719627 518723 3385412 5773213 7333425 8313282 9028536 9160323 7954275 5449259
3254E449259k530261j434045p37039j216625j831796j280810K05062J342814J503267
$$ 5449259 2918998 1484953 747914 -468711 -2300507 -3581317 -3376255 -2033441 -530174
3245e30174J120777O75929J34397m78726o52792l450J018145J538404J315097
$$ -530174 590603 1266532 1400929 922203 269411 265961 1284106 2822510 4137607
3236D137607Q77840M98354m03202k279178m168096m185092j593340K060230M278102
$$ 4137607 5015447 5513801 5110599 2831421 -1336675 -5521767 -7115107 -5054877 -776775
3227g76775L930906K023442L56507k35047l33835q99359j912857k142513n01569
$$ -776775 3154131 5177573 5534080 5299033 4965198 4065839 2152982 10469 -491100
3218d91100K259094L673895K020767j399154l214136j586946J751106L604678
$$ -491100 1767994 5441889 7462656 6063502 2849366 1262420 3013526 6618204
3210F618204K791744O34924j358108k736622l113135j873799L05661J312357K27336
$$ 6618204 9409948 10044872 8686764 5950142 2837007 963208 1268869 2581226 2808562
3201B808562j241522j353464r43746j563958k337457j224180J310454K705977
$$ 2808562 1567040 213576 -730170 -2294128 -4631585 -5855765 -4545311 -1839334
3193a839334K190268J414797J117450K03042j283129j406352L17024J733816J513035
$$ -1839334 350934 1765731 2883181 3086223 1803094 396742 713766 2447582 3960617
3184C960617R61617J016712M84324j023838j603582n56861m2632r22796p56777
$$ 3960617 4922234 5938946 6423270 5399432 3795850 3238989 3196357 2273561 1516784
3175A516784J094642P20214l670668o627795k912089L365629M119874m74258l008119
$$ 1516784 2611426 3331640 -339028 -6966823 -9878912 -6513283 -2393409 -2867667 -5875786
3166e875786j079172J44052j666364j861252K126132N581818M542156K208008
$$ -5875786 -6954958 -6810906 -8477270 -10338522 -8212390 -2630572 1911584 4119592
3158D119592K520317L298325J212664j455330q75421J534392K117067J327943
$$ 4119592 6639909 9938234 11150898 9695568 8820147 10354539 12471606 13799549
3150A3799549J405087R40886k159253n037365l608545J14812Q86624j179245j597675
$$ 13799549 15204636 16145522 13986269 8948904 5340359 5455171 6341795 5162550 3564875
3141C564875m053l95704k879210k612683J562129M270983J904594k077678l124635
$$ 3564875 3560822 3165118 285908 -2326775 -764646 3506337 5410931 3333253 208618
3132B08618j852904j043106o49889N80978J720760J310067J93099L6079P97818
$$ 208618 -1644286 -2687392 -3337281 -2756303 -1035543 274524 467623 503702 1301520
3123A301520J506418J720151J080815l75946r06190R16711K456668n25935o548619
$$ 1301520 2807938 4528089 5608904 5232958 4326768 5243479 7700147 7174212 625593
3114F25593q468528l233997L301537M672807K297925J349687K214294J510398
$$ 625593 -7842935 -11076932 -7775395 -3102588 -804663 545024 2759318 4269716
3106D269716j039147k378636j489207j44148Q77850K099914K696934J523737p5828
$$ 4269716 3230569 851933 -637274 -781422 96428 2196342 4893276 6417013 6341185
3097F341185l03417n36532k721340m480513j913765L344546N376067K570151m91379
$$ 6341185 6037768 5501236 2779896 -1700617 -3614382 -269836 5106231 7676382 7185003
3088G185003o77641l21973j751385l082949k335235j252127j661048j718410O12631
$$ 7185003 6507362 6185389 4434004 1351055 -984180 -2236307 -3897355 -5615765 -5003134
3079e003134L357078L490968J708904O23229K38842j060948k595502k287728n42571
$$ -5003134 -1646056 1844912 3553816 4177045 4415887 3354939 759437 -1528291 -2070862
3070b070862M09899N06745J664164L746266M197818K162617j32359r50035j300207
$$ -2070862 -1660963 -1154218 509946 4256212 8454030 10616647 10484288 9534253 8234046
3061H234046k505793l786755l623646j893244M63201K518511L288406K105555
$$ 8234046 5728253 1941498 -1682148 -3575392 -3112191 -593680 2694726 4800281
3053D800281q746q29536K08633J113155M03710n86399j04878Q61747J22292j925046
$$ 4800281 4791535 3961999 4170632 5283787 5687497 5101098 4996220 5857967 5980259 4055213
3043D055213k674123j399938l29296r25379j484135J00539K900734M112580K686611
$$ 4055213 1381090 -18848 -348144 -1273523 -2757658 -2657119 243615 4356195 7042806
3034G042806J11988j840493k604054k425382j968169k118927k927073l068999
$$ 7042806 7154794 5314301 2710247 284865 -1683304 -3802231 -6729304 -9798303
3026i798303j660885j3399J21276n92600k49781P23648J80867j404854q11424
$$ -9798303 -11459188 -11472587 -11351311 -11943911 -12193692 -11470044 -11289177 -12694031 -13505455
3017a3505455K522203M657150K952757K62963K88707J873207J845409Q98559J795063
$$ -13505455 -10983252 -6326102 -3373345 -3110382 -2821675 -948468 896941 1795500 3590563
3008C590563L468982K401269p47096j559445O79017J614132p54391k837675j912877
$$ 3590563 7059545 9460814 8713718 7154273 7833290 9447422 8693031 5855356 3942479
2999C942479n35642j320133k100594k96288J973659J644057J66240L83037Q55947
$$ 3942479 3406837 2086704 -13890 -310178 1663481 3307538 3473778 3856815 4712762
2990D712762j332511m317972l828995o09703M66396j591210k628388o37704J406717
$$ 4712762 3380251 -937721 -4766716 -5376419 -4910023 -6501233 -9129621 -9767325 -8360608
2981h360608J410896J459273K995911L548412J251636j377930j539207p56177
$$ -8360608 -6949712 -5490439 -2494528 1053884 2305520 927590 -611617 -1367794
2973a367794j856407l895316l756319j132216J430983K335798J934473P76341
$$ -1367794 -3224201 -7119517 -10875836 -12008052 -10577069 -8241271 -6306798 -5530457
2965e530457m62274k26080K103587M353983M011785J871176P24304J010457N78328
$$ -5530457 -5992731 -6218811 -4115224 238759 4250544 6121720 6846024 7856481 8434809
2956H434809j346769k870526k649894j781012j363327l66483K379341N386969
$$ 8434809 7088040 4217514 1567620 -213392 -1576719 -1943202 436139 5823108
2948E823108N604881K137303k385045m499586l417488j434154j039285k230951
$$ 5823108 11427989 13565292 11180247 6680661 3263173 1829019 789734 -1441217
2940a441217l074350k326446n04729J410552K927952L402585J972615r20323l079368
$$ -1441217 -4515567 -6842013 -7346742 -5936190 -3008238 394347 2366962 1446639 -1632729
2931a632729k774214p53768Q48524R78291K40667l09689j28585O09199J220830
$$ -1632729 -4406943 -5160711 -4312187 -3333896 -3093229 -3402918 -3531503 -2922304 -1701474
2922a701474J338236J488645J951237J405684j445957m917077n483878k589803
$$ -1701474 -363238 1125407 3076644 4482328 3036371 -1880706 -7364584 -9954387
2914i954387L26079P22059m611J1481j61988j447757j762456O45808L289116K808862
$$ -9954387 -9628308 -8906249 -8910860 -8899379 -9061367 -10509124 -12271580 -11625772 -8336656 -5527794
2904e527794L90390k53738J322269K820052L879200N248914M663744l99949o210533
$$ -5527794 -5137404 -5391142 -4068873 -1248821 2630379 7879293 12543037 12143088 5932555
2895E932555n782553N04787M074194L49476m782968m441519n56342J027374K61594
$$ 5932555 150002 654789 4728983 5078459 295491 -4146028 -4702370 -3674996 -3413402
2886c413402J207580L719958L638945K49038k466996k211775j093185j296840
$$ -3413402 -2205822 1514136 5153081 5402119 2935123 723348 -369837 -1666677
2878a666677k117156k252703j802231j064223M9294Q20779K81895p40943m22350
$$ -1666677 -3783833 -6036536 -7838767 -8902990 -8853696 -8032917 -7751022 -8491965 -8914315
2869h914315J050713J571162L75092j089805j713529j767496j147029R15553L690203
$$ -8914315 -7863602 -6292440 -5917348 -7007153 -8720682 -10488178 -11635207 -10719654 -7029451
2860g029451M750518K985859K34710r49917o3810J248871R87737j261622l447317
$$ -7029451 -2278933 706926 941636 -8281 -72091 1176780 2164517 902895 -2544422
2851b544422k891466O40J396619q34277l560906k787888J64954P87073j424826
$$ -2544422 -5435888 -5435248 -4038629 -4872906 -8433812 -11221700 -11056746 -10269673 -11694499
2842a1694499k578050j097950J84244l61510m33907J319829K259034M25701j608678
$$ -11694499 -14272549 -15370499 -15186255 -15547765 -15981672 -14661843 -12402809 -11977108 -13585786
2833a3585786q76157J179769J503114M05376J82275Q95710J107965J084414J742424
$$ -13585786 -14461943 -13282174 -11779060 -11373684 -11191409 -10295699 -9187734 -8103320 -6360896
2824f360896J881267K3464k146302j753981O91761K160059J834596J479890J583677
$$ -6360896 -4479629 -4456165 -6602467 -8356448 -7664687 -5504628 -3670032 -2190142 -606465
2815f06465Q29129o33656j014400l04858m69623j762761k218680j390247j066482
$$ -606465 222664 -410992 -1425392 -1730250 -2199873 -3962634 -6181314 -7571561 -8638043
2806h638043j383199j015L258539M685330K041409j460547j493212J419853L327704
$$ -8638043 -10021242 -10022257 -6763718 -2078388 -36979 -1497526 -2990738 -1570885 1756819
2797A756819K439008J88866j907056l228911k692631L03526L648550M147202J706246
$$ 1756819 4195827 4384693 2477637 -751274 -3443905 -3140379 508171 4655373 6361619
2788F361619n94603r39348p09398j316351j804179j118567n67329j876496m059991
$$ 6361619 5767016 4827668 4118270 2801919 997740 -120827 -688156 -2564652 -6624643
2779f624643m384008j968532J298548L155010K750770L90868k634758l837539
$$ -6624643 -11008651 -12977183 -11678635 -8523625 -5772855 -5381987 -8016745 -11854284
2771a1854284j214830L855511O977858N387727J183685j509605j619048j459508
$$ -11854284 -13069114 -9213603 -2235745 3151982 4335667 2826062 1207014 -252494
2763b52494k572279l660968l092431j236532P16060K374802L230745J956676j310492
$$ -252494 -2824773 -6485741 -9578172 -10814704 -10098644 -7723842 -4493097 -2536421 -3846913
2754c846913l311685r27963M242903P069005M943364N26568k091386j917840q47357
$$ -3846913 -7158598 -8086561 -3843658 3225347 8168711 8695279 6603893 4686053 3838696
2745C838696p79709k227746m382054n243963k908426J886522N537208N358578
$$ 3838696 3058987 831241 -3550813 -8794776 -11703202 -9816680 -4279472 1079106
2737A079106K623159K86249j090663k758911l921008j871220L107924O129230
$$ 1079106 3702265 3988514 2897851 138940 -3782068 -5653288 -2545364 3583866
2729C583866L399871k296885m716318k035143J435105J728558K25936L56627J824300
$$ 3583866 6983737 4686852 -29466 -2064609 -629504 1099054 1324990 1681617 3505917
2720C505917J343825j729673m054436l334364j649634j901802l274736k962370
$$ 3505917 4849742 3120069 -934367 -4268731 -5918365 -7820167 -11094903 -14057273
2712a4057273j037270k87302j316999j177894J871987M969074M276687M93680
$$ -14057273 -15094543 -15381845 -16698844 -17876738 -16004751 -11035677 -6758990 -6265310
2704f265310j830567j84977K911488L394402O22571k238435k225476J40970J929840
$$ -6265310 -8095877 -8280854 -5369366 -1974964 -1352393 -3590828 -5816304 -5675334 -3745494
2695c745494J553635M77459Q45405K354502K695409P85700j872322l254848k862993
$$ -3745494 -2191859 -1714400 -868995 1485507 4180916 4966616 3094294 -160554 -3023547
2686c023547j301683P03807K107767J829646L72343j26961J246420K542433J704592
$$ -3023547 -4325230 -3621423 -1513656 315990 688333 561372 1807792 4350225 6054817
2677F054817l28540j310135j332275k126933l324045k598861P2037J504144k77
$$ 6054817 5726277 4416142 3083867 956934 -2367111 -4965972 -4893935 -3389791 -3390068
2668c390068j792523p27431K251070L816273L096433K071206J747038O87075k206334
$$ -3390068 -5182591 -5910022 -3658952 157321 3253754 5324960 7071998 7759073 5552739
2659E552739n434672o303461l649792J096582M821085M971725K075584k44762
$$ 5552739 118067 -6185394 -9835186 -8738604 -3917519 1054206 3129790 2885028
2651B885028Q03084L449769L390633l55128l891873l664465j001297K98357q23378
$$ 2885028 3688112 7137881 10528514 10173386 6281513 2617048 1615751 1914108 1090730
2642A090730k217966k251533j353898q0852J687123L024562J909005j701939m534782
$$ 1090730 -1127236 -3378769 -4732667 -4813519 -3126396 -101834 1807171 105232 -4429550
2633d429550l536957K74340L153656L088073J263574l59555r75311m37374J169496
$$ -4429550 -7966507 -7692167 -4538511 -1450438 -186864 -546419 -1521730 -1959104 -789608
2624g89608K756350K551617K02026k428457l411758k853296k053427j533502j002213
$$ -789608 1966742 4518359 4720385 2291928 -1119830 -3973126 -6026553 -7560055 -8562268
2615h562268n71968p04032j205496j353446q58154J36471J587307L020700K994831
$$ -8562268 -9134236 -9838268 -11043764 -12397210 -13255364 -13118893 -11531586 -8510886 -5516055
2606e516055P14705j861974j408408K550821O314203O068347K320062r67769j127101
$$ -5516055 -4801350 -6663324 -8071732 -5520911 793292 6861639 9181701 8213932 7086831
2597G086831N68333R91663j021600l371423l094594P3521K997389K618597k74868
$$ 7086831 7655164 8646827 7625227 4253804 1159210 1232731 4230120 6848717 6573849
2588F573849k023438q09421J374708K099768J764259J811016J446533j124374
$$ 6573849 4550411 3740990 5115698 7215466 8979725 10790741 12237274 11112900
2580A1112900m795858n853170k802279J377641K900439J399870o64860j381121
$$ 11112900 6317042 463872 -2338407 -960766 1939673 3339543 2674683 1293562
2572A293562p39198L78402J033969N13460r46733j901353j227046J45215n746
$$ 1293562 554364 932766 1966735 2480195 1533462 -367891 -1594937 -1449722 -1455468
2563a455468k452996n162188n073548j220066L976317O706679N396739K176422
$$ -1455468 -3908464 -9070652 -14144200 -15364266 -11387949 -4681270 715469 2891891
2555B891891K70858L13840L00500j008735k322127k017151m66280R70704J894145
$$ 2891891 3162749 3476589 3777089 2768354 446227 -1570924 -2037204 -1066500 827645
2546H27645K322056J403337j305726l846151l346921K03540L391567L205496K81217
$$ 827645 3149701 4553038 3247312 -598839 -3945760 -3742220 -350653 2854843 3136060
2537C136060k205225k018304K18809K000730J552526k91350j085774R4807J474655
$$ 3136060 930835 -1087469 -868660 1132070 2684596 2393246 1307472 1402279 2876934
2528B876934J317904M91423O23352J004432o9006j592872q04380J958168K898276
$$ 2876934 4194838 4686261 5309613 6314045 6245039 4652167 3847787 5805955 8704231
2519H704231M69032j982522j360340M81716J20697j804122j976218M350J216570
$$ 8704231 9173263 7190741 5830401 6312117 6432814 4628692 2652474 2656824 3873394
2510C873394J78920j472108k193222k239841j699839J01485K280832K285996m71542
$$ 3873394 4052314 2580206 386984 -1852857 -3552696 -3451211 -1170379 1115617 644075
2501F44075l130498l031804r76106O00909Q98425O03369J36146j34197P08673
$$ 644075 -2486423 -5518227 -6494333 -5893424 -4994999 -4391630 -4255484 -4389681 -3681008
2492c681008K558928L207643R43723k408738l162499l70006K978314L474040O99423
$$ -3681008 -1122080 2085563 3029286 620548 -2541951 -2911957 66357 3540397 4239820
2483D239820k909640m479846k996010j12355J451053R33659K58601R49700J683590
$$ 4239820 1330180 -3149666 -6145676 -6258031 -4806978 -3873319 -3614718 -2665018 -981428
2474i81428O20924j127184j021393N27883M88396j768362l047173j179469J725187
$$ -981428 -360504 -1487688 -2509081 -1981198 -1492802 -3261164 -6308337 -7487806 -5762619
2465e762619K869419K953395M002338N016553L302714o33307l085438k409336
$$ -5762619 -2893200 60195 4062533 9079086 12381800 11748493 8663055 6253719
2457F253719j198325k052374l713722l323398r27300N96127j87568j072123Q03674
$$ 6253719 5055394 3003020 -710702 -4034100 -4961400 -4365273 -4552841 -5624964 -4821290
2448d821290M694419O422360L335857j940399m263907k295774O9715n81516k487502
$$ -4821290 -126871 6295489 9631346 7690947 3427040 1131266 1200981 619465 -1868037
2439a868037j937764P94693K167314J159304M22281J314492J745665L66220p72676
$$ -1868037 -3805801 -3011108 -843794 315510 737791 2052283 3797948 4164168 3391492
2430C391492o189O73568r81570l393196l740223k532404k024901j759151K61875
$$ 3391492 3385303 4058871 3077301 -315895 -4056118 -6588522 -8613423 -10372574 -10110699
2421a0110699K988807L299397J331660M60855J549394J676619k70507j260362
$$ -10110699 -7121892 -3822495 -2490835 -2029980 -480586 1196033 925526 -334836
2413c34836M75652J821080k92210l548742l539157k27676K576789K867286J989071
$$ -334836 140816 1961896 1669686 -1879056 -5418213 -5645889 -3069100 -201814 1787257
2404A787257J237658K90967r25071j609749j709318k037067k530389k217699j017402
$$ 1787257 3024915 3315882 2390811 781062 -928256 -2965323 -5495712 -7713411 -8730813
2395h730813J50739J038517K116580K972191K504304R32816r9157K11673R53919
$$ -8730813 -8580074 -7541557 -5424977 -2452786 51518 984334 885177 1096850 2050769
2386B050769J201806J123409R53077K30745j207369k365983j932127K41595K618358
$$ 2050769 3252575 4375984 5329061 5559806 4352437 1986454 54327 295922 2914280
2377B914280K988434O48638k254036k723526o95563Q87633N97648O30829K494914
$$ 2914280 5902714 6551352 4297316 1573790 878227 1765860 2363508 2994337 5489251
2368E489251L374601K86500m154942m628796r54544J735710Q13475q18048o66078
$$ 5489251 8863852 9150352 4995410 366614 -587930 1147780 1961255 1143207 477129
2359D77129o28974k569336m216968k920415k93354N91930L63587J916670N190853
$$ 477129 -151845 -2721181 -6938149 -9858564 -10151918 -9559988 -9196401 -7279731 -2088878
2350b088878O934726N206527J367949k088620l540221k545194j40629J527250
$$ -2088878 4845848 10052375 11420324 9331704 5791483 3246289 3105660 4632910
2342D632910J335249L13279l62250j021650j794716j282534R30360K390864J097062
$$ 4632910 5968159 6281438 5919188 4897538 3102822 1820288 2750648 5141512 6238574
2333F238574r88614q06798Q79379R26403q76878j790726r72342l87399p68273
$$ 6238574 5249960 4443162 5322541 6248944 5372066 3581340 2608998 2221599 1453326
2324A453326o06674K10667l20915k264598k757512p82804O86147l86934j387399
$$ 1453326 846652 1057319 736404 -1528194 -4285706 -5068510 -4382363 -4769297 -6156696
2315f156696O08166L437848K697321j395760m011145k595995k03587p14493l289577
$$ -6156696 -5548530 -2110682 586639 -809121 -4820266 -7416261 -7619848 -8334341 -11623918
2306a1623918l661323O9152M924183O606645M270161P95699j044490j223205j091195
$$ -11623918 -15285241 -15216089 -10291906 -3685261 584900 1380599 336109 -887096 -1978291
2297a978291j116540j171145j643401k414242j706269J724955N661939O234335
$$ -1978291 -3094831 -4265976 -5909377 -8323619 -10029888 -8304933 -2642994 3591341
2289C591341K887560q40425k014279j385491r40612p77195Q9831J592583K781390
$$ 3591341 6478901 5638476 3624197 2238706 1298094 520899 610730 2203313 4984703
2280D984703K894760J370008j667967m203740l689881o88755J125439R375j367934
$$ 4984703 7879463 9249471 7581504 3377764 -312117 -1000872 124567 133942 -1233992
2271a233992m40855J095868O64247j94679J613889M597993L928481j071400n263515
$$ -1233992 -1674847 -578979 85268 -109411 1504478 6102471 10030952 8959552 3696037
2262C696037m809668j997964q61994j303257n89347J413581J952955j46995k487366
$$ 3696037 -1113631 -3111595 -3973589 -5276846 -5866193 -4452612 -2499657 -2646652 -5134018
$$ [...]
##END NTUPLES=NMR SPECTRUM
##END=
