##TITLE=31Pdec_DE-71H_oil
 D2O, 64 sc
 2.11.2024
##JCAMPDX= 6.0         $$ Bruker NMR JCAMP-DX V2.0
##DATA TYPE= NMR SPECTRUM
##DATA CLASS= NTUPLES
##ORIGIN= UXNMR, Bruker Analytische Messtechnik GmbH
##OWNER= root
$$ XWIN-NMR		Version 3.5
$$ Sat Nov  2 14:41:00 2024 Russian Standard Time (UT+4h)  she@DPX200
##.OBSERVE FREQUENCY= 81.013821
##.OBSERVE NUCLEUS= ^31P
##.ACQUISITION MODE= SIMULTANEOUS
##.ACQUISITION SCHEME= undefined
##.AVERAGES= 64
##.DIGITISER RES= 17
##SPECTROMETER/DATA SYSTEM= spect
##.PULSE SEQUENCE= zgpg30
##.SOLVENT NAME= CDCl3
##.SHIFT REFERENCE= (INTERNAL, CDCl3, 0, 198.062)
##AUDIT TRAIL= $$ (NUMBER, WHEN, WHO, WHERE, WHAT)
$$ ##TITLE= Audit trail, XWIN-NMR		Version 3.5
$$ ##JCAMPDX= 5.01
$$ ##ORIGIN= Bruker BioSpin GmbH
$$ ##OWNER= she
$$ F:/spectra/data/she/nmr/P31/2/pdata/1/auditp.txt
$$ ##AUDIT TRAIL=  $$ (NUMBER, WHEN, WHO, WHERE, WHAT)
(   1,<2024-11-02 14:39:56.78 +0400>,<she>,<DPX200>,
      <created by zg, POWCHK disabled, PULCHK disabled
       configuration hash MD5:
       00 E9 B6 7A A2 85 ED C7 34 08 36 98 17 FE 4E 26
       data hash MD5: 32K
       38 DB B6 D4 33 28 EE A4 46 DF 82 9F A2 0E AD A0>)
(   2,<2024-11-02 14:39:58.96 +0400>,<she>,<DPX200>,
      <Start of raw data processing
       efp BC_mod = 2 LB = 1.5 FT_mod = 6 PKNL = 1 PHC0 = 1812.617 PHC1 = 1237.888 SI = 64K 
       data hash MD5: 64K
       7F 5A DA 94 33 4F DF 59 32 64 66 6F F4 03 CD 37>)
(   3,<2024-11-02 14:40:24.75 +0400>,<she>,<DPX200>,
      <pk PHC0 = 442.6084 PHC1 = -1139 
       data hash MD5: 64K
       54 21 77 64 BD 6D 7D 55 E5 62 64 1B 12 E7 9D 1F>)
$$ ##END=
$$ 
$$ hash MD5
$$ 99 FD 20 17 70 E1 A2 72 09 E8 1D F2 A2 B0 5F F3
##$RELAX= 
##$RELAX= 
##$RELAX= 
##$RELAX= 
##$RELAX= 
##$RELAX= 
##$RELAX= 
##$RELAX= 
$$ Bruker specific parameters
$$ --------------------------
##$DU= <F:/spectra>
##$EXPNO= 2
##$NAME= <P31>
##$PROCNO= 1
##$TYPE= <nmr>
##$USER= <she>
##$AMP= (0..31)
100 100 100 100 100 100 100 100 100 100 100 100 100 100 100 100 100 100 
100 100 100 100 100 100 100 100 100 100 100 100 100 100 
##$AQSEQ= 0
##$AQ_mod= 1
##$AUNM= <au_zg>
##$AUTOPOS= <>
##$BF1= 81.014009
##$BF2= 200.13
##$BF3= 200.13
##$BF4= 200.13
##$BF5= 200.13
##$BF6= 200.13
##$BF7= 200.13
##$BF8= 200.13
##$BYTORDA= 1
##$CFDGTYP= 0
##$CFRGTYP= 5
##$CHEMSTR= <none>
##$CNST= (0..31)
1 1 145 1 1 1 1 1 1 1 1 1 1 1 1 1 1 1 1 1 1 1 1 1 1 1 1 1 1 1 1 1 
##$CPDPRG= <waltz16>
##$CPDPRG1= <>
##$CPDPRG2= <waltz16>
##$CPDPRG3= <>
##$CPDPRG4= <mlev>
##$CPDPRG5= <mlev>
##$CPDPRG6= <mlev>
##$CPDPRG7= <mlev>
##$CPDPRG8= <mlev>
##$CPDPRGB= <>
##$CPDPRGT= <>
##$D= (0..31)
0 1 0 0 0 0 0 0 0 0.06 0 0.03 2e-05 3e-06 0 0 0.0002 0 0 0 0 0 0 0 0 0 
0 0 0 0 0 0 
##$DATE= 1730543996
##$DBL= (0..7)
120 120 120 11 120 120 24 19 
##$DBP= (0..7)
150 150 150 150 150 150 150 150 
##$DBP07= 0
##$DBPNAM0= <>
##$DBPNAM1= <>
##$DBPNAM2= <>
##$DBPNAM3= <>
##$DBPNAM4= <>
##$DBPNAM5= <>
##$DBPNAM6= <>
##$DBPNAM7= <>
##$DBPOAL= (0..7)
0.5 0.5 0.5 0.5 0.5 0.5 0.5 0.5 
##$DBPOFFS= (0..7)
$$ [...]
##$SUBNAM2= <"">
##$SUBNAM3= <"">
##$SUBNAM4= <"">
##$SUBNAM5= <"">
##$SUBNAM6= <"">
##$SUBNAM7= <"">
##$SUBNAM8= <"">
##$SUBNAM9= <"">
##$SW= 400.765351723535
##$SWIBOX= (0..15)
0 1 3 0 0 0 0 0 0 0 0 0 0 0 0 0 
##$SW_h= 32467.5324675325
##$TD= 32768
##$TD0= 1
##$TE= 0
##$TE2= 300
##$TE3= 300
##$TEG= 300
##$TL= (0..7)
0 120 53 12 22 120 120 120 
##$TP= (0..7)
150 150 150 150 150 150 150 150 
##$TP07= 0
##$TPNAME0= <>
##$TPNAME1= <>
##$TPNAME2= <>
##$TPNAME3= <>
##$TPNAME4= <>
##$TPNAME5= <>
##$TPNAME6= <>
##$TPNAME7= <>
##$TPOAL= (0..7)
0.5 0.5 0.5 0.5 0.5 0.5 0.5 0.5 
##$TPOFFS= (0..7)
0 0 0 0 0 0 0 0 
##$TUNHIN= 0
##$TUNHOUT= 0
##$TUNXOUT= 0
##$USERA1= <user>
##$USERA2= <user>
##$USERA3= <user>
##$USERA4= <user>
##$USERA5= <user>
##$V9= 5
##$VALIST= <valist>
##$VCLIST= <CCCCCCCCCCCCCCC>
##$VD= 0
##$VDLIST= <DDDDDDDDDDDDDDD>
##$VPLIST= <PPPPPPPPPPPPPPP>
##$VTLIST= <TTTTTTTTTTTTTTT>
##$WBST= 1024
##$WBSW= 4
##$XGAIN= (0..3)
0 0 0 0 
##$XL= 0
##$YL= 0
##$YMAX_a= 9302
##$YMIN_a= -12325
##$ZGOPTNS= <>
##$ZL1= 120
##$ZL2= 120
##$ZL3= 120
##$ZL4= 120
##$ABSF1= 0
##$ABSF2= 0
##$ABSG= 0
##$ABSL= 0
##$ALPHA= 0
##$AQORDER= 0
##$ASSFAC= 0
##$ASSFACI= 0
##$ASSFACX= 0
##$ASSWID= 0
##$AUNMP= <proc_1d>
##$AZFE= 0.1
##$AZFW= 0.5
##$BCFW= 0
##$BC_mod= 2
##$BYTORDP= 0
##$COROFFS= 0
##$CY= -3
##$DATMOD= 1
##$DC= 0
##$DFILT= <>
##$DTYPP= 0
##$F1P= 0
##$F2P= 0
##$FCOR= 1
##$FTSIZE= 65536
##$FT_mod= 6
##$GAMMA= 0
##$GB= 0
##$INTBC= 1
##$INTSCL= 9.790993e-09
##$ISEN= 30
##$LB= 1.5
##$LEV0= 0
##$LPBIN= 0
##$MAXI= 10000
##$MC2= 0
##$MEAN= 0
##$ME_mod= 0
##$MI= 50
##$NCOEF= 0
##$NC_proc= -8
##$NLEV= 6
##$NOISF1= 182.463
##$NOISF2= 159.3651
##$NSP= 0
##$NTH_PI= 0
##$NZP= 0
##$OFFSET= 198.0616
##$PC= 4
##$PHC0= 2255.225
##$PHC1= 98.88794
##$PH_mod= 1
##$PKNL= yes
##$PPARMOD= 0
##$PSCAL= 0
##$PSIGN= 0
##$REVERSE= no
##$SF= 81.0140089999434
##$SI= 65536
##$SIGF1= 159.3651
##$SIGF2= -187.1042
##$SINO= 113.3802
##$SIOLD= 16384
##$SREGLST= <1H.CDCl3>
##$SSB= 0
##$STSI= 65536
##$STSR= 0
##$SW_p= 32467.5324675325
##$SYMM= 0
##$S_DEV= 0
##$TDeff= 32768
##$TDoff= 0
##$TI= <>
##$TILT= no
##$TM1= 0
##$TM2= 0
##$TOPLEV= 0
##$USERP1= <user>
##$USERP2= <user>
##$USERP3= <user>
##$USERP4= <user>
##$USERP5= <user>
##$WDW= 1
##$XDIM= 65536
##$YMAX_p= 85619124
##$YMIN_p= -451817034
$$ End of Bruker specific parameters
$$ ---------------------------------
##NTUPLES= NMR SPECTRUM
##VAR_NAME=  FREQUENCY,     SPECTRUM/REAL,   SPECTRUM/IMAG
##SYMBOL=    X,             R,               I
##VAR_TYPE=  INDEPENDENT,   DEPENDENT,       DEPENDENT
##VAR_FORM=  AFFN,          ASDF,            ASDF
##VAR_DIM=   65536,         65536,           65536
##UNITS=     HZ,            ARBITRARY UNITS, ARBITRARY UNITS
##FACTOR=    0.49542278885378, 1,            1
##FIRST=     16045.7642231865, 0,            0
##LAST=      -16421.768244346, 0,            0
##MIN=       -16421.768244346, -451817034,   0
##MAX=       16045.7642231865, 85619124,     0
$$ Real data points
##PAGE= N=1
##DATA TABLE= (X++(R..R)), XYDATA
$$ [...]
7472e93994l551528l025490q73762K052078M824168O043701L822986j466522n548366
7463A683271m394592L77882L337638K299513J76887l54346J447M73344K385015
7454E986059N507840N993473J538501l990129n001262j592324J331292J193155
7446A0966605q3328o22075j035632j609205r07275J146077J821042n99718l611994
7437E464497l410334O6279L045715K587187j53824j635186k67799J547070L12866
7428G556471l675372n911335l401587Q56140J697351r46224k208040J61976K509976
7419c360644J210799j837263k575894q81818K69365o151N2923R87815J403573
7410d737295J139200J763369L343672L784035K306791P70043K84031p43321l394456
$$ plain form
7472 -593994 -4145522 -7171012 -8044774 -5992696 -1168528 4875173 8698159 7231637 1683271
7463 1683271 -2711321 -2333439 1004199 3303712 3480599 3126253 3127700 3601044 5986059
7454 5986059 11493899 17487372 19025873 15035744 10034482 8442158 9773450 10966605
7446 10966605 10883277 10261202 9225570 7616365 6709090 7855167 9676209 9076491 5464497
7437 5464497 2054163 2120442 5166157 7753344 7599520 5964334 5696535 7243605 7556471
7428 7556471 3881099 -2030236 -5431823 -4575683 -2878332 -3824556 -6032596 -5870620 -3360644
7419 -3360644 -2149845 -3987108 -6563002 -7444820 -7175455 -7181606 -7128683 -6140868 -4737295
7410 -4737295 -3598095 -1834726 1508946 5292981 7599772 8369815 8653846 7910525 4516069
7401D516069n494870m470176j297984Q77861R91181M90171L33007J62478K08501
7392c683762J320480K704243K136442n53118k329999p68738K520733L945489K386243
7383G678013p5285j237468q70297O7224O98629N30570k50033n61006L32385J209474
7373G522206l0749l180234n196471l996188j390760n07201j222604n07360K700024
7364e809337N475835M887983J998139N914l46878j089879k986095l771635j508830
7355c144783K126422L667086K159240q4387q56622n01128n09675j093231j282703
7346D80219p36264j51956O3424M19233J291612K143526K410076K470092K839394
7337A1229356K801776J011765k401059n369377n997948m380526j917062K46373
$$ plain form
7401 4516069 -978801 -5448977 -6746961 -5869100 -4877919 -4387748 -4054741 -3892263 -3683762
7392 -3683762 -2363282 340961 2477403 1924285 -405714 -1174452 1346281 5291770 7678013
7383 7678013 7602728 6365260 5494963 5562187 6260816 6791386 6541353 5980347 6312732 7522206
7373 7522206 7491457 4311223 -885248 -4881436 -6272196 -6779397 -8002001 -8509361 -5809337
7364 -5809337 -333502 4554481 6552620 6558534 6211656 5121777 2135682 -1635953 -3144783
7355 -3144783 -1018361 2648725 4807965 4723578 3866956 3365828 2856153 1762922 480219
7346 480219 -256045 -408001 -344577 74656 1366268 3509794 5919870 8389962 11229356
7337 11229356 14031132 15042897 12641838 7272461 1274513 -3106013 -5023075 -4776702
7329d776702J435175J151172k50290j283452j036072n57951j048724j319927P09351
7320f977420M037709M782890J369348k797075l447381m83017K775057L734253
7312B994364K055022j351195m472300m576406j084458K715979L365528J781356
7304A427890J244638J818399O71695k153823k829073J47764L112017K677469L68599
7295F485575q47131j277946k400296k896528q78142J794154J636797r78764k419767
7286a782048j313279L53138J379982K615131L737338K738242l03572k385638j897598
7277C141696p27714o39908o27050K37710K54051j943822m030549k633446J681194
7268e287838M734507L808984M15605k058048k001236n16645N87545J200413K681554
$$ plain form
7329 -4776702 -3341527 -2190355 -2440645 -3724097 -4760169 -5318120 -6366844 -7686771 -6977420
7320 -6977420 -2939711 1843179 3212527 415452 -3031929 -3514946 -739889 2994364
7312 2994364 5049386 3698191 -774109 -5350515 -6434973 -3718994 -353466 1427890
7304 1427890 2672528 4490927 5162622 3008799 179726 327490 3439507 6116976 6485575
7295 6485575 5638444 4360498 1960202 -936326 -1814468 -20314 1616483 637719 -1782048
7286 -1782048 -3095327 -2742189 -1362207 1252924 4990262 7728504 7424932 5039294 3141696
7277 3141696 2413982 1774074 1147024 1384734 1638785 -305037 -4335586 -6969032 -5287838
7268 -5287838 -553331 3255653 3671258 1613210 -388026 -904671 -317126 883287 3564841
7259C564841M860481M766713N49463m296574m190361O31191L487559L78287m185326
7250E566274l773599O92611K798916R8462l243964l272328j191723j96112q34909
7241c356372j517276j360346o24008L06566R31290O59534j60488k53346P26572
7232d647874J492082J167711Q08466J631580K751978K337321N93541k12108R29822
7223F852519K023654Q13955j671911k110916M80624K938196J953774j458667l410952
7214F410276k428960r97962j619606l606296m724300m094839k199633L49443K567084
7205a0344793L006987J520669M1225J75936J103964J273515R10199J138295J811027
7196F37024K119485K288380K648799K043791n99245l880921n338847m572552k883148
$$ plain form
7259 3564841 8425322 13192035 13741498 9444924 5254563 5885754 9373313 9751600 5566274
7250 5566274 1792675 2485286 5284202 5382664 2138700 -1133628 -2325351 -2521463 -3356372
7241 -3356372 -4873648 -6233994 -6858002 -6551436 -5620146 -4960612 -5121100 -5374446 -4647874
7232 -4647874 -3155792 -1988081 -1179615 451965 3203943 5541264 6134805 5922697 6852519
7223 6852519 8876173 9690128 8018217 5907301 6387925 9326121 11279895 9821228 6410276
7214 6410276 3981316 2983354 1363748 -2242548 -6966848 -11061687 -13261320 -12911877 -10344793
7205 -10344793 -7337806 -5817137 -5775912 -5599976 -4496012 -3222497 -2312298 -1174003 637024
7196 637024 2756509 5044889 7693688 9737479 9138234 5257313 -81534 -4654086 -7537234
7187g537234q11120J471844K413597Q78789r70466m7443K687355L351625J342077
7178B779024K60885J743477K640484L25161k951351l678887k108722q19733n97479
7169b407141n59924n35552o43124p5288J233601J339544p60306k561398j379676
7160f349264J124112J087464j653631l306795j774136P22127J363284L19646n31248
7151h998441l92269K26276P06993P08473J80218m54199p70392r75647j204944
7142a0973932o23335J297786K949487K081098o44952j839689l1632K020620J266811
7133d497738j124545j469644J136928L808621M174829L153462K418455J365829
7125H966197j238898l855348l272755O49088L905126L250361K44348j303376l74703
$$ plain form
7187 -7537234 -8348354 -6876510 -4462913 -3584124 -4554590 -4602033 -1914678 1436947 2779024
7178 2779024 3039909 4783386 7423870 7749031 4797680 1118793 -989929 -1809662 -2407141
7169 -2407141 -2967065 -3502617 -4145741 -4221029 -2987428 -1647884 -2408190 -4969588 -6349264
7160 -6349264 -5225152 -4137688 -5791319 -9098114 -10872250 -10150123 -8786839 -8467193 -8998441
7151 -8998441 -9390710 -9164434 -8457441 -7748968 -7568750 -8022949 -8793341 -9768988 -10973932
7142 -10973932 -11597267 -10299481 -7349994 -5268896 -5913848 -7753537 -7785169 -5764549 -4497738
7133 -4497738 -5622283 -7091927 -5954999 -2146378 2028451 5181913 7600368 8966197
7125 8966197 7727299 3871951 599196 1248284 5153410 8403771 8648119 7344743 6970040
7116F970040R76609J324555J151268O86425p28144k573770k980448j639327o87213
7107B499995j397229k027706o52022J584364K083298N41455r96159j236857r01057
7098e01918j044253j665379k119726j890962q58775N68954J651643J948551J457877
7089b453988J76427j615829k658445j682491N90635J930880J542519Q32672P12267
7080b625353K73124q38952j061275M76652K079389K030172J013111J30220j216743
7071B60345l093168l057286M18165M417993M985813K650049R32599O08531l73852
7062G749189j920555j372668J468928L130630J520620j226793k270422j473054
7054E605875m6730J479985K543725K004468m18881l624603o226545o586444k844126
$$ plain form
7116 6970040 7946649 9271204 10422472 11108897 10380753 7806983 4826535 3187208 2499995
7107 2499995 1102766 -924940 -1576962 7402 2090700 2632155 1635996 399139 -501918
7098 -501918 -1546171 -3211550 -5331276 -7222238 -8081013 -7512059 -5860416 -3911865 -2453988
7089 -2453988 -2277561 -3893390 -6551835 -8234326 -7643691 -5712811 -4170292 -3337620 -2625353
7080 -2625353 -2352229 -3191181 -4252456 -3775804 -1696415 333757 1346868 1477088 260345
7071 260345 -2832823 -5890109 -5471944 -1053951 3931862 6581911 7514510 8123041 7749189
7062 7749189 5828634 4455966 5924894 9055524 10576144 9349351 7078929 5605875
7054 5605875 5559145 7039130 9582855 11587323 11168442 7543839 1317294 -5269150 -8113276
7045h113276M006521Q199704M914873k286296n014421j657749O60003k380929
7037a671570n595119l226115J663189K849700J289887K377725N542240M556767
7029G786704j990066p668211p096553k282212J740462K933301J909351l08297
7021d975521j752696l3630M096315O229597L645757r45758l112244k233428j105618
7012a87226j493149k417373k256173p65146Q73229J201805J06091n22601J128373
7003d332170L836361M207704J169916k310050l100969j589082p379R85883J939872
6994H00086K326616J200940n96523j350686j223580j714222k513451j514635J508478
6985c076977L681225K637862n24757l135359m104380l765724k183530L86991K359582
$$ plain form
7045 -8113276 -4106755 4092949 9007822 6721526 1707105 49356 709359 -1671570
7037 -1671570 -7266689 -10492804 -8829615 -5979915 -4690028 -2312303 3229937 7786704
7029 7786704 5796638 -1871573 -8968126 -11250338 -9509876 -6576575 -4667224 -4975521
7021 -4975521 -6728217 -6761847 -2665532 3564065 7209822 6264064 3151820 918392 -187226
7012 -187226 -1680375 -4097748 -6353921 -7119067 -6245838 -5044033 -4937942 -5460543 -4332170
7003 -4332170 -495809 3711895 4881811 2571761 -529208 -2118290 -2125669 -1139786 800086
6994 800086 3126702 4327642 3731119 2380433 1156853 -557369 -3070820 -4585455 -3076977
6985 -3076977 604248 3242110 2717353 -418006 -4522386 -8288110 -10471640 -10084649 -7725067
6976g725067K283623J032814O35546J298729J636216J516283K051564K541291
6968E270999N93393l395818n078865k030462J832762J280055k480525l417753
6960g426214M12416M309648M298550K444329K261633K706424O99160k732685l388709
6951C584552l77285K427640J940372n16262k257496k951750l443989l105996r08096
6942e608310J821599K241325j15739k159954r91590K200734L444651J077444k064881
6933a54721k488169p28717j86837j776920k534124m57149K008046J549193r35025
6924e704423j839430l83783P54609K80924K32693J980689L374612J997941q41987
6915a48155j868517m42694J008622Q15021J18191O69879K104846K331368J81058
$$ plain form
6976 -7725067 -5441444 -4408630 -3773084 -2474355 -838139 678144 2729708 5270999
6968 5270999 5864392 2468574 -2610291 -4640753 -2807991 -1527936 -4008461 -7426214
6960 -7426214 -7013798 -2704150 1594400 4038729 6300362 9006786 9705946 6973261 3584552
6951 3584552 3207267 5634907 7575279 7059017 4801521 1849771 -1594218 -4700214 -5608310
6942 -5608310 -3786711 -1545386 -1661125 -3821079 -4812669 -2611935 832716 1910160 -154721
6933 -154721 -2642890 -3371607 -3558444 -5335364 -7869488 -8326637 -6318591 -4769398 -5704423
6924 -5704423 -7543853 -7927636 -7173027 -6892103 -6659410 -4678721 -1304109 693832 -148155
6915 -148155 -2016672 -2459366 -1450744 -635723 -517532 152347 2257193 4588561 4769619
6906D769619k899540m030961k011920R79093J686946p9206r61287J450804N017337
6897C920885N587851K318442j558178l060364k396493j181970K8481J086680Q61636
6888E606970j453306m336075n136550l198518k72953K101676L905652N019162
6880B236058M235868J133805k338736l680794k669592j101295j84854L69297P72636
6871a227607J96548j984581m767649n971053m102107L5717L464766L547102J076342
6862i732522p2856K391929N811318N731971J766600k194588l538307l659379m221489
6853g717323l847366q43478K998644M258456K518537M90282M142L56569N71347
6844a210190Q68699J299718R09079o51754j869461q69900K128592M446175L220972
$$ plain form
6906 4769619 1870079 -2160882 -4172802 -3193709 -1506763 -1585969 -2547256 -1096452 3920885
6897 3920885 9508736 11827178 10269000 7208636 4812143 3630173 3658654 4745334 5606970
6888 5606970 4153664 -182411 -5318961 -8517479 -8790432 -6688756 -2783104 2236058
6880 2236058 6471926 7605731 5266995 1586201 -1083391 -2184686 -2369540 -2000243 -1227607
6871 -1227607 -1031059 -3015640 -7783289 -13754342 -17856449 -17820732 -14355966 -10808864 -9732522
6862 -9732522 -9805378 -7413449 -1602131 4129840 5896440 3701852 163545 -3495834 -7717323
6853 -7717323 -11564689 -12408167 -9409523 -5151067 -2632530 -2142248 -2138106 -1781537 -1210190
6844 -1210190 -341491 958227 1867306 1215552 -653909 -1523809 604783 5050958 8271930
6835H271930j586086o344038o751801k359511K678690M171205K280680K78804
6827F39873M5937O28588O97106L32193J13515K8472k03541o81319j365303j834547
6817a599026j290744K80363J479431J206711L61744L14790L63562j172778l503229
6808c559176l441769K94151M689974N492751J752320l364605n669410l633954
6800g439718M20252K826027K532399J688472J769521J135054j612543l875468
6792b556004k084564K504141M937662L404935R09713l99826k074126m804370n405169
6783e567608j565065L530355N003652K759106O77488O95136J213825Q94356O50825
6774H292070J267841J479732l28449l503468n170632l183321Q48832K361592q05886
$$ plain form
6835 8271930 6685844 341806 -6409995 -8769506 -6090816 -1919611 361069 639873
6827 639873 685810 1314398 2011504 2343697 2457212 2485684 2282143 1600824 235521 -1599026
6817 -1599026 -2889770 -2609407 -1129976 76735 438479 753269 1116831 -55947 -3559176
6808 -3559176 -7000945 -6706794 -2016820 3475931 5228251 1863646 -3805764 -7439718
6800 -7439718 -7019466 -4193439 -1661040 27432 1796953 2932007 1319464 -2556004
6792 -2556004 -4640568 -2136427 2801235 6206170 7115883 6716057 4641931 -162439 -5567608
6783 -5567608 -7132673 -3602318 1401334 4160440 4837928 5533064 6746889 7641245 8292070
6774 8292070 9559911 11039643 10711194 7207726 2037094 -1146227 -297395 2064197 1258311
6765A258311m549590k865242L668914P514640M057264j886595k791848J227156
6757E633010L287093k78486n359165n911510r46231N276025P756338M764372r91883
6748A3229563m764205m347840j909786m03503K74531J665401L068071K513503
6740I325735M06653j085956j778260l210119m803960l903312k43253K912335L069724
6731F89587J134075j031541k732233l201443j382011J557373K322935j31572k819624
6722e594454l005602j710233r64835j99280J942005M240260M422820K818182J662669
6713C611532J590677J479364J152208J430652J608855l23057m262337p015009
6705g27115n837442j583247K543307M250913L382095R61185j710889l331108l114521
$$ plain form
6765 1258311 -3291279 -6156521 -2487607 5027033 9084297 7197702 4405854 5633010
6757 5633010 8920103 8641617 3282452 -2629058 -3575289 1700736 9457074 14221446 13229563
6748 13229563 8465358 4117518 2207732 1804229 2078760 3744161 6812232 9325735
6740 9325735 9732388 8646432 6868172 3658053 -1145907 -5049219 -5292472 -2380137 689587
6731 689587 1823662 792121 -1940112 -5141555 -6523566 -4966193 -2643258 -2774830 -5594454
6722 -5594454 -8600056 -10310289 -11275124 -11474404 -9532399 -5292139 -869319 1948863 3611532
6713 3611532 5202209 6681573 7833781 9264433 10873288 10550231 6287894 -727115
6705 -727115 -6564557 -8147804 -5604497 -1353584 2028511 2989696 1278807 -2052301 -5166822
6696e166822j466378K92616J235850J627223K012179J844871L8741k851630m271780
6687f705130k607756L85355J594299M94365o22876j87723Q29165R78325L43137
6678e498839k52885m40966J55330K035941M364309M768965K038629j852705l730704
6669A587075k661241l49779J273968J653595J091968j00189j539848k432218j961764
6660c438433m09500M15880j020112l346403l032308R12370M652071M241045J193120
6651A67730R4758J569928J832937o20836k649122k177725j465429k089171j315049
6642f651979K671723N922979M080550l27571j477341P24576J145735j758924l810572
6633E19176k474000n45532n72229o69598J265439L267170K604453M36071k07799
$$ plain form
6696 -5166822 -6633200 -6340584 -5104734 -3477511 -1465332 379539 418280 -2433350 -6705130
6687 -6705130 -9312886 -8927531 -7333232 -6838867 -7461743 -7649466 -6820301 -5841976 -5498839
6678 -5498839 -5751724 -6192690 -6037360 -4001419 362890 5131855 7170484 5317779 1587075
6669 1587075 -1074166 -1423945 -149977 1503618 2595586 2495397 955549 -1476669 -3438433
6660 -3438433 -3847933 -3432053 -4452165 -7798568 -10830876 -9918506 -5266435 -1025390 167730
6651 167730 262488 1832416 3665353 3044517 395395 -1782330 -3247759 -5336930 -6651979
6642 -6651979 -3980256 1942723 6023273 5695702 4218361 4942937 6088672 4329748 519176
6633 519176 -1954824 -2500356 -3072585 -3742183 -2476744 790426 3394879 3830950 3623151
6624C623151Q85342J467934N07925j051619k114101j918994N2193K624441K771174
6615F847446p16937m511624m268928k23865L224784L149350Q38451j008103j288604
6606B041970k51946J426122K354307J053554j937220l914647l118515r58293n8636
6597c363304r97713k194996k339663j535079l14558J079429K255925K640289K248855
6588b520815J655202R46223k50616j289431m18524K699387N482932N108350K077227
6579A3489935p41948k221702l686110n275961m621294q49038K573598J785927
6571D53407j974732l762550j398217K220974L502487K262491N89265k81542o23918
6562I87665j039557j765214k439687k060264j16038J955157J856843l69610j783697
$$ plain form
6624 3623151 4508493 5976427 6484352 5432733 3318632 1399638 1451831 4076272 6847446
6615 6847446 6130509 1618885 -2650043 -2873908 350876 3500226 4338677 3330574 2041970
6606 2041970 1790024 3216146 5570453 6624007 4686787 772140 -2346375 -3304668 -3363304
6597 -3363304 -4361017 -6556013 -8895676 -10430755 -10745313 -9665884 -7409959 -4769670 -2520815
6588 -2520815 -865613 80610 -170006 -1459437 -1877961 821426 6304358 11412708 13489935
6579 13489935 12747987 10526285 6840175 1564214 -3057080 -3906118 -1332520 453407
6571 453407 -1521325 -5283875 -6682092 -4461118 -958631 1303860 1893125 1611583 987665
6562 987665 -51892 -1817106 -4256793 -6317057 -6433095 -4477938 -2621095 -2990705 -4774402
6553d774402l90214J761458J127304k243483m246044j939994K355192L769087
6545d581096J210516j068999P65039M626408N224346J463891k305797k936635
6537B397673k351787k703323j896375J943939M987829K570281k293349k150618
6529E04270L171692N479624P62054m493949l509821Q02302J808885j34285j31530
6520D259242J498928r443m453494n878220k089401J947715K195343Q94521R44810
6511f89999M87957k686871n565410l877129P22786K578626L74239j195249J247724
6502h603326M793343M669327J017178j605980o03124J640457J767117J12447o82370
6493B505069l75318j355702l925721m624449j158747L465601M484939J560989
$$ plain form
6553 -4774402 -5164616 -3403158 -2275854 -4519337 -8765381 -10705375 -8350183 -4581096
6545 -4581096 -3370580 -4439579 -3674540 951868 6176214 7640105 5334308 2397673
6537 2397673 45886 -2657437 -4553812 -2609873 2377956 4948237 2654888 504270
6529 504270 3675962 9155586 9917640 5423691 1913870 2716172 4525057 4390772 4259242
6520 4259242 5758170 5748727 1295233 -4582987 -6672388 -4724673 -2529330 -1634809 -689999
6511 -689999 -202042 -2888913 -8454323 -12331452 -11608666 -9030040 -8655801 -9851050 -8603326
6502 -8603326 -3809983 859344 1876522 270542 -332582 1307875 3074992 3187439 2505069
6493 2505069 2129751 774049 -3151672 -7776121 -8934868 -5469267 -984328 576661
6485E76661j451649k009850j164385o44959n42531k16707O79062K260164L782928
6476A268734L464294Q87217j412947j249540l13878j115256j971559K95655L658089
6467C510809K797826j915188l918809q53745J234192k244753o521712m764414
6459a2675794J466784N184806M150281J888783P13554j14538m16017Q99248K227306
6450C324413Q63948j954096k442843n35563J72966j209525j715081l15321K95454
6441c515648j009703j626019j99378P01087p86660k394743j513153P67930J883327
6432g692960J461897O56412J52822N81337K562177M856736M901389K444022N3102
6423I976934r48134j868925k939183k113072O45394J892721p6172k315309k080273
$$ plain form
6485 576661 -874988 -2884838 -4049223 -4694182 -5236713 -5453420 -4774358 -2514194 1268734
6476 1268734 4733028 5620245 4207298 2957758 2643880 1528624 -442935 -147280 3510809
6467 3510809 6308635 4393447 474638 -379107 855085 -1389668 -7911380 -12675794
6459 -12675794 -11209010 -6024204 -1873923 14860 728414 613876 197859 1097107 3324413
6450 3324413 4188361 2234265 -208578 -744141 -571175 -1780700 -3495781 -3811102 -3515648
6441 -3515648 -4525351 -6151370 -6350748 -5649661 -6436321 -8831064 -10344217 -9576287 -7692960
6432 -7692960 -6231063 -5574651 -5421829 -4840492 -2278315 2578421 7479810 9923832 9976934
6423 9976934 9028800 7159875 4220692 2107620 2753014 4645735 4569563 2254254 173981
6414A73981o80338K75075K024843M458105L563574j925874n720090k142517M244125
6405D270884M467815j479679n059646k473936P30778j74627k066350n11853K758846
6396D62232L302410P42342j981584l233635l131323j766871O0116M30345q36494
6387e952462j029637J382684L833842L392016J104189l73013j344898l643788
6379b631067o024755n078528o68779L131923L359665J646158J154669K089567
6371c021147J955076o00730l707444m248005j340926K637968M655460M127023
6363D57275K703478J456641j57185k295585l518616k708643r00291J73549M58016
6354d331361J062715J971455J842681J39144j773560k169476j063112k02254q19191
$$ plain form
6414 173981 -506357 -231282 1793561 6251666 9815240 7889366 2169276 26759 4270884
6405 4270884 8738699 7259020 2199374 -274562 456216 281589 -1784761 -2296614 462232
6396 462232 3764642 4506984 2525400 -708235 -3839558 -5606429 -5546313 -5115968 -5952462
6387 -5952462 -6982099 -5599415 -1765573 1626443 2730632 2357619 1012721 -2631067
6379 -2631067 -8655822 -13734350 -14403129 -11271206 -7911541 -6265383 -5110714 -3021147
6371 -3021147 -1066071 -1666801 -5374245 -9622250 -10963176 -8325208 -3669748 457275
6363 457275 3160753 4617394 4460209 2164624 -1353992 -4062635 -4962926 -4789377 -4331361
6354 -4331361 -3268646 -1297191 545490 684634 -1088926 -3258402 -4321514 -4523768 -5342959
6345e342959j777839q79244J737249K997763J066075j355793m44777K840243L727596
6336B568314Q40931j385688P66895M788516N758465L067415q7004k116855m019771
6327A0181218n604637m815706j630693O18951n14665l123957l479281q25735K010226
6318g184279K325143M22927j401122j751341j177930o19194j5582Q04249R14396
6309g682733m48643j896596j175705J431138L130594K583598J544817J569593
6301i43937J588228M66614l50595Q37780K748909K828637J043563n66367j206938
6292F445894j674037k073150j751135j138452j263773j611139o71083J433199
6284b303676K808127K164904k53293l500083n927525n370649j636520K060775
$$ plain form
6345 -5342959 -7120798 -8000042 -6262793 -3265030 -2198955 -3554748 -3999525 -1159282 2568314
6336 2568314 3409245 2023557 2790452 7578968 13337433 16404848 16317844 14200989 10181218
6327 10181218 4576581 -239125 -1869818 -1250867 -1765532 -4889489 -8368770 -9194505 -7184279
6318 -7184279 -4859136 -4436209 -5837331 -7588672 -8766602 -9385796 -9401378 -8597129 -7682733
6309 -7682733 -8131376 -10027972 -11203677 -9772539 -6641945 -4058347 -2513530 -943937
6301 -943937 644291 1110905 760310 1598090 4346999 7175636 8219199 7652832 6445894
6292 6445894 4771857 2698707 947572 -190880 -1454653 -3065792 -3736875 -2303676
6284 -2303676 504451 2669355 2416062 -1084021 -7011546 -12382195 -14018715 -11957940
6276a1957940K658614J369600J548099L519627M846906M731402M078053J851295
6268A2645656l589098r143971q588701j504068M567126L902325n4775r47537J041902
6259a671141J103556j565488k841314p05669J949716K218360Q92279R8893K26927
6250b93881N46055P39674O20678j60584j262731j706588j317549j003650j232183
6241e070759j331044o62171M93968J516665K001459J520096k17078k537952l864062
6232h150878l115947q29762J310507J955347J221745M78151P71105J465961J011511
6223c882260q44901k422855k072777l1218K105238L024055K445483J090839L40509
6214b47887J037879K242139K172861P02255m21542k81513q6772r78109k275066
$$ plain form
6276 -11957940 -9299326 -7929726 -6381627 -2862000 1984906 6716308 10794361 12645656
6268 12645656 9056558 -87413 -8676114 -10180182 -5613056 -1710731 -1765506 -2713043 -1671141
6259 -1671141 -567585 -2133073 -4974387 -5680056 -3730340 -1511980 -619701 -520808 -293881
6250 -293881 252174 991848 1612526 1451942 189211 -1517377 -2834926 -3838576 -5070759
6241 -5070759 -6401803 -7063974 -6570006 -5053341 -3051882 -1531786 -1748864 -4286816 -8150878
6232 -8150878 -11266825 -12096587 -10786080 -8830733 -7608988 -7130837 -6359732 -4893771 -3882260
6223 -3882260 -4727161 -7150016 -9222793 -9254011 -7148773 -4124718 -1679235 -588396 -247887
6214 -247887 789992 3032131 5204992 5907247 5485705 5204192 5117420 4139311 1864245
6205A864245k988146l262290k947660p53904L120299N292827K852305k217289
6197I60387m850359k705938J961972N550196N869581K368588l439670p653423
6189a938666o879591k230635J623954J914022K76915n78596l26071o0923R8496
6180h101095Q88414K456523M153530N061415M257061J538443j734088l629539
6172D890664l819442l623720l729625l329482j869260p4733J301540K209008K233052
6163e811998N81184j958691k798876o42781K498268L692623K440578M83305o24841
6154b141229m40121Q97118K607691L198767J692556j258117m068291n454062m649411
6145i615099j651737J985681L961959L822107L313346L126958J354645k854997
$$ plain form
6205 1864245 -1123901 -4386191 -7333851 -8087755 -4967456 325371 3177676 960387
6197 960387 -3889972 -6595910 -4633938 916258 6785839 9154427 5714757 -1938666
6189 -1938666 -8818257 -11048892 -9424938 -7510916 -7234001 -7812597 -8138668 -8199591 -8101095
6180 -8101095 -7212681 -4756158 -602628 4458787 8715848 10254291 8520203 4890664
6172 4890664 1071222 -2552498 -6282123 -9611605 -11480865 -11555598 -10254058 -8045050 -5811998
6163 -5811998 -5230814 -7189505 -9988381 -10631162 -8132894 -4440271 -1999693 -1516388 -2141229
6154 -2141229 -2581350 -1684232 923459 4122226 5814782 4556665 488374 -4965688 -9615099
6145 -9615099 -11266836 -9281155 -5319196 -1497089 1816257 4943215 6297860 3442863
6137C442863o196421m897078l25631K639416K434364K133718L525137M088650
6129F845018J757926j048509j203027O7085m53210k323755k288810r1565Q47360
6120B108513q30549k013551k12473K273556J961348l79248j074896Q51851K625495
6111E310046K085381K65131r75222j578121k419967l374535l520216k521735r44423
6102g673661L52664P31690K57595n5771Q74454K805636M243805M070555K529396
6093H136363O31910o91985r51320m53739k02558o26572q38053k23277J7895j295854
6083C502810k666710j628005J085808K096848N33133o87090K05532J132879K74622
6074C849827p02636k91737o13682l424145n472752k684843K637653M040915P5905
$$ plain form
6137 3442863 -2753558 -7650636 -7976267 -5336851 -2902487 -768769 2756368 6845018
6129 6845018 8602944 7554435 6351408 6418493 5965283 3641528 1352718 1261153 2108513
6120 2108513 1277964 -735587 -948060 1325496 3286844 2907596 1832700 2684551 5310046
6111 5310046 7395427 7660558 6685336 5107215 2687248 -687287 -4207503 -6729238 -7673661
6102 -7673661 -7320997 -6589307 -6331712 -6387483 -5513029 -2707393 1536412 5606967 8136363
6093 8136363 8768273 8076288 7124968 6671229 6468671 5842099 5004046 4780769 4798664 3502810
6083 3502810 836100 -791905 293903 2390751 2923884 2236794 2442326 3575205 3849827
6074 3849827 3147191 2855454 2241772 -1182373 -6655125 -9339968 -6702315 -2661400 -2585495
6065b585495l739536k815422J122120L874626M041028K592298N06964j027230
6057A969353o40712J005553J206519r30556k842794k390865j031561j085034k012880
6048f752977j850273o37054J81097N89967J652142K964176K889350J255409r6404
6039A95433L03832J842393K606789J221545j752085l786220k632790P59185K803983
6030A562065J759729K11552J441587M520244N314281K095443k119816l444760
6022A1340325j714548r2597q28802k642801k669993l27814J846217J515565m80740
6013E944812j628901j293548r81930j517174k097973k209381k197347j601420
6005g582862N87046L263856L530341J017632q19264L14968J887081N91558k063693
$$ plain form
6065 -2585495 -6325031 -9140453 -8018333 -4143707 -102679 2489619 2996583 1969353
6057 1969353 1328641 2334194 3540713 2610157 -232637 -2623502 -3655063 -4740097 -6752977
6048 -6752977 -8603250 -9240304 -9059207 -8469240 -6817098 -3852922 -963572 291837 195433
6039 195433 499265 2341658 4948447 6169992 4417907 631687 -2001103 -1241918 1562065
6030 1562065 3321794 3533346 4974933 9495177 14809458 16904901 14785085 11340325
6022 11340325 9625777 9533180 8704378 6061577 3391584 3063770 4909987 6425552 5944812
6013 5944812 4315911 3022363 2040433 523259 -1574714 -3784095 -5981442 -7582862
6005 -7582862 -6995816 -3731960 -201619 816013 -3251 311717 2198798 2790356 726663
5996G26663j822456J595060L578814R76079l526701m754999j247364L257760M188194
5987B971050J202836j665730j178265Q50087K39073l132379m644512j579813K782361
5978d155292L857521J748016l52820j385980k383730k742225p04591K726119M148094
5969G55112K515587M43239J38709P71919O79969k27442j219472j968558k180792
5960b91729j540432n70782k10976l49226j35404L64557L57221j04414l81412o18862
5950c481459j032372n94847J234253K318432M13137k591407k594711M75000K316769
5941c537205R59591l87478R96304K830896J913137m71869q44232P65918J137115
5932C362177r78839l324301l725822k569359j284992l54299M63765J114106J150404
$$ plain form
5996 726663 -1095793 499267 4078081 5054160 1527459 -3227540 -4474904 -1217144 2971050
5987 2971050 4173886 2508156 1329891 2179978 2419051 -713328 -5357840 -6937653 -4155292
5978 -4155292 -297771 1450245 1097425 -288555 -2672285 -5414510 -6119101 -3392982 755112
5969 755112 3270699 3713938 3852647 4624566 5304535 5077093 3857621 1889063 -291729
5960 -291729 -1832161 -2402943 -2613919 -2963145 -3098549 -2733992 -2376771 -2481185 -2862597 -3481459
5950 -3481459 -4513831 -5108678 -3874425 -1555993 -1142856 -3734263 -6328974 -5853974 -3537205
5941 -3537205 -2577614 -2965092 -1968788 862108 2775245 2303376 1459144 2225062 3362177
5932 3362177 2383338 -940963 -4666785 -7236144 -8521136 -8875435 -8411670 -7297564 -6147160
5923f147160L46302p02776o90595J012838K985256K849756K26154k523341l154616
5914e798182k009889p58724J88987J651529L559555M245933K289459j331694l513870
5905a476896k140542J073675K130780j89026k530314j708468P83089J613896R94696
5896a449110J329644J880843o1302k826079j233353M514244O906939J625763n322315
5887E365274n839429r66418J892780J10429k235213k349951k135316k979974k728807
5878a1866625K13886L732450M991185L847810J835566P3900p12075k25168N04750
5869B395679K10112k62275R88712L208988L203320J28647k812145k910477j588419
5860B562142j608095k770842k663375m58395K020765K487659K97174k937321m160998
$$ plain form
5923 -6147160 -5800858 -6503634 -7194229 -6181391 -3196135 -346379 -120225 -2643566 -5798182
5914 -5798182 -7808071 -8566795 -8377808 -6726279 -3166724 1079209 3368668 2036974 -1476896
5905 -1476896 -3617438 -2543763 -412983 -602009 -3132323 -4840791 -4057702 -2443806 -1449110
5896 -1449110 -119466 1761377 1700075 -1126004 -2359357 2154887 9061826 10687589 5365274
5887 5365274 -474155 -1440573 452207 562636 -1672577 -4022528 -6157844 -9137818 -11866625
5878 -11866625 -11652739 -7920289 -2929104 918706 2754272 2828172 2116097 1890929 2395679
5869 2395679 2605791 2343516 3332228 6541216 9744536 9873183 7061038 4150561 2562142
5860 2562142 954047 -1816795 -4480170 -4938565 -2917800 -430141 -132967 -3070288 -7231286
5851g231286j518262L009274M990005K592499j148206k293588p51640N32896j07100
5842a925408j575412k277317j939700j119872l23329J59003M54627J161986K404418
5833d981004L020631J705599r97801k827166k278973l03233Q97378L68425p23590
5824f119734o00912J088438K893386L120794J562105m26730j384640j074149m27780
5815a369222l76330q20233q51301k6356R68475J340660J355451J544086J250674
5806C015904l97364k188903j805748K45537M10287k473096m263443j059767M426377
5797d090216N965614K230912k148411l721420l732093l644962k020282J721963
5789i438895M448086L538987J084096M96741J316071R06240o68813j359863j254307
$$ plain form
5851 -7231286 -8749548 -5740274 -750269 1842230 694024 -1599564 -2351204 -1818308 -1925408
5842 -1925408 -3500820 -5778137 -7717837 -8837709 -9161038 -9002035 -8547408 -7385422 -4981004
5833 -4981004 -1960373 -254774 -1252575 -4079741 -6358714 -6661947 -5764569 -5396144 -6119734
5824 -6119734 -6720646 -5632208 -2738822 381972 1944077 1517347 132707 -941442 -1369222
5815 -1369222 -1745552 -2565785 -3417086 -3443442 -2474967 -1134307 221144 1765230 3015904
5806 3015904 2618540 429637 -1376111 -1130574 -720287 -3193383 -7456826 -8516593 -4090216
5797 -4090216 1875398 4106310 1957899 -1763521 -5495614 -9140576 -11160858 -9438895
5789 -9438895 -4990809 -1451822 -367726 129015 1445086 2351326 1682513 322650 -931657
5780i31657j799622j800629J197748N461758N778666R53550l675237l486769p49881
5771I47927n04705l014179m113642j822102J143302J642961O1833r44316O4626
5762f538295K028332K786309J310202j065539j816950j47451J831810J693044
5754H1462k49673j775266k017730k046753k310715j650029M33320K375412K651081
5745d508891J923741J685865J754886P76253j214393k361078j319824J073868
5737b189573K786208K565663P79881j199377k277675k482004k399420j886817
5729f303114k39631K029181K939822J698169L41401R78119K340260J414605j880490
5720C318322m332167m060696k762661k341144j980479l63309J418936J523692
$$ plain form
5780 -931657 -2731279 -4531908 -3334160 2127598 7906264 8859814 5184577 1697808 947927
5771 947927 443222 -2570957 -6684599 -8506701 -7363399 -5720438 -5658605 -6602921 -6538295
5762 -6538295 -4509963 -1723654 -413452 -1478991 -3295941 -3443392 -1611582 81462
5754 81462 -168211 -1943477 -3961207 -6007960 -8318675 -9968704 -9535384 -7159972 -4508891
5745 -4508891 -2585150 -899285 855601 1631854 417461 -1943617 -3263441 -2189573
5737 -2189573 596635 3162298 3942179 2742802 465127 -2016877 -4416297 -6303114
5729 -6303114 -6542745 -4513564 -1573742 124427 465828 1443947 3784207 5198812 3318322
5720 3318322 -1013845 -5074541 -7837202 -10178346 -12158825 -12522134 -11103198 -9579506
5712i579506M54308J00897O42145P14201J3705n53386r19159j745663k381533
5703a3253991j253376J368051L075687K431710O95075j35049M71583J778003K699909
5694b122398K085664l42456k763850k590631K19390K698638K545218P27350n60151
5685a03226r14510j256375j638640j273598j17546J017967J578805J474522P07125
5676e25476k79310n64995k8433J76326n00476o68787R48268L021711L107243J177076
5666E863147l65897j18920Q94664J383513J245099L56603j829681m353999m525588
5657a451059j431534J927585K192700K45763k85918J339549J797246j116398m747652
5648a529718m900282j346959K098896K418771L35439j577290j929979r95023N29260
$$ plain form
5712 -9579506 -9125198 -9024301 -8382156 -7667955 -7654250 -8207636 -9126795 -10872458 -13253991
5703 -13253991 -14507367 -13139316 -10063629 -7631919 -6936844 -7071893 -6600310 -4822307 -2122398
5694 -2122398 -36734 -379190 -3143040 -5733671 -5514281 -2815643 -270425 456925 -103226
5685 -103226 -1017736 -2274111 -3912751 -5186349 -5303895 -4285928 -2707123 -1232601 -525476
5676 -525476 -804786 -1369781 -1398214 -1221888 -1722364 -2391151 -1442883 1578828 4686071 5863147
5666 5863147 5497250 5378330 6272994 7656507 8901606 9258209 7428528 3074529 -1451059
5657 -1451059 -2882593 -955008 1237692 1483455 1197537 2537086 4334332 3217934 -1529718
5648 -1529718 -6430000 -7776959 -5678063 -3259292 -2923853 -4501143 -6431122 -7426145 -6896885
5639f896885K051889K810993K096159P5193j920371k348034r89196N51750M27025
5630d141477j156601j911389l01681K341115L492909K574072J084638Q5587o84963
5621A382210j223780q42142R4137r085j380793j967023m83830J366773J501314
5612a562219O10329M05136J88266j665780l497377j508421M044261P463927M711326
5603I189448p50024k306282J069108L978408K392406j323955k653500j288263
5595H307346m46148j377790j996522r83156Q9438o2233p3327J169347J844585
5586F471540L53152r72048P74037L354114J895022k986772m988533j517334K127315
5577D510493R81506k095780j634064J624527K632479L45917j713042k038091k473896
$$ plain form
5639 -6896885 -4844996 -2034003 62156 137349 -1783022 -4131056 -5120252 -4568502 -4141477
5630 -4141477 -5298078 -7209467 -7511148 -5170033 -1677124 896948 1981586 2067173 1382210
5621 1382210 158430 -683712 -589575 -598660 -1979453 -3946476 -4430306 -3063533 -1562219
5612 -1562219 -951890 -546754 -358488 -2024268 -5521645 -7030066 -2985805 4478122 9189448
5603 9189448 8439424 6133142 7202250 11180658 13573064 12249109 9595609 8307346
5595 8307346 7861198 6483408 4486886 3503730 3593168 3530935 3457608 4626955 6471540
5586 6471540 6824692 5852644 6626681 9980795 11875817 8889045 3900512 2383178 4510493
5577 4510493 5491999 3396219 1762155 3386682 6019161 6365078 4652036 2613945 140049
5568A40049l122061j618790J614748K711778O53078n76224J540618L753619K314656
5559G411471r86973j767117L07907J627655L33196j444080j112485Q77891J663304
5550F910769p68512n083082p327184m822677O75314M703803M804804K226916n85043
5541G35108k141152j751672K31800J631101L25493k535720l565498j835050Q8878
5532h816712L60322J24852N79004Q28055J97787r5762O57723J013025j60607j671255
5522f983568j920671q31744J125168L509389M791498L508551J266108J229977
5514E694708K843158K157688j350401l177135j164507P06856q75060l063582k399839
5505f28114j072944k416248m175884k201654K096447L977165K918785K186426
$$ plain form
5568 140049 -2982012 -4600802 -2986054 -274276 378802 -197422 1343196 5096815 7411471
5559 7411471 6424498 4657381 4965288 6592943 6926139 5482059 4369574 5247465 6910769
5550 6910769 6142257 1059175 -6268009 -11090686 -10415372 -5711569 -906765 1320151 735108
5541 735108 -1406044 -3157716 -2925916 -1294815 -969322 -3505042 -7070540 -8905590 -8816712
5532 -8816712 -8456390 -8331538 -7752534 -6924479 -6726692 -6822454 -6164731 -5151706 -5312313 -6983568
5522 -6983568 -8904239 -9735983 -8610815 -5101426 -309928 3198623 4464731 5694708
5514 5694708 8537866 10695554 9345153 6168018 5003511 5710367 4835307 1771725 -628114
5505 -628114 -1701058 -4117306 -8293190 -10494844 -8398397 -4421232 -1502447 683979
5497F83979K546157K025110O71743K42675K32107q74707j802929q77707l20428
5488B526000k635493m756968k243110K357283K600597j297509k816151l7510J985550
5479d317311Q57276M98950K768948L403496L9117k741487r13611K253464J715586
5470C564428j771596m078873l829395k166741Q4654J640854O29396j858146j891227
5461i676646J014490K288645n8773j455149J529169M752338L071660j107765j882041
5452a524072R01145K622078J746200O74427K96052o31181j534715n36191J614432
5443C628175K458512J986968J903057J796083J88530j684290j475743j95909o53381
5434G952002k188379j624283Q50792J542582o57454k540143j853120l33620j90957
$$ plain form
5497 683979 3230136 5255246 5926989 6169664 6401771 5527064 3724135 2846428 2526000
5488 2526000 -109493 -4866461 -7109571 -4752288 -2151691 -3449200 -6265351 -6302861 -4317311
5479 -4317311 -3460035 -2961085 -192137 3211359 3250476 508989 -404622 1848842 3564428
5470 3564428 1792832 -2286041 -6115436 -8282177 -8197523 -6556669 -5927273 -7785419 -9676646
5461 -9676646 -8662156 -6373511 -6432284 -7887433 -6358264 -1605926 1465734 357969 -1524072
5452 -1524072 -622927 1999151 3745351 4419778 4715830 4084649 2549934 2013743 3628175
5443 3628175 6086687 8073655 9976712 11772795 11961325 10277035 8801292 8605383 7952002
5434 7952002 5763623 4139340 4990132 6532714 5875260 3335117 1481997 1148377 957420
5425I57420q73224q00172J49741J077360J243409L02136j181518j659042n83570
5416a367460L33030l29617j176964l69639R79120P21458m13681k61691N80996
5407a304448j70966j966669j992659k9961J158303L26382j031546j932845k688782
5398i633191k539967m88112J465864K24898k836419k736413J682996N665771N390184
5389c804389K624275O32075l98731j291417r69084J179464K680809R09906k955775
5380a392867n359176m528081j498612J745356L764825M381860M620596M804731
5372F538632L110161j653122o347319o237922j765303J474890N74391j167807
5364e473399l31808J510738J599731Q75755J478485K535658K163296J092936P39579
$$ plain form
5425 957420 84196 -715976 -566235 511125 1754534 2056670 875152 -783890 -1367460
5416 -1367460 -1034430 -1364047 -2541011 -2910650 -1931530 -1210072 -1623753 -1885444 -1304448
5407 -1304448 -1475414 -3442083 -5434742 -5464703 -4306400 -3980018 -5011564 -6944409 -9633191
5398 -9633191 -12173158 -12661270 -11195406 -10970508 -13806927 -16543340 -14860344 -9194573 -3804389
5389 -3804389 -1180114 -548039 -946770 -2238187 -3207271 -2027807 653002 1562908 -1392867
5380 -1392867 -6752043 -11280124 -12778736 -11033380 -7268555 -2886695 1733901 6538632
5372 6538632 9648793 7995671 1648352 -4589570 -6354873 -4879983 -4305592 -5473399
5364 -5473399 -5805207 -4294469 -2694738 -1818983 -340498 2195160 4358456 5451392 6190971
5355F190971O9362j956937l158872j387024R71863J10354k927342l554380n68365
5346f210370K499167K891441J662296R72508J645018L553975N434154M484930
5338A6933119n76785o218921p348304l883176l91695Q68657K098655M326570M662809
5329A0470929J617928j264064o59368J039511l81740m005359n309600l334266
5321a826029j565550j802074j787646k8105J264203K62183q51324N56840K769188
5312c008314K168917p29329j749360L22270J608749p69269l899751l245489O23993
5303h677583K993124J758335m17284q68718k77221J9101Q74273L110318M693726
5294C208071L158345k31486j784518o43953J89091j327642l214522k783060q80917
$$ plain form
5355 6190971 6260333 4303396 1144524 -242500 729363 839717 -2087625 -5642005 -6210370
5346 -6210370 -3711203 -819762 842534 1815042 3460060 7014035 12448189 16933119
5338 16933119 16356334 10137413 2789109 -1094067 -1485762 -617105 1481550 5808120 10470929
5329 10470929 12088857 10824793 10165425 11204936 10823196 6817837 1508237 -1826029
5321 -1826029 -3391579 -5193653 -6981299 -7009404 -5745201 -5483018 -6334342 -5777502 -3008314
5312 -3008314 -839397 -1568726 -3318086 -2995816 -1387067 -2156336 -6056087 -9301576 -8677583
5303 -8677583 -5684459 -3926124 -4343408 -5212126 -5489347 -5470246 -4595973 -1485655 3208071
5294 3208071 6366416 6134930 4350412 3706459 3895550 2567908 -646614 -3429674 -4310591
5285d310591m89189k113197l087938j533713J133190K342927J366426q04042l094664
5276a0590791m432325l341649N06198M635756N661011L234526N48810L91147K132871
5267a254446L276834K572901O67178j185992k074285j960881j923912k847498
5259d730101l513547j680876K201614M477088K919940j47739j305455o54220n38613
5250b971909j336349j490292o67528J05951P43022J658605J800192K29586j003867
5241b932589Q88170M557285N608139K741957r12428k961271m194158n054053m016364
5232f275312j188592N73881M02140J390258N038185P384841M401093j479035m279866
5223E967593k324330N94179R48481r86548k964979l319687j679096Q40802K265522
$$ plain form
5285 -4310591 -4799780 -6912977 -10000915 -11534628 -10401438 -8058511 -6692085 -7496127 -10590791
5276 -10590791 -15023116 -18364765 -17858567 -13222811 -7561800 -4327274 -3778464 -3387317 -1254446
5267 -1254446 2022388 4595289 5262467 4076475 2002190 41309 -1882603 -4730101
5259 -4730101 -8243648 -9924524 -7722910 -3245822 -325882 -473621 -1779076 -2433296 -2971909
5250 -2971909 -4308258 -5798550 -6466078 -6360127 -5617105 -3958500 -2158308 -1928722 -2932589
5241 -2932589 -2044419 2512866 8121005 10862962 9950534 6989263 2795105 -2258948 -6275312
5232 -6275312 -7463904 -6890023 -6487883 -5097625 -59440 7325401 11726494 10247459 5967593
5223 5967593 3643263 4237442 5185923 4199375 1234396 -2085291 -3764387 -2923585 -658063
5214f58063J915832J269886J593620K072618J695202J251504J515365J122175
5206A1778139j344833m427321n364517l629822q01774J874547L532897K680352
5198D297668j006140m673721m869977j814233J125963J657979J60015j998802
5190g121248l255907j893277J888655M579077L029176q60214k214288J96821K724676
5181b926529K548499J153597R61361J568600J237359m1886j024557j444223j951537
5172H0684k462904k039612l97408J298364J488154L0534j342120r71306M66244
5163c849370Q16432k68322o33067R94261K818790K595249P55412p00330r02245
5154A626810j17362J254651K083279R25327j224263j180260J273083J782601j783309
$$ plain form
5214 -658063 1257769 2527655 4121275 6193893 7889095 9140599 10655964 11778139
5206 11778139 10433306 6005985 641468 -2988354 -3790128 -1915581 1617316 4297668
5198 4297668 3291528 -1382193 -6252170 -8066403 -6940440 -5282461 -5122446 -7121248
5190 -7121248 -10377155 -12270432 -10381777 -5802700 -2773524 -3633738 -5848026 -5651205 -2926529
5181 -2926529 -378030 775567 1736928 3305528 4542887 4501001 3476444 2032221 80684
5172 80684 -2382220 -4421832 -4819240 -3520876 -2032722 -2002188 -3344308 -4315614 -3849370
5163 -3849370 -3032938 -3301260 -3934327 -2940066 -121276 2473973 3229385 2529055 1626810
5154 1626810 1509448 2764099 4847378 5772705 4548442 3368182 4641265 6423866 4640557
5145D640557m653163k085795K317672J625206l224116m677883m96667L425197
5137c128992L190539K008360K644439K307903p92005k413041P91769M536214L077407
5128A2222593j734072l677851j670778J7981p02614j894489k486295l555844m660101
5119h141470l620047n10795J980491K557693K272150J516390k48195j630337j33312
5110e957432L429044N086330L385119J368540J474274J942731L81053k132968
5102H976691l134274k682865k384217k065849l52145K121527K749599M44541k736975
5093I36033l950605k527296k74803O07054k33308j055136l13409J063819Q22581
5084d925070j100232j946539O6269L012525L850032K330454M17385r67138k167392
$$ plain form
5145 4640557 -12606 -2098401 219271 1844477 -1379639 -6057522 -6554189 -3128992
5137 -3128992 61547 2069907 4714346 7022249 6230244 3817203 4608972 9145186 12222593
5128 12222593 10488521 6810670 5139892 5157873 4455259 2560770 74475 -3481369 -8141470
5119 -8141470 -11761517 -12272312 -10291821 -7734128 -5461978 -3945588 -4193783 -5824120 -5957432
5110 -5957432 -2528388 2557942 5943061 7311601 8785875 10728606 11109659 8976691
5102 8976691 5842417 3159552 775335 -1290514 -1642659 478868 3228467 3673008 936033
5093 936033 -3014572 -5541868 -5816671 -5209617 -5442925 -6498061 -6811470 -5747651 -4925070
5084 -4925070 -6025302 -7971841 -7905572 -4893047 -1043015 1287439 1704824 737686 -1429706
5075a429706k541406q89178J845284L116383K444312J730927J343715o79338m017476
5066I23517m415323L24466N668583N643109R26500k570130k088032m72705n14346
5057C425639j444055j779109j512085l86150K128139L972002J735765l570927
5049B569219o171699l234523J084430J979688L04259p35761j062770j651908o68358
5040g587423L188122O311369M679767O26107n53965R25906M36902k500928l485030
5031B040827j252172L23533m34139j69580K662350M147177J418316k364150l349476
5022C022686k786069l226107k993361M07936M230483L501078j149342l977278
5014b969974k351018L06680N89319k88197P9879Q30680o4252j324404K47117M142707
$$ plain form
5075 -1429706 -3971112 -4860290 -3015006 101377 2545689 4276616 5620331 4940993 923517
5066 923517 -3491806 -3167340 2501243 8144352 9070852 6500722 4412690 3939985 3425639
5057 3425639 1981584 202475 -1309610 -1695760 432379 4404381 6140146 2569219
5049 2569219 -3602480 -6837003 -5752573 -3772885 -3468626 -4204387 -5267157 -6919065 -7587423
5040 -7587423 -4399301 1912068 6591835 7217942 6663977 7589883 8026785 5525857 2040827
5031 2040827 788655 1112188 678049 508469 3170819 7317996 8736312 6372162 3022686
5022 3022686 236617 -2989490 -5982851 -5574915 -1344432 2156646 1007304 -2969974
5014 -2969974 -5320992 -5014312 -4424993 -4713190 -4633311 -3802631 -3866883 -5191287 -4944170 -801463
5004h01463N553580J911736k758741k827841J220125L608879J399270k181669
4996E123876l346702k599209j959203j139549M64872J146626j37585p53116J745456
4987a454534M912300M679043J463170j176743k159393k644246j983793R47859
4979B583663L702085K971603M71494N19344K428137J393918l066111n839739m157593
4970A006801r65738O40197Q44306Q5671j883970l118450j263579J211115l51936
4961c795583m448092m586025K62879L894244L079658J552119J588775K02154k929842
4952e179713k551098K477362N030901J003626l231940j344189K362877P35401
4944f96773l985470m358982P5206L198572K271326J62192p22033p40174m57671
$$ plain form
5004 -801463 4752117 6663853 3905112 1077271 2297396 5906275 7305545 5123876
4996 5123876 1777174 -822035 -2781238 -3920787 -3455915 -2309289 -2446874 -3199990 -1454534
4987 -1454534 3457766 8136809 9599979 8423236 6263843 3619597 1635804 2583663
4979 2583663 6285748 9257351 9728845 10248189 12676326 14070244 11004133 5164394 1006801
4970 1006801 41063 681260 1525566 1611237 -272733 -3391183 -4654762 -3443647 -3795583
4961 -3795583 -8243675 -12829700 -12566821 -8672577 -5592919 -4040800 -2452025 -2249871 -5179713
4952 -5179713 -7730811 -5253449 -222548 781078 -2450862 -3795051 -1432174 -696773
4944 -696773 -4682243 -9041225 -8966019 -5767447 -3496121 -3333929 -4055962 -4796136 -5253807
4935e253807j68509m60885n23520J234956L021243R13123l605244l796786J502685
4926g136744M615842R56371l566129k594555J015729J985351J405085J696566
4918a622484L28218l817996n196623p06946L305447J330589j772614k02729K099238
4909f255900j31557k745128m71026K266028Q1398k088377J607067N627763K854350
4900G44618j788475q41884J524400r72969k844693J916027N177887j226339p706100
4891f017528k833875M376664L14344o881079k258197O262338K215776o391956
4883a1213513j423889Q236386J588928j1585996o464052N732287n542301k6640727
4875d7312877j7733984J90495m3079592j38010567j62738399m3132110J21013985
$$ plain form
4935 -5253807 -5422316 -5883201 -6406721 -5171765 -2150522 -1237399 -4842643 -8639429 -7136744
4926 -7136744 -2520902 -1564531 -5130660 -7725215 -6709486 -4724135 -3319050 -1622484
4918 -1622484 -1294266 -5112262 -10308885 -11015831 -7710384 -6379795 -8152409 -8355138 -6255900
4909 -6255900 -6387457 -9132585 -9603611 -7337583 -7256185 -9344562 -7737495 -2109732 744618
4900 744618 -1043857 -1885741 -361341 -1334310 -4179003 -2262976 2914911 1688572 -6017528
4891 -6017528 -8851403 -4474739 -4160395 -11041474 -13299671 -7037333 -4821557 -11213513
4883 -11213513 -12637402 -4401016 -2812088 -14398084 -20862136 -15129849 -20672150 -47312877
4875 -47312877 -65046861 -64856366 -107935958 -245946525 -408684924 -451817034 -330803049
4868c30803049J72611891R7014047J5607706N138626K2547766J2566907p050615
4861a2366721j861846J2143228N255542j1047013j0379458J511670M369605J273934
4853a1101059M810710P778365r31178r935570l867022P783774P260715n99422
4845A199313k50558M868886R35680q192692p435714K028976N848267J998962Q21723
4836A822843L388805J241965m494946l959748K176059K928667l140186n554394
4828e590935o97599L000356Q62223j487547k43505P26000o93093q19334J382979
4819c560455J751069n20366q60166J720967K149099j660695m804299l087365J361225
4810g510986M086513K997921j442990o068738n834916J67688N227101L210182
$$ plain form
4868 -330803049 -158191158 -61177111 -45569405 -40430779 -17883013 -5316106 -12366721
4861 -12366721 -14228567 -2085339 3170203 -7876810 -18256268 -16744598 -12374993 -11101059
4853 -11101059 -6290349 1488016 556838 -9378732 -13245754 -5461980 1798735 1199313
4845 1199313 948755 5817641 6753321 -1439371 -8875085 -6846109 -997842 1001120 1822843
4836 1822843 5211648 6453613 1958667 -2001081 174978 3103645 -36541 -5590935
4828 -5590935 -6288534 -3288178 -2425955 -3913502 -4157007 -3431007 -4124100 -4943434 -3560455
4819 -3560455 -1809386 -2329752 -3189918 -1468951 680148 -980547 -5784846 -8872211 -7510986
4810 -7510986 -3424473 -426552 -1869542 -7938280 -13773196 -13605508 -8378407 -5168225
4802e168225k094847k539865J925925M292937K298782N27345J142529J106552
4794A491133p00952j471547o92333j223454l015566k479140P60782K880914K568223
4785a881940K395667K723837Q60371k541106k922724O04944L327725K396104L31523
4776E294401o88474k018298l877599l459583m21173J233592k29737r08665K086269
4767b989267N290563M190033K02182j825356o40423P51264R3252j648620k451337
4758I72291j798938q72750q39482j126970j36456J842807K165098j64380k075105
4749b033885n54334K747526M118676L118655J745165J86438k265418l600857j356383
4740B105583K289931K718155r1809j686288l90373O14057q43519k749532k853931
$$ plain form
4802 -5168225 -7263072 -9802937 -7877012 -3584075 -1285293 -757948 384581 1491133
4794 1491133 790181 -681366 -1373699 -2597153 -5612719 -8091859 -7331077 -4450163 -1881940
4785 -1881940 513727 3237564 4097935 1556829 -1365895 -760951 2566774 4962878 5294401
4776 5294401 4605927 2587629 -1289970 -4749553 -5170726 -3937134 -4166871 -5075536 -2989267
4767 -2989267 2301296 6491329 6693511 4868155 4227732 4978996 5072248 3423628 972291
4758 972291 -826647 -1699397 -2538879 -3665849 -3802305 -1959498 205600 41220 -2033885
4749 -2033885 -2588219 159307 4277983 7396638 9141803 9328241 7062823 3461966 2105583
4740 2105583 4395514 7113669 7021860 5335572 4945199 5559256 4715737 1966205 -887726
4731h87726j732732n96486O03097J879586K779566L482192L795928J946266k397225
4722H872466n367432l463009M89806R44310j914438k985069p88978J130145J365202
4713a716997K509066M844687M658456O73615l567231n489728o196485n987715
4705a0272332l106628J250814K729107Q17274J09990K271979L011943n5602k857913
4696f101368j759508Q76755J836592K100299K798818J848144j001477j408874
4688h10619K368531M949984J885105k858539l309807p20158j01625j687613k459197
4679b743938k671208m065333m467192r68842L816763N219558L998098L793117
4671A911023L512027k66377m983143m443766P41846L110539k81456l886924k839572
$$ plain form
4731 -887726 -2620458 -3216944 -2613847 -734261 2045305 5527497 9323425 11269691 8872466
4722 8872466 3505034 42025 531831 1476141 -438297 -3423366 -4212344 -3082199 -1716997
4713 -1716997 792069 5636756 10295212 10968827 7401596 1911868 -4284617 -10272332
4705 -10272332 -13378960 -12128146 -9399039 -8581765 -8471775 -6199796 -3187853 -3243455 -6101368
4696 -6101368 -7860876 -6984121 -5147529 -3047230 -248412 1599732 598255 -810619
4688 -810619 1557912 6507896 8393001 5534462 2224655 1504497 1402872 -284741 -2743938
4679 -2743938 -5415146 -9480479 -13947671 -14916513 -11099750 -5880192 -1882094 1911023
4671 1911023 5423050 5156673 173530 -4270236 -3528390 -417851 -699307 -4586231 -7425803
4662g425803P47122L035747L766442L381753N11100m120960n970499k653121J987023
4653f741196L175513J290664n86602j908403l583167m212164j689121K624810
4645a1629666N008151M192219K179823P47508p5528k72867N43061J349534J72094
4636B214329k550986l231170L81573N295781O195130K021833k675653l611460
4628D039377j687175m11614m69750J74021J741437J935177K85591l59898J632990
4619F880156L617380K483620o75814k374339j680015o94242j003659k068716k667998
4610A816373k037575o1113K132531K525330O56676j236612j029065N10662J383119
4601D660326J414733J606620J695262P33685p53510j495630j723794k579234l825955
$$ plain form
4662 -7425803 -6678681 -3642934 123508 3505261 4016361 -104599 -6075098 -8728219 -6741196
4653 -6741196 -3565683 -2275019 -2861621 -4770024 -8353191 -12565355 -14254476 -11629666
4645 -11629666 -6621515 -2429296 -249473 498035 422507 149640 692701 2042235 2214329
4636 2214329 -336657 -3567827 -3186254 2109527 8304657 10326490 7650837 4039377
4628 4039377 2352202 1940588 1470838 1644859 3386296 5321473 5607064 5247166 6880156
4619 6880156 10497536 12981156 12305342 9931003 8250988 7556746 6553087 4484371 1816373
4610 1816373 -221202 -282315 1850216 4375546 5032222 3795610 2766545 3277207 4660326
4601 4660326 6075059 7681679 9376941 10110626 9357116 7861486 6137692 3558458 -267497
4592b67497m064232k695074j65551K752186M490612L170579m54720k415629m12554
4583f1880K574849K493544P5943j112118o93506j124783k424083k164533n20810
4574b957377l40013j615596p93923L063860N979338M879378J780173j3061l47376
4565I635403n78693p84456j103099k823628n457510n541345j378617L418839M342922
4556b70184J993893L65652P62567J114450M75895L47502J268258J422961k68383
4547G212611k059419j756052K49908J581218Q29006r79409j702924m76238J368718
4538D267419J925840R96462n8436o63764j701252l133127k724336R81461N373438
4529E263705N844832J372372l865059n179119k344187R44863J464953p86127l486264
$$ plain form
4592 -267497 -4331729 -7026803 -7192354 -4440168 50444 3221023 2766303 350674 -61880
4583 -61880 2512969 5006513 5082456 3970338 3276832 2152049 -272034 -2436567 -2957377
4574 -2957377 -3297390 -4912986 -5706909 -2643049 3336289 8215667 9995840 9982779 9635403
4565 9635403 9056710 8272254 7169155 4345527 -1111983 -6653328 -8031945 -4613106 -270184
4556 -270184 1723709 2089361 2851928 3966378 4442273 4789775 6058033 7480994 7212611
4547 7212611 5153192 3397140 3647048 5228266 6057272 5077863 3374939 2898701 4267419
4538 4267419 6193259 7189721 7131285 6467521 4766269 1633142 -1091194 -109733 5263705
4529 5263705 11108537 12480909 8615850 3436731 1092544 2037407 3502360 2716233 -770031
4520g70031m294607k399133J031307L601167L675257J956275N25064K78175K86302
4511C889776j38343k70462K30484l2263k000781l849856l189171q66598J12408
4502f114806p28280p08796J498665L778579M048663K946711J621682l17034k772685
4493C252699l758062k282476l31788K68895N85155J778278K249999O13611j002209
4484A374102k01149J319420N85837j425566j738258q99402j658832l211421k099022
4475g954291J350851K841345R07710j169997j224849j022509j758359j490784
4467i520883Q71474L171318L727619L705346L804659K417194p32578k846611k328262
4458B269276j239389j158629m00124J881030K731325R6638k902342k339846N99834
$$ plain form
4520 -770031 -5064638 -7463771 -6432464 -2831297 843960 2800235 3325299 3603474 3889776
4511 3889776 3751433 3480971 3711455 3679192 1678411 -2171445 -5360616 -6227214 -6114806
4502 -6114806 -6843086 -7551882 -6053217 -2274638 1774025 4720736 6342418 6025384 3252699
4493 3252699 -505363 -2787839 -3119627 -2850732 -2265577 -487299 1762700 2376311 1374102
4484 1374102 1172953 2492373 3078210 1652644 -85614 -985016 -2643848 -5855269 -7954291
4475 -7954291 -6603440 -3762095 -2854385 -4024382 -5249231 -6271740 -8030099 -9520883
4467 -9520883 -8649409 -5478091 -1750472 1954874 5759533 8176727 7444149 4597538 2269276
4458 2269276 1029887 -128742 -528866 1352164 4083489 4180127 1277785 -1062061 -462227
4449d62227K072849J624854J628905K396132K026102K47168j171918j311746o28678
4440F421441N39541J543724Q33717j621578k904325r92721J594461J160122j684781
4431D889601l313509k526012j065217J90198J638538K249037M78469k223124k632568
4422b314587o84832L86384p98664j982579j338057j7694M21127K89469K63929
4413e775504n3431r65111j897855k442775k489879j237495J816383M820933M959356
4404c265378K271692k75266r51358j022033j742894k173499j141645O52141J702030
4395e946210J451457L19750o53261J0019K710379N323787N155710K454870m25
4386A0826076p68136q64457j034950o77257O5313r6777j180044j696387j458250
$$ plain form
4449 -462227 1610622 3235476 4864381 7260513 9286615 9533783 8361865 7050119 6421441
4440 6421441 6960982 8504706 9338423 7716845 4812520 3819799 5414260 6574382 4889601
4431 4889601 1576092 -949920 -2015137 -1824939 -186401 2062636 2541105 317981 -2314587
4422 -2314587 -2999419 -2613035 -3411699 -5394278 -6732335 -6750029 -6328902 -6039433 -5775504
4413 -5775504 -5828935 -6794046 -8691901 -11134676 -13624555 -14862050 -13045667 -8224734 -3265378
4404 -3265378 -993686 -1268952 -2220310 -3242343 -4985237 -7158736 -8300381 -7648240 -5946210
4395 -5946210 -4494753 -4175003 -4828264 -4818245 -2107866 3215921 8371631 10826501 10826076
4386 10826076 10057940 9193483 8158533 7481276 7546589 7449812 6269768 4573381 3115131
4377C115131j839865k627187j834176L54452J040120l95618n38528K320509M289823
4368C884661J282913m310805o377768l049483J760957L951316L011651O37982
4360G91424j380747j841753j056046j011727k683134l811681j682832K462232
4352a0214264M479975K756146N8756l69730J589859L671339L751672J329130j966822
4343E086061l313215j652668O37560P84245m43660l65802P33843o1286k814184
4334a409106l634519o96172K363676J761034p15263p47570J794015L046637J148831
4325B911563j695809l072032k857742j432209J337652M156343M235399J022811
4317D605976k097356j851513O61658J753761R8456k163244k647654j069330J424602
$$ plain form
4377 3115131 1275266 -1351921 -3186097 -2831645 -1791525 -2187143 -2725671 -405162 3884661
4368 3884661 5167574 856769 -5520999 -8570482 -6809525 -2858209 153442 791424
4360 791424 -589323 -2431076 -3487122 -4498849 -7181983 -10993664 -12676496 -10214264
4352 -10214264 -5734289 -2978143 -2919387 -3289117 -1699258 1972081 5723753 7052883 5086061
4343 5086061 1772846 120178 757738 1541983 1098323 732521 1466364 1405078 -1409106
4334 -1409106 -5043625 -5739797 -3376121 -1615087 -2330350 -3077920 -1283905 1762732 2911563
4325 2911563 1215754 -1856278 -4714020 -6146229 -4808577 -652234 3583165 4605976
4317 4605976 2508620 657107 1318765 3072526 3170982 1007738 -1639916 -2709246 -1284644
4308a284644L414812L567805J479868j323091k400259r60156J309475K186547
4300E990357R85117j328876l225184l708480l071116k511610k384709j437261
4292a0691762J042585L178546K748333J049663J556983M170876M263547n08515
4284F810256n531639m783275Q32158M704851L440740L92687l07931Q18541J148977
4275G525365P07386J251687K345572J642519j241699l867433m345441l390601
4267F27355k308409r12120J212703K818856K295255L75435l54277J024371K326165
4258G105334J215201j593124l290618k386766J40188K534939L533317K243491
4250I501962j219509m528007m535894j032451K359330K350336j64530j846672
$$ plain form
4308 -1284644 2130168 5697973 7177841 5854750 3454491 2494335 3803810 5990357
4300 5990357 6975474 5646598 2421414 -1287066 -4358182 -6869792 -9254501 -10691762
4292 -10691762 -9649177 -6470631 -3722298 -2672635 -1115652 3055224 7318771 6810256
4284 6810256 1278617 -3504658 -2672500 2032351 5473091 5865778 5557847 6376388 7525365
4275 7525365 8232751 9484438 11830010 13472529 12230830 8363397 4017956 627355
4267 627355 -1681054 -2593174 -1380471 1438385 3733640 4109075 3754798 4779169 7105334
4258 7105334 8320535 6727411 3436793 1050027 1190215 3725154 7258471 9501962
4250 9501962 8282453 3754446 -781448 -1813899 545431 2895767 2731237 884565
4242H84565j319312J5608P13096O08690l57420k310364l953186k989921Q40089
4233g868155M576810N164044K884642N18636k61258l14187r91398j997003j943267
4224b31136m33783J272166J804965J304759R88302J355120J525117N08629j419813
4215F674326k902689k726824q04286J620232K759764J919927L39317l41315k54357
4206F284095p25663j594819r91417J489119L249678J782403j969025m795409m765953
4197b036991k272444J309699M370948N383485M160452K222411O85312j127167
4189A2695705l541929m604907k608356O71828K032906J381304J234875K105884
4181I367310J752040n68209k363375j606764M69909J652474J639433J265462P01248
$$ plain form
4242 884565 -434747 -419139 293957 902647 545227 -1765137 -5718323 -8708244 -7868155
4233 -7868155 -3291345 1872699 4757341 5275977 5014719 4700532 3709134 1712131 -231136
4224 -231136 -664919 607247 2412212 3716971 4705273 6060393 7585510 8094139 6674326
4215 6674326 3771637 1044813 240527 1860759 4620523 6540450 6879767 6538452 6284095
4206 6284095 5558432 3963613 2972196 4461315 7710993 9493396 7524371 2728962 -2036991
4197 -2036991 -4309435 -2999736 1371212 6754697 10915149 13137560 13822872 12695705
4189 12695705 9153776 4548869 1940513 2612341 4645247 6026551 7261426 9367310
4181 9367310 11119350 10551141 8187766 6581002 7050911 8703385 10342818 11608280 12309528
4172A2309528j02883o03104n40827m79461o38111n00811k19391p34943j653708
4163F836289q50839K483848N942845O545677M198619J257443l33157k93686N85084
4154B6372123J100587N15869l18514K75076K115495K728066R51509n94543J105842
4145C4251510M543694N143068K162561J148517O889807J5133757J4994131J352079
4137H5619124j7399798k7106760k2871599j3144698q435777r839725j1017521
4130b4196754p994269k785263J053811K123783O96147j798110k598589j6371L818515
4121c1697100N272849L926159K093389N10985j646340l028628j112932K708826
4113b2972792L852078J326711q73208l08628R55027J431303K725469M596844L286045
$$ plain form
4172 12309528 12206645 11603541 11062714 10583253 9945142 9444331 9224940 8489997 6836289
4163 6836289 5985450 8469298 14412143 20957820 25156439 26413882 26080725 25787039 26372123
4154 26372123 27472710 27988579 27670065 27945141 30060636 32788702 33740211 33145668 34251510
4145 34251510 38795204 43938272 46100833 47249350 54139157 69272914 84267045 85619124
4137 85619124 68219326 41112566 18240967 5096269 -3339508 -13179233 -24196754
4130 -24196754 -32191023 -34976286 -33922475 -31798692 -31102545 -32900655 -35499244 -35515615 -31697100
4121 -31697100 -26424251 -22498092 -20404703 -19893718 -21540058 -24568686 -25681618 -22972792
4113 -22972792 -19120714 -17794003 -18667211 -18975839 -18020812 -16589509 -13864040 -9267196 -5981151
4104e981151j666512m388077j013317L761527L684441K99126n93769J549387K446625
4095a901720P40482j000614j809241l018971m161116l503160k093727k202775
4087a8950842k438379K82235M427389N213505K371262P62869K376941L332115
4079b622905O16240l150136m028173j936810O84305K210570K004444J1104k330016
4070h541377l041012k158326j051031M82891L186919M952703K847430j329305
4062d651108k376570O08312K887933J736514O0076K56167J3441k404906l723048
4053g593189r11126L019510L242509L35266j327704l05722J200091J850479K125406
4044A635520J662883m55137l053922l751449k391370r67877l85298L12944J712732
$$ plain form
4104 -5981151 -7647663 -12035740 -13049057 -9287530 -5603089 -5303963 -5897732 -4348345 -1901720
4095 -1901720 -1161238 -2161852 -3971093 -6990064 -11151180 -14654340 -16748067 -18950842
4087 -18950842 -21389221 -21106986 -16679597 -11466092 -9094830 -8331961 -5955020 -2622905
4079 -2622905 -2006665 -5156801 -9184974 -11121784 -10437479 -8226909 -6222465 -6211361 -8541377
4070 -8541377 -11582389 -13740715 -14791746 -14308855 -11121936 -6169233 -3321803 -4651108
4062 -4651108 -7027678 -6419366 -3531433 -1794919 -1734843 -1478676 -1465235 -3870141 -7593189
4053 -7593189 -8504315 -5484805 -2242296 -1907030 -3234734 -3540456 -2340365 -489886 1635520
4044 1635520 3298403 2843266 -210656 -3962105 -6353475 -7321352 -7706650 -7393706 -5680974
4035e680974L122635L695369K888962M82605k371747l252736j467997K53502p93580
4026c123961l263871l592346r97608J956664L351439L775078M064948L659844
4018E830187K013787k6936j208402j398985j540102k350665l197770k419718N27791
4009c770813L343635K778610j170864m559591m052539p92861J508544J001629
4001e714250j249779l449867m492013l745259j076417K654303N663220N939612
3993e470450K515980k846573n915820l981411O13169L215695K791424K060703
3985g017283K049107R06915j072653m60535K998165M299051J000742j845809M98639
3976A356339M150063K393006l397340n807750k764691M65158L76323q45911j294502
$$ plain form
4035 -5680974 -2558339 1137030 4025992 4508597 2136850 -1115886 -2583883 -2330381 -3123961
4026 -3123961 -6387832 -9980178 -10977786 -9021122 -5669683 -1894605 2170343 5830187
4018 5830187 7843974 7817038 6608636 5209651 3669549 1318884 -1878886 -4298604 -3770813
4009 -3770813 -427178 2351432 1180568 -3379023 -7431562 -8224423 -6715879 -5714250
4001 -5714250 -6964029 -10413896 -14905909 -18651168 -19727585 -17073282 -11410062 -5470450
3993 -5470450 -2954470 -5801043 -11716863 -15698274 -15085105 -11869410 -9077986 -7017283
3985 -7017283 -4968176 -4061261 -5133914 -5594449 -2596284 1702767 2703509 857700 1356339
3976 1356339 5506402 7899408 4502068 -1305682 -4070373 -3605215 -3228892 -4074803 -5369305
3967e369305k257797l320235j243743L281757L967395j812227p322368n217403
3959a9293926J889577N340240K521130r12242k29522K508060K865048J60132k797904
3950g949407l620213k145988L00336K074237K303249J633676J501873K352926
3942c549311L100587K597481J063970l84792j261350k068029k962738k783343
3934f247525m56315K671006L472616J053607j238123K49650M182631N340072J347904
3925A0375523m029629n543430k651145O19876R58820r58464k347146j865279n72272
3916f013146l1280m16861q45485j024969j540394k303865j955562K16442K721787
3907a1193333L634073L254474L307992L818285K856918k06008l142022l572106
$$ plain form
3967 -5369305 -7627102 -10947337 -12191080 -8909323 -4941928 -6754155 -14076523 -19293926
3959 -19293926 -17404349 -12064109 -9542979 -10455221 -10684743 -8176683 -5311635 -5151503 -7949407
3950 -7949407 -11569620 -13715608 -13415272 -11341035 -9037786 -7404110 -5902237 -3549311
3942 -3549311 -448724 2148757 3212727 2827935 1566585 -501444 -3464182 -6247525
3934 -6247525 -6703840 -4032834 -560218 493389 -744734 -495084 3687547 9027619 10375523
3925 10375523 6345894 802464 -1848681 -1228805 -269985 -1228449 -3575595 -5440874 -6013146
3916 -6013146 -6044426 -6461287 -7306772 -8331741 -9872135 -12176000 -14131562 -13915120 -11193333
3907 -11193333 -7559260 -4304786 -996794 2821491 5678409 5472401 2330379 -1241727
3899a241727j866211j96579K98390J13938k95108j348183l204637m710650m299335
3890a6750102j888858Q35470K452480L383012M438455M538128J923344k253918
3882c321989m107355j968391J172731J928934R24827N43089N06156q72996k502259
3873g697253j538034J838432M391315M528660L479085J861215r01304l391376
3865B570740k870620k41662K06486k229386k711351J351517N253925L814189o80240
3856D463598k382924q60273m36512k163420k514653j38813J668109N20337j608796
3847c453347k225985j748579j170372K36428K563343L505710J539168j346779
3839b100413k498197k205240k044315j571327L93675K587966K636762R27823J15964
$$ plain form
3899 -1241727 -3107938 -3304517 -3006127 -2892189 -3187297 -4535480 -7740117 -12450767 -16750102
3890 -16750102 -18638960 -17803490 -15351010 -11967998 -7529543 -2991415 -1068071 -3321989
3882 -3321989 -7429344 -9397735 -8225004 -6296070 -5371243 -4828154 -4321998 -5194994 -7697253
3873 -7697253 -9235287 -7396855 -3005540 1523120 5002205 6863420 5962116 2570740
3865 2570740 -299880 -541542 -335056 -2564442 -5275793 -3924276 1329649 5143838 4463598
3856 4463598 2080674 1220401 783889 -1379531 -3894184 -4032997 -2364888 -1844551 -3453347
3847 -3453347 -5679332 -7427911 -8598283 -8361855 -5798512 -2292802 -753634 -2100413
3839 -2100413 -4598610 -6803850 -8848165 -10419492 -10025817 -7437851 -4801089 -3873266 -3757302
3830c757302R48470J482232O06794m90971q83733j179879j427789m48835J544890
3821c606123K296181J029570O4087R40528J557743j54014k138360j346027Q47024
3812e09391O41535j606108j533158K083641M907380L324987p22809l294306l559139
3803b67368k941162j894821k39829J226860J823794K181881K705079K728050K504447
3794G826931L300960L916254P65829n839667r457166n693717P93188K579064q2145
3785a890469j180160O95327J164037j054098j664291J017338K300062j160893
3777a773147n500085n569652k393553l87878m58807l21671N76277P91359L40234
3768a4696923P32846K110066L187920L527484L533139K914263J394703K26778
$$ plain form
3830 -3757302 -2808832 -1326600 -719806 -1210777 -2094510 -3274389 -4702178 -5151013 -3606123
3821 -3606123 -1309942 -280372 -216285 724243 2281986 2127972 -10388 -1356415 -509391
3812 -509391 132144 -1473964 -3007122 -923481 3983899 7308886 6586077 3291771 -267368
3803 -267368 -3208530 -5103351 -5343180 -4116320 -2292526 -110645 2594434 5322484 7826931
3794 7826931 11127891 15044145 15809974 9970307 513141 -5180576 -4387388 -1808324 -1890469
3785 -1890469 -3070629 -2375302 -1211265 -2265363 -3929654 -2912316 -612254 -1773147
3777 -1773147 -7273232 -12842884 -15236437 -15624315 -16083122 -16404793 -15828516 -15037157 -14696923
3768 -14696923 -13964077 -11854011 -8666091 -5138607 -1605468 1308795 2703498 2930276
3760B930276P09155J709317R23930j589139l284690k734404j441721j333513j860759
3751e971548r08611J788108L581421K175115q89234j871484O771J553324P93527
3742B57389J02017J675343K952369O43804k943835k834010N12418J821249l20906
3733A865838j570139L14961J918758O96217p84272j69078M87176n44299p52315
3724A462847J656329L481880J817180n43142K8556J452714k45440l648427m254027
3715A208470j867977q8387o7954j36280k36378j456699k250144l23573K505408
3706b713514K365630l88498j808751o51699P94039J546026K515671K676482M844
3697D340230l609926l692309q7321K387893J088411j291910j713802n92217N03771
$$ plain form
3760 2930276 3639431 5348748 6272678 4683539 1398849 -1335555 -2777276 -4110789 -5971548
3751 -5971548 -6880159 -5092051 -1510630 664485 -224749 -2096233 -2089462 -536138 257389
3742 257389 359406 2034749 4987118 5630922 2687087 -146923 365495 2186744 1865838
3733 1865838 295699 610660 2529418 3225635 2441363 2272285 2759461 2215162 1462847
3724 1462847 3119176 6601056 8418236 7875094 7903650 9356364 9110924 5462497 1208470
3715 1208470 -659507 -747894 -815848 -952128 -1188506 -2645205 -4895349 -5218922 -2713514
3706 -2713514 -347884 -736382 -2545133 -3196832 -2402793 -856767 1658904 4335386 4340230
3697 4340230 730304 -2962005 -3049326 -661433 426978 -864932 -2578734 -3170951 -2667180
3688b667180R72443J18203k206297l408001p46028L476957L932266K00900k249906
3679b576643l45344K316604J553147j475380k973060j637913J151720L367291
3671f19578L011978l30642l693342l636079j332061q89733k516859k360734K40227
3662a2126823J255323o19471j212251J659379L895542J995003j110159j321683
3654g585140L02430R98170J681568L972307N565310L620584k09183k710704m065797
3645A569545n409312m740246m09223M120977M406253J731320N35223J284896J284064
3636D373497N93879J286690K127017P452l861193m933780k425383j7734O14199
3627b235356J536107L268307L194365N92811j544810j393105q14925j379788j795244
$$ plain form
3688 -2667180 -1694737 -1576534 -3782831 -7190832 -7936860 -4459903 -527637 -326737 -2576643
3679 -2576643 -2921987 -605383 947764 -527616 -3500676 -5138589 -3986869 -619578
3671 -619578 2392400 2061758 -1631584 -5267663 -6599724 -7489457 -10006316 -12367050 -12126823
3662 -12126823 -10871500 -11490971 -12703222 -11043843 -7148301 -5153298 -6263457 -7585140
3654 -7585140 -7282710 -6284540 -4602972 -630665 4934645 8555229 8346046 5635342 1569545
3645 1569545 -3839767 -8580013 -8989236 -4868259 -462006 1269314 1804537 3089433 4373497
3636 4373497 4967376 6254066 8381083 8388535 4527342 -406438 -2831821 -2849555 -2235356
3627 -2235356 -699249 2569058 5763423 6356234 4811424 3418319 2603394 1223606 -571638
3618e71638j133578j009884k433055l482767k229217L90813K340870L055305K874434
3609b198717J911593P09015K58281N11214N77057O91586J728876K487182L73896
3600G049983m215100o986728m782041N60619M681936N158468K469608j333748
3592B602997l598066k650821J31562J398202N9043j308358l82676J614017K126350
3583g750Q93004n76687j614555k246649j557900J166976L913454L183313j356199
3574A797007n392531m694060l22337K702973J764908m18900j43533K021865K581735
3565a02873N96306j224798r36482K85797J053386J874343K775360J879934j286507
3556D914466l705829k840750m80068K34543n55286q83833q30324j256887p27748
$$ plain form
3618 -571638 -1705216 -2715100 -5148155 -8630922 -10860139 -10469326 -8128456 -5073151 -2198717
3609 -2198717 -287124 421891 680172 1191386 1768443 2460029 4188905 6676087 7049983
3600 7049983 2834883 -4151845 -8933886 -8373267 -3691331 1467137 3936745 2602997
3592 2602997 -995069 -3645890 -3514328 -2116126 -2057083 -3365441 -3748117 -2134100 -7750
3583 -7750 885254 308567 -1305988 -3552637 -5110537 -3943561 -30107 3153206 1797007
3574 1797007 -3595524 -8289584 -8611921 -5908948 -4144040 -4562940 -4706473 -2684608 -102873
3565 -102873 493433 -731365 -1667847 -1382050 -328664 1545679 4321039 6200973 4914466
3556 4914466 1208637 -1632113 -2112181 -1877638 -2432924 -3316757 -4147081 -5403968 -6131716
3547f131716K042465M310691K642129j002249j659710P50343J526611o62188j704383
3538A11993N04863K339692P48432j697276j335602R57114K069707J456006M24274
3529E579203p41086j953599j908502k48285R20630J06819j129594j119703r86971
3520a481088j925033k063659O22850M097246M398460R74201l010427m779140l850049
3511g016639r99114J995032K595453K74095j744607k30668L251266M206734J558354
3502C889906r58915k17212K230150K743456M61542j975193j963179l1653J018684
3493E197586j53571j531638o33338J474217J285122j876855m421660l521205r91075
3484e172417j57958r90576q86438J121473L544884M979172N097490L644268O31107
$$ plain form
3547 -6131716 -4089251 221440 2863569 1861320 201610 951953 2478564 1816376 111993
3538 111993 616856 2956548 3704980 2007704 672102 1629216 3698923 5154929 5579203
3529 5579203 4838117 2884518 976016 727731 1648361 1755180 625586 -494117 -1481088
3520 -1481088 -3406121 -5469780 -4846930 -749684 3648776 4622977 1612550 -3166590 -7016639
3511 -7016639 -8015753 -6020721 -3425268 -3151173 -4895780 -5126448 -1875182 2331552 3889906
3502 3889906 2930991 2713779 4943929 7687385 8148927 6173734 4210555 4178902 5197586
3493 5197586 5044015 3512377 2879039 4353256 5638378 3761523 -660137 -4181342 -5172417
3484 -5172417 -5330375 -6320951 -7207389 -6085916 -2541032 2438140 7535630 11179898 11811005
3475A1811005k580561m065117l215176r69976J186656J731053n2061k586987k922913
3466a664077n65663J318219K84287j704958j346878R66164K131018J210321J28154
3457G56587o5486n42706k045477l324880k768436j03675L423687N415713L863400
3448D608727o1018k185613n33828J329049p80866m929552n410227j242149K400092
3439f805385K000613L57423J377364L978628M166478Q94066l008193m573408l235069
3430d847483m40552J661594J738944N07697j83634J00194P100j036981j720239
3421d213360j216254p27120j190474j200440P34840L030718K543207q85547l456843
3412f581273j698644L365670P120371O154084J686558j971398k178429m71103
$$ plain form
3475 11811005 9230444 5165327 1950151 980175 2166831 3897884 3845823 1258836 -1664077
3466 -1664077 -2229740 -911521 -627234 -2332192 -3679070 -2712906 -581888 628433 756587
3457 756587 691101 148395 -1897082 -5221962 -7990398 -8094073 -4670386 745327 4608727
3448 4608727 4547709 2362096 1828268 3157317 2376451 -2553101 -7963328 -9205477 -6805385
3439 -6805385 -4804772 -4447349 -3069985 908643 5075121 5969187 2960994 -1612414 -4847483
3430 -4847483 -5288035 -3626441 -1887497 -1379800 -1563434 -1463240 -1456140 -2493121 -4213360
3421 -4213360 -5429614 -6156734 -7347208 -8547648 -7812808 -4782090 -2238883 -3124430 -6581273
3412 -6581273 -8279917 -4914247 2206124 8360208 10046766 8075368 5896939 5425836
3404E425836R6356r40425j520605p27363j88906j199863k413397j807461L01790
3395b974038J766522J436846N8994j262166k119858k369002j847184q02739K48131
3386g864494J310009K728444L929457L342956M52785k744082l594953k000833
3378d440711m24573m27653p81460P0767J343574J455106R15668J247709J840226
3369G98653Q43404j007304q92599J173582J632385q67556k694731p77045K350162
3360E58951K413773k63282k094689j901452j156650m7930K247019M085136K682051
3351F522927j055887l168170k382870j268926j391459j548141j389145k212777
3343g894448l041238p89523L690856M738803J90572m018207j866063L742171N148121
$$ plain form
3404 5425836 5522192 4581767 3061162 2333799 2144893 945030 -1468367 -3275828 -2974038
3395 -2974038 -1207516 229330 288324 -973842 -3093700 -5462702 -7309886 -8112625 -7864494
3386 -7864494 -6554485 -3826041 103416 3446372 3899157 1155075 -2439878 -4440711
3378 -4440711 -4865284 -5292937 -6074397 -6003630 -4660056 -3204950 -2289282 -1041573 798653
3369 798653 1642057 634753 -257846 915736 2548121 1680565 -1014166 -1791211 558951
3360 558951 2972724 2709442 614753 -1286699 -2443349 -2491279 -244260 3840876 6522927
3351 6522927 5467040 2298870 -84000 -1352926 -2744385 -4292526 -5681671 -7894448
3343 -7894448 -10935686 -11725209 -8034353 -3295550 -3104978 -7123185 -8989248 -5247077 -98956
3334i8956Q93538l080500k618209l79587m77088k256557j957984J489714M781398
3325c704231M155595j53534l890627l344561M62544L115732K159957o01969k462672
3316d263766l027285k735423p49655L012095N490141L555627r59335k554090J029353
3307a202338N785342O436298K499430k026368l713117k774717j491017j133974
3299B379539j173833r01025o93616j206944k059719k281528j726475r98894k36110
3290h898605P51309J284073M02968j105879r96885J469378M308975N254950M113162
3281F583446K158410O04431J86426P67720R25999m61959k065012j667964m1823
3272F989674l07374k731177l667575j329899R90359N2063k273423k349974l88628
$$ plain form
3334 -98956 794582 -2285918 -4904127 -5283714 -5760802 -8017359 -9975343 -8485629 -3704231
3325 -3704231 451364 297830 -3592797 -6937358 -6474814 -3359082 -1199125 -1801094 -4263766
3316 -4263766 -7291051 -10026474 -10776129 -7764034 -2273893 1281734 322399 -2231691 -1202338
3307 -1202338 4583004 11019302 13518732 11492364 7779247 5004530 3513513 2379539
3299 2379539 1205706 304681 -388935 -1595879 -3655598 -5937126 -7663601 -8662495 -8898605
3290 -8898605 -8147296 -6863223 -6460255 -7566134 -8563019 -7093641 -2784666 2470284 6583446
3281 6583446 8741856 9346287 9532713 10300433 11226432 10764473 8699461 7031497 6989674
3272 6989674 6682300 3951123 283548 -1046351 -55992 -3929 -2277352 -4627326 -5015954
3263e015954J044812J819826L356456M626885L427506O52805r36670j486779l247529
3254D241358n443879m681644q80409J813538J210275k831Q38161K320813J952769
3245A368151J44088j137644j371701j005242J64904K145901L628882L310983J422955
3236H671277q99564k689694l220064k376146j129087k26943J094087L076209L205449
3227E505524n67327n011376m601089K41577L036863R64911q80502J816972M973952
3218E479505K332099m415488p741009m743843J59029K418156K114224J246719
3210c150608O56388N74601R80155P92017o52661j517254R3325K122187Q55208
3201G53358k858964m166063j717530K03294j099445k231608L19411L831050L445809
$$ plain form
3263 -5015954 -3971142 -2151316 1205140 5832025 9259531 9912336 8975666 7488887 4241358
3254 4241358 -1202521 -5884165 -6764574 -4951036 -3740761 -3743592 -2905431 -584618 1368151
3245 1368151 1512239 374595 -997106 -2002348 -1837444 308457 3937339 7248322 8671277
3236 8671277 7771713 5082019 1861955 -514191 -1643278 -1870221 -776134 2300075 5505524
3227 5505524 4938197 -73179 -4674268 -4432691 -1395828 -430917 -1311419 505553 5479505
3218 5479505 7811604 3396116 -4344893 -9088736 -8929707 -6511551 -4397327 -3150608
3210 -3150608 -2494220 -1919619 -939464 -147447 -800108 -2317362 -2224037 -101850 753358
3201 753358 -2105606 -6271669 -7989199 -7785905 -8885350 -11116958 -10797547 -6966497 -3520688
3192c520688q6118j726047P5420J846543J287035L14360P52934J046501m79917
3183d89977k117166j404682O23754Q70838j022078k273430j353648J5185R5229
3174g055975o6803J228669L102457L223333J376189l75665r28030j190984j479409
3165b166218l56962K470381M197338K147656k223119n009000m900384l865929
3157i706237k928698n26995L674676O301625M199888p58996l611304k408589K62235
3148e502395J736963K339876L074177K935529O90212k172234k765495p35819J277298
3139H78112J301009K33107k36423j09562k29126l10960L70208R38074m35333l528841
3129a129735n406769l779891q4592K015612R65291r24800m34873K471007M356195
$$ plain form
3192 -3520688 -3606806 -5332853 -5257433 -3410890 -2123855 -1809495 -1056561 -10060 -489977
3183 -489977 -2607143 -4011825 -3388071 -2517233 -3539311 -5812741 -7166389 -7151204 -7055975
3174 -7055975 -7122778 -5894109 -2791652 431681 1807870 1432205 504175 -686809 -2166218
3165 -2166218 -2523180 -52799 4144539 6292195 4069076 -939924 -5840308 -9706237
3157 -9706237 -12634935 -13161930 -9487254 -3185629 1014259 255263 -3356041 -5764630 -5502395
3148 -5502395 -3765432 -1425556 1648621 4584150 5274362 3102128 336633 -399186 878112
3139 878112 2179121 2412228 2175805 2066243 1837117 1526157 1896365 2834439 2399106 -1129735
3129 -1129735 -6536504 -10316395 -10400987 -8385375 -7420084 -8344884 -8779757 -6308750 -1952555
3120a952555K416815j736195l512477q43933K976048L153707o78405m167830l776101
3111h120926n78307K117587K907977K539816J631127L55382l44238M49668J655222
3102B613308J167112q17953j567761J79109J923120P00554k679677m621872l371483
3093f475543p95307M87215J68734p1854J062204L105935M444849M014914K496651
3084H437798J572378J737261J519876l60965k820707l741187l014945k478448
3076H51061k781806k365156k41282K173919L269531L562251M126595M146582K225037
3067A4966732p13187k224348j855048j585512k538659l359257k516100m68161
3059b93540J233188J596625M15588j611809k457490l25408L412234M744140J909150
$$ plain form
3120 -1952555 464260 -1271935 -4784412 -5628345 -2652297 501410 -176995 -4344825 -8120926
3111 -8120926 -8699233 -6581646 -3673669 -1133853 497274 852656 508418 958086 2613308
3102 2613308 3780420 2962467 1394706 1573815 3496935 4197489 1517812 -3104060 -6475543
3093 -6475543 -7270850 -6783635 -6614901 -6686755 -5624551 -2518616 1926233 5941147 8437798
3084 8437798 10010176 11747437 13267313 12906348 10085641 6344454 3329509 851061
3076 851061 -1930745 -4295901 -4537183 -2363264 906267 4468518 8595113 12741695 14966732
3067 14966732 14253545 12029197 10174149 8588637 6049978 2690721 174621 -293540
3059 -293540 939648 2536273 2951861 1340052 -1117438 -1442846 1969388 6713528 8622678
3050H622678j951983k824513j017056q1957j513975l129241k664331o46214R80116
3041d226476J431978J394189J610332J843204J058347j226531l583967l560376
3033e259300p49999K071115K317380J145769J612007L824695M486026J648645
3025A1096338k398517m036134k403603M92878K354784K150329K73659j623810
3017E905924j715865O3809J698415J372907n63202k444562l205088k735958j275866
3008b899486N41141J663188J645030J303506J543213J936008J307912n18276k347224
2999D175012k932762k186751j126070q43648j324706j261663M11062K729329L321997
2990I61800J243267j694327l101365k720603j992037j529466l91415K038850M627046
$$ plain form
3050 8622678 6670695 3846182 2829126 2747169 1233194 -1896047 -4560378 -5206592 -4226476
3041 -4226476 -2794498 -1400309 210023 2053227 3111574 1885043 -1698924 -5259300
3033 -5259300 -6009299 -3938184 -1620804 -475035 1136972 4961667 9447693 11096338
3025 11096338 8697821 4661687 2258084 2750962 5105746 7256075 7529734 5905924
3017 5905924 4190059 4253868 5952283 7325190 6761988 4317426 1112338 -1623620 -2899486
3008 -2899486 -2358345 -695157 949873 2253379 3796592 5732600 7040512 6522236 4175012
2999 4175012 1242250 -944501 -2070571 -2914219 -4238925 -5500588 -5089526 -2360197 961800
2990 961800 2205067 510740 -2590625 -5311228 -7303265 -8832731 -9224146 -7185296 -2558250
2981b558250N645083M799290L268286J799122k12828l038908m859993l377180
2973A464622O63518L450701K684705M59315j43237L12519r08734l598193m495520
2964a10304k557204p54494j236646j916346j67623K629664L207917J487669L87192
2955I69825J195308K073788J307620m02039j487307j527711j033828n41348m53854
2946A00454p53838o17699N76446J715854Q65085j758696l239156j582690J226823
2937c467417J556418p99210j918920R71977N170116N444278Q38158l827243l943836
2928B4321m86082K129215J763777j59287j919281l150268l421594k034682J40445
2919g113436R78934N7043p22442j38966P98504J022909Q74507N26939o09972j773165
$$ plain form
2981 -2558250 3086833 7886123 11154409 12953531 12740703 9701795 4841802 1464622
2973 1464622 2128140 5578841 8263546 8722861 8579624 8892143 7983409 4385216 -110304
2964 -110304 -2667508 -3422002 -4658648 -6574994 -6742617 -4112953 -905036 582633 969825
2955 969825 2165133 4238921 5546541 5144502 3657195 2129484 1095656 554308 100454
2946 100454 -653384 -1271083 -694637 1021217 1886302 127606 -3111550 -4694240 -3467417
2937 -3467417 -1910999 -2710209 -4629129 -3657152 1512964 6957242 7795400 3968157 24321
2928 24321 -461761 1667454 3431231 3271944 1352663 -1797605 -5219199 -7253881 -7113436
2919 -7113436 -6134502 -6077459 -6799901 -6938867 -6140363 -5117454 -4242947 -3716008 -4325980 -6099145
2909f099145p71200K345986M141400K395944n64738j564687j250960k064335l462426
2900f894161k768166J14900K244620J775257j62781j697817k040888j114878O29886
2891i914028K005808K167679J582292Q75760j57861j153918n92956J500003K314790
2882a372431K12238k144177j639819L99159Q51973L19123J357008K651154N19305
2873A153533l936328m948467n61921M167821M420009J560609n28277j062470j345505
2864a080996j240059J70085K214139L367445L142373J861634j6946j499213j697207
2855E221255j330952j583203j543605L76342K644938K030412q14761j594715P47483
2846D153194K148495K35682j950270j751229j480365l474463m972118k543041
$$ plain form
2909 -6099145 -6870345 -4524359 -382959 2012985 1448247 -116440 -1367400 -3431735 -6894161
2900 -6894161 -9662327 -9547427 -7302807 -5527550 -5690331 -7388148 -9429036 -10543914 -9914028
2891 -9914028 -7908220 -5740541 -4158249 -3282489 -3440350 -4594268 -5187224 -3687221 -1372431
2882 -1372431 -1160193 -3304370 -4944189 -4545030 -3693057 -3373934 -2016926 634228 1153533
2873 1153533 -2782795 -7731262 -8293183 -4125362 294647 1855256 1326979 264509 -1080996
2864 -1080996 -2321055 -2150970 63169 3430614 6572987 8434621 8417675 6918462 5221255
2855 5221255 3890303 2307100 763495 1139837 3784775 5815187 5000426 3405711 4153194
2846 4153194 6301689 6537371 4587101 2835872 1355507 -2118956 -7091074 -9634115
2838i634115J765945L483161K309834J114596O32206k20895o41599P86370K483994
2829B079497J910021N7565j68773J115995J533581R33177R51718J172656r628
2820I575809j616754j441999k77482m70681j289716m13670R80576o6651k154627
2811B824805j022347K702397L530417n5485l094538k469976j556249l426948n056435
2802g624359k600898J852365L523722K002002O55202R31809J206065K24400j405250
2793a234942k516437k201628l76389J176215J66462k489364k795976P18910M234093
2784e319056L743368L25368k306446k994169k830451j921113L0918J446569O24088
2775i200924j175591j349683K65449J895202K916918L618609L105075O10613j989845
$$ plain form
2838 -9634115 -7868170 -4385009 -2075175 -960579 -328373 -549268 -1190867 -404497 2079497
2829 2079497 3989518 4047083 3878310 4994305 6527886 7461063 8412781 9585437 9575809
2820 9575809 7959055 6517056 6239574 5768893 4479177 4065507 5046083 4979432 2824805
2811 2824805 1802458 4504855 8035272 7979787 4885249 2415273 859024 -2567924 -7624359
2802 -7624359 -10225257 -8372892 -4849170 -2847168 -2191966 -1260157 -54092 170308 -1234942
2793 -1234942 -3751379 -5953007 -6329396 -5153181 -4986719 -7476083 -10272059 -9553149 -5319056
2784 -5319056 -1575688 -1250320 -3556766 -6550935 -9381386 -11302499 -11271581 -9825012 -9200924
2775 -9200924 -10376515 -11726198 -11460749 -9565547 -6648629 -3030020 75055 685668 -1304177
2766a304177k137485l77491P96526J002840J563692J902900K80192k125873k040390
2757b439266N23279J772210Q1288j514901m74148J280930R72626m60041l39140
2748e97163J255900J927008P38483r51300j766351j445879k90096Q79599Q41036
2739E91237m52157j124861K82615K449962K858527J141566q07780j606846j517829
2730A814434j090424m80837j45718n25554r03448k50397O20319l05802k846956
2721d114383l920802j509878K359156M222665L387984J640347m6166j985619l497883
2712c464579l013651q80885N47047N37842J159594L404451M708779K726554m75694
2703E249458j142575M43637N22720k053072l941123k443152O34715J916037Q57410
$$ plain form
2766 -1304177 -3441662 -3819153 -3022627 -2019787 -456095 1446805 1726997 -398876 -2439266
2757 -2439266 -1915987 -143777 -62489 -1577390 -2051538 -770608 202018 -258023 -597163
2748 -597163 658737 2585745 3324228 2372928 606577 -839302 -1129398 -249799 591237
2739 591237 139080 -985781 -703166 1746796 4605323 5746889 4939109 3332263 1814434
2730 1814434 724010 243173 97455 -428099 -1331547 -1581944 -961625 -1267427 -4114383
2721 -4114383 -8035185 -9545063 -7185907 -2963242 424742 2065089 2018923 33304 -3464579
2712 -3464579 -6478230 -7359115 -6812068 -6274226 -5114632 -1710181 2998598 5725152 5249458
2703 5249458 4106883 4550520 5073240 3020168 -920955 -3364107 -2729392 -813355 44055
2694D4055o58518j335303j176662m88253J68580O6560l76438L30270K160241K793400
2684A527932J087002o01573R2183J473619K94070k834148m109406k332884l56453
2675e759658k52350o31334m8567K71770p72743j373662M65387L219537L709449
2666a172171J688961j39477l03741k14203j395646l184549l908201k959727j058163
2657a2646917N81702R68690J45766m70904M72366K266420K660642P62448j700374
2648f960161k571230j603294J29517J941235L398751L409102J172524k098931
2640c182487l891645l040485o41275J649828L022836L222768K343725J292115
2632G75380J077607J233794M39928q94559o88453J287412K325640Q77567p40524
$$ plain form
2694 44055 -614463 -1949766 -3126428 -3614681 -3446101 -3379541 -3755979 -3425709 -1265468 1527932
2684 1527932 2614934 2013361 2105544 3579163 3873233 1039085 -3070321 -5403205 -5759658
2675 -5759658 -6012008 -6643342 -6691909 -6420139 -7192882 -8566544 -8101157 -4881620 -1172171
2666 -1172171 516790 377313 73572 -140631 -1536277 -4720826 -8629027 -11588754 -12646917
2657 -12646917 -12065215 -11096525 -10950759 -11421663 -10949297 -8682877 -6022235 -5259787 -6960161
2648 -6960161 -9531391 -11134685 -11005168 -9063933 -5665182 -2256080 -1083556 -3182487
2640 -3182487 -7074132 -10114617 -10755892 -9106064 -6083228 -2860460 -516735 775380
2632 775380 1852987 3086781 3526709 2632150 1943697 3231109 5556749 6434316 5693792
2623E693792k87768J29018k533141o203674n818464j213233K143039J293384l04549
2614g101596Q32050K648995J827829k67529k83429J197927J114985l78247m02350
2605h11365J256502J794957L51515q95603r30594j200787j998609j412306Q71752
2596b974538K223521J120994m69495m01754O94065J375979J672075J710165O26791
2587E577803j374313k368530j886628k022157l338045k781317J385223N466961
2579a341003M982414J290991o68667J97366O38984o26241j123084J72382N78783
2570D101925j435242l068500j543987J267705J647877m41986j776774r03004K16617
2561a935369l35089j742404k071773j059824j43923k69515o73511p4959J488315
$$ plain form
2623 5693792 5406024 5535042 3001901 -3201773 -9020237 -10233470 -8090431 -6797047 -7101596
2614 -7101596 -6269546 -3620551 -1792722 -2060251 -2343680 -1145753 -30768 -409015 -811365
2605 -811365 445137 2240094 2591609 1696006 765412 -435375 -2433984 -3846290 -2974538
2596 -2974538 -751017 369977 -99518 -501272 192793 1568772 3240847 4951012 5577803
2587 5577803 4203490 1834960 -51668 -2073825 -5411870 -8193187 -6807964 -1341003
2579 -1341003 3641411 4932402 4263735 4461101 5100085 4473844 3350760 3523142 4101925
2570 4101925 2666683 -401817 -1945804 -678099 969778 527792 -1248982 -2151986 -1935369
2561 -1935369 -2270458 -4012862 -6084635 -7144459 -7288382 -7557897 -8231408 -8306367 -6818052
2552f818052K719457K912766K755964K777814K153051K67969j521318j512444
2544C735207m02646j70300n22882O72265K957062K613077j803590o178699n876893
2535d977399k017184M94084j32178j214575o79477K93231L61023L76707J161602
2526f334166J574261O70651j87215O57783K465340L242475K442744Q51835j061561
2517D322147k806715k912007n46702K380450K960333J074184n64437k69750P46225
2508D383728Q09177J09216l52454n98787j273887k328910l046463k811404j448419
2499f558203M61478J466308N83473j053164j311795j16879M47460k86388j89437
2490f557147J971777L701977K101169j493603l102804j624649K31983M66883J93773
$$ plain form
2552 -6818052 -4098595 -1185829 1570135 4347949 6501000 6768969 5247651 3735207
2544 3735207 3332561 3162261 2639379 3311644 6268706 8881783 7078193 899494 -4977399
2535 -4977399 -6994583 -6500499 -6632677 -7847252 -8526729 -8233498 -7872475 -7495768 -6334166
2526 -6334166 -4759905 -4089254 -4276469 -3618686 -1153346 2089129 4531873 5383708 4322147
2517 4322147 1515432 -1396575 -1943277 437173 3397506 4471690 3907253 3637503 4383728
2508 4383728 5192905 5302121 4949667 4350880 3076993 748083 -2298380 -5109784 -6558203
2499 -6558203 -6096725 -4630417 -4046944 -5100108 -6411903 -6528782 -6081322 -6367710 -6557147
2490 -6557147 -4585370 -883393 1217776 -275827 -3378631 -5003280 -4771297 -4304414 -4110641
2481d110641P64189J227412K41249j359352j677087l76038J260655K158527K095341
2472B24255J091229n93575j979437j842315M1040K329275K896407N73593l282781
2463e42309n294357l240399J161444L745256K426923q17685k734551k219144l98339
2454g913161J327239K238177K176913J555892J081137R15980O91763N98771J378987
2445D051698K720909K962337J298141q93674j980832k185445k542227k873978
2437E56929k327367j045496L25884K044205M294481N274134K519310l351058p939775
2428C51247p189995j575236M384827O478090M453558J514535L63292L43784o95815
2419H428287k495278k590517o42915M05849r44512j843409L71025L328977L118773
$$ plain form
2481 -4110641 -3346452 -2119040 -1877791 -3237143 -4914230 -5290268 -4029613 -1871086 224255
2472 224255 1315484 721909 -1257528 -3099843 -3058803 -729528 2166879 2740472 -542309
2463 -542309 -5836666 -9077065 -7915621 -4170365 -1743442 -2561127 -5295678 -7514822 -7913161
2454 -7913161 -6585922 -4347745 -2170832 -614940 466197 1382177 2073940 2672711 4051698
2445 4051698 6772607 9734944 11033085 10139411 8158579 5973134 3430907 556929
2437 556929 -1770438 -2815934 -2490050 -445845 3848636 9122770 11642080 8291022 351247
2428 351247 -6838748 -8413984 -4029157 2448933 6902491 8417026 8780318 9124102 8428287
2419 8428287 5933009 3342492 2699577 3105426 2160914 317505 688530 4017507 7136280
2410G136280P09816K17533J705582J110366k261369l846513j424589O85885j519548
2401B513443m968778m084092P40544M013779L021270L78043p44087K903J612855
2392B485880L231546L737849K403644K90302j045702j928714l400780m353921
2384A420104k755516N19534K240563J384069M7270m78920j136133j879395p44291
2375a382715K225674L469746O75720l463165m603528j902189K173577N164902
2367B358022N742683L587079L93307q52205K57245M07832k480387n567581n220697
2358a374702k385866k78381R93001L061501M396913K185660j576335j749968J584574
2349D856397K318774k262156o806848n783252j349350O44228j056133l132222
$$ plain form
2410 7136280 7846096 8063629 9769211 10879577 8618208 4771695 3347106 4032991 2513443
2401 2513443 -2455335 -6539427 -5798883 -1785104 1236166 1614209 870122 873025 2485880
2392 2485880 5717426 9455275 11858919 12149221 11103519 9174805 5774025 1420104
2384 1420104 -1335412 -815878 1424685 2808754 2856024 2377104 1240971 -638424 -1382715
2375 -1382715 842959 4312705 4988425 1525260 -3078268 -4980457 -2806880 2358022
2367 2358022 8100705 11687784 12081091 11228886 11486131 11893963 9413576 3845995 -1374702
2358 -1374702 -3760568 -4038949 -3045948 15553 4412466 6598126 5021791 3271823 4856397
2349 4856397 7175171 4913015 -1893833 -7677085 -9026435 -8382207 -9438340 -12570562
2341a2570562l444809k411365k90256K818647N179925N108946L693010K863491
2333I47027J933947o93444l603315l880334j717876L16605J897616M517276O772240
2324F489742N028775l81492m387008m182748k618727k629667k771322j187965
2316f640412J56021q84159k048425j89784K914595K970381O3977j532369k4643
2307e214818J921779K209015K066350K563913K070339p34135l893534m479693
2299c490784k382545m1395O22424k96704j441877j393567K85369K489577L540283
2290b109219K991034J810582P94666j48273j089484j736714k199016k805413k976559
2281g468396j703269O44614K588300L799986N069061N622041L181070j914136
$$ plain form
2341 -12570562 -16015371 -18426736 -18716992 -15898345 -10718420 -5609474 -1916464 947027
2333 947027 2880974 2187530 -1415785 -5296119 -7013995 -6697390 -4799774 -282498 6489742
2324 6489742 11518517 11137025 6750017 2567269 -51458 -2681125 -5452447 -6640412
2316 -6640412 -6484391 -7368550 -9416975 -9606759 -6692164 -3721783 -3657806 -5190175 -5214818
2307 -5214818 -3293039 -1084024 982326 3546239 5616578 4882443 988909 -3490784
2299 -3490784 -5873329 -5914724 -5292300 -5589004 -7030881 -8424448 -8139079 -5649502 -2109219
2290 -2109219 881815 2692397 3487063 3338790 2249306 512592 -1686424 -4491837 -7468396
2281 -7468396 -9171665 -8527051 -5938751 -2138765 2930296 8552337 11733407 9819271
2273I819271n345099m033261o80232k5431j919982j836273J878404N126956L810700
$$ plain form
2273 9819271 4474172 440911 -239321 -264752 -2184734 -4021007 -2142603 2984353 6795053
$$ [...]
##END NTUPLES=NMR SPECTRUM
##END=
