##TITLE=31Pdec_DE-71-2
 CDCl3, 64 sc
 30.10.2024
##JCAMPDX= 6.0         $$ Bruker NMR JCAMP-DX V2.0
##DATA TYPE= NMR SPECTRUM
##DATA CLASS= NTUPLES
##ORIGIN= UXNMR, Bruker Analytische Messtechnik GmbH
##OWNER= root
$$ XWIN-NMR		Version 3.5
$$ Wed Oct 30 14:48:25 2024 Russian Standard Time (UT+4h)  she@DPX200
##.OBSERVE FREQUENCY= 81.013821
##.OBSERVE NUCLEUS= ^31P
##.ACQUISITION MODE= SIMULTANEOUS
##.ACQUISITION SCHEME= undefined
##.AVERAGES= 64
##.DIGITISER RES= 17
##SPECTROMETER/DATA SYSTEM= spect
##.PULSE SEQUENCE= zgpg30
##.SOLVENT NAME= CDCl3
##.SHIFT REFERENCE= (INTERNAL, CDCl3, 0, 198.062)
##AUDIT TRAIL= $$ (NUMBER, WHEN, WHO, WHERE, WHAT)
$$ ##TITLE= Audit trail, XWIN-NMR		Version 3.5
$$ ##JCAMPDX= 5.01
$$ ##ORIGIN= Bruker BioSpin GmbH
$$ ##OWNER= she
$$ F:/spectra/data/she/nmr/P31/2/pdata/1/auditp.txt
$$ ##AUDIT TRAIL=  $$ (NUMBER, WHEN, WHO, WHERE, WHAT)
(   1,<2024-10-30 14:47:11.37 +0400>,<she>,<DPX200>,
      <created by zg, POWCHK disabled, PULCHK disabled
       configuration hash MD5:
       00 E9 B6 7A A2 85 ED C7 34 08 36 98 17 FE 4E 26
       data hash MD5: 32K
       C6 66 EC 4A 3B F6 67 33 55 6E CF 28 B5 FB B9 B8>)
(   2,<2024-10-30 14:47:20.85 +0400>,<she>,<DPX200>,
      <Start of raw data processing
       efp BC_mod = 2 LB = 1.5 FT_mod = 6 PKNL = 1 PHC0 = 2402.974 PHC1 = 684.0884 SI = 64K 
       data hash MD5: 64K
       B9 3A 52 11 4E 9D 01 77 A7 D8 67 A6 9C 6A 33 C8>)
(   3,<2024-10-30 14:47:54.95 +0400>,<she>,<DPX200>,
      <pk PHC0 = -25.10765 PHC1 = 0 
       data hash MD5: 64K
       57 30 66 A9 31 E8 2F 4F 7D C6 32 F9 4B 95 71 6D>)
(   4,<2024-10-30 14:48:00.54 +0400>,<she>,<DPX200>,
      <abs ABSG = 5 
       data hash MD5: 64K
       36 6E E9 6E 98 F4 FE 9F 3A 41 28 86 9B 9B BB F5>)
$$ ##END=
$$ 
$$ hash MD5
$$ ED C0 43 4D 3B 26 A1 F2 D0 38 F5 1C 04 15 B7 63
##$RELAX= 
##$RELAX= 
##$RELAX= 
##$RELAX= 
##$RELAX= 
##$RELAX= 
##$RELAX= 
##$RELAX= 
$$ Bruker specific parameters
$$ --------------------------
##$DU= <F:/spectra>
##$EXPNO= 2
##$NAME= <P31>
##$PROCNO= 1
##$TYPE= <nmr>
##$USER= <she>
##$AMP= (0..31)
100 100 100 100 100 100 100 100 100 100 100 100 100 100 100 100 100 100 
100 100 100 100 100 100 100 100 100 100 100 100 100 100 
##$AQSEQ= 0
##$AQ_mod= 1
##$AUNM= <au_zg>
##$AUTOPOS= <>
##$BF1= 81.014009
##$BF2= 200.13
##$BF3= 200.13
##$BF4= 200.13
##$BF5= 200.13
##$BF6= 200.13
##$BF7= 200.13
##$BF8= 200.13
##$BYTORDA= 1
##$CFDGTYP= 0
##$CFRGTYP= 5
##$CHEMSTR= <none>
##$CNST= (0..31)
1 1 145 1 1 1 1 1 1 1 1 1 1 1 1 1 1 1 1 1 1 1 1 1 1 1 1 1 1 1 1 1 
##$CPDPRG= <waltz16>
##$CPDPRG1= <>
##$CPDPRG2= <waltz16>
##$CPDPRG3= <>
##$CPDPRG4= <mlev>
##$CPDPRG5= <mlev>
##$CPDPRG6= <mlev>
##$CPDPRG7= <mlev>
##$CPDPRG8= <mlev>
##$CPDPRGB= <>
##$CPDPRGT= <>
##$D= (0..31)
0 1 0 0 0 0 0 0 0 0.06 0 0.03 2e-05 3e-06 0 0 0.0002 0 0 0 0 0 0 0 0 0 
0 0 0 0 0 0 
##$DATE= 1730285230
##$DBL= (0..7)
120 120 120 11 120 120 24 19 
##$DBP= (0..7)
150 150 150 150 150 150 150 150 
##$DBP07= 0
##$DBPNAM0= <>
##$DBPNAM1= <>
$$ [...]
##$SUBNAM3= <"">
##$SUBNAM4= <"">
##$SUBNAM5= <"">
##$SUBNAM6= <"">
##$SUBNAM7= <"">
##$SUBNAM8= <"">
##$SUBNAM9= <"">
##$SW= 400.765351723535
##$SWIBOX= (0..15)
0 1 3 0 0 0 0 0 0 0 0 0 0 0 0 0 
##$SW_h= 32467.5324675325
##$TD= 32768
##$TD0= 1
##$TE= 0
##$TE2= 300
##$TE3= 300
##$TEG= 300
##$TL= (0..7)
0 120 53 12 22 120 120 120 
##$TP= (0..7)
150 150 150 150 150 150 150 150 
##$TP07= 0
##$TPNAME0= <>
##$TPNAME1= <>
##$TPNAME2= <>
##$TPNAME3= <>
##$TPNAME4= <>
##$TPNAME5= <>
##$TPNAME6= <>
##$TPNAME7= <>
##$TPOAL= (0..7)
0.5 0.5 0.5 0.5 0.5 0.5 0.5 0.5 
##$TPOFFS= (0..7)
0 0 0 0 0 0 0 0 
##$TUNHIN= 0
##$TUNHOUT= 0
##$TUNXOUT= 0
##$USERA1= <user>
##$USERA2= <user>
##$USERA3= <user>
##$USERA4= <user>
##$USERA5= <user>
##$V9= 5
##$VALIST= <valist>
##$VCLIST= <CCCCCCCCCCCCCCC>
##$VD= 0
##$VDLIST= <DDDDDDDDDDDDDDD>
##$VPLIST= <PPPPPPPPPPPPPPP>
##$VTLIST= <TTTTTTTTTTTTTTT>
##$WBST= 1024
##$WBSW= 4
##$XGAIN= (0..3)
0 0 0 0 
##$XL= 0
##$YL= 0
##$YMAX_a= 3340
##$YMIN_a= -10326
##$ZGOPTNS= <>
##$ZL1= 120
##$ZL2= 120
##$ZL3= 120
##$ZL4= 120
##$ABSF1= 198.0616
##$ABSF2= -202.7028
##$ABSG= 5
##$ABSL= 3
##$ALPHA= 0
##$AQORDER= 0
##$ASSFAC= 0
##$ASSFACI= 0
##$ASSFACX= 0
##$ASSWID= 0
##$AUNMP= <proc_1d>
##$AZFE= 0.1
##$AZFW= 0.5
##$BCFW= 0
##$BC_mod= 2
##$BYTORDP= 0
##$COROFFS= 0
##$CY= -3
##$DATMOD= 1
##$DC= 0
##$DFILT= <>
##$DTYPP= 0
##$F1P= 0
##$F2P= 0
##$FCOR= 1
##$FTSIZE= 65536
##$FT_mod= 6
##$GAMMA= 0
##$GB= 0
##$INTBC= 1
##$INTSCL= 9.790993e-09
##$ISEN= 30
##$LB= 1.5
##$LEV0= 0
##$LPBIN= 0
##$MAXI= 10000
##$MC2= 0
##$MEAN= 0
##$ME_mod= 0
##$MI= 50
##$NCOEF= 0
##$NC_proc= -8
##$NLEV= 6
##$NOISF1= 182.463
##$NOISF2= 159.3651
##$NSP= 0
##$NTH_PI= 0
##$NZP= 0
##$OFFSET= 198.0616
##$PC= 4
##$PHC0= 2377.866
##$PHC1= 684.0884
##$PH_mod= 1
##$PKNL= yes
##$PPARMOD= 0
##$PSCAL= 0
##$PSIGN= 0
##$REVERSE= no
##$SF= 81.0140089999434
##$SI= 65536
##$SIGF1= 159.3651
##$SIGF2= -187.1042
##$SINO= 113.3802
##$SIOLD= 16384
##$SREGLST= <1H.CDCl3>
##$SSB= 0
##$STSI= 65536
##$STSR= 0
##$SW_p= 32467.5324675325
##$SYMM= 0
##$S_DEV= 0
##$TDeff= 32768
##$TDoff= 0
##$TI= <>
##$TILT= no
##$TM1= 0
##$TM2= 0
##$TOPLEV= 0
##$USERP1= <user>
##$USERP2= <user>
##$USERP3= <user>
##$USERP4= <user>
##$USERP5= <user>
##$WDW= 1
##$XDIM= 65536
##$YMAX_p= 52090237
##$YMIN_p= -285059194
$$ End of Bruker specific parameters
$$ ---------------------------------
##NTUPLES= NMR SPECTRUM
##VAR_NAME=  FREQUENCY,     SPECTRUM/REAL,   SPECTRUM/IMAG
##SYMBOL=    X,             R,               I
##VAR_TYPE=  INDEPENDENT,   DEPENDENT,       DEPENDENT
##VAR_FORM=  AFFN,          ASDF,            ASDF
##VAR_DIM=   65536,         65536,           65536
##UNITS=     HZ,            ARBITRARY UNITS, ARBITRARY UNITS
##FACTOR=    0.49542278885378, 1,            1
##FIRST=     16045.7642231865, 0,            0
##LAST=      -16421.768244346, 0,            0
##MIN=       -16421.768244346, -285059194,   0
##MAX=       16045.7642231865, 52090237,     0
$$ Real data points
##PAGE= N=1
##DATA TABLE= (X++(R..R)), XYDATA
$$ [...]
##PAGE= N=2
##DATA TABLE= (X++(I..I)), XYDATA
9543 2075456 1171478 1439516 369700 -2206584 -3882773 -3584351 -3552550 -6057056 -9719466
9534 -9719466 -10909831 -8044478 -3087102 651155 1132781 -1234162 -3942586 -4579037 -3516634
9525 -3516634 -3436353 -5361202 -6762419 -5100146 -1647497 344414 85432 -581022 -593900
9516 -593900 -594978 -817945 -755497 -940723 -2433215 -4256415 -3965500 -1377319 726423 385193
9506 385193 -1447239 -3450160 -5961837 -9052847 -11011734 -10676750 -9395180 -8734578 -7924860
9497 -7924860 -5631646 -2800724 -1491208 -1963993 -3078497 -4566086 -6591359 -7876226
9489 -7876226 -6860012 -4459929 -3214620 -3599143 -3464414 -1446348 1175079 2504069 2036705
9480 2036705 183563 -2319484 -3945306 -3249500 -1049947 30568 -913715 -1793874 -757061
9471 -757061 1303684 2892406 4492659 6873796 8523505 7525650 5022277 3850467 4130370
9462 4130370 3386446 1331283 1067950 4075628 7083515 6442379 3385600 1831368 2285136
9453 2285136 1547851 -1618785 -4226256 -3727975 -1932162 -2010505 -3631881 -3809445 -1659890
9444 -1659890 360706 -111333 -2915265 -6514265 -9379202 -9743545 -6308294 -468593 3986103
9435 3986103 4941596 4244228 4297938 4061999 1022237 -3832310 -6277010 -4500132 -1632288
9426 -1632288 -1445070 -3781999 -5790485 -5807034 -4158425 -1630841 596242 437953 -3171156
9417 -3171156 -7958741 -10086459 -8514407 -5796088 -4259040 -3382142 -1768497 85510
9409 85510 407940 -1457005 -4468812 -7036210 -7846755 -6332462 -3397579 -1162472 -900250
9400 -900250 -1478873 -760404 1603553 3570105 2899259 -569463 -4788960 -7324460 -7417396
9391 -7417396 -6338706 -5431985 -4108428 -777500 4254235 8285642 9188165 7481103 4768354
9382 4768354 1834399 -533213 -791386 1227837 2939255 2190891 657917 1314993 3485465
9373 3485465 3755607 1530473 34324 1276292 3594712 5249318 6839653 8421528
9365 8421528 7743121 3951724 134040 -868850 -786820 -2757912 -5852375 -6553890 -4476240
9356 -4476240 -2639646 -2430254 -2039172 -177495 2051161 3659652 5142515 6388148 5882441
9347 5882441 3199753 187677 -1407048 -1731566 -1505512 -787076 121851 272052 -687179
9338 -687179 -2376291 -4957222 -8368908 -10059733 -6445696 2101363 10328606 13785433
9330 13785433 13183279 11580042 9866429 7336039 4443487 2161033 124274 -1982134
9322 -1982134 -2673177 -1056823 419422 -1197488 -4735404 -6542586 -6292507 -7322554 -10645818
9313 -10645818 -12324499 -8591326 -1091747 4921032 6119294 3374475 -205281 -2048122
9305 -2048122 -1679886 -675108 -850778 -2239228 -3331274 -3080455 -1619166 685340 3311394
9296 3311394 4851653 4166036 2519001 2452438 3979230 4243152 1991967 -128409 478084
9287 478084 2427386 2893741 2294996 3239304 5597391 6085293 3179489 -527210 -2033494
9278 -2033494 -1607349 -1132300 -653005 1147408 3798656 4734866 2628718 -499063 -1522050
9269 -1522050 52037 1508243 44343 -4197958 -8426060 -10000923 -8501623 -5377153
9261 -5377153 -2382232 -542622 64945 127788 415713 762647 -72392 -2889714 -6298152
9252 -6298152 -7071885 -2847834 5356060 13428308 17250779 15899142 12046350 9221661
9244 9221661 8679140 8995293 8424781 6969072 5821920 5354128 4528495 2528472 339554
9235 339554 -62808 1783747 3824373 3681993 1576255 67237 735642 2285971 2663336
9226 2663336 1919061 1639690 2292131 2886046 3068103 3694872 5006820 5920882 5692994
9217 5692994 4699847 2939722 -450358 -5128295 -8782358 -9964209 -10136907 -11030561 -11317263
9208 -11317263 -8308664 -2253186 3476370 6269066 6212263 4429798 1939778 282454
9200 282454 712132 2121747 2087723 667678 611609 2694147 3606976 477736 -4851435
9191 -4851435 -8529669 -9762910 -10288101 -10327604 -8698256 -6497637 -6852763 -10119839 -12484343
9182 -12484343 -10895790 -6961251 -4045223 -2406131 399624 5155195 9293629 9648864
9174 9648864 5437381 -1652316 -9114395 -14879312 -17737455 -17453503 -14796220 -11247647
9166 -11247647 -8067454 -5238644 -1870066 1715812 3138657 731976 -3241587 -4301103
9158 -4301103 -1150055 2737155 3902345 3080502 2891164 3406476 2684467 581674 -922884
9149 -922884 -999918 -887621 -1296450 -1365164 -799602 -790032 -1898698 -2984360 -3172002 -3036359
9139 -3036359 -2841988 -1606880 726861 2146482 1411429 400971 1477356 3714409 4060263
9130 4060263 1553566 -1751220 -3537336 -2938542 -234270 2818089 2979305 -1181968 -5958648
9121 -5958648 -5677655 -58481 4712737 3822014 -228277 -1931485 -470012 422712 -1016397
9112 -1016397 -2218423 -863754 1530708 2121357 575563 -1403869 -2885223 -4016470
9104 -4016470 -4248186 -2364153 1385185 4708318 5732378 5290082 5800382 8095686 10299879
9095 10299879 10158365 7791483 5494488 5157016 6645607 8604424 9864452 9748457 7955414
9086 7955414 4971936 2119995 443027 -164857 -209533 350969 1340674 1277997 -1358172
9077 -1358172 -5675398 -8678230 -8537671 -6242894 -3405095 -75238 3803166 6126184
9069 6126184 4244733 -1137990 -5821506 -6752105 -5427622 -5619361 -8664379 -12215707 -13162486
9060 -13162486 -10621511 -6150282 -2072259 69714 110330 -956477 -1612147 -483974 2912164
9051 2912164 7290455 9602819 7178928 633626 -6036497 -8990605 -7679533 -4082066
9043 -4082066 -89510 3105991 4212036 2630283 -87962 -1569839 -1664122 -2382698 -4520810
9034 -4520810 -6365502 -6503534 -5875346 -5812395 -5866463 -5201792 -4633687 -5395799 -6920351 -7657353
9024 -7657353 -7284141 -6414814 -5010337 -3001072 -1759264 -2785453 -5185079 -6367089 -5088977
9015 -5088977 -2169737 1247251 4070645 4453789 1245367 -3624842 -6618578 -6710138 -5766416
9006 -5766416 -4830019 -2965562 -364905 602260 -1171042 -3778250 -5505283 -7115226 -9198412
8997 -9198412 -10003358 -8220208 -5531930 -3882528 -2424156 90031 2074218 1533418 -87703
8988 -87703 -42689 1191896 1396398 1413629 3917146 7656533 7797191 3006539 -2133308
8979 -2133308 -3509613 -2538179 -2749923 -4688077 -6866534 -9102283 -11797030 -13629074 -12955925
8970 -12955925 -10646246 -9083627 -8877914 -8488247 -6631835 -3476687 2605 2441868
8962 2441868 2549408 594476 -1203286 -1149473 -296810 -854188 -3087105 -5280466 -6221179
8953 -6221179 -6214361 -5964970 -5727340 -5289251 -3932918 -1160630 1656387 1749237 -1289716
8944 -1289716 -3589332 -1222499 4450423 8271162 7773350 5441741 4431556 5017246 6098134
8935 6098134 7310612 7919721 5837185 8516 -7293171 -12358866 -13650487 -12390846
8927 -12390846 -10454553 -8937739 -8043751 -7067323 -5000640 -2180031 -619683 -1590095 -3688528
8918 -3688528 -4749019 -4979939 -6406449 -9419496 -11824469 -11799698 -10230237 -9205179 -9212021
8909 -9212021 -8835489 -6810126 -3572218 -825720 -15358 -1279207 -3603308 -5609303 -5995696
8900 -5995696 -3812772 518779 4393191 4878555 2454505 1416012 4725093 9534991
8892 9534991 10336514 6214713 2106931 2282201 5409600 7477358 7000913 5182027 3008985
8883 3008985 994437 477348 2148613 3826793 2641727 -632711 -2289766 -975626
8875 -975626 761896 993816 1261941 3142019 4824824 3871569 1485601 936949 2666378
8866 2666378 4028284 3736703 3596396 5086645 6651534 5808053 2557431 -611158 -1422964
8857 -1422964 304519 2885411 4139804 2874880 -490443 -4724850 -8911569 -12325469
8849 -12325469 -13783572 -12448266 -9413744 -7243709 -7356246 -8654390 -9100820 -7763994
8841 -7763994 -4911160 -1151688 2632361 5167479 5575507 4162442 1925102 -547663
8833 -547663 -3336699 -6572802 -9847988 -12168956 -12538373 -10846707 -8046088 -5122362 -2313996
8824 -2313996 65981 770917 -1056838 -4001396 -5448163 -4698632 -3419831 -2743044 -1860515
8815 -1860515 -311117 320087 -1493124 -4772877 -7221512 -7809805 -6865252 -4836418 -2671082
8806 -2671082 -2354780 -5009344 -8911979 -11143834 -10813698 -9176124 -7399035 -6189037 -6817637
8797 -6817637 -9890913 -13261571 -13876385 -12001594 -10892839 -11647610 -11417574 -8222805 -4650807
8788 -4650807 -4242069 -6207450 -6734951 -4542275 -2127296 -1621081 -2136579 -1898088 -863871
8779 -863871 -152036 -355828 -1606572 -4245265 -8090685 -11551073 -12841535 -12273538 -12293850
8770 -12293850 -14538467 -17351156 -17266472 -13203769 -8227563 -6219873 -7380714 -8426265
8762 -8426265 -7184671 -5161795 -4647313 -4957708 -3455717 452190 4468015 6617170 7328763
8753 7328763 7603303 6833327 3870090 -653690 -4576421 -6575130 -7106110 -6909489 -5570961
8744 -5570961 -2063048 3631755 9691579 13250931 12443921 8244675 4086347 2900848
8736 2900848 4424633 5958373 5620729 3881678 1857147 -351969 -2590092 -3189499 -516506
8727 -516506 4169008 7218064 6596060 4121726 2928318 3779083 5008580 5338163 5262000
8718 5262000 5683659 6485712 6996052 7171295 7745649 9437222 12224388 15107109 16404091
8709 16404091 14715741 10149361 4678540 970587 494337 2566054 5203684 6918292
8701 6918292 7616430 7850191 7692767 6838537 5533063 4646715 4707806 5419595 6139907 6119812
8691 6119812 4336971 370739 -4031431 -5628235 -3178936 571917 1814682 109348
8683 109348 -1525032 -667781 1968641 4191028 4906812 4432083 3494809 2792987 2659641
8674 2659641 2294611 -13431 -4916111 -10436774 -13113378 -10951076 -5279803 75812
8666 75812 1637826 -919022 -4404008 -5045168 -2174640 1325877 2359972 758219 -1252587
8657 -1252587 -2006430 -1991079 -2608228 -4092095 -5198102 -5006535 -4520232 -5577333 -7963820
8648 -7963820 -8809428 -6054829 -1777783 -341615 -3270285 -7630585 -9751111 -8757568 -5804557
8639 -5804557 -1828105 2397510 5390023 6120340 5555527 5534963 6422316 7123933 7041013
8630 7041013 6609764 6023563 4714748 2294200 -792626 -3492687 -4506227 -3092559 -425779
8621 -425779 786086 -492635 -1695746 21097 3223286 3785888 1109165 -562242 1733383
8612 1733383 5414021 6487231 5142393 3902585 2295425 -2117805 -7855408 -9573729
8604 -9573729 -5616681 -1536452 -3251655 -9397621 -13771431 -13643732 -11928839 -11634805 -11911010
8595 -11911010 -10491080 -7217122 -3652645 -1021430 194646 86990 -107633 1344397
8587 1344397 4261402 6049497 4843333 1938618 -158844 -771115 -600977 314158 2029977
8578 2029977 3114047 2248625 993950 2146495 5102328 5753254 2145247 -2279112 -3038867
8569 -3038867 -580771 351457 -3326917 -9675368 -14305114 -14733324 -11716162 -7473749 -3711060
8560 -3711060 -1218080 -346691 -944042 -1894344 -1722790 -226532 1143826 1136738 245136
8551 245136 -342127 -527388 -983664 -1741427 -2261443 -2241555 -1212185 1601424 5429038
8542 5429038 7302204 5617436 3165384 3477748 5000101 2951022 -2966535 -7409215
8534 -7409215 -7321010 -6267149 -8061281 -10319396 -8513929 -3441112 171086 922821 1803648
8525 1803648 4334469 6037287 4549712 954930 -2104426 -3322182 -2961276 -2113382 -2275572
8516 -2275572 -3997714 -5629020 -4933928 -2020296 862200 2238528 2380418 1685048 268728
8507 268728 -738672 250542 2845998 4644638 4282600 2965348 2355134 2381335 1930893
8498 1930893 698967 -423183 -517721 -92944 -1269888 -5481269 -10574501 -11957488 -7933258
8489 -7933258 -2148625 961010 1133760 404359 -1269892 -4771459 -7916910 -7404031 -4229135
8480 -4229135 -2693136 -3833248 -4255131 -2161141 -116277 -516719 -2357692 -4006527 -5309428
8471 -5309428 -5410456 -2633488 1417819 1856542 -2633779 -6731573 -5355046 -145276 4207756
8462 4207756 6651368 8785005 10142062 9107162 6735476 5252754 3945473 669626
8454 669626 -3410802 -4698147 -2583013 -398735 -753812 -2767498 -4028952 -2919042 734037
8445 734037 5018891 6488329 3666731 -610825 -2551976 -2030910 -1348502 -763450 1344444
8436 1344444 4602430 6571122 6584455 6536393 7631590 9046687 9847614 9713690 8014195
8427 8014195 4767426 2052093 1706323 2346799 1804058 1507284 4361675 8800662 9805937
8418 9805937 6430684 3542578 4707089 7752341 9209588 8921175 7907626 5599141
8410 5599141 2095981 -88098 436962 1394858 675689 -1708 1640311 4029510 4159529
8401 4159529 2513870 1928374 2878796 3517530 3511257 4160238 4967622 3739443 712461
8392 712461 -556103 2235101 6856551 9354034 8676215 6897727 5574712 3742501 167354
8383 167354 -3657049 -4583519 -2103808 399181 96960 -1346107 -639518 1793617 2767506
8374 2767506 1906520 1982054 3249233 2187610 -2231649 -5523595 -4058037 -743524 -509652
8365 -509652 -2966544 -3822002 -1693224 755154 1334489 120668 -2389628 -5197448 -5612667
8356 -5612667 -1877333 3478163 6463133 7257273 9143435 12220979 12693297 8996902 4288485
8347 4288485 1537678 97147 -1158423 -1053407 1115860 3032381 2264829 -350947 -2457629
8338 -2457629 -3395735 -3609486 -2790023 -1047962 -470068 -2915714 -6922322 -8869823 -6887291
8329 -6887291 -2206845 2687199 5831268 6386263 5018157 3476672 2823035 2403462 1150790
8320 1150790 -860870 -2755597 -3737937 -3008648 -149570 3429865 4836507 2840444 -437517
8311 -437517 -2262318 -2458147 -2341667 -1848181 100861 3055881 5063921 5119993 3819557
8302 3819557 1691464 -1313801 -4520289 -6401729 -6317539 -5284703 -4650363 -4803351 -5307260
8293 -5307260 -5570156 -5427686 -5612706 -7129363 -9451612 -10361875 -8899388 -7314074 -8014027
8284 -8014027 -9491555 -8153623 -4023421 -1295888 -2395677 -4780137 -5367560 -5009487 -5777144
8275 -5777144 -6289568 -3523140 1821784 5558009 5554347 3615096 1439780 -1685854 -5778397
8266 -5778397 -8123241 -6950757 -4832933 -5369999 -7854690 -8447087 -6109779 -3978410 -4281173
8257 -4281173 -5051726 -3597430 -958047 -504481 -3126648 -6152039 -6999276 -6032900 -5265191
8248 -5265191 -5593017 -6253026 -6300867 -5596206 -4372888 -2628521 -344659 2056111 4006246
8239 4006246 5496458 6938743 8187473 8332091 6899329 4665950 2625682 753435
8231 753435 -1250738 -2576400 -2140611 -666139 -198018 -1164735 -1680388 -651333 149687
8222 149687 -1343616 -4121206 -5323053 -4356469 -3794995 -5907969 -9800040 -12570479 -12313822
8213 -12313822 -9389008 -5384262 -1488386 2154805 5657953 8183879 8126571 4870922
8205 4870922 -115561 -4423713 -6533579 -6281654 -4461708 -2714207 -2875108 -5233628 -7938958
8196 -7938958 -9155721 -9211195 -9514262 -10126569 -9952252 -8831370 -7669522 -6588377 -4688176
8187 -4688176 -1901163 409188 1120042 554847 -108577 353064 2718434 6236820 8213852
8178 8213852 6333957 1520311 -2959163 -5084949 -5079741 -3197436 878519 5958606 9277587
8169 9277587 9666048 8747353 7971425 6700212 4547957 3249165 4230653 6214853 7330918
8160 7330918 7944689 9109976 9695277 7762643 3984692 1051126 11689 -363504 -624706
8151 -624706 582010 4146174 8479515 10576867 8485163 2980365 -2399422 -3696856
8143 -3696856 -232920 4444747 6334777 4915042 2265860 -212458 -2200562 -2926759
8135 -2926759 -1977301 -932869 -1322489 -1403928 1740195 6883386 9165163 6881557 4100077
8126 4100077 4639846 6766271 6559988 3828220 1218609 -771101 -3952839 -8040031 -9818588
8117 -9818588 -7602961 -3735507 -1257436 -118289 1596031 4040670 5379810 4968479
8109 4968479 4761509 6544716 8877214 8432867 4430807 167236 -781498 1282843 3220311
8100 3220311 3376399 2858500 2728016 2309925 1039274 -104673 -336370 -634921 -2086061
8091 -2086061 -3941122 -4864176 -4921848 -4649833 -3383865 -764537 963462 -1041896 -5832609
8082 -5832609 -8954208 -7945251 -5364148 -5138191 -7711290 -10351115 -10926774 -9588382 -7389419
8073 -7389419 -5001690 -2828288 -1193318 -133113 517335 990925 1913269 4133830 7432589
8064 7432589 9963909 10100140 8517510 7209415 6521946 4632933 418678 -4482416 -7398783
8055 -7398783 -7609033 -6617420 -5907345 -5402512 -4143334 -1836677 442478 997144 -782254
8046 -782254 -3403565 -4656812 -4332349 -4573583 -6672079 -8534248 -6967646 -2162292 1898010
8037 1898010 1875108 -1480562 -4834763 -5886950 -4700061 -2537082 -437918 1528735 4102519
8028 4102519 7262844 8718242 5549487 -1661889 -7857314 -8343145 -3811089 961007
8020 961007 2531237 1080972 -1934142 -5814537 -9887749 -12925554 -14418982 -15231506 -16117659
8011 -16117659 -16438524 -14978329 -11436020 -6870534 -3287464 -2551789 -4529631 -6374987
8003 -6374987 -5098423 -1042696 2592662 3808281 3684394 3924006 4590396 5142974 5714592
7994 5714592 6076148 5109403 2796752 1116716 1360086 2184920 2174356 2552592 4811217
7985 4811217 7052933 5979391 2142807 -48941 1869947 5314142 6298673 4030487
7977 4030487 699381 -1613880 -2523733 -2831766 -3341831 -3675826 -2313235 1187745 4479054
7968 4479054 4767549 2662957 1306337 1452698 353843 -3350660 -6623194 -6062346 -2670000
7959 -2670000 -121072 -77783 -1871096 -5224131 -9981251 -13876757 -14057367 -11162345 -9079797
7950 -9079797 -10032985 -12258899 -13099800 -11966273 -9382014 -5535293 -1303393 1091171 163884
7941 163884 -3056839 -6344568 -8231098 -7924580 -5007609 -625129 2446614 2561036 1012262
7932 1012262 -312827 -1774206 -4581101 -7730775 -8893253 -8048581 -7775961 -9564176 -11883049
7923 -11883049 -12501871 -10906674 -7675076 -3258462 1291974 3654908 1993431 -2806629
7915 -2806629 -7630800 -9825434 -8929350 -6146826 -2965142 -466447 571701 -318213 -2595492
7906 -2595492 -4199196 -2862408 1248590 4931863 5109883 2214995 -660277 -1486557 -680382
7897 -680382 859132 2971454 4983550 5191100 2771803 -1010647 -4478995 -7249549 -9317871
7888 -9317871 -9755567 -7766641 -4257447 -1001374 1269264 2874698 3953541 4508643 5287733
7879 5287733 7277039 10232865 12568892 12795847 10695662 7402400 4715360 3772212 3892698
7870 3892698 3305794 1406732 -523624 -1232260 -970576 -417693 563043 2161033 3898206
7861 3898206 5698028 8256251 11132653 12060445 9719993 5654753 1769846 -2178896
7853 -2178896 -6427012 -8727642 -7292875 -4591661 -4378451 -5930918 -5455223 -2766290 -1775453
7844 -1775453 -3659400 -4300798 -354646 6090012 11001333 13047100 12579729 9498954 4919189
7835 4919189 2020099 2229001 2901022 1471238 -608346 -985907 -829678 -2555060 -5233035
7826 -5233035 -6097986 -5065202 -3936678 -2495777 495301 3344507 2792753 -934949 -4435216
7817 -4435216 -6303905 -7906463 -9029606 -7455191 -3785443 -2096892 -3967101 -5858413
7809 -5858413 -4629992 -1979140 -802418 -465919 1210637 3978671 6423315 8859549
7801 8859549 11453621 11494396 6753193 513519 -1251754 2060117 4566999 1973237 -2912592
7792 -2912592 -4750522 -2745971 -200684 1164418 2881639 5876237 8091846 7206749
7784 7206749 3718019 -212678 -3569910 -6300248 -7332953 -5302769 -1340935 1312925
7776 1312925 1414208 1280152 2833395 4151800 2249045 -2115780 -5135196 -4843903 -2693510
7767 -2693510 -579596 866492 898053 -1346972 -4492806 -5267740 -2590557 931614 2933105
7758 2933105 4286944 6313748 7412790 5336852 1423146 -500339 948475 3453245
7750 3453245 4727427 5158617 6118181 7405927 7438841 5316051 2150968 438389 1753721
7741 1753721 4792353 6541977 6029625 5658830 7594894 10238989 10482720 8604818 8031201
7732 8031201 9906299 10652116 6345802 -2211233 -10273969 -13893174 -12673429 -8879695
7724 -8879695 -5308000 -3582819 -3297792 -2883403 -1865626 -1604049 -3014527 -4614904 -4452903
7715 -4452903 -3340344 -3958983 -6576113 -8081530 -6442006 -3875009 -3482458 -4448070 -3613134
7706 -3613134 -1086104 -600599 -3546479 -6150861 -4632231 -415339 2485084 3161153 3617289
7697 3617289 4297117 3664571 1995663 1755335 3412612 4221343 2509037 260811 -329351
7688 -329351 -355406 -2049885 -5029991 -7043676 -7247326 -6564979 -5555941 -3881973 -1542668
7679 -1542668 849764 2801440 3965644 3879699 2392259 -231384 -3906576 -8198133 -10912138
7670 -10912138 -9259964 -3512622 2459017 5660305 6990663 8228278 8430786 5925929
7662 5925929 2019553 -346676 -595941 -439193 -737455 -1117798 -1780114 -2865079 -2888438
7653 -2888438 -827473 988401 -606725 -4653083 -7071758 -6438816 -5141121 -4737354 -4167356
7644 -4167356 -3266806 -3980497 -6579035 -8263002 -7306809 -5362546 -3913668 -1897468 840608
7635 840608 1130657 -3235518 -9187123 -11639754 -9549221 -5991001 -3772994 -3741190 -6042356
7626 -6042356 -10063758 -13805506 -15665004 -16031415 -15224196 -11604651 -4577593 2166751 4233499
7617 4233499 2736212 2992066 6807136 10010998 8832184 5066963 2712079 2342881 1912062
7608 1912062 1536426 3916105 9623428 14686685 14587192 9596341 4340834 2101290 1365764
7599 1365764 -968617 -4711205 -7082030 -7560140 -8748226 -11573926 -12864655 -9930008
7591 -9930008 -5102249 -2731125 -3205676 -3204816 -1079295 1383362 2504910 2798684 2882969
7582 2882969 2116712 371570 -1084292 -1591861 -2146960 -3471652 -4793033 -5513273 -6378065
7573 -6378065 -7877097 -9034957 -8937358 -8044520 -6911993 -5171392 -3184312 -3233359 -7102656
7564 -7102656 -13108837 -17246885 -17204451 -14200454 -11089722 -9557089 -9068155 -8028494 -6037964
7555 -6037964 -4813215 -6014324 -8382771 -8757757 -6320123 -3746017 -3116494 -2986205 -1431493
7546 -1431493 169880 -592319 -2409561 -1374566 3166623 7263950 7740560 6031039 5254452
7537 5254452 5937711 6562043 6486077 6148050 5614039 5087685 5983365 9235354 12964059
7528 12964059 14068208 12138069 9659566 8125975 6307953 3231700 515729 -18460
7520 -18460 657699 418636 -393622 471267 3155216 4792398 3428349 822722 -26367
7511 -26367 1163986 2015090 779991 -1864897 -4019026 -4231506 -2000413 2078922 6111191
7502 6111191 7712484 5947579 2478687 351531 1373863 4659749 7823237 9537202
7494 9537202 10528952 11839294 12814655 11890355 9170774 6810884 6328136 6766981 6372198
7485 6372198 4992414 3660806 2641529 1333791 -281020 -1488955 -2103804 -2807515 -4200243
7476 -4200243 -6163181 -7751488 -7066476 -2352807 5215897 10824522 10481575 6025615 3165363
7467 3165363 4187284 5320140 2442548 -3235348 -7172083 -7167869 -4623632 -1514122 1101935
7458 1101935 2002454 -18614 -4264400 -8180516 -9926122 -9782167 -8883609 -7971632 -7685637
7449 -7685637 -8472783 -9351318 -8068698 -3782416 1031463 2595556 -202589 -4579141 -6703056
7440 -6703056 -5306157 -2272892 -8076 1176831 2652403 4779554 5707654 3600420
7432 3600420 -522227 -3251809 -2123640 2278110 7415241 10926337 11550371 9350654
7424 9350654 6026363 4162639 4874738 6349233 5768043 2758193 -27502 -106366 1894056
7415 1894056 3154438 1988094 -660841 -2984162 -4624770 -6650235 -9679174 -12849118
7407 -12849118 -14828020 -15338252 -15218965 -15095138 -14462267 -12389696 -8981107 -5721551 -4143539
7398 -4143539 -4338269 -5038911 -4962362 -3659036 -1323833 1314692 2768613 1638926 -1451097
7389 -1451097 -3708045 -3278024 -1910047 -2791825 -5833221 -7204225 -4383021 222703 2289582
7380 2289582 972672 -677718 -168583 1643569 2509997 1781940 475429 -636654 -1815146
7371 -1815146 -3370663 -4652066 -4447162 -2489871 -334791 -87420 -1993735 -4037299 -4517220
7362 -4517220 -4110027 -4282783 -4638828 -3770655 -2325161 -2672284 -4919360 -5809687 -3200964
7353 -3200964 435275 1313569 -257562 -581460 1847582 4520498 5142700 4776528 5233807
7344 5233807 5580618 3526171 -864191 -5161098 -7929579 -10014508 -12264529 -13824856
7336 -13824856 -13536611 -11876542 -10621085 -11197531 -13790797 -17155152 -18655670 -15643328
7328 -15643328 -8316136 -917464 1495798 -1976387 -7236603 -9762486 -9098030 -8081566
7320 -8081566 -8596624 -9644467 -9551688 -8431856 -7561496 -7358274 -7254657 -7147271 -7635462
7311 -7635462 -8748183 -9617784 -9749758 -9528008 -8988489 -7343469 -4697450 -3066094 -4043262
7302 -4043262 -6016233 -5645867 -2304140 813161 803645 -1284484 -2262159 -1191054 -161329
7293 -161329 -890674 -2325992 -2353036 -755589 702911 809892 332722 569702 1433148
7284 1433148 1938928 2095568 2841010 3865397 3136455 -264501 -4071523 -5238720 -3673506
7275 -3673506 -1810479 -1095808 -1111360 -1873089 -4132892 -6772669 -6802220 -3465209 100865
7266 100865 1148448 957829 1885074 2966737 1633920 -1548960 -3295901 -2234164 32642
7257 32642 2214429 4421116 5886394 5112436 3107170 3162248 5988440 8023300 6401693
7248 6401693 3036165 1617627 2718416 4211955 4755622 4263977 2206066 -1816233 -6284181
7239 -6284181 -8828641 -8873165 -7503456 -5305081 -2360983 16016 -80935 -2399430 -4236452
7230 -4236452 -3499671 -824450 1624244 2238896 768754 -1500541 -2116571 304274 3511999
7221 3511999 3035337 -2352639 -7764766 -6877245 622161 8192772 9730546 6039504 2613175
7212 2613175 2346099 3083839 2346279 1260941 1932936 3339204 2912506 1040083 550644
7203 550644 1871998 2240036 540078 -472647 1461497 4385548 5121907 3818358 2921101
7194 2921101 3200379 3450274 3068182 2369033 1054875 -1171902 -2920194 -2413135 -383128
7185 -383128 428497 -1215705 -3707663 -4790172 -3719085 -1474309 -106002 -1316964 -4250019
7176 -4250019 -5419709 -2530024 2409474 5593410 6060057 5556085 4777933 2806736 55953
7167 55953 -1399861 -973747 -340362 -418835 -100255 1330705 3069077 4983511 8311042
7158 8311042 12764621 15272189 13444482 8769535 4869638 3922292 6000371 10313538
7150 10313538 15321462 18577535 18224125 14654929 10124195 7053087 6702543 8426057
7142 8426057 9907500 9119104 6271691 3050526 392191 -1618897 -2397325 -1595082 -770442
7133 -770442 -1714062 -3247802 -2644480 -317052 438317 -935497 -837695 2634924 6205663
7124 6205663 6217199 3548775 882598 -1829417 -5669850 -8973973 -9056995 -6176565 -2462404
7115 -2462404 1488106 5518717 7151926 4153005 -933734 -3027763 -1276793 203539
7107 203539 -1419045 -4406882 -6098672 -6331396 -5962326 -4930176 -3361665 -2360085 -2199287
7098 -2199287 -1443483 939909 4035625 6443900 7918645 8806962 9123632 8768240 7573836
7089 7573836 5028515 1348073 -1270385 -433784 3079138 5711660 5424873 3621315 2124804
7080 2124804 504401 -2183923 -4799496 -5172830 -2983741 -176271 1122667 286567 -1717842
7071 -1717842 -3286217 -3593204 -3275253 -3249100 -3185417 -2261879 -1073533 -1007978 -1621470 -813045
7061 -813045 1568895 2458950 -440672 -4910149 -6398811 -3255399 1832333 5046829 4440522
7052 4440522 124062 -6446655 -12628432 -15470451 -13867597 -9741808 -6333349 -5226367
7044 -5226367 -5488734 -5653462 -5673266 -6348494 -7532266 -8055949 -7375714 -6261410 -5733916
7035 -5733916 -6254882 -7925801 -10214463 -11456198 -10341727 -8263241 -8153862 -10227348 -11204029
7026 -11204029 -9145002 -6571979 -6607322 -8265332 -8450719 -6895417 -5781070 -5525108 -4380915
7017 -4380915 -1786362 1047811 3604796 6099325 7398819 6116168 3574687 2342143
7009 2342143 1972452 -62221 -3128052 -3465778 -432599 1649995 -228013 -3431936 -3886859
7000 -3886859 -1355741 1773828 3909423 4051404 1193402 -3239074 -4954265 -1819287
6992 -1819287 2796108 4530121 3737365 3583014 4390916 3532270 -53350 -4494212 -7603768
6983 -7603768 -8202125 -5585444 -452424 4116330 5225922 3504207 1725616 699543
6975 699543 -961587 -3289140 -3948223 -1448561 2462362 4372433 2376927 -2219977 -5652729
6966 -5652729 -4832583 -777666 1836081 -397253 -5954469 -10487974 -11256353 -8409398 -3707064
6957 -3707064 144767 332268 -3637295 -8965883 -12441376 -13292583 -12189999 -9421932 -5847356
6948 -5847356 -3589902 -3453408 -3394434 -1791038 -160747 -73837 241277 2891934 6122625
6939 6122625 6993792 6352316 6776615 7162017 4363923 -596076 -3233520 -2469032 -1671032
6930 -1671032 -2472126 -2801593 -2086389 -3100343 -6696489 -9473736 -9151261 -8132374 -9113734
6921 -9113734 -10851827 -10988176 -9756175 -8266413 -6344627 -4742711 -6167045 -10938092
6913 -10938092 -14606256 -13392098 -9557328 -7853386 -8802654 -9235841 -7813665 -6172048
6905 -6172048 -5553804 -5702993 -6344566 -6741274 -4779677 198594 4453486 3361124 -2278995
6896 -2278995 -6931006 -7577151 -6817063 -7784590 -9246499 -7816144 -3091565 1534261 2488536
6887 2488536 -814870 -5882290 -9214680 -8701418 -4733593 623026 5279137 7989231
6879 7989231 8384960 6961662 4884811 3328049 3041823 4441755 7327298 10345715 11777709
6870 11777709 11330698 10173953 8794796 6156176 1767158 -2754800 -5338224 -5674696
6862 -5674696 -4773896 -3367542 -1879782 -1018859 -1244680 -2410527 -4666194 -8439074 -12587800
6853 -12587800 -14282227 -12373339 -9475485 -8724522 -9532208 -8701076 -5056141 -757384 1765884
6844 1765884 2195679 1559786 749343 127435 -453028 -1392043 -2552796 -3206494 -3335097
6835 -3335097 -3970291 -5284719 -5598810 -3723972 -1163193 -264059 -1089481 -1870124 -1689999
6826 -1689999 -891596 248740 1153153 172497 -3279104 -6371960 -5481452 -1254348 1640945
6817 1640945 365084 -2931688 -4599126 -3837745 -2307266 -1277036 -871360 -1148499 -2319032
6808 -2319032 -3986207 -5044887 -4584987 -2837345 -1138953 -550318 -452250 615946 2461462
6799 2461462 3024168 1537843 226505 1199801 3108210 3043654 709021 -1667213 -2787728
6790 -2787728 -3137417 -2907760 -1741019 -429835 -393862 -1484929 -2580179 -3960829 -6384059
6781 -6384059 -8215738 -6917392 -3537212 -1925393 -2625373 -1564573 3303981 7794804
6773 7794804 6815884 1190561 -3951621 -5669211 -4984881 -3523219 -1632419 409386 1854721
6764 1854721 2371690 1926108 25775 -3478099 -7175225 -9092378 -8738851 -7173293 -5538425
6755 -5538425 -4540298 -4638526 -5391602 -5095774 -2469057 1472364 4311861 4795530 3530642
6746 3530642 1487075 -933894 -3257817 -4517838 -4144475 -2920972 -2464520 -3420492 -4290306
6737 -4290306 -2754812 1398503 5474458 6944580 6581212 7143647 9533849 12010110 12847361
6728 12847361 11736228 8700170 4010330 -530619 -2609530 -2238133 -1318188 -181757
6720 -181757 2444141 5507601 5532807 2152660 -172146 1243106 2592796 -693026 -6420710
6711 -6420710 -8560910 -5965093 -3103069 -2665133 -2488294 -533209 1657416 2233232 2216138
6702 2216138 3168495 4130415 3077320 -77887 -3632654 -6153558 -7156405 -6688696 -5229531
6693 -5229531 -3308300 -746350 2842781 6587580 8640458 8371273 7178372 6749927 7546587
6684 7546587 9100075 10474190 10258352 7669012 4093020 2006134 1824500 1434529 -422361
6675 -422361 -2035949 -1270777 1150650 2567588 1925697 854245 1266383 3077367 4732881
6666 4732881 5429965 6141741 8148942 10967083 12752593 12990653 13341970 14802551 15622044
6657 15622044 14070837 12021436 12813965 15915576 17104035 14627415 11751268 11546727
6649 11546727 12363678 11151454 8701742 8024720 8960218 8364399 5486444 3305295 3486006
6640 3486006 3401105 396462 -3302705 -2905519 2534447 8724281 11255098 9730793 6070716
6631 6070716 1211387 -4325129 -8127536 -7420776 -3241961 -285708 -1209611 -3327789 -2898915
6622 -2898915 -693633 -401155 -2687792 -4445926 -4068077 -3864012 -5876870 -8280911 -8091808
6613 -8091808 -5400302 -2640596 -1130201 -604171 -1018800 -2314536 -2968382 -1300172 1671931
6604 1671931 2775704 526674 -3165478 -5528893 -5770297 -4970861 -4434025 -4748641 -5645161
6595 -5645161 -6346014 -6532374 -6756301 -7146212 -6371383 -3410985 125888 1579538 1177737
6586 1177737 1875829 4536046 6043202 3998131 803218 314590 2102990 2379764 -81091
6577 -81091 -2528147 -3053951 -3360374 -5341151 -7785859 -8542434 -7852872 -7260495 -6781674
6568 -6781674 -5646362 -4762189 -5704572 -7583138 -7515965 -4556616 -1031965 570567 268688
6559 268688 -439613 -619395 -143841 783617 1567589 1580373 910629 -187363 -2384208 -6167870
6549 -6167870 -9714468 -10135145 -7406085 -4700439 -3897784 -3393466 -1876436 -1337768 -3522890
6540 -3522890 -5656131 -3450264 2472385 6781133 6225229 3172562 1671538 2521320 3451576
6531 3451576 2526568 185087 -1347987 -227777 2945651 5553108 6085995 5779264 5881752
6522 5881752 4956154 1409765 -2559482 -3061853 -341057 1179313 -732418 -3300559 -3502737
6513 -3502737 -2102427 -1012671 84098 1869134 2920867 2290076 2453905 6116087 11187556
6504 11187556 12481226 8153809 1473811 -3784286 -6805091 -8247736 -8219033 -7028952
6496 -7028952 -5954015 -5725410 -5374259 -3726724 -1241649 578028 1016252 623909 335304
6487 335304 784887 2162862 4064722 5558527 5936128 5475616 5043174 4785972 3759089
6478 3759089 1464139 -631526 -358015 2035583 3428026 1634767 -1455640 -2217239 9300
6469 9300 2584105 3517198 3282311 2469130 270747 -3589720 -7480613 -9593722 -9346488
6460 -9346488 -6282764 30268 7529117 11511103 9330771 3696854 -829153 -3121120
6452 -3121120 -5080812 -7524854 -9245160 -9259700 -7408916 -3452901 1878761 5661307 5376082
6443 5376082 2347620 -61712 -1159089 -2761726 -4693521 -4251429 -942280 1861449
6435 1861449 1684586 473750 1361172 4221844 6603418 7269011 6609688 4877690 2200117
6426 2200117 -485595 -2439161 -4500090 -7804268 -11565120 -13651548 -13096304 -10780438
6418 -10780438 -8045756 -5997995 -5849694 -8282508 -12091499 -14635294 -14251944 -11729253
6410 -11729253 -9190944 -8051862 -8177295 -8452864 -7900408 -6635999 -5940073 -6949522 -8957119
6401 -8957119 -9474167 -6708231 -1905604 1665248 2460693 2456403 4212122 6922511 7148814
6392 7148814 3512403 -1223691 -3441376 -2347028 541411 3704572 5874458 5723750
6384 5723750 3524028 1976750 3078726 5050420 4848579 2902939 2337728 3821529 4655148
6375 4655148 3500513 2542293 3573698 5053001 5069938 4635985 5541082 6908725 6663130
6366 6663130 5220932 4919965 6145761 6450476 3811352 -882996 -4950004 -6475273 -5658418
6357 -5658418 -4408054 -4610620 -6294978 -7673535 -7177714 -4867068 -1755465 1121069 2628812
6348 2628812 2031985 436866 409273 3119673 7011920 10089515 11975907 12790668 12072370
6339 12072370 10416117 9976223 11016555 10034208 4410728 -2694254 -5830775 -4694100
6331 -4694100 -3924793 -5726285 -7328658 -6704369 -6025863 -7105185 -7587531 -5147610 -2282261
6322 -2282261 -2756234 -5287955 -5191080 -1443085 2102735 2494888 742246 -1292468 -3086838
6313 -3086838 -3490911 -653372 3884235 4671428 -760474 -7137207 -7461484 -2157973 2001520
6304 2001520 1428724 -344145 1080743 4999967 7817238 7926885 5895698 2232659 -2161814
6295 -2161814 -4886827 -4281999 -2134622 -1815165 -4092353 -6703049 -7572650 -6568732 -4611739
6286 -4611739 -3168115 -4316973 -9016694 -15015482 -18341032 -17282154 -13573930 -9775397
6278 -9775397 -7127986 -5873432 -5691256 -5447354 -4119759 -2258329 -1157194 -737798 80146
6269 80146 1229555 1789874 2121839 3187366 3845725 1875058 -1833812 -3389349 -1414741
6260 -1414741 654396 -446096 -3263718 -4175035 -2208783 818426 3031611 3305647 1193528
6251 1193528 -1879478 -3006413 -1232446 1168444 2436535 3820228 6073707 6323722
6243 6323722 1934004 -4521191 -8043273 -7805258 -7231519 -8262438 -9288261 -8555820 -6117434
6234 -6117434 -2310058 2433960 5998311 5935495 2986067 593540 471223 1134392 1068438
6225 1068438 665192 553499 583478 1052784 2607010 4474929 5076363 4637515 4782809
6216 4782809 5375161 4503362 1969986 -93182 -710156 -1342042 -3004513 -4963673 -7014132
6207 -7014132 -9953204 -12800928 -12810440 -9696433 -6780976 -6308872 -6626098 -5757015 -4625373
6198 -4625373 -4495473 -4179775 -2368083 -139629 1358512 3028425 4843496 3684826 -2171521
6189 -2171521 -8759329 -10822070 -8960855 -8052772 -9467813 -9510349 -5827113 -1055881 1172727
6180 1172727 556270 -1080172 -2710931 -4103103 -4640897 -3867396 -2480137 -1832040 -2720991
6171 -2720991 -4728929 -6295536 -5915517 -4025381 -2919603 -3746458 -4680511 -3604376 -1392469
6162 -1392469 -422955 -910769 -1416863 -2298626 -5350831 -9782388 -11813917 -9382627 -4618717
6153 -4618717 -413302 2970682 6211921 8104358 6769545 2583717 -2092402 -5530621
6145 -5530621 -7485561 -8012021 -7040186 -5180589 -3888485 -4462223 -6974408 -9852374 -10494923
6136 -10494923 -7250619 -1410928 3402254 4495532 2415880 -228418 -1540104 -1470074
6128 -1470074 -927372 -545066 -147031 887632 2531212 3511296 2547623 209157 -1446210
6119 -1446210 -1301754 -126187 1237487 3071521 5153138 5466698 2504038 -1820654 -3744354
6110 -3744354 -2342025 -675667 -1460661 -3299206 -2749253 871228 4609582 5644458 4253798
6101 4253798 2707636 2724016 4706174 7983734 10483506 9347309 3827829 -2779350 -5963841
6092 -5963841 -4878546 -2741321 -2236382 -2542581 -1698791 91822 1049990 366595 -1419701
6083 -1419701 -3619718 -5472413 -5909640 -4858999 -4079905 -4981628 -6128333 -4812391 -946155
6074 -946155 2571875 3676217 3527684 4337326 6200276 7237579 6253675 4230123 3114910
6065 3114910 3590719 4388134 3899727 2018580 -285641 -2741134 -5676135 -8188718 -8480430
6056 -8480430 -6768536 -5635566 -6055020 -5417934 -1787600 2044628 1907442 -1850526 -5376082
6047 -5376082 -7212073 -9066468 -10916612 -9932038 -5437678 -931275 721389 782142 1347852
6038 1347852 1728594 607055 -841877 -772079 393929 1399254 2611613 4417983 5080793
6029 5080793 3294774 1368675 2420202 5347478 6234772 4491381 3856398 6645240 10358286
6020 10358286 11432561 9704643 7306434 5106567 2478107 -359387 -1933673 -1590035
6012 -1590035 -568963 -385772 -758813 45601 2726048 5618334 6688912 6341049 6735675
6003 6735675 8242218 8536500 6236807 3548364 3427292 5399132 6392073 5011950 2768886
5994 2768886 1428591 1429008 2889719 5784225 8562001 8808369 6375456 4243806 5068057
5985 5068057 7957901 9730267 8593827 5813653 4325756 6135657 10319583 13222876
5977 13222876 11541241 5742709 -258312 -3135375 -3047770 -2302208 -2254691 -2220987 -759726
5968 -759726 2509856 5985305 7079187 5029317 2509184 2992505 6392888 9016573 8253162
5959 8253162 5328570 2518234 -127550 -3481574 -6632715 -8005102 -8186232 -9008394 -10146288
5950 -10146288 -9256059 -5863937 -2785949 -2777629 -5543407 -8991800 -11743608 -13066560 -11791809
5941 -11791809 -7353468 -1663363 1680833 608714 -3520081 -7295035 -8164879 -6172365
5933 -6172365 -3379177 -1691793 -1097275 -163836 1753337 3425995 3197434 854090 -2471971
5924 -2471971 -5486865 -6911614 -5314033 -495108 4942865 7214485 5398897 2685589
5916 2685589 2667605 5423544 8310148 9485062 8930106 6687321 2439491 -2657826 -5719284
5907 -5719284 -5038350 -2248265 -450146 -906151 -2594154 -4248495 -5428793 -5906027 -5512839
5898 -5512839 -4842248 -4917883 -5781377 -6363139 -6135975 -5905326 -6393507 -7029112 -7017210 -6797532
5888 -6797532 -7305389 -8326719 -8874694 -8888632 -9066091 -9013945 -7346122 -4239064 -2123165
5879 -2123165 -2530425 -3658346 -2790069 -99861 1977339 2391006 1978375 640032 -2873650
5870 -2873650 -7633490 -10157618 -9138204 -7802128 -9108127 -11009494 -9798217 -6400449
5862 -6400449 -5213439 -7216442 -8597465 -7009669 -5210399 -6617323 -10340999 -12962609
5854 -12962609 -13053998 -11666236 -10013793 -8867765 -8990640 -10153747 -10618965 -9165350 -6644875
5845 -6644875 -4291418 -2003766 190499 884097 -247256 -449752 2744927 7239239 8557979
5836 8557979 5870277 2783255 2066489 2498245 1603682 -896619 -3326470 -4076755 -2784902
5827 -2784902 -791450 -474166 -2741788 -5525659 -6372144 -5752203 -5540247 -5152921 -2505287
5818 -2505287 1450718 3016974 1342199 16249 1676353 4471059 5699400 5648065 5514858
5809 5514858 4589287 2269322 257753 -229392 -1144609 -4376392 -7945557 -8839826 -7793852
5800 -7793852 -7485108 -7504156 -5430704 -2157921 -1595758 -4805801 -8544519 -10350567 -11186175
5791 -11186175 -11928861 -11167119 -8458345 -6389895 -6732002 -7024022 -3930023 1505530 4736411
5782 4736411 3212923 -1185005 -4887291 -5937968 -4508038 -1633915 1854767 5510697
5774 5510697 8726046 10441084 9933772 7616018 4303674 200173 -4211324 -6947110
5766 -6947110 -6206355 -3141285 -733292 209379 1382668 2931174 2280574 -1484751 -5092961
5757 -5092961 -5243288 -2880248 -821105 556491 2187053 2889787 882923 -2317804 -3366495
5748 -3366495 -2099322 -1379670 -1955572 -1397652 1105102 2738709 1387811 -1359768 -3390790
5739 -3390790 -5125726 -7010692 -6826334 -2831011 2149366 3269736 -280164 -4635958
5731 -4635958 -6340459 -5324354 -2810541 858569 5254506 8791756 10062502 9249500
5723 9249500 7343572 4877420 2260445 536446 658098 2073471 2758669 1010506 -2782966
5714 -2782966 -6264374 -7263010 -5874516 -3924234 -2242874 543384 5614158 11093712
5706 11093712 13127943 10052589 4392629 177447 -1073178 -1131078 -2210884 -4052733
5698 -4052733 -4276023 -1618752 1852704 2673184 -1000 -3456078 -4740099 -3546523 -1219340
5689 -1219340 1376537 3644379 4532810 4038234 4235818 6423084 8075773 5467173 -911359
5680 -911359 -6470926 -8311833 -7940294 -7628213 -7327317 -6621546 -6652115 -7921881 -8706216
5671 -8706216 -8037076 -7914414 -9695329 -10413363 -6363068 824802 5544552 5337923 2911180
5662 2911180 745219 -2369764 -7806896 -13265890 -14996601 -12273162 -7624207 -3651346
5654 -3651346 -1324676 -637842 -1204252 -2270393 -3206175 -4001402 -4794982 -5313514 -5346023
5645 -5346023 -5345118 -5895693 -6813324 -7284497 -6776487 -5487498 -4029585 -2889589 -2142431 -1632456
5635 -1632456 -1370994 -1439455 -1485843 -1056667 -752006 -1937804 -4382817 -5365568 -2766270
5626 -2766270 1772379 4772067 5477743 6084815 7543041 8121006 7060459 6691146 8810012
5617 8810012 11061312 9570607 4170252 -1456535 -4460886 -5432971 -6204114 -7041973 -6883522
5608 -6883522 -5258945 -3098703 -1892461 -2322296 -3561146 -3970267 -2719759 -620552 750606
5599 750606 487741 -1100271 -2890184 -3782507 -3639700 -3400362 -3727513 -3894099 -3043495
5590 -3043495 -2111728 -2722903 -4205817 -4042024 -1978248 -1105850 -3239395 -5651570 -4909617
5581 -4909617 -2100864 -1075640 -2496327 -3135140 -1138258 1337506 1689284 312781 -980458
5572 -980458 -1820773 -2702070 -2989667 -1535474 1225530 3374517 3658201 2506143 974402
5563 974402 -339472 -1094448 -775856 668357 1783023 141254 -5090091 -11351316 -14780256
5554 -14780256 -14549612 -13809137 -15432381 -18255365 -19119818 -17429805 -15341643 -13961611 -12144560
5545 -12144560 -9560798 -8293342 -9873407 -12520137 -13090059 -10771013 -7388845 -4864175
5537 -4864175 -3772572 -3755953 -3833343 -2634306 160817 2585738 1985628 -1745967 -5563688
5528 -5563688 -6379182 -3929842 -83533 3680964 6989771 9322234 9570890 7294187 3425467
5519 3425467 -844485 -5010452 -8311864 -8924944 -5777715 -902252 1879486 1111821 -920692
5510 -920692 -1558945 -973499 -1089089 -2806790 -5578419 -8413788 -9794899 -7916473 -3072793
5501 -3072793 1124976 1339579 -1029628 -1491392 1233836 3150942 320422 -5751108 -9693856
5492 -9693856 -8284482 -3490645 188666 513212 -564892 343166 3675756 6288450 5676738
5483 5676738 3272567 1940144 1665272 462011 -1161568 -145388 4116767 7963603
5475 7963603 8136877 5643249 3256506 1608338 -43523 -1160425 -671479 757182 1513872
5466 1513872 1315866 772012 -353573 -2332370 -3811764 -3354332 -2122057 -2531404 -4337551
5457 -4337551 -4594774 -1948468 1387591 2863665 2786758 2875830 3063815 1574634 -2142241
5448 -2142241 -6041237 -7599855 -6782185 -6197602 -8023941 -11229582 -12710284 -11115634 -8253342
5439 -8253342 -6183719 -4439363 -1449966 2479521 5469911 6692783 6738073 5701187 3100688
5430 3100688 -109274 -1725464 -1388580 -1564323 -4084355 -7195244 -7789886 -5764271 -4329676
5421 -4329676 -6028147 -9868255 -12789938 -12953902 -10950279 -8350425 -5969118 -3762861
5413 -3762861 -1859528 -852775 -769840 -375632 1613312 4631640 6448177 5679728 3519638
5404 3519638 2332058 2902003 3888680 3919221 3199114 2555503 1862479 670292 -12142
5395 -12142 1632825 5197963 7395849 5978881 3137534 2881184 5577444 7590853 6550933
5386 6550933 4275897 3328296 3183991 1897421 -219462 -1143023 -491396 81680 -467479
5377 -467479 -1640919 -2956380 -4362972 -5008912 -3629540 -597562 2166790 3745124 4884250
5368 4884250 5613698 4321176 460483 -3536067 -4739199 -3062329 -573343 1596807
5360 1596807 3793888 5722971 5889859 3725257 816094 -917074 -1469936 -2256518 -3771805
5351 -3771805 -4730830 -3658677 -611367 3055364 6039585 7550680 6876582 3754322 -425611
5342 -425611 -2845850 -1719677 1780351 4738411 5339810 3961716 2070575 1051660 1708524
5333 1708524 3653696 5250012 5293895 4631146 4734867 4796925 2231209 -3295094 -8398570
5324 -8398570 -9935610 -8670469 -7144265 -5552210 -2562722 678685 1064880 -1294949
5316 -1294949 -1951548 1797589 6477345 7010902 3830462 1840576 3101193 4482105 3036599
5307 3036599 -149273 -3105368 -6617765 -12024855 -17624852 -20284155 -19426891 -16882917
5299 -16882917 -13855887 -10608031 -8160172 -7472819 -7574638 -7271240 -7936888 -11280252 -14817732
5290 -14817732 -13598289 -7007355 -110085 2692273 1656396 -1566921 -6668062 -11975971
5282 -11975971 -13458388 -9920031 -5822345 -5256144 -6178957 -4771461 -2597682 -4100008
5274 -4100008 -8568482 -10358807 -7203064 -3285706 -3030429 -5878892 -8508286 -8889589 -6897762
5265 -6897762 -3778000 -2161420 -4052051 -7809103 -9510688 -8071065 -6496827 -7279550
5257 -7279550 -9208681 -9889096 -8972990 -7580947 -6591939 -6666622 -8039058 -9341601 -8660938
5248 -8660938 -6638447 -6290813 -8673161 -10988962 -10352109 -7315444 -4203715 -2010744 -749819
5239 -749819 -1134324 -3716244 -7129650 -8890543 -7811177 -4951259 -2501166 -1761314 -1641244
5230 -1641244 241613 3908398 5747441 3034303 -1603697 -3402320 -2150871 -1654396
5222 -1654396 -2991034 -3253262 -1662240 -1646667 -4943335 -8566878 -10179958 -11722426 -14584570
5213 -14584570 -15845635 -13259128 -9795166 -8778111 -8301037 -5410621 -2371894 -3042854
5205 -3042854 -5615552 -5086370 -1385726 935218 218454 -922756 -1340817 -2758132 -5243275
5196 -5243275 -6632622 -6955125 -8403683 -10441186 -10116064 -7908171 -7737753 -9869232 -9449810
5187 -9449810 -4279842 1208166 2417271 217178 -2762941 -6528851 -10650836 -11432562
5179 -11432562 -7104456 -2509847 -3334515 -7849047 -9615526 -7027789 -4745055 -5836054
5171 -5836054 -7843850 -8072190 -8388145 -11960812 -17636699 -20461235 -17238432 -9748620 -2418833
5162 -2418833 1970452 3728147 4204198 3750236 2384836 1214841 1294158 1360118 -1055029
5153 -1055029 -5695887 -8904700 -8061080 -4917654 -2952548 -2799115 -2180664 317401 3146159
5144 3146159 3485875 228753 -4545487 -6836338 -4277289 1200784 5193899 5550141 4021803
5135 4021803 3065965 2948587 2796536 2456104 1919665 647714 -967409 -999430 1465194
5126 1465194 4483914 5549865 4399381 2001371 -1527521 -5806276 -8480946 -7438728
5118 -7438728 -4144172 -2259158 -3143053 -4852141 -5352471 -4535169 -3025759 -1079653 902819
5109 902819 2224869 2552498 1829493 -60354 -2528413 -4031260 -3887447 -3205366 -2476447
5100 -2476447 -27981 4608393 7663373 5330510 64914 -1814473 1066509 3440243
5092 3440243 1591744 -1562011 -1847286 154034 1759031 3107450 5373739 6924397
5084 6924397 5799645 4105373 5197960 7580916 6450866 1133460 -3718940 -4918306
5076 -4918306 -4320115 -4466383 -4818730 -4167489 -3166886 -2290739 -425856 2211518 2785890
5067 2785890 53497 -3029406 -3884670 -4675858 -8360794 -12743638 -13074970 -9416810 -6669270
5058 -6669270 -7316589 -8564823 -7448641 -4886857 -3342408 -3578150 -5022630 -6684845 -6732740
5049 -6732740 -3919528 -350249 141348 -2568143 -4293039 -2707069 -520388 -459504 -775765
5040 -775765 1159446 3863783 4019552 1486466 -1635411 -5058988 -9507145 -13266173 -13708929
5031 -13708929 -11612864 -10009911 -9026045 -5859980 -167803 4459512 5414834 4113187
5023 4113187 2789385 1257488 -1268085 -3328023 -2413179 1739955 6269608 7396204
5015 7396204 3579732 -2711986 -6800244 -6543784 -4677501 -4954304 -6940208 -6915989 -3340012
5006 -3340012 1272712 3915745 4011101 2528563 570080 -673114 -505983 357778 949786
4997 949786 1673643 2923238 3057718 523829 -2724055 -3223873 -1104170 353022 137020
4988 137020 491471 2013108 2029472 -856494 -4570486 -7543644 -11033982 -15416934 -17859302
4979 -17859302 -16373641 -13108887 -10752061 -8294845 -3470515 2556985 6037555 5180899
4971 5180899 1633546 -1764016 -3164302 -2654776 -2194364 -3671991 -6585541 -9019626 -10713939
4962 -10713939 -12791393 -14629542 -14281104 -12353449 -11801655 -13087409 -13447250 -11998528 -11207769
4953 -11207769 -11724759 -10492586 -6390695 -3108102 -3349782 -4602388 -4207471 -4353846 -7669743
4944 -7669743 -11448854 -11142115 -7196649 -4014811 -3928008 -5979695 -8977509 -12343557 -15364313
4935 -15364313 -18088503 -21112407 -22848342 -20255411 -14302890 -10624865 -12009062 -14540199
4927 -14540199 -14203697 -12413902 -11388958 -9579059 -6435901 -6149097 -10805043 -14989145
4919 -14989145 -13710922 -10877036 -12695765 -17064276 -17430376 -13638139 -10842984 -10543844
4911 -10543844 -10602043 -11445822 -14330255 -16078756 -13536764 -10525687 -12265524 -16030197 -16117708
4902 -16117708 -14691727 -17709634 -22983649 -23132930 -18341787 -15152421 -14387367 -11805813
4894 -11805813 -9201527 -12511729 -19663417 -22744085 -21677927 -23125072 -26903579 -27364145
4886 -27364145 -27048401 -33434609 -42842557 -44703649 -41493877 -45301906 -54605103 -56685130
4878 -56685130 -54168606 -62890790 -80601905 -90630640 -104444839 -157913064 -240718018
4871 -240718018 -271766445 -189787938 -43432928 58013440 71471219 49085591 46516587
4864 46516587 57973897 55515437 42642475 38404620 40080521 33542127 22361989 19802896
4856 19802896 24063973 23983646 20100298 20385910 22555823 18679549 11701905 10910702 15222244
4847 15222244 15956120 12904738 13568538 18502772 20346565 16470615 11300058 6857170
4839 6857170 1452794 -2707604 -612621 6430279 11427700 12042158 12667986 15800084 18616266
4830 18616266 18959877 18217554 17189220 14621602 10784166 7876809 6377638 4948052
4822 4948052 3809615 4438889 6453710 8333798 10162455 12183720 12377506 9432607 6267088
4813 6267088 6285736 7972779 7706325 6000630 5948886 7137482 6516475 4263899 3446361
4804 3446361 4452531 4824152 4183998 4443202 5433389 5107274 3882802 4159312 5662992
4795 5662992 5792182 4426483 3886927 4314482 3747773 2706310 3814746 6591780 7510126
4786 7510126 5905878 5084635 6629948 8282081 8766526 10210303 13897770 17507978 18630797
4777 18630797 17950900 17265169 17047923 17205651 17564293 16664781 12830757 7237223 3151200
4768 3151200 1557256 516503 -723526 -473055 1751716 3864291 4593062 4825566 4467622
4759 4467622 1662970 -3175930 -6082016 -4503311 -766820 1405475 1198714 -341960
4751 -341960 -2852526 -5765446 -7151797 -5964707 -3978707 -3565703 -4771398 -5904562 -5563346
4742 -5563346 -3102813 1026139 4347429 3839882 -418629 -4993993 -7395157 -8342436 -8871034
4733 -8871034 -8174676 -6035743 -4486595 -4706619 -4725664 -2811521 -1023763 -2477416 -6499729
4724 -6499729 -9256936 -8274601 -4112355 1370583 6106774 8058134 6658360 3620307
4716 3620307 726307 -2327548 -6306684 -9904083 -10961169 -9407401 -6917767 -4286957
4708 -4286957 -1191823 1887760 3531629 3075810 964687 -2177291 -5302787 -6357029
4700 -6357029 -3876653 780631 4247223 4305708 1475654 -1875177 -2932493 -38858 5296311
4691 5296311 8683653 7150987 2830817 453360 1471133 2864954 1843909 -661493
4683 -661493 -1967189 -1089943 939093 2780337 3601534 3205365 2435728 2694315 4116541
4674 4116541 4985635 4019434 2605156 3405986 6854601 10337285 11241656 9728177 7697495
4665 7697495 5881318 3392910 98466 -2244104 -2286342 -1497087 -2637551 -5987638 -8678176
4656 -8678176 -8244054 -5533048 -3259298 -2692414 -2921676 -2824670 -2460836 -2403798 -2580622 -2172224
4646 -2172224 -346983 3065362 7421741 11686183 15070828 17268958 18139244 17453169 15155373
4637 15155373 11776049 8392042 6016852 4874145 4305019 3588215 2693933 1783218 299148
4628 299148 -2274201 -4635812 -4347507 -1308509 1053343 -147703 -3155800 -3823846 -1355092
4619 -1355092 796880 -111442 -2750711 -4004248 -2489121 1042680 4830046 6637301
4611 6637301 5119835 1955219 873208 3095169 5322819 3923426 -318417 -3557170
4603 -3557170 -3826598 -2384550 -791724 817627 2192689 1780398 -1637214 -6811174 -10456621
4594 -10456621 -10017997 -6050701 -1801516 -89243 -673111 -1281940 -912034 -683355 -1219046
4585 -1219046 -1073023 1032408 3889056 5387597 5479365 5830793 7120724 8460511 9253319
4576 9253319 9830323 10052348 8957541 6514596 4519789 4708313 6454904 7277838 5740131
4567 5740131 3262565 2482303 3872481 4870306 3093936 -297873 -1909701 -662413 697540
4558 697540 -747477 -4479733 -7647564 -8535215 -7685236 -6537401 -6340278 -7719470 -9824167
4549 -9824167 -10185486 -6841004 -822290 4321812 5730096 3689828 1138743 993614 3565877
4540 3565877 6386121 7065548 6244158 6647760 9192968 11686317 12010574 10758498 9454787
4531 9454787 7944686 5478119 3058559 2300083 2473197 1031313 -2784241 -6764289 -8527634
4522 -8527634 -7961977 -6431698 -4912404 -3632159 -2674478 -2135738 -1883448 -1453239 -223264
4513 -223264 2015949 4450055 5637054 4883478 2866021 760016 -544254 -254813 2044819
4504 2044819 5274607 7201214 6884086 5834705 5773327 6241883 5675196 4019365 2811114
4495 2811114 2897505 3242408 2222140 -199405 -1628338 810335 6712512 11380275 10571157
4486 10571157 5841635 2509596 2489994 2823331 1964938 2917437 7661541 12663443 13566250
4477 13566250 11103437 8485304 5928892 2217074 -954349 -1237083 -264639 -827414 -1131968
4468 -1131968 2369417 7583031 8522266 4248403 -223761 -2236893 -4085545 -6326133
4460 -6326133 -5675260 -2114240 -1302707 -6032459 -10953140 -10162566 -5245992 -1331104 408732
4451 408732 1494076 1392937 -630903 -2064548 -895853 -235104 -3797444 -8964679 -10080917
4442 -10080917 -7201820 -5683434 -7665204 -9757255 -9463972 -8398775 -7974528 -6840114
4434 -6840114 -4521812 -3597347 -5879288 -9245104 -10400436 -8891180 -6814284 -6006199 -6581725
4425 -6581725 -7174294 -6243821 -4116223 -3211731 -4748206 -6258550 -4780420 -1586309 -578343
4416 -578343 -2316249 -3164414 -831596 2544799 3739230 1957984 -1879349 -6525702 -9995999
4407 -9995999 -10496198 -9025651 -8649383 -10156817 -11018755 -9654528 -7722709 -6652440 -4997029
4398 -4997029 -1433528 2342296 4319410 5482528 7590362 9490573 8720506 5673077
4390 5673077 3390469 3914475 7084214 11908493 16574600 18006729 14418350 8223127
4382 8223127 3865100 2670953 2131110 274965 -1827047 -2492713 -1972221 -1405346 -882497
4373 -882497 297015 2444420 5236129 7700523 8155543 5506085 1164409 -1674152 -1482943
4364 -1482943 19113 547825 245758 755254 2271975 3150443 2229428 183749 -1627095
4355 -1627095 -2673290 -3333011 -4188443 -5540080 -7043688 -7577132 -6110232 -3164769 -823403
4346 -823403 -537209 -1279658 -882390 817451 1477406 -387793 -2743834 -2337939 689899
4337 689899 2341786 -512416 -6386833 -11115052 -12328921 -10655096 -7427524 -3331650
4329 -3331650 505505 2045426 218763 -3536581 -6669165 -8055676 -8328817 -8087671 -7016091
4320 -7016091 -5095788 -3650597 -4119828 -5939136 -6663398 -4758068 -1678279 -257352 -1116872
4311 -1116872 -1731334 454912 4849830 8499108 9419102 8023094 5647826 3252481 1799643
4302 1799643 2175408 3651661 3741473 1115942 -2152565 -2988137 -1491812 -733246 -2364391
4293 -2364391 -4722040 -6034359 -7132271 -9185359 -10589086 -8731734 -4139866 -272464
4285 -272464 831298 376695 -2048 -422238 -1131334 -941119 1005138 3344460 4065226
4276 4065226 2935104 886816 -1796542 -4723516 -5782351 -2842282 2901324 7522430
4268 7522430 8812244 8278437 8112645 8081652 6583050 3269541 -819804 -4666027 -7275138
4259 -7275138 -7086128 -3291967 2157323 5430749 4407851 702248 -2291026 -2774447 -1634179
4250 -1634179 -768407 -985060 -1449875 -803134 1285023 3653480 4866592 4826325 4699983
4241 4699983 5002797 4385287 1227568 -3656436 -7032653 -6658612 -4057046 -2943689 -4998407
4232 -4998407 -8039368 -8638771 -5977940 -2669775 -1836385 -3548094 -4436927 -1397659 4271222
4223 4271222 7505646 5181516 310064 -1021552 3399136 9706563 12767256 11335990
4215 11335990 7819142 4724113 2666303 891245 -1384858 -3717366 -4240469 -1751759
4207 -1751759 1940202 3547701 2669866 2347392 4155763 5407055 3404553 60432 -892909
4198 -892909 306745 124533 -2421984 -4317083 -3337408 -1016006 235545 416650 1036292
4189 1036292 2629200 4177462 3895713 399821 -5530319 -10496114 -11521150 -9395133
4181 -9395133 -7190239 -5997192 -4562426 -2636793 -1501748 -1074197 135153 1665488
4173 1665488 1232253 -905931 -1442316 649213 2004639 133315 -2712792 -3390692 -2340779
4164 -2340779 -1455829 -506098 1231051 2419922 1865068 865249 477720 -851088 -3796362
4155 -3796362 -5365863 -3351719 -469057 284228 1165549 5280364 9658783 9195169 5289187
4146 5289187 3440365 4046676 4067643 6946401 20127454 40052223 50235576 40585358
4138 40585358 20778200 7295159 3680125 1924082 -1871131 -3695086 -1834790 -740064
4130 -740064 -2912039 -4594459 -2450344 1168718 2700698 2625759 2980141 3031739 873306
4121 873306 -2735658 -5056371 -4755514 -2592003 112408 1905347 1248783 -1865840 -4855201
4112 -4855201 -4852719 -2105038 219234 -103787 -1642076 -1178272 2087328 5305753 5571151
4103 5571151 3751042 3074541 4303795 4843688 3303323 1926464 2441253 2333606 -1294916
4094 -1294916 -6047124 -6706438 -2824992 494178 -199346 -2835848 -4185385 -4013164 -3050409
4085 -3050409 -631414 2913963 4572089 2533984 -459878 -814937 722850 888283 -535215
4076 -535215 -667265 1495010 3572210 3509428 1921917 339297 -452588 6432 1592416
4067 1592416 2595018 1312695 -941134 -827015 2445075 5971380 7311070 7129703 6602306
4058 6602306 5149792 2766057 1872503 3919027 6045406 4509532 377160 -1804823
4050 -1804823 -787714 -327933 -3223027 -7070462 -7983474 -5969108 -3945606 -3033302 -1959258
4041 -1959258 -748798 -1816038 -6248288 -11189955 -12756927 -10558425 -7617229 -6241364
4033 -6241364 -5782079 -4763368 -3467225 -3125691 -3509459 -3003783 -1076814 752722 914256
4024 914256 -323594 -1647981 -2453015 -2854799 -2769885 -2351974 -2954609 -5943389 -10159760
4015 -10159760 -12088042 -9579575 -4529225 -806920 -143517 -1167481 -2038616 -2549409 -3382223
4006 -3382223 -4566022 -5480372 -5773654 -5555745 -5000935 -4372779 -4261536 -5175985 -6806490
3997 -6806490 -8117854 -8380985 -7869259 -7272113 -6543029 -4814599 -1849228 728386 569796
3988 569796 -2600793 -6172944 -7616697 -7676719 -9080932 -12100430 -13351967 -10050046 -3914731
3979 -3914731 777352 2108186 1742543 1900051 3205399 5464544 8298789 10311844 9573595
3970 9573595 6063414 2132306 -600739 -3291190 -7329332 -11206483 -12115944 -10115299
3962 -10115299 -8541672 -10119153 -14228394 -18222848 -20035794 -19179174 -16419331 -13024602
3954 -13024602 -9737352 -6476127 -3518045 -2150192 -2858354 -3702113 -2513716 -340336
3946 -340336 -334445 -3156045 -6083238 -7201409 -7622256 -8445175 -8579372 -7585276 -7807931 -10735811
3936 -10735811 -13407447 -11986306 -7686121 -5507238 -7541383 -11011413 -12939795 -13189221
3928 -13189221 -12174167 -9022515 -3717282 1387340 3986959 4207503 3453855 2508620 1645623
3919 1645623 787382 -1273617 -5589893 -9937070 -9671788 -3660412 3065936 5114788 3204249
3910 3204249 1949102 2902815 3441625 1856317 -246041 -985016 -369233 1387849 4689213
3901 4689213 8348075 9225893 6035939 1661841 -274668 274619 902556 912447 1758622
3892 1758622 3609290 4159766 1873294 -1438125 -2882045 -2455789 -2955058 -5855263 -8973979
3883 -8973979 -9287713 -7020123 -5271601 -5759155 -6686417 -5460561 -2006541 1766729 4621262
3874 4621262 6571276 7497930 6863423 4705569 1644884 -1880737 -5089519 -5991803 -3014760
3865 -3014760 2183875 5350166 3993799 2106 -2674043 -1836433 1811657 5786745
3857 5786745 7292678 5064808 945068 -1497492 -998063 -58442 -1222188 -3417585 -3948901
3848 -3948901 -2912845 -2910966 -4556303 -5087472 -2403096 1641503 3387861 1478029 -2522226
3839 -2522226 -6500640 -9239834 -10096248 -8916959 -6459873 -3875242 -1615074 425877
3831 425877 1863974 2037849 1425312 1636097 3345975 5203314 5681779 5236603 5432638
3822 5432638 6436059 6885312 6256930 5694015 5822453 5278025 2754223 -488898 -1885206
3813 -1885206 -966650 314764 892720 2329695 6129295 10636179 12387266 10296822 6934419
3804 6934419 5249466 5244244 4737092 2575348 -244088 -2548885 -4641162 -7185182 -9398082
3795 -9398082 -9666278 -7782549 -5318137 -3475239 -1603008 1604709 6208649 10864644
3787 10864644 13872614 13922271 10731365 5790476 1726558 -36180 -402471 -601441 -75728
3778 -75728 2148672 4717036 4605839 721182 -4719799 -8704089 -9959953 -8758481 -5798983
3769 -5798983 -2099523 1109359 3209933 4333217 4481635 3486099 2021593 1402050 1872403
3760 1872403 2225579 1534890 32988 -2091076 -5088697 -7988735 -8290524 -4867737 -41191
3751 -41191 2783175 2719725 1288353 -337089 -2177456 -4025646 -5028121 -4900015 -4342051
3742 -4342051 -4016253 -3849771 -3323647 -1945640 182153 1840213 1590423 -161301 -1283042
3733 -1283042 -1226626 -2599080 -7308996 -12406316 -12807928 -8025275 -3057127 -1808517 -2546104
3724 -2546104 -1544032 1224167 2618236 1268382 -772974 -1271398 -525038 -216738 -1065243
3715 -1065243 -2589578 -4357386 -6309490 -7874844 -7657261 -4684861 67124 3944495
3707 3944495 4862169 3264284 1611574 1941390 4055100 5921656 5616083 3057746 180778
3698 180778 -746621 680523 2540571 2517003 111666 -3165247 -5265954 -4890469 -2050798
3689 -2050798 1688461 3852375 3011328 262502 -1887592 -2134431 -1283118 -714597 -806459
3680 -806459 -986721 -595531 550757 1929992 2564954 2032107 1181828 1167922 1735785 1303334
3670 1303334 -933751 -3595989 -4251999 -1758164 2555661 5750365 5549504 2368238 -930426
3661 -930426 -1779902 -260801 1736129 3088166 4023054 4439177 3375384 811032 -1359573
3652 -1359573 -1336139 261622 1210651 597439 -108168 936075 3622013 6074665 6836070
3643 6836070 6295050 5858949 6213023 6826147 6822097 5651268 3099403 -371126 -3145868
3634 -3145868 -3501442 -1794498 -707990 -2475578 -6436411 -9917571 -10770240 -8457289 -3722431
3625 -3722431 1758900 6117296 8532693 9102964 7323375 2538033 -3287827 -5783654
3617 -5783654 -3209818 926016 2851178 3817084 6823620 10074494 8687999 2483000
3609 2483000 -3040584 -4188519 -2787620 -1261035 1011793 4165950 5401893 3421726
3601 3421726 1553854 2779660 4823629 4145893 2010987 2010849 3549347 2821857 -476259
3592 -476259 -2252966 -194361 3225100 4884792 4960773 5460113 7065997 8574175 8209806
3583 8209806 5283172 1597773 487407 2856251 5276786 4212067 944230 -471773
3575 -471773 918727 2553481 3138761 3884076 4798738 3819554 681418 -1912455 -2338279
3566 -2338279 -2053647 -2165921 -1286875 1315038 3414104 2892286 597390 -1981477 -5368949
3557 -5368949 -9956208 -13466942 -13495470 -11100479 -9202387 -8546926 -7723718 -6228076 -5090602
3548 -5090602 -5002050 -5676997 -6444266 -6074290 -3293898 881391 2947136 1164656 -1619653
3539 -1619653 -1927816 -731211 -1362246 -3723125 -4597315 -3337105 -2979520 -4996508 -6861047
3530 -6861047 -6330581 -4750595 -4051435 -3280651 -655308 2881302 4728776 4164743 2707299
3521 2707299 1690673 1208850 911213 477430 -185689 -341198 945093 2606988 1602068
3512 1602068 -3129237 -8110657 -9054482 -6329125 -4223980 -5136886 -7181240 -7799483 -7002487
3503 -7002487 -6000867 -4988163 -3846132 -3247386 -3301722 -2528689 -121632 1849145 710704
3494 710704 -2889958 -5623056 -5913867 -5297998 -4872393 -3049942 1467124 6400115 7992340
3485 7992340 5681878 2526019 1168520 1433774 2101574 2888956 3740025 4029211 3995088
3476 3995088 5547094 9630007 13550847 13272207 8530334 3566342 2015690 2891060 2825643
3467 2825643 657569 -2086002 -4215706 -6032689 -7591018 -8153572 -8083731 -9265034 -12305821
3458 -12305821 -14853109 -14462081 -12211584 -11437212 -13114281 -14519421 -12884810 -8611497
3450 -8611497 -3976391 -160422 2986129 5122008 5213842 3355302 1428716 1141142 1994659
3441 1994659 2072181 757631 -245814 768816 2777054 2881112 109246 -3094418 -4235794
3432 -4235794 -4337980 -6170764 -9494830 -10697760 -7898871 -4124321 -3745049 -7163852 -10801612
3423 -10801612 -11466786 -8973318 -4969196 -1090812 1529593 2413112 2066082 1600500 1767553
3414 1767553 2515224 3109798 2407617 -187489 -3421260 -4837486 -3704948 -2272427 -2810047
3405 -2810047 -4418230 -4467381 -2376123 31156 1324471 1381230 -118696 -3435552 -6684422
3396 -6684422 -6668198 -2905694 1139416 1999211 -144158 -2568247 -3157479 -1555661 1251950
3387 1251950 3552166 4431955 5221465 7691493 10456006 9767017 5002982 480385 -217526
3378 -217526 987118 316129 -1841781 -2222344 -539767 69386 -1753165 -3709128 -3735074
3369 -3735074 -2550658 -1373477 90599 2047797 3194754 2206919 -930465 -5694687
3361 -5694687 -11091058 -14359027 -12420051 -6307246 -1709520 -2698030 -6611582 -7744918
3353 -7744918 -4846916 -2011402 -2594393 -5278166 -6736718 -5752432 -3496944 -1342061 307452
3344 307452 1823422 3855044 6457819 8391215 8226151 6584576 6095814 8259282 11334102
3335 11334102 12391158 10602370 7266177 3424050 -756066 -4562564 -6837054 -7966189
3327 -7966189 -9823379 -12638987 -13609151 -10338649 -4623965 -809890 -734131 -2267152 -3014588
3318 -3014588 -3420718 -5124776 -7649440 -8425064 -5997783 -2063698 253169 -88287 -775666
3309 -775666 1138820 5344504 8009221 6010843 649271 -3814573 -4622612 -2246506 1644795
3300 1644795 5864528 9073005 9408222 5980029 72162 -5671665 -8868401 -8626009 -6396803
3291 -6396803 -5303450 -6978750 -9232431 -8783290 -6147314 -5214158 -7590233 -10327364 -10317689
3282 -10317689 -7902887 -4561448 -283522 4321444 6439197 4939449 3354232 5109207
3274 5109207 7747533 6334494 1421752 -1265401 941669 4411439 5080891 3423923
3266 3423923 2093886 2123705 3218638 4935605 5876424 4218725 576114 -1994839 -2078269
3257 -2078269 -1443998 -1326720 -269226 2394752 3962591 1995300 -1833445 -4372641 -5480986
3248 -5480986 -6851541 -8053846 -7229911 -4914475 -3824713 -4910053 -6333095 -6457779 -5466491
3239 -5466491 -3885827 -1769061 306354 1402551 1850633 3119029 5705810 8539446
3231 8539446 10594848 11664999 11488086 9758201 7306836 5704064 5180914 4300727 2208156
3222 2208156 -83112 -1261452 -1398562 -1322627 -1342659 -1521182 -2445309 -4539706 -6724359
3213 -6724359 -6770448 -3581407 1092504 3767605 2358969 -2041596 -6745231 -10140887 -11873991
3204 -11873991 -11095041 -6672132 236481 5738043 6778690 4137888 866569 -944781
3196 -944781 -698161 1646463 4930713 6369533 4156477 29979 -2793475 -3665441 -4246920
3187 -4246920 -4776337 -3461485 106373 3600361 4894942 4271543 2934158 1390482 199438
3178 199438 259709 1177473 1250047 425640 1426404 6120005 12141818 15092809 13374358
3169 13374358 9300797 6147819 5601891 7395191 9660244 9814651 6618984 1510825
3161 1510825 -3032983 -6181589 -8704547 -10659447 -10828543 -8924614 -7008941 -7601144 -10726069
3152 -10726069 -13677609 -13916949 -11777146 -9788555 -9385593 -9186651 -7266068 -4260768 -2568188
3143 -2568188 -2626167 -2104916 419426 3004328 3126161 1345145 63282 -370797 -1762800
3134 -1762800 -4427170 -6026330 -4914218 -2735370 -2385796 -4464253 -6916725 -7618224 -6428821
3125 -6428821 -5024094 -5228659 -7219663 -9145294 -8963480 -6667161 -3933303 -1668629 726912
3116 726912 3306639 4532269 3474840 1594544 588706 -428966 -3348364 -7193876
3108 -7193876 -8521005 -6148288 -3003064 -2048045 -2503645 -1906941 -213224 580209 57139
3099 57139 62183 1725843 4025100 5766588 7008933 7653398 6399630 2564937 -2023929
3090 -2023929 -4356356 -3210458 -112991 2297054 2484315 1253328 1131974 3683134 7098759
3081 7098759 7646321 4060096 -928024 -4240612 -5807844 -6762907 -6310909 -3233084 518531
3072 518531 1157251 -1685381 -4057684 -3039582 -337310 1008398 1133785 2242792 4487504
3063 4487504 5650185 4588201 2690051 1574162 1153411 723965 606931 1514623 2847636
3054 2847636 2845065 726106 -2032465 -3269013 -2799910 -2564925 -3729895 -4739518 -3515729
3045 -3515729 -933490 -182251 -2420272 -5029493 -5260369 -3993041 -4186452 -6571213 -8859587
3036 -8859587 -9014471 -7457094 -5643107 -3937244 -1755593 995687 3437571 4413796 3352333
3027 3352333 770904 -1902674 -3463519 -4092475 -4943562 -6421490 -7538977 -7428766 -6805092
3018 -6805092 -7008307 -7859617 -7576911 -5161853 -1971922 -193926 -345476 -1259039 -2231395
3009 -2231395 -3867061 -6441697 -8670490 -9060546 -7742302 -5911968 -4023314 -1835959
3001 -1835959 -724 23331 -1870443 -3674304 -3647620 -2698564 -3240445 -5815726 -7880782
2992 -7880782 -6477832 -1763792 2817322 4240914 3270512 3087321 4537966 4430115 -142133
2983 -142133 -7111003 -11380989 -11140428 -9629339 -9944228 -10662014 -8494769 -3533517 722423
2974 722423 2102228 2175495 3410391 5605829 6291432 4019196 182286 -2630379 -3510442
2965 -3510442 -3792357 -4698552 -5343900 -3996133 -782276 2201112 3388321 2925358 1294756
2956 1294756 -1410289 -4211270 -5143868 -3700252 -1875712 -1418654 -1514010 -817254 -199343
2947 -199343 -1073026 -1985531 278458 6161832 12268359 15193891 14475909 11465681 7421372
2938 7421372 3499599 766242 -961354 -3104459 -6297375 -9334998 -10638254 -9669196
2930 -9669196 -6601404 -2108674 1978382 3555518 2771086 2080305 2727671 3055058 1920918
2921 1920918 1737056 5232886 10278816 11452979 7209224 2373838 2008999 5173038 6990111
2912 6990111 5413333 3159739 3086218 4229106 3560521 125135 -4090409 -6806204 -7607765
2903 -7607765 -7516473 -7537139 -7989559 -8548009 -8493716 -7344907 -5526088 -4002060 -3004935 -1619338
2893 -1619338 1012182 4513635 7650737 9375336 9099259 6613607 2539950 -1512520
2885 -1512520 -4048595 -4781983 -4111362 -2095024 1042307 3848690 4613234 3632183 3161227
2876 3161227 4449137 5840396 4730714 832349 -3358262 -5099627 -3804020 -1159029
2868 -1159029 441090 -459427 -3648606 -7532860 -9973244 -9247422 -5053518 887297 5695797
2859 5695797 7625049 7445367 6954348 6368588 4192491 -262508 -5387840 -8873331 -9957271
2850 -9957271 -9423890 -8078710 -6122686 -3647322 -786675 2603086 6565257 10062993
2842 10062993 11072049 8392916 3369874 -761176 -1674825 -6650 1685387 1795274
2834 1795274 908344 261049 24199 -287050 -611757 -630194 -754053 -1648945 -2960944 -3651618
2824 -3651618 -3503271 -3089111 -2288595 -340850 2252109 3492291 2545572 1380882 2436801
2815 2436801 5459215 8056120 8876122 8642491 8081101 6570768 3658911 631851 -860036
2806 -860036 -1334675 -3114334 -6975773 -10341804 -9923196 -5687719 -1005711 1115885 750648
2797 750648 -203684 -580035 -330335 587981 2392830 4863935 7439585 9629426 10747747
2788 10747747 9940196 7330992 4412283 2326084 624042 -1111858 -1588675 357207
2780 357207 3007619 3119228 -120369 -4510135 -7975281 -9975042 -9834129 -6514318 -931542
2771 -931542 3913626 6333420 7543397 8823465 9164617 7146359 3399644 -286818 -2952940
2762 -2952940 -4481847 -5206163 -6481425 -9708551 -13535556 -14205375 -10444756 -5973317 -5050822
2753 -5050822 -7321597 -9342341 -9526744 -8955372 -8622894 -8705605 -9736517 -11842656 -13324391
2744 -13324391 -12342285 -9518995 -6771517 -4376122 -1519329 1113920 2012635 1597358 1678665
2735 1678665 2507060 2829125 2406155 1900844 813383 -1628357 -3972704 -3974069 -2244402
2726 -2244402 -1425934 -2060388 -2548982 -2748738 -3770886 -4542687 -3109625 -1448330 -3658263
2717 -3658263 -8369236 -8878860 -3260109 1565065 -326487 -5273955 -6332884 -3703172
2709 -3703172 -2730856 -4574676 -5587058 -4540296 -3867222 -3839255 -1666189 2684373 5245877
2700 5245877 4222175 2609279 2674279 2216071 -1014228 -4832106 -5709372 -3731279 -1480139
2691 -1480139 -63934 696521 -285756 -4313127 -9626323 -12032565 -9448855 -4212294 -343107
2682 -343107 516594 89295 997521 3676417 5856717 5291135 2481710 -296795 -2317985
2673 -2317985 -4976122 -8624743 -10764154 -8757259 -3251591 2377788 5216031 4453568
2665 4453568 943057 -3333797 -5910796 -5549614 -3409712 -1562525 -463458 1161308
2657 1161308 4009694 6804312 7519283 5545031 2492077 951024 2072097 4016107
2649 4016107 3322560 -1501142 -7985677 -11849201 -10990087 -7048067 -3516446 -2890670 -5140342
2640 -5140342 -7986690 -8653119 -6075124 -1707126 1932867 3366610 2845131 1663671 1260183
2631 1260183 2341727 4167769 5079289 4310292 2767874 1464887 52599 -2044249 -3863935
2622 -3863935 -3860449 -2271794 -844414 -185384 839909 2660844 3709991 2491771 -394097
2613 -394097 -3230439 -4978840 -5204875 -3661552 -1316054 -430321 -1746975 -2641827 -359864
2604 -359864 3591875 5087280 3429279 2528313 4868085 7412947 5978661 1372261 -2102520
2595 -2102520 -3000870 -3847339 -5954138 -7042171 -5517055 -3928344 -5560405 -9414861 -11302610
2586 -11302610 -9092585 -4541552 -412822 1956167 2395034 1524654 1017734 2289213 4392937
2577 4392937 4940121 3569607 2563334 3258297 3999382 3072419 1708026 2104847 3834612
2568 3834612 4510607 3161722 562544 -3202317 -8678660 -14263853 -16232763 -12869094
2560 -12869094 -6889639 -2587174 -1814395 -3561775 -5862428 -6853425 -5402157 -2336402
2552 -2336402 -172793 -203442 -739929 273147 1923793 1641479 -713482 -2368449 -1402323
2543 -1402323 1071918 3021420 3950845 4414138 4654711 4826018 5367096 6039859 5560533
2534 5560533 3352387 938567 412638 1930573 3672875 3949363 2531635 306925 -1485728
2525 -1485728 -1882440 -853789 657286 1728275 2300257 2953774 4478530 7715182 12597077
2516 12597077 16842115 17115333 12697864 6834617 3197702 2255921 2429832 2906084 2929074
2507 2929074 233092 -5935817 -10932223 -8418819 1059024 9306117 10150164 6213293
2499 6213293 3575931 3370953 2562234 466095 -329146 1262259 3458526 5036005 6249753
2490 6249753 5986136 2027910 -4488519 -8444030 -6742400 -2383820 -380645 -1747935
2482 -1747935 -3833136 -4744550 -4680233 -3840439 -1690778 1781200 5823092 9662535 12203351
2473 12203351 11933176 8983369 6313121 6368714 7136976 4530983 -1195265 -4948918 -4126007
2464 -4126007 -3015681 -6769191 -13041837 -13793930 -5592484 5401720 10366588 7469474
2456 7469474 2442685 858904 2572433 4050505 3748205 3396948 4910446 7914735 10562874
2447 10562874 11503320 10543495 8411358 6591701 6505122 7818473 8196759 5955280 2575703
2438 2575703 1163266 2469591 4019600 3478841 1185684 -1389800 -3826455 -5806422
2430 -5806422 -5489534 -1264367 5173929 9680682 9992031 7632835 5221269 3514217 1674806
2421 1674806 -1124328 -5217450 -10187440 -14198867 -15022110 -12919503 -11188786 -12350227
2413 -12350227 -14932696 -15747855 -14271505 -12534694 -11326956 -9295668 -6180624 -4277003
2405 -4277003 -5305711 -7673799 -8572662 -7743584 -7408364 -8782780 -10203865 -9195757 -5625631
2396 -5625631 -2004346 -455220 -15149 1891435 5230933 6553977 3816042 30483
2388 30483 -805529 -251928 -3729741 -11834379 -17851264 -16279018 -10138837 -6357395 -6600392
2379 -6600392 -6904640 -4898183 -2772550 -2961883 -4680891 -5668282 -4724852 -1997528 901812
2370 901812 1004095 -3025580 -7874381 -8731215 -5920331 -4831430 -8134466 -11894761 -11531709
2361 -11531709 -8034586 -5202020 -3714586 -1857541 -191192 -1157861 -4524502 -7004755
2353 -7004755 -6795755 -5575619 -5488011 -6599776 -7952303 -9041525 -9534306 -9076253 -7890078
2344 -7890078 -6468331 -4849147 -3456378 -3849110 -6531092 -8713788 -7144708 -3126917
2336 -3126917 -1513608 -4036574 -6990790 -7063181 -6157481 -7735635 -10802771 -11002326 -6777924
2327 -6777924 -1369232 1355295 776177 -1012644 -1830013 -1053738 195675 226698 -1216687
2318 -1216687 -2377060 -1600740 561108 2245585 2482400 1385255 -904824 -3874762 -5998639
2309 -5998639 -6325910 -6227783 -7543597 -9307019 -8612405 -4799807 -380872 2579382 4447102
2300 4447102 5595761 4786199 1672885 -1376604 -2147540 -1532474 -1398679 -1188942 506610
2291 506610 2164268 649390 -3555007 -5727170 -2702462 3095133 6854127 6822501 5042010
2282 5042010 4028871 4440745 5346048 5314633 3454633 386356 -1961918 -2235720 -1140598
2273 -1140598 -574965 -1623384 -3782425 -5626866 -5785547 -3904884 -1242433 294573 272867
2264 272867 181857 1109690 1900537 702001 -2430055 -5825252 -8515097 -10599714 -11528113
2255 -11528113 -10038153 -6484516 -3525901 -3114062 -3725540 -2180860 1931686 5176222
2247 5176222 4286804 210174 -3199354 -4226706 -5215483 -8512016 -12153422 -11894390 -7054963
2238 -7054963 -1672300 710444 687684 80701 -1771387 -6103866 -11110586 -13698032 -13996911
2229 -13996911 -14707350 -16239600 -16082500 -13390488 -10575255 -9212193 -7821748 -5495776
2221 -5495776 -4493523 -6670762 -9872037 -10766263 -9384290 -7969388 -6981797 -5443678 -4040670
2212 -4040670 -4311865 -5108384 -3290734 1649880 6560411 8859141 9284897 9673650 10360588
2203 10360588 10867488 11210284 11303844 10511913 8794404 7137077 6171255 5548054 5129951
2194 5129951 5449852 6560992 7860496 9358454 11386442 12659790 10794498 5730757
2186 5730757 665537 -1611396 -1496838 -619496 628386 1920144 1658140 -653155 -2310769
2177 -2310769 -465620 3715371 6542051 6592859 5287761 3473188 768770 -1703749 -1443535
2168 -1443535 1611331 4350993 4898598 5041767 6523661 7439277 4942014 28794 -3154265
2159 -3154265 -2352303 631727 2716872 2684557 1406562 428018 694789 1755372 2081718
2150 2081718 833907 -1008276 -2127072 -2893819 -4527376 -6617904 -7381938 -6648702 -6597567
2141 -6597567 -8452604 -10011983 -8117679 -2893257 1935680 2690342 -1374070 -8370656
2133 -8370656 -15443888 -19989046 -20717582 -18497849 -15657602 -13860326 -12897672 -11748973 -10248175
2124 -10248175 -9159403 -8842786 -8361771 -6125392 -1555033 3769513 7004666 6665729 4108027
2115 4108027 1611863 -613982 -3957754 -7779776 -8535562 -4243474 1703113 3740882
2107 3740882 782114 -2844562 -3377546 -1946184 -1698323 -2915467 -3267996 -1770840 -11895
2098 -11895 474272 67284 -92921 371607 1184780 1784218 1066308 -1940020 -6239705 -8734682
2088 -8734682 -7168461 -2795911 937396 2167333 2077992 2680230 4241163 5344522 4724602
2079 4724602 2449920 -242757 -1721960 -935265 1668958 4207628 4907149 3734065 2242599
2070 2242599 1937733 3181274 5375148 7272614 7077015 3545525 -2197003 -6938142 -8609015
2061 -8609015 -8487517 -8807755 -8946305 -6245553 -760840 3441526 3175918 324641 -987026
2052 -987026 -21915 476480 -673166 -1091800 1139853 3934647 3572498 -622510 -5722709
2043 -5722709 -8677666 -8864945 -7551633 -6298203 -6020164 -6563554 -6903787 -6293584 -5177246
2034 -5177246 -4540608 -4732452 -5501163 -6527760 -6958333 -5233559 -1068484 2796944 2962075
2025 2962075 -221865 -2741457 -2155186 -429386 -95922 88775 3007229 8060096 11287370
2016 11287370 10472407 7489018 5270872 4792147 5525991 6552947 6395475 3988023 894255
2007 894255 377911 2917718 4877146 3437491 628422 -22637 1116374 988199 -847704
1998 -847704 -1967081 -1880387 -3001073 -5852538 -7108835 -4584341 -1282129 -1613840 -5331201
1989 -5331201 -8119769 -7361229 -4565704 -2246646 -912176 191261 1183470 1478789 751666
1980 751666 -739677 -2332587 -3156144 -2671888 -1359864 -536399 -1226231 -3334755 -5951181
1971 -5951181 -8261601 -10028128 -11094838 -10518331 -6914377 -540867 5403434 7180804
1963 7180804 4694034 1754890 1243577 1525047 -708778 -5256222 -8377457 -7631305 -4455852
1954 -4455852 -1605588 -142277 188427 -470709 -1624540 -1766320 153511 3149736 5432482
1945 5432482 6747685 8077013 9282055 8768073 5962045 2717482 1299531 1822010 2655981
1936 2655981 2722791 2162340 1039691 -1086501 -3848697 -5569612 -5056295 -3226351 -1970580
1927 -1970580 -1842274 -1938172 -1810046 -2189365 -3543943 -5041313 -5590987 -5216525 -4761391
1918 -4761391 -4668306 -4557613 -3742536 -1899248 434598 1950983 1774966 757085 801246
1909 801246 2538198 4449856 4839952 3951980 3462052 4401678 6119120 6728258 4223379
1900 4223379 -1805947 -8712498 -12088778 -9968267 -5298795 -2919779 -4351203 -6897987
1892 -6897987 -7703227 -6950902 -6456198 -6526112 -5608176 -2738499 863159 3195946 4005712
1883 4005712 5070460 7746087 11081810 13197758 13811028 13968016 13635089 11506630 7520309
1874 7520309 3562776 925084 -957324 -2293666 -1854610 242951 1084175 -1186382 -3961549
1865 -3961549 -3555153 -491266 1809854 2406592 3186852 4529815 4709774 3751928 3822967
1856 3822967 5029572 4701241 2010244 -424191 -941969 -1067664 -1641194 -845327 1383361
1847 1383361 1135060 -3605274 -8358391 -7860824 -3775405 -1896649 -3552986 -5067515 -4849440
1838 -4849440 -5383212 -7700587 -9194915 -8606570 -8639012 -11130354 -13225970 -11350072 -6530127
1829 -6530127 -2862906 -2280146 -3359480 -4134231 -3743426 -2090090 21422 816852 -700059
1820 -700059 -3296008 -5152970 -6314328 -7906799 -9529857 -9463015 -7549559 -5918472 -6107565
1811 -6107565 -6947401 -6354371 -4213202 -2213636 -1329487 -852686 -29606 715831 1025145
1802 1025145 2060274 5157822 9098559 10363050 6996643 1206581 -2941157 -3667643
1794 -3667643 -2166257 73731 2746821 5455478 6858142 6114404 4139208 2508253
1786 2508253 1900640 2426389 4530028 8168832 11493248 11963167 9238402 5873700 4456941
1777 4456941 4799713 4744587 3154869 994891 -385046 -793031 -704619 -388479 -259851
1768 -259851 -1161476 -3250868 -5206832 -5550073 -4225783 -1989225 786534 3239845 3161897
1759 3161897 -498324 -4822915 -5630801 -3149607 -1734560 -3284788 -4765211 -3915142 -3163491
1750 -3163491 -4620483 -5039281 -605614 5854306 8166655 6107816 5280135 7509275 7788119
1741 7788119 2870288 -2901347 -4041676 -1781019 -1071201 -2889341 -4349936 -4618833 -5700298
1732 -5700298 -7662088 -7539647 -3897790 794348 3525122 4009791 3397403 1784742 -1291365
1723 -1291365 -4865439 -6524838 -4512501 393671 5058239 6431288 4319070 1323792
1715 1323792 -408990 -1466268 -3260182 -4995436 -4435289 -1362759 1697062 2605980 1986849
1706 1986849 1945723 3573038 6228629 8343949 8411730 5983876 2279500 -615769 -1458120
1697 -1458120 -548884 981380 1943528 1511382 -10383 -824099 807400 4308876 6992780
1688 6992780 6838467 4302669 1199055 -1227930 -2753495 -3764431 -5119180 -7684159
1680 -7684159 -11277517 -14501141 -16055475 -15695133 -13613693 -9836002 -4962125 -684843
1672 -684843 1516099 1811169 1295815 375977 -960973 -1724743 -507343 2145039 3515503
1663 3515503 1846725 -1375240 -3349613 -3274893 -2372187 -1317275 389131 2364898 2661456
1654 2661456 202765 -3347711 -5321668 -4790960 -2543161 726059 4706929 8447768
1646 8447768 10567196 10523162 8693913 5575510 2090253 95819 726447 2287152 1787774
1637 1787774 -1022093 -3053973 -2011832 729679 2422738 2430263 2028279 2081097 2488709
1628 2488709 3074094 3611693 3589739 3027865 2814655 3267760 3242740 1679744 -941028 -3670616
1618 -3670616 -6341818 -8534637 -8871061 -7183292 -5958742 -7263950 -9279112 -8590686 -5277589
1609 -5277589 -2641820 -1861231 -219243 4180954 8619100 8622547 3314678 -3559791 -7254746
1600 -7254746 -5924749 -1709692 1513535 2028257 1864439 3662919 6666998 7742417 6070419
1591 6070419 4239124 4135866 4404683 3305362 1806975 1977671 3923612 6168935 7802691
1582 7802691 8474763 7388008 4240533 538305 -1687882 -2030440 -1342861 -82619 1445116
1573 1445116 1986095 393616 -2460555 -4541842 -5403580 -6563714 -8989965 -11516841 -12057599
1564 -12057599 -9526531 -4667452 7074 1375751 -1640972 -6186306 -7494502 -3654606
1556 -3654606 2197451 4996549 2754022 -1852503 -4598361 -4014520 -2420758 -2836422 -5603368
1547 -5603368 -8834452 -11499363 -14158200 -16352599 -15670893 -11185020 -6186055 -5034251
1539 -5034251 -7840464 -10492505 -9778537 -6344042 -2520373 417392 2056215 1951310 287208
1530 287208 -1742086 -3309410 -4835231 -6662932 -7791330 -6915447 -4127615 -827635 1502191
1521 1502191 1907869 226005 -2389221 -3844617 -2967855 -699382 1128911 1639105 934127
1512 934127 -825356 -3181230 -4796004 -4681315 -4081979 -5630476 -9940332 -14141581 -14853937
1503 -14853937 -12054030 -8850204 -7520814 -6971155 -4654566 -158859 4067198 5261196
1495 5261196 2759485 -1916603 -6234939 -7746253 -5392181 -710974 3035661 3924016
1487 3924016 3011007 2119128 967397 -1908826 -5928321 -8227392 -7055662 -3840583 -1342473
1478 -1342473 -1106444 -3121513 -6250765 -8094165 -6202274 -1022333 3562699 4302647 2279774
1469 2279774 873139 989296 575094 -1506060 -3681559 -4268109 -3657474 -2916555 -2033153
1460 -2033153 -840380 -173846 -530106 -693920 498883 1692014 273042 -3848946 -7427058
1451 -7427058 -7391425 -4056245 -284199 1643464 1704376 1337002 1689894 2580816 2988581
1442 2988581 2603181 2513237 3818700 6012137 7731371 8763247 9806326 10290775 8531477
1433 8531477 4906877 2743161 4189902 6834330 6893395 4787472 4527449 7592136 10601832
1424 10601832 10188729 7422122 5426176 4644045 3046798 72254 -2233530 -2065055 8791
1415 8791 2032482 2421365 565197 -2993274 -6525075 -8134187 -7175211 -4272588 -356616
1406 -356616 3365953 4987620 3097019 -1319487 -5447195 -7428243 -7506125 -6490575 -4868022
1397 -4868022 -3873349 -5352446 -9213782 -12593546 -13130923 -11757541 -10508375 -8985339 -5558882
1388 -5558882 -1298558 493808 -877044 -2113786 -752430 1153189 319475 -2618033
1380 -2618033 -3984348 -2323809 -10573 555390 -85857 -134394 769557 1825580 2761554
1371 2761554 3832029 4798076 5060987 4457989 3179179 1408498 -285434 -974115 -744059
1362 -744059 -1307633 -3977520 -7499551 -9251503 -8355204 -6267439 -4472188 -3115779 -2029392
1353 -2029392 -1506439 -1535489 -1519741 -1285706 -1292737 -1519879 -1409291 -1223468 -1858514 -2712849
1343 -2712849 -1609462 1954313 5178484 5251711 2976084 1275161 1139566 1147223 351951
1334 351951 -645246 -1452469 -2583844 -3930623 -4177850 -2406472 769288 3963295 5936212
1325 5936212 5727628 3174900 -306569 -2511943 -2526083 -1422689 -757849 -943196 -1077137
1316 -1077137 28876 2204999 2927224 -743239 -8027586 -13723315 -13735114 -10160837 -8203201
1307 -8203201 -8941046 -8700159 -5510663 -2067229 -1024346 -1200323 -710596 -626138 -2573866
1298 -2573866 -5138923 -5864747 -5134083 -4921704 -5019785 -3783580 -1784568 -1322722 -2440011
1289 -2440011 -2524716 -194785 3141422 6050541 8790936 11408887 12324269 10004025 4733696
1280 4733696 -1792548 -7309499 -9385103 -6977962 -2097495 1900903 4116358 6265616
1272 6265616 8782846 9583392 8069353 7577296 11265235 17279347 20790757 19872852 16575224
1263 16575224 12715150 7918820 2567961 -481066 519731 2594450 894240 -4939786
1255 -4939786 -9827678 -9668206 -6616567 -5886539 -8489578 -10075770 -7228998 -1906839 1976701
1246 1976701 3852071 5695838 7605875 7608620 5479698 3362095 2081450 -53216 -3766168
1237 -3766168 -7076452 -8551905 -9553815 -11267513 -12146140 -11013041 -10483193 -13828296 -19662407
1228 -19662407 -23270397 -22677033 -19962545 -16810433 -12674168 -8104221 -5930294 -7105373
1220 -7105373 -8487485 -7333298 -5593155 -6775897 -10304869 -12392694 -11699941 -10607840
1212 -10607840 -10739846 -10624653 -8958040 -7265989 -7261318 -7556631 -5545063 -1576080 1329481
1203 1329481 1866607 2156136 4280604 7010577 7483005 5120498 2246626 1107983 1771898
1194 1771898 3091599 4268800 4730231 3655539 961423 -1672259 -2054434 113027 2965266
1185 2965266 4624202 4599334 2992396 -128305 -3646386 -5100379 -3229105 -211956 578059
1176 578059 -934469 -1330540 1347973 4497414 4359345 1007905 -2201343 -3322649 -3428805
1167 -3428805 -3543166 -2740721 -564596 840651 -875525 -4823510 -7892608 -8660658 -8170623
1158 -8170623 -6990767 -4076331 464950 3704706 2994316 -438604 -3144304 -4163838
1150 -4163838 -5698844 -8808977 -10975627 -9497491 -5593306 -2951735 -2903373 -3202689 -1618970
1141 -1618970 1243352 3230030 3085073 889523 -2409727 -4890514 -4437663 -997851 2827422
1132 2827422 4623866 4733410 4848907 5155371 4457678 2292431 -778602 -4195815 -6992502
1123 -6992502 -7442332 -5453298 -4288504 -6775564 -10323383 -9498399 -3844140 1104004 1895665
1114 1895665 1732888 4223191 6716965 4257868 -2340367 -7113113 -6629211 -2913566 798250
1105 798250 3250163 4046376 3063566 1687649 1706232 2457687 1787257 48206 64782 2575539
1095 2575539 4864602 4830101 3433956 2128265 916984 146687 930172 2129904 291588
1086 291588 -5058519 -9139773 -7888807 -3619321 -1374013 -1748082 -1244513 1430295 3556898
1077 3556898 2943103 815879 -563938 -587048 249761 1568125 2891976 3571027 3543440
1068 3543440 3263155 2790062 1935280 1125229 936055 913151 64703 -1513718 -2531081
1059 -2531081 -1894845 551864 4112999 7100387 7485037 5134209 2726036 2859842 4847687
1050 4847687 6074875 5933432 6270182 8042059 9686666 9291065 6790194 3598984 1299409
1041 1299409 752988 1184870 245037 -3433108 -7673579 -8420777 -4320898 1702579 5666706
1032 5666706 6046388 4046020 1832567 751725 130057 -2138409 -6713630 -11048699 -12132782
1023 -12132782 -10407603 -8768989 -7997243 -5862342 -1136050 4121952 7171916 7347744
1015 7347744 5419797 2303487 -790670 -2979374 -5216439 -9003180 -12977619 -13534950
1007 -13534950 -9968932 -6022595 -4569529 -3737882 -812590 2740781 3487188 1411251
999 1411251 -487914 -1020538 -1750898 -3364730 -4271635 -3273693 -1165105 904464 2770227
990 2770227 4533801 6081096 7532908 8740787 8377683 5191408 329919 -3134714 -3325162
981 -3325162 -1059323 1630842 3041583 2042019 -1282700 -4683577 -4987109 -1139394 4787568
972 4787568 9873848 12611381 12760188 10429990 6226103 1550723 -2109262 -4098643 -4666388
963 -4666388 -4471482 -4078541 -3641606 -3152796 -3138966 -4572930 -7621956 -11045141 -13398780
954 -13398780 -14229930 -13588683 -11418881 -8374595 -6112187 -5390754 -4817048 -3008304 -1032799
945 -1032799 -791286 -1819681 -2091979 -1572386 -2187976 -3963539 -4030204 -777141 3123669
936 3123669 3530855 -474192 -5956883 -9305949 -9061707 -6380964 -3638527 -2167230 -1003961
927 -1003961 1529569 4981930 6720782 5220763 2279196 1152062 3168163 6775800
919 6775800 9344754 9423725 7676044 5924985 5088348 4320858 2649164 750561 48433
910 48433 677601 1755118 3084409 4782933 5595337 3761649 -272468 -3973865 -5713354
901 -5713354 -5748665 -4421582 -1945422 -97247 -1027578 -3618674 -4204107 -2101079 -1026065
892 -1026065 -3217106 -5774631 -5617551 -4614318 -5845648 -7408623 -4797645 1687484 6647831
883 6647831 6668002 3584991 337530 -2486453 -4974162 -6348983 -6704869 -7490774 -8707730
874 -8707730 -8063028 -4497358 -336655 1749876 1950569 1765527 1265163 85444 -391930
865 -391930 1568228 5134519 7617275 7885163 7221876 6874536 6537654 5513927 3828014
856 3828014 1702257 -767369 -2707871 -2311832 1307720 6402723 9587062 8752882 4793315
847 4793315 543189 -1708750 -1793067 -1262558 -1700426 -3249090 -4635230 -4743649 -4111057
838 -4111057 -4339106 -5749337 -6369442 -4185179 27599 3412442 4524798 4568092 4736677
829 4736677 4133488 1597239 -1848766 -4210908 -5356943 -6622094 -7894380 -7254171 -4032055
820 -4032055 -518276 373872 -1748432 -4667792 -5975107 -5058715 -3202677 -2174547 -2504635
811 -2504635 -3090362 -2719451 -1638106 -993955 -1064124 -957330 -18487 1324596 2178718 2006941
801 2006941 928110 -223508 -461313 90406 106211 -903821 -1432491 -361395 437811
792 437811 -1766820 -6093638 -8399146 -6692000 -3636891 -2444177 -2606676 -1637657 695764
783 695764 2261886 1899078 652214 -255981 -941510 -1995786 -3290132 -4155757 -4198620
774 -4198620 -3664170 -3271526 -3742516 -5308010 -7618855 -10012807 -11715071 -12132549 -11423848
765 -11423848 -10408371 -9361027 -7590657 -5167598 -4109247 -6064423 -9377503 -10673666
757 -10673666 -9277664 -7662665 -7284595 -6673197 -4454029 -1549548 888001 3142297 5048284
748 5048284 5163068 3746343 3747202 6191605 7258949 3451398 -2321605 -3907854 -232185
739 -232185 3514159 2855162 -1351631 -5478990 -7019585 -5373218 -1678538 1381045 1950734
730 1950734 1539438 2863027 5279502 5422432 2629598 236764 450305 1349957 632885
721 632885 -791978 -1111022 -861655 -1361579 -1829866 -597479 2072713 4469665 5737726
712 5737726 6060665 5630650 4896380 4762898 5365514 5876618 6327913 7687175 9100459
703 9100459 7662118 2819292 -1507353 -1656546 1143722 3515163 4912365 6495977 7146766
694 7146766 4837969 874865 -1454607 -1891222 -2731898 -3822213 -2757815 -426168 -1261333
685 -1261333 -6271976 -10275671 -8589484 -2967135 1618515 2889823 1319576 -2521654
677 -2521654 -7220248 -9419312 -7073251 -2532464 402972 979630 349945 -1943574 -6527389
668 -6527389 -10669112 -10665744 -7555560 -6170564 -7892292 -8409111 -4160988 2479740 6640297
659 6640297 6991837 5979992 5681282 5739349 4801593 2559662 630032 1658168 6419755
650 6419755 11731628 13172870 10411513 7600467 7645072 8797645 8543214 7868531 8766790
641 8766790 9812294 7979326 3714237 395587 -854588 -2026695 -3681637 -3452905 -275412
632 -275412 3339892 5061753 5833561 7084269 7547445 5662021 3093141 2581983 3425819
623 3425819 2398176 -1240910 -4817891 -6423553 -6871234 -6772490 -4846097 -911679 2035802
614 2035802 1393334 -903121 -681526 2529113 4762952 3301632 413367 -206041 1132950
605 1132950 668724 -3346343 -8156399 -10123809 -9003586 -7285322 -6431053 -5511696 -3352296
596 -3352296 -483869 1457860 1387329 -421758 -2399227 -2450842 349053 4494523 7282656
587 7282656 7524129 6143239 4122971 1453129 -1321770 -2370507 -857926 1327224 1773161
578 1773161 507131 -914085 -2253598 -4323251 -6424071 -6609228 -4725529 -2914490 -2538568
569 -2538568 -2724320 -2704971 -3419182 -5486089 -7476803 -7879383 -7343067 -7133626 -6476988 -3583137
559 -3583137 1111744 4755034 5353320 3784791 2246145 1912613 2598666 3731041 4823369
550 4823369 5265769 4297440 1578695 -2090310 -4913712 -5503170 -4144863 -2207144 -558194
541 -558194 539004 365022 -1591801 -3493919 -1803842 4401007 11204500 13702294 11128346
532 11128346 6596252 2939762 885456 327767 692349 289551 -1957427 -3936032 -2268348
523 -2268348 2539215 5749646 4530372 1682722 1181684 2446009 2045831 -434014 -1840848
514 -1840848 -587195 1062517 839048 -95468 666540 2920769 4315573 3907460 3159361
505 3159361 3243546 3084249 1048559 -2310369 -4408904 -3510335 -602809 1883152 2564268
496 2564268 1734377 37099 -2368281 -5082128 -6920067 -6964247 -5750391 -4536074 -3542463
487 -3542463 -1913636 363694 1569366 153575 -3009017 -5321081 -5325855 -3841242 -2129203
478 -2129203 -288447 1675967 2428747 749244 -1887795 -2126722 1243143 5523729 7182796
469 7182796 5385124 1522376 -3174121 -7753070 -10486190 -10246837 -8756634 -8940100 -10581220
460 -10581220 -10096563 -5788621 -1042848 -322116 -3550025 -6799310 -7643458 -7272210 -7468736
451 -7468736 -8084123 -8248609 -8009239 -7585090 -6575920 -5253553 -5274668 -7348813 -9109093
442 -9109093 -7454300 -2863604 778185 1152658 175726 405245 686116 -2149517 -7840464
433 -7840464 -11676836 -9790664 -3676291 1755478 3376414 1837241 -456590 -1469611
425 -1469611 -26234 3751915 7813130 9293300 7226561 3584155 1069210 460017 681212
416 681212 846430 1234676 2270235 3388196 3484756 2358407 1195978 1223095 1995706 1660892
406 1660892 -755801 -3865047 -5313863 -4309260 -2071708 -138726 826614 682129 -545011
397 -545011 -2271324 -3477808 -3678423 -3190487 -2263788 -772670 943548 1992993 2360845
388 2360845 3440323 6046559 8531618 8242930 4876341 1245788 286187 1984148 3781792
379 3781792 3586946 1749249 94894 -358236 -224085 -510290 -1256647 -1695462 -1298427
370 -1298427 -303534 388798 -430421 -3261241 -6573599 -7407322 -4526331 -349111 1781505
361 1781505 1786268 2364769 4439112 5563653 3739142 497829 -1467372 -2003379 -2779431
352 -2779431 -4032129 -4328941 -3225142 -2086596 -2018957 -2489937 -2382811 -1305369 491013
343 491013 2610938 4532518 5628625 5453517 3980612 1868298 559623 1294010 3513118
334 3513118 5078239 4710992 3288256 1995998 508367 -1695265 -3467878 -3365247 -2134362
325 -2134362 -1803283 -2688505 -3382308 -3539384 -4395354 -6182997 -7226833 -6428131 -4836394
316 -4836394 -3757067 -2851285 -1315914 223214 332245 -1247824 -3170704 -3832410 -2847537
307 -2847537 -1578134 -2109765 -4879206 -7419143 -6634077 -2471216 1856149 3478314 2432386
298 2432386 452566 -1246835 -2426145 -3427497 -4943974 -7036246 -8151190 -6695338
290 -6695338 -3859513 -2788111 -4178720 -5004821 -2949449 156501 1208216 107779 -1128035
281 -1128035 -1754046 -2014242 -855405 2780564 6918706 8091893 6064898 4029974 3685715
272 3685715 3186615 951619 -1508581 -2309366 -2245610 -2909467 -3613129 -2703938 -843959
263 -843959 -484786 -2489015 -5361690 -7566116 -8576387 -7793781 -4768514 -1038568 449638
254 449638 -1023284 -2511774 -1053701 2409762 4296321 2681312 -1337232 -5889584 -9846851
245 -9846851 -12079174 -11398513 -8173963 -4547053 -2091973 -426285 1076039 1684344 765489
236 765489 -438679 -293653 692295 621401 -945532 -2717986 -4010991 -5413170 -7014402
227 -7014402 -7833117 -7392630 -6253019 -4730930 -2886258 -2033465 -3968596 -7802445 -9884786
218 -9884786 -8440624 -6323308 -7198736 -10559427 -12822899 -12333602 -10744364 -9734185 -8780992
209 -8780992 -6745230 -3998671 -2131843 -2263054 -3996251 -5649580 -5587666 -3707670 -1333531
200 -1333531 557496 2238812 3996331 5106311 4855355 3560455 1717123 -721232 -3224020
191 -3224020 -4179179 -2835862 -528202 1364842 3187418 5117880 5331786 2492613 -1345688
182 -1345688 -3139551 -3117880 -3688350 -5023180 -5172660 -4094361 -3776458 -4166011 -2810941
173 -2810941 643550 3235965 3128638 1859247 897594 -474959 -2197356 -2076121 246054
164 246054 1497609 -99154 -1146368 1910278 6777189 8396990 6044421 3038889 782365
$$ [...]
##END NTUPLES=NMR SPECTRUM
##END=
