##TITLE=31Pdec_DE-70_oil2
 CDCl3, 60 sc
 29.10.2024
##JCAMPDX= 6.0         $$ Bruker NMR JCAMP-DX V2.0
##DATA TYPE= NMR SPECTRUM
##DATA CLASS= NTUPLES
##ORIGIN= UXNMR, Bruker Analytische Messtechnik GmbH
##OWNER= root
$$ XWIN-NMR		Version 3.5
$$ Tue Oct 29 16:02:27 2024 Russian Standard Time (UT+4h)  she@DPX200
##.OBSERVE FREQUENCY= 81.013821
##.OBSERVE NUCLEUS= ^31P
##.ACQUISITION MODE= SIMULTANEOUS
##.ACQUISITION SCHEME= undefined
##.AVERAGES= 70
##.DIGITISER RES= 17
##SPECTROMETER/DATA SYSTEM= spect
##.PULSE SEQUENCE= zgpg30
##.SOLVENT NAME= CDCl3
##.SHIFT REFERENCE= (INTERNAL, CDCl3, 0, 198.062)
##AUDIT TRAIL= $$ (NUMBER, WHEN, WHO, WHERE, WHAT)
$$ ##TITLE= Audit trail, XWIN-NMR		Version 3.5
$$ ##JCAMPDX= 5.01
$$ ##ORIGIN= Bruker BioSpin GmbH
$$ ##OWNER= she
$$ F:/spectra/data/she/nmr/P31/2/pdata/1/auditp.txt
$$ ##AUDIT TRAIL=  $$ (NUMBER, WHEN, WHO, WHERE, WHAT)
(   1,<2024-10-29 16:01:17.64 +0400>,<she>,<DPX200>,
      <continue with go, POWCHK disabled, PULCHK disabled
       configuration hash MD5:
       00 E9 B6 7A A2 85 ED C7 34 08 36 98 17 FE 4E 26
       data hash MD5: 32K
       AD DD 41 06 EA C2 20 6C DF 3E 36 48 52 8A 49 4E>)
(   2,<2024-10-29 16:01:19.59 +0400>,<she>,<DPX200>,
      <Start of raw data processing
       efp BC_mod = 2 LB = 1.5 FT_mod = 6 PKNL = 1 PHC0 = 2620.587 PHC1 = 167.688 SI = 64K 
       data hash MD5: 64K
       DF A1 B3 FC CB 3F 76 A5 CE 57 A1 22 BF 14 7B 86>)
(   3,<2024-10-29 16:01:49.07 +0400>,<she>,<DPX200>,
      <pk PHC0 = 23.55885 PHC1 = -62 
       data hash MD5: 64K
       FB BB C8 3F AA B7 16 72 93 A9 3C 8A 16 9D D8 EF>)
(   4,<2024-10-29 16:01:54.92 +0400>,<she>,<DPX200>,
      <abs ABSG = 5 
       data hash MD5: 64K
       F6 69 B5 D7 89 A2 08 96 12 14 DD CB B4 B6 CA B4>)
$$ ##END=
$$ 
$$ hash MD5
$$ B2 25 96 66 5F F9 73 25 88 55 36 0C 88 ED 25 0D
##$RELAX= 
##$RELAX= 
##$RELAX= 
##$RELAX= 
##$RELAX= 
##$RELAX= 
##$RELAX= 
##$RELAX= 
$$ Bruker specific parameters
$$ --------------------------
##$DU= <F:/spectra>
##$EXPNO= 2
##$NAME= <P31>
##$PROCNO= 1
##$TYPE= <nmr>
##$USER= <she>
##$AMP= (0..31)
100 100 100 100 100 100 100 100 100 100 100 100 100 100 100 100 100 100 
100 100 100 100 100 100 100 100 100 100 100 100 100 100 
##$AQSEQ= 0
##$AQ_mod= 1
##$AUNM= <au_zg>
##$AUTOPOS= <>
##$BF1= 81.014009
##$BF2= 200.13
##$BF3= 200.13
##$BF4= 200.13
##$BF5= 200.13
##$BF6= 200.13
##$BF7= 200.13
##$BF8= 200.13
##$BYTORDA= 1
##$CFDGTYP= 0
##$CFRGTYP= 5
##$CHEMSTR= <none>
##$CNST= (0..31)
1 1 145 1 1 1 1 1 1 1 1 1 1 1 1 1 1 1 1 1 1 1 1 1 1 1 1 1 1 1 1 1 
##$CPDPRG= <waltz16>
##$CPDPRG1= <>
##$CPDPRG2= <waltz16>
##$CPDPRG3= <>
##$CPDPRG4= <mlev>
##$CPDPRG5= <mlev>
##$CPDPRG6= <mlev>
##$CPDPRG7= <mlev>
##$CPDPRG8= <mlev>
##$CPDPRGB= <>
##$CPDPRGT= <>
##$D= (0..31)
0 1 0 0 0 0 0 0 0 0.06 0 0.03 2e-05 3e-06 0 0 0.0002 0 0 0 0 0 0 0 0 0 
0 0 0 0 0 0 
##$DATE= 1730203161
##$DBL= (0..7)
120 120 120 11 120 120 24 19 
##$DBP= (0..7)
150 150 150 150 150 150 150 150 
##$DBP07= 0
##$DBPNAM0= <>
##$DBPNAM1= <>
$$ [...]
##$SUBNAM3= <"">
##$SUBNAM4= <"">
##$SUBNAM5= <"">
##$SUBNAM6= <"">
##$SUBNAM7= <"">
##$SUBNAM8= <"">
##$SUBNAM9= <"">
##$SW= 400.765351723535
##$SWIBOX= (0..15)
0 1 3 0 0 0 0 0 0 0 0 0 0 0 0 0 
##$SW_h= 32467.5324675325
##$TD= 32768
##$TD0= 1
##$TE= 0
##$TE2= 300
##$TE3= 300
##$TEG= 300
##$TL= (0..7)
0 120 53 12 22 120 120 120 
##$TP= (0..7)
150 150 150 150 150 150 150 150 
##$TP07= 0
##$TPNAME0= <>
##$TPNAME1= <>
##$TPNAME2= <>
##$TPNAME3= <>
##$TPNAME4= <>
##$TPNAME5= <>
##$TPNAME6= <>
##$TPNAME7= <>
##$TPOAL= (0..7)
0.5 0.5 0.5 0.5 0.5 0.5 0.5 0.5 
##$TPOFFS= (0..7)
0 0 0 0 0 0 0 0 
##$TUNHIN= 0
##$TUNHOUT= 0
##$TUNXOUT= 0
##$USERA1= <user>
##$USERA2= <user>
##$USERA3= <user>
##$USERA4= <user>
##$USERA5= <user>
##$V9= 5
##$VALIST= <valist>
##$VCLIST= <CCCCCCCCCCCCCCC>
##$VD= 0
##$VDLIST= <DDDDDDDDDDDDDDD>
##$VPLIST= <PPPPPPPPPPPPPPP>
##$VTLIST= <TTTTTTTTTTTTTTT>
##$WBST= 1024
##$WBSW= 4
##$XGAIN= (0..3)
0 0 0 0 
##$XL= 0
##$YL= 0
##$YMAX_a= 5703
##$YMIN_a= -6569
##$ZGOPTNS= <>
##$ZL1= 120
##$ZL2= 120
##$ZL3= 120
##$ZL4= 120
##$ABSF1= 198.0616
##$ABSF2= -202.7028
##$ABSG= 5
##$ABSL= 3
##$ALPHA= 0
##$AQORDER= 0
##$ASSFAC= 0
##$ASSFACI= 0
##$ASSFACX= 0
##$ASSWID= 0
##$AUNMP= <proc_1d>
##$AZFE= 0.1
##$AZFW= 0.5
##$BCFW= 0
##$BC_mod= 2
##$BYTORDP= 0
##$COROFFS= 0
##$CY= -3
##$DATMOD= 1
##$DC= 0
##$DFILT= <>
##$DTYPP= 0
##$F1P= 0
##$F2P= 0
##$FCOR= 1
##$FTSIZE= 65536
##$FT_mod= 6
##$GAMMA= 0
##$GB= 0
##$INTBC= 1
##$INTSCL= 9.790993e-09
##$ISEN= 30
##$LB= 1.5
##$LEV0= 0
##$LPBIN= 0
##$MAXI= 10000
##$MC2= 0
##$MEAN= 0
##$ME_mod= 0
##$MI= 50
##$NCOEF= 0
##$NC_proc= -9
##$NLEV= 6
##$NOISF1= 182.463
##$NOISF2= 159.3651
##$NSP= 0
##$NTH_PI= 0
##$NZP= 0
##$OFFSET= 198.0616
##$PC= 4
##$PHC0= 2644.146
##$PHC1= 105.688
##$PH_mod= 1
##$PKNL= yes
##$PPARMOD= 0
##$PSCAL= 0
##$PSIGN= 0
##$REVERSE= no
##$SF= 81.0140089999434
##$SI= 65536
##$SIGF1= 159.3651
##$SIGF2= -187.1042
##$SINO= 113.3802
##$SIOLD= 16384
##$SREGLST= <1H.CDCl3>
##$SSB= 0
##$STSI= 65536
##$STSR= 0
##$SW_p= 32467.5324675325
##$SYMM= 0
##$S_DEV= 0
##$TDeff= 32768
##$TDoff= 0
##$TI= <>
##$TILT= no
##$TM1= 0
##$TM2= 0
##$TOPLEV= 0
##$USERP1= <user>
##$USERP2= <user>
##$USERP3= <user>
##$USERP4= <user>
##$USERP5= <user>
##$WDW= 1
##$XDIM= 65536
##$YMAX_p= 211465505
##$YMIN_p= -348000550
$$ End of Bruker specific parameters
$$ ---------------------------------
##NTUPLES= NMR SPECTRUM
##VAR_NAME=  FREQUENCY,     SPECTRUM/REAL,   SPECTRUM/IMAG
##SYMBOL=    X,             R,               I
##VAR_TYPE=  INDEPENDENT,   DEPENDENT,       DEPENDENT
##VAR_FORM=  AFFN,          ASDF,            ASDF
##VAR_DIM=   65536,         65536,           65536
##UNITS=     HZ,            ARBITRARY UNITS, ARBITRARY UNITS
##FACTOR=    0.49542278885378, 1,            1
##FIRST=     16045.7642231865, 0,            0
##LAST=      -16421.768244346, 0,            0
##MIN=       -16421.768244346, -348000550,   0
##MAX=       16045.7642231865, 211465505,    0
$$ Real data points
##PAGE= N=1
##DATA TABLE= (X++(R..R)), XYDATA
$$ [...]
$$ plain form
6602 -824154 -1314383 -4599595 -8446046 -10212852 -8405291 -5437380 -6010430 -10305659 -12354109
6593 -12354109 -8691943 -4786201 -7707699 -15389423 -19262202 -15795772 -9171567 -3509082
6585 -3509082 1139608 5245214 8383225 11456106 14589721 13445774 4571168 -5927290
6577 -5927290 -7543980 -454043 3573597 -1903288 -9477767 -10743582 -8198245 -7438265
6569 -7438265 -6010179 564348 7629089 6700854 -1003619 -5807225 -2953576 3507408
6561 3507408 9071395 12748249 12905295 7254856 -1805629 -8521821 -11605778 -14805496
6553 -14805496 -19076000 -20633183 -18019147 -14706601 -12802591 -10164763 -5982422 -3426753
6545 -3426753 -4043925 -4807859 -3553038 -2211611 -1723312 858616 6310412 9232505 4776116
$$ packed form
6602h24154m90229l285212l846451j766806J807561K967911n73050m295229k048450
6593a2354109L662166L905742k921498p681724l872779L466430O624205N662485
6585c509082M648690M105606L138011L072881L133615j143947q874606j0498458
6577e927290j616690P089937M027640n476885p574479j265815K545337P59980
6569g438265J428086O574527P064741r28235p704473m803606K853649O460984
6561C507408N563987L676854J57046n650439r060485o716192l083957l199718
6553a4805496m270504j557183K614036L312546J904010K637828M182341K555669
6545c426753o17172p63934J254821J341427M88299K581928N451796K922093m456389
$$ plain form
6536 4776116 -4436409 -12521147 -17810928 -21518908 -22645086 -19954979 -16478871 -15962587
6528 -15962587 -16244290 -12157292 -4522074 -318621 -3283850 -9614148 -14136576 -15714131
6520 -15714131 -14728255 -10189183 -2734437 2947877 2572831 -2405157 -6623212 -6675670 -3113087
6511 -3113087 1554287 4236453 2295077 -3620839 -8726204 -9293009 -7888774 -9622920
6503 -9622920 -13577544 -13091150 -6033509 631554 299180 -3815811 -4345061 -1824715 -3607199
6494 -3607199 -11063526 -15860463 -11852039 -4132157 -1567500 -5029888 -8418800 -8117037
6486 -8117037 -5735182 -3394499 -1864654 -2443381 -5457683 -7372322 -4584452 -131609
6478 -131609 -1354909 -10070702 -19967704 -24906738 -24955691 -22657161 -18380977 -12075420 -5515165
$$ packed form
6536D776116r212525q084738n289781l707980j126178K690107L476108N16284
6528a5962587k81703M086998P635218M203453k965229o330298m522428j577555
6520a5714131R85876M539072P454746N682314l75046m977988m218055n2458L562583
6511c113087M667374K682166j941376n915916n105365n66805J404235j734146
6503i622920l954624M86394P057641O665063l32374m114991n29250K520346j782484
6494c607199p456327m796937M008424P719882K564657l462388l388912L01763
6486h117037K381855K340683J529845n78727l014302j914639K787870M452843
6478a31609j223300q715793r897002m939034m8953K298530M276184O305557O560255
$$ plain form
6469 -5515165 -30488 4491970 6167101 1060223 -10139167 -19455342 -19848475 -13180836
6461 -13180836 -6190335 -1698572 1688584 4131323 4610867 5053058 8541226 13160225
6453 13160225 12542204 3770112 -8645522 -17566623 -19528640 -16270736 -12598086 -12448790
6445 -12448790 -14571370 -13037249 -5026140 3522707 4499559 -1179418 -4555388 -920030
6437 -920030 5196718 8970901 12373841 18107623 22160930 18889565 10695697 6088640
6429 6088640 8669582 13661064 15845918 15577144 14869510 12209658 5399233 -2660053 -5769230
6420 -5769230 -2642360 282225 -3292736 -10677712 -12617525 -4770724 6556419 12103749
6412 12103749 10416492 7540393 7568800 8212885 6341105 3159412 1153702 -597942 -4065585
$$ packed form
6469e515165N484677M522458J675131n106878j1199390r316175l93133O667639
6461a3180836O990501M491763L387156K442739M79544M42191L488168M618999
6453A3160225o18021q772092j2415634q921101j962017L257904L672650J49296
6445a2448790k122580J534121Q011109Q548847R76852n678977l375970L635358
6437i20030O116748L774183L402940N733782M053307l271365q193868m607057
6429F088640K580942M991482K184854k68774p07634k659852o810425q059286l109177
6420e769230L126870K924585l574961p384976j939813P846801J1327143N547330
6412A2103749j687257k876099K8407O44085j871780l181693k005710j751644l467643
$$ plain form
6403 -4065585 -7036484 -4718211 3029555 9363407 6897464 -4817107 -18803053 -26554958
6395 -26554958 -24373942 -15297338 -5392951 2244440 9319975 17521604 23697531 22926352
6387 22926352 16151855 10815570 11834017 14896863 12088448 2587008 -6386491 -9483506
6379 -9483506 -9765339 -12861538 -17807981 -18282270 -12638572 -8050138 -11999394 -22086031
6371 -22086031 -27828907 -22411877 -9932248 -404285 178452 -6285208 -13834265 -17701709
6363 -17701709 -16453582 -11568989 -6193026 -3468311 -4821439 -9115858 -13031432 -12620252
6355 -12620252 -6128223 3292922 8585089 4970416 -4002497 -8450321 -2009418 11018012
6347 11018012 20094554 19635633 13635791 8906019 6717393 3657331 -1154837 -3982710
$$ packed form
6403d065585k970899K318273P747766O333852k465943j1714571j3985946p751905
6395b6554958K181016R076604R904387P637391P075535Q201629O175927p71179
6387B2926352o774497n336285J018447L062846k808415r501440q973499l097015
6379i483506k81833l096199m946443m74289N643698M588434l949256j0086637
6371b2086031n742876N417030J2479629R527963N82737o463660p549057l867444
6363a7701709J248127M884593N375963K724715j353128m294419l915574M11180
6355a2620252O492029R421145N292167l614673q972913m447824O440903J3027430
6347A1018012R076542m58921n999842m729772k188626l060062m812168k827873
$$ plain form
6339 -3982710 -2375205 587174 580613 -1839870 -2930369 -2422415 -4258251 -9879902 -14534615
6330 -14534615 -12620579 -4483715 4440152 9515889 9379816 4048114 -5729533 -16738423
6322 -16738423 -23770655 -23480595 -16995808 -8501371 -2342279 -1126894 -4445556 -8785038
6314 -8785038 -10491498 -9539843 -8756329 -9066226 -8251503 -5644363 -4756189 -8155469 -12003836
6305 -12003836 -9822662 -1030615 8240243 12981813 13968524 13670877 11839816 7872100
6297 7872100 4350639 4442920 7134735 8297543 5900698 1549960 -2478088 -4933001 -4705421
6288 -4705421 -1287741 3546329 7196471 9795752 13536081 17802024 18392284 13622125
6280 13622125 8334273 8648997 14114868 18190367 16079271 9310645 2499271 -1613981
$$ packed form
6339c982710J607505K962379o561k420483j090499N07954j835836n621651m654713
6330a4534615J914036Q136864Q923867N075737j36073n331702r777647j1008890
6322a6738423p032232K90060O484787Q494437O159092J215385l318662m339482
6314h785038j706460R51655P83514l09897Q14723K607140Q88174l399280l848367
6305a2003836K181174Q792047R270858M741570R86711k97647j831061l967716
6297G872100l521461R2281K691815J162808k396845m350738m028048k454913K27580
6288d705421L417680M834070L650142K599281L740329M265943N90260m770159
6280A3622125n287852L14724N465871M075499k111096o768626o811374m113252
$$ plain form
6272 -1613981 -2863115 -1772629 846041 3184739 3438033 2164761 2464298 6442577 11595127
6263 11595127 12292908 6058539 -2670765 -7057484 -5892597 -4522618 -6920996 -9767874
6255 -9767874 -7123307 746541 6899460 6255405 1443602 -1298923 73946 1791130
6247 1791130 -298982 -5424482 -8432119 -5143612 3011610 9842976 10269454 5358445
6239 5358445 1052888 1904474 6711947 10573152 10669103 9434930 11769089 19019346 26271086
6230 26271086 26907485 20300267 13377780 13096599 18678552 23597447 24408245 24218789 26582164
6221 26582164 29222289 26537096 16998772 5476682 -1749852 -2628709 85216 2481657
6213 2481657 3092037 3242677 4215501 4767650 2797686 -441140 -113259 6227578 13877552
$$ packed form
6272a613981j249134J090486K618670K338698K53294j273272K99537L978279N152550
6263A1595127O97781o234369q729304m386719J164887J369979k398378k846878
6255i767874K644567P869848O152919o44055m811803k742525J372869J717184
6247A791130k090112n125500l007637L288507Q155222O831366M26478m911009
6239E358445m305557Q51586M807473L861205R5951j234173K334159P250257P251740
6230B6271086O36399o607218o922487k81181N581953M918895Q10798j89456K363375
6221B6582164K640125k685193r538324j1522090p226534q78857K713925K396441
6213B481657O10380J50640R72824N52149j969964l238826L27881O340837P649974
$$ plain form
6204 13877552 15182028 8589829 760119 -1394570 1617292 3917388 2001077 -2334837
6196 -2334837 -5936855 -7837380 -8067860 -5819558 -1043325 3524684 4443290 1615867 -1430812
6187 -1430812 -1330925 2507420 8766278 15393535 19342043 17793038 11818648 7254428 9059351
6178 9059351 14979176 17429475 12399257 4282604 486467 3080146 8050150 11749320
6170 11749320 14711567 18094144 19506584 15714877 8521090 4131255 5599104 8986738
6162 8986738 9068553 6179607 4338471 4623521 4634238 3869699 4991797 8748712 11559527
6153 11559527 9876363 4039348 -3337924 -9492130 -10941673 -5150315 4923074 12090038
6145 12090038 13508432 13625996 15462621 14656039 7624374 184058 111993 4825573 5568749
$$ packed form
6204A3877552J304476o592199p829710k154689L011862K300096j916311m335914
6196b334837l602018j900525k30480K248302M776233M568009R18606k827423l046679
6187a430812R9887L838345O258858O627257L948508j549005n974390m564220J804923
6178I059351N919825K450299n030218q116653l796137K593679M970004L699170
6170A1749320K962247L382577J412440l791707p193787m389835J467849L387634
6162H986738Q1815k888946j841136K85050J0717p64539J122098L756915K810815
6153A1559527j683164n837015p377272o154206j449543N791358J0073389P166964
6145A2090038J418394J17564J836625q06582p031665p440316p2065M713580P43176
$$ plain form
6136 5568749 1672186 425585 3137387 2632814 -2993837 -5415686 -70864 4919408
6128 4919408 1287260 -6033750 -6996818 -2045218 -168668 -4887326 -11128665 -14086135
6120 -14086135 -13076669 -7990337 161548 5703924 2816992 -6148717 -13340090 -16114964
6112 -16114964 -18363365 -21554410 -22348040 -20074928 -18660429 -18914835 -16346005 -9545947
6104 -9545947 -3653064 -1945206 -935803 1881182 2437124 -1948975 -5306953 -1138365
6096 -1138365 6666530 9016019 4914534 1431550 1676357 1143292 -3079070 -6916699 -5865555
6087 -5865555 -1566766 1096391 -433032 -5982575 -13913691 -20167418 -19814235 -13195832
6079 -13195832 -7811031 -9930531 -15880566 -16158611 -8093842 153738 35257 -6484463
$$ packed form
6136E568749l896563j246601K711802n04573n626651k421849N344822M990272
6128D919408l632148p321010r63068M951600J876550m718658o241339k957470
6120a4086135J009466N086332Q151885N542376k886932q965709p191373k774874
6112a6114964k248401l191045p93630K273112J414499k54406K568830O800058
6104i545947N892883J707858J009403K816985N55942m386099l357978M168588
6096a138365P804895K349489m101485l482984K44807n33065m222362l837629J051144
6087e865555M298789K663157j529423n549543p931116o253727L53183O618403
6079a3195832N384801k119500n950035k78045Q064769Q247580j18481o519720
$$ plain form
6071 -6484463 -9798921 -4742217 4066398 9131884 8648605 6202315 4618864 3423504
6063 3423504 1605336 -376200 -2097370 -4527318 -8724578 -14123593 -18586979 -19650665
6055 -19650665 -16362714 -11119576 -8676339 -11230481 -15216368 -15418984 -11426315 -6854930
6047 -6854930 -3056720 1960927 8372890 13672644 18190997 25479876 34306683 36467622
6039 36467622 27689961 15590731 10163202 10132566 6634935 -1708291 -6599237 -3729734
6031 -3729734 300879 -1359946 -5083347 -2388359 7639669 17295861 19915829 15629567
6023 15629567 7881463 -1055858 -9301514 -13230141 -9778738 -1289181 4604805 2487948
6015 2487948 -4174892 -6973421 -3465272 -226162 -3089394 -8637295 -9290157 -3223494
$$ packed form
6071f484463l314458N056704Q808615N065486m83279k446290j583451j195360
6063C423504j818168j981536j721170k429948m197260n399015m463386j063686
6055a9650665L287951N243138K443237k554142l985887k02616L992669M571385
6047f854930L798210N017647O411963N299754M518353P288879Q826807K160939
6039C6467622q777661j2099230n427529l0636l497631q343226m890946K869503
6031c729734M030613j660825l723401K694988J0028028R656192K619968m286262
6023A5629567p748104q937321q245656l928627L451403Q489557N893986k116857
6015B487948o662840k798529L508149L239110k863232n547901o52862O066663
$$ plain form
6007 -3223494 5849949 15459872 24215396 27309857 20901795 11013191 8967143 15813089
5999 15813089 20064361 14430602 5722178 2391043 981318 -6288164 -16822759 -20838366
5991 -20838366 -16023127 -9311296 -5597181 -3791779 -3360958 -5501284 -7287799 -3925855
5983 -3925855 1246910 -1855138 -14976929 -26071515 -24276253 -13750675 -6542509 -6934814
5975 -6934814 -9649244 -9959198 -8276978 -5855900 -2147706 3021508 8602522 13732089
5967 13732089 17054632 15623001 8216070 -525796 -3006626 3369565 13264049 18647095
5959 18647095 15394341 5487596 -4766805 -8796438 -4526570 4056184 10920971 13174176
5951 13174176 11562032 7661528 2878532 -993849 -3173809 -5653571 -11030066 -18422791
$$ packed form
6007c223494R073443R609923Q755524L094461o408062r888604k046048O845946
5999A5813089M251272n633759q708424l331135j409725p269482j0534595m015607
5991b0838366M815239O711831L714115J805402M30821k140326j786515L361944
5983c925855N172765l102048j3121791j1094586J795262J0525578P208166l92305
5975f934814k714430l09954J682220K421078L708194N169214N581014N129567
5967A3732089L322543j431631p406931q741866k480830O376191R894484N383046
5959A8647095l252754r906745j0254401m029633M269868Q582754O864787K253205
5951A3174176j612144l900504m782996l872381k179960k479762n376495p392725
$$ plain form
5943 -18422791 -23711397 -24145417 -20951725 -17111700 -14123164 -11406024 -8019490 -4781242
5935 -4781242 -4574102 -9124291 -15107440 -16183287 -10825890 -5384947 -6151273 -10521309 -10128337
5926 -10128337 -1613972 9934224 17805652 19761353 17460497 14266242 14395051 20195316
5918 20195316 28865655 34861938 36168433 34991311 32338841 26715530 19489822 16508393
5910 16508393 21215747 29427094 33839904 31520699 25098833 19082480 16572938 17031059
5902 17031059 16276935 11789657 8226071 12715651 23633209 30507543 28022648 23266135
5894 23266135 24254831 28022956 27095175 22004978 18350714 15247057 7130517 -4030647
5886 -4030647 -8918940 -5061955 -1656720 -6535752 -15572516 -19562729 -16184106 -10412401
$$ packed form
5943a8422791n288606m34020L193692L840025K988536K717140L386534L238248
5935d781242K07140m550189n983149j075847N357397N440943p66326m370036L92972
5926a0128337Q514365J1548196P871428J955701k300856l194255J28809N800265
5918B0195316Q670339N996283J306495j177122k652470n623311p225708k981429
5910A6508393M707354Q211347M412810k319205o421866o016353k509542M58121
5902A7031059p54124m487278l563586M489580J0917558O874334k484895m756513
5894B3266135R88696L768125r27781n090197l654264l103657q116540j1161164
5886d030647m888293L856985L405235m879032r036764l990213L378623N771705
$$ plain form
5878 -10412401 -6846308 -5981012 -5860271 -4212038 -343871 3497921 4444694 3226006 3411863
5869 3411863 6251154 9740052 12819290 15824357 16307570 10370411 190239 -5873394
5861 -5873394 -4173331 -1278865 -4265404 -10588285 -13127406 -11338377 -11082083 -15511181
5853 -15511181 -21820451 -25911345 -25680105 -21026654 -14952148 -13047147 -17265535 -21652473
5845 -21652473 -19001042 -10258336 -2108853 3188417 8847372 14659106 14768454 7107771
5837 7107771 -1157081 -2088419 2898737 5826257 2967778 -1273688 -871732 4599164 10154095
5828 10154095 11427715 9281237 7928861 9109651 10150849 8717512 6850480 7597817
5820 7597817 9828251 10426431 10352616 13442098 19034746 21339482 18075306 14636907 16083777
$$ packed form
5878a0412401L566093Q65296J20741J648233L868167L841792R46773j218688J85857
5869C411863K839291L488898L079238L005067M83213n937159j0180172o063633
5861e873394J700063K894466k986539o322881k539121J789029K56294m429098
5853a5511181o309270m090894K31240M653451O074506J905001m218388m386938
5845b1652473K651431Q742706Q149483N297270N658955N811734J09348p660683
5837G107771q264852r31338M987156K927520k858479m241466M01956N470896N554931
5828A0154095J273620k146478j352376J180790J041198j433337j867032P47337
5820G597817K230434N98180p3815L089482N592648K304736l264176l438399J446870
$$ plain form
5811 16083777 18941738 15873270 6604699 -860508 -141784 6404640 11820618 12772799
5803 12772799 11109342 8624133 3755891 -4914489 -13898835 -16876749 -12095852 -4811885
5795 -4811885 -598324 1092945 3722756 6396797 4720351 -1222426 -4872961 -1464822
5787 -1464822 5053461 6252385 -1177711 -12172450 -18704336 -16996960 -10092108 -4420988
5779 -4420988 -3813481 -6940900 -10636692 -13813275 -16353962 -16565800 -13590460 -10803200 -11697814
5770 -11697814 -12898722 -7557161 3165592 9026918 4568053 -2431973 -1779295 5153553
5762 5153553 9220086 7631634 6094369 7836089 8588824 4295056 -2156321 -4517024
5754 -4517024 201976 10076236 19707498 22662471 16828503 8632817 7479935 14116841
$$ packed form
5811A6083777K857961l068468r268571p465207P18724O546424N415978R52181
5803A2772799j663457k485209m868242q670380q984346k977914M780897P283967
5795d811885M213561J691269K629811K674041j676446n942777l650535L408139
5787a464822O518283J198924p430096j0994739o531886J707376O904852N671120
5779d420988O07507l127419l695792l176583k540687k11838K975340K787260q94614
5770a1697814j200908N341561J0722753N861326m458865p000026O52678O932848
5762E153553M066533j588452j537265J741720P52735m293768o451377k360703
5754d517024M719000R874260R631262K954973n833968q195686j152882O636906
$$ plain form
5746 14116841 18981967 14565789 4701620 -2159459 -4490370 -7022211 -11385660 -14036768
5738 -14036768 -13293846 -12359339 -13477832 -13680791 -9364251 -2390820 1452269 -1046664 -7840594
5729 -7840594 -14821160 -19689527 -22464162 -23555415 -22479191 -18947893 -14927559 -13998137
5721 -13998137 -17139812 -20273607 -18624539 -13210697 -9505928 -8898349 -5958815 2669239
5713 2669239 10684150 9109622 -697270 -7468383 -4451412 2438308 3683725 -1509513
5705 -1509513 -6260506 -6134471 -3229467 -1498278 -2470590 -5366914 -7737085 -5957698 1361358
5696 1361358 9914809 12893401 8864388 4075962 5606767 13832885 22587203 25484268
5688 25484268 21544487 15706253 14071224 17866046 22542344 23551069 21237311 18042727
$$ packed form
5746A4116841M865126m416178r864169o861079k330911k531841m363449k651108
5738a4036768P42922R34507j118493k02959M316540O973431L843089k498933o793930
5729g840594o980566m868367k774635j091253J076224L531298M020334R29422
5721a3998137l141675l133795J649068N413842L704769O07579K939534Q628054
5713B669239Q014911j574528r806892o771113L016971O889720J245417n193238
5705a509513m750993J26035K905004J731189r72312k896324k370171J779387P319056
5696A361358Q553451K978592m029013m788426J530805Q226118Q754318K897065
5688B5484268l939781n838234j635029L794822M676298J008725k313758l194584
$$ plain form
5680 18042727 13092470 3507325 -9638901 -20805044 -25754692 -24465680 -18370819 -8746252
5672 -8746252 1541210 8639585 11234713 10506970 6788643 408983 -4655541 -3997554
5664 -3997554 -472383 -1963566 -9386957 -14093452 -10638389 -4550246 -2129887 29216
5656 29216 7870901 18369013 24103766 24946310 25735453 25595794 19979484 11670419 8637876
5647 8637876 10561888 8642047 1033002 -2717867 2753311 9018457 7027082 1625034
5639 1625034 3963772 14686320 23883282 25197939 21496261 17205998 12665886 7304592
5631 7304592 2513660 -878209 -4108830 -7455216 -8445676 -5010472 1155254 5883505
5623 5883505 6671187 4927813 4188439 5973205 7723785 6017426 1700355 -379650 2387203
$$ packed form
5680A8042727m950257r585145j3146226j1166143m949648J289012O094861R624567
5672h746252J0287462P098375K595128p27743l718327o379660n064524O57987
5664c997554L525171j491183p423391m706495L455063O088143K420359K159103
5656B9216P841685J0498112N734753Q42544P89143j39659n616310q309065l032543
5647H637876J924012j919841p609045l750869N471178O265146j991375n402048
5639A625034K338738J0722548R196962J314657l701678m290263m540112n361294
5631G304592m790932l391869l230621l346386r90460L435204O165726M728251
5623E883505P87682j743374p39374J784766J750580j706359m317071k080005K766853
$$ plain form
5614 2387203 6671311 7215717 2414133 -5893261 -15691838 -24702701 -28514279 -22917969
5606 -22917969 -9146179 5498765 13637683 13784242 10000352 6459718 3218692 -2303462
5598 -2303462 -10054927 -15121300 -12324873 -2505706 7599198 11733142 8965704 2877898
5590 2877898 -1797660 -2198251 155220 -72617 -6001499 -13366647 -15173251 -11414241 -9077315
5581 -9077315 -11382499 -12903045 -8419487 -1119116 2635215 2306818 1502953 578380 -2948902
5572 -2948902 -8142098 -10479136 -7724759 -1809623 4552481 9411503 10841104 8651647
5564 8651647 6026671 5904700 7032292 7083080 7322410 9488069 10622755 7263770 3009350
5555 3009350 4576061 10825255 13579438 10144512 6889540 8203762 10056295 8366439
$$ packed form
5614B387203M284108N44406m801584q307394r798577r010863l811578N596310
5606b2917969J3771790J4644944Q138918J46559l783890l540634l241026n522154
5598b303462p751465n066373K796427R819167J0104904M133944k767438o087806
5590B877898m675558m00591K353471k27837n928882p365148j806604L759010K336926
5581i077315k305184j520546M483558P300371L754331l28397q03865r24573l527282
5572b948902n193196k337038K754377N915136O362104M859022J429601k189457
5564H651647k624976j21971J127592N0788K39330K165659J134686l358985m254420
5555C009350J566711O249194K754183l434926l254972J314222J852533j689856
$$ plain form
5547 8366439 6263216 7737866 10327132 10133619 9111641 11080366 14529615 15682773
5539 15682773 15208407 15326727 13344375 5486118 -4660493 -9138716 -6500269 -2459343
5531 -2459343 225929 4643296 11034730 13275475 8026339 1137160 -179779 2766137
5523 2766137 3237151 -1011987 -6126490 -8746647 -9292535 -9199436 -9124580 -10129899 -13109153
5514 -13109153 -16359423 -16563293 -12955932 -8087620 -3783659 925644 6453797 9943865
5506 9943865 8759424 5471002 5976997 11861895 17137426 14687819 5018580 -3648411
5498 -3648411 -4246143 2118401 9035039 12845982 15412860 19311315 23257351 23957094 20901334
5489 20901334 17078620 15083448 14361466 13067338 11545043 12574791 17803031 24548754
$$ packed form
5547H366439k103223J474650K589266j93513j021978J968725L449249J153158
5539A5682773m74366J18320j982352p858257j0146611m478223K638447M040926
5531b459343K685272M417367O391434K240745n249136o889179j316939K945916
5523B766137M71014m249138n114503k620157n45888R3099P4856j005319k979254
5514a3109153l250270k03870L607361M868312M303961M709303N528153L490068
5506I943865j184441l288422N05995N884898N275531k449607r669239q666991
5498c648411n97732O364544O916638L810943K566878L898455L946036O99743l055760
5489B0901334l822714j995172p21982j294128j522295J029748N228240O745723
$$ plain form
5481 24548754 27170398 22235460 11939032 1638281 -5500838 -9899621 -11893407 -9692203
5473 -9692203 -3187607 2436668 1047223 -6166891 -10699654 -7290401 -1657869 -3959592
5465 -3959592 -15360410 -25124703 -22466990 -8499216 6018045 13075510 14053328 13820930
5457 13820930 12355231 5984245 -4395641 -11384810 -9665048 -3226663 -219783 -2192502
5449 -2192502 -2915973 2201109 10389472 16755820 20689201 24063789 26830004 28302370
5441 28302370 29848647 31751459 29762464 20121104 6648003 -2796081 -6224983 -7834402
5433 -7834402 -8683218 -4632464 4454283 11096138 10109912 5922041 4746315 4892316 1195778
5424 1195778 -5325854 -9718013 -12172438 -16865332 -22685848 -22962825 -15336214 -5435604
$$ packed form
5481B4548754K621644m934938j0296428j0300751p139119m398783j993786K201204
5473i692203O504596N624275j389445p214114m532763L409253N632532k301723
5465c959592j1400818r764293K657713J3967774J4517261P057465R77818k32398
5457A3820930j465699o370986j0379886o989169J719762O438385L006880j972719
5449b192502p23471N117082Q188363O366348L933381L374588K766215J472366
5441B8302370J546277J902812j988995r641360j3473101r444084l428902j609419
5433g834402q48816M050754R086747O641855r86226m187871j175726J46001l696538
5424A195778o521632m392159k454425m692894n820516k76977P626611R900610
$$ plain form
5416 -5435604 474538 741727 -4553161 -14842846 -24930188 -26173700 -16460635 -4898813
5408 -4898813 -2270136 -9484497 -18613302 -22399250 -19519582 -13311748 -9010268 -10369728
5400 -10369728 -15895738 -19899433 -19303169 -16847509 -15404100 -12979829 -7359299 -2243494
5392 -2243494 -3158738 -9056981 -13871408 -15927628 -19879089 -28393628 -37429406 -41982522
5384 -41982522 -41984924 -39501369 -33745086 -22853103 -8689771 3935789 12249226 16650902
5376 16650902 17269445 13017431 5443794 491652 3082888 10474220 14040931 8662831
5368 8662831 -1843692 -9919698 -12382557 -10859686 -6692094 -380782 4171158 760003
5360 760003 -10900000 -22192884 -24713111 -19761623 -15010246 -14077246 -14086630 -12273931 -9625540
$$ packed form
5416e435604N910142K67189n294888j0289685j0087342j243512R713065J1561822
5408d898813K628677p214361r128805l785948K879668O207834M301480j359460
5400a0369728n526010m003695N96264K455660J443409K424271N620530N115805
5392b243494r15244n898243m814427k056220l951461q514539r035778m553116
5384d1982522k402K483555N756283J0891983J4163332J2625560Q313437M401676
5376A6650902O18543m252014p573637m952142K591236P391332L566711n378100
5368H662831j0506523q076006k462859J522871M167592O311312M551940l411155
5360G60003j1660003j1292884k520227M951488M751377R33000r384J812699K648391
$$ plain form
5351 -9625540 -7348264 -4470212 -864357 876276 -1042533 -4620112 -6798007 -7383864
5343 -7383864 -8071871 -8915045 -8210330 -5576591 -3170009 -3366632 -6231538 -9683517 -11593867
5334 -11593867 -11349053 -9777667 -8359670 -8693924 -11576964 -15299680 -15738633 -10564200 -3429348
5325 -3429348 -978457 -4592607 -8415290 -7763226 -5834883 -7976304 -12159012 -11054254
5317 -11054254 -2890133 5839767 9600883 10168250 11371940 12491976 10775754 7175967
5309 7175967 5281417 6167103 7721233 7869819 5610607 316388 -6668593 -10704931 -7787636
5300 -7787636 19015 5995490 6122159 2778719 906847 2890391 7653069 12212858
5292 12212858 13032350 8245529 428926 -4514487 -3512263 -598536 -2783131 -11698914
$$ packed form
5351i625540K277276K878052L605855J740633j918809l577579k177895n85857
5343g383864o88007q43174P04715K633739K406582j96623k864906l451979j910350
5334a1593867K44814J571386J417997l34254k883040l722716m38953N174433P134852
5325c429348K450891l614150l822683O52064J928343k141421m182708J104758
5317a1054254Q164121Q729900L761116N67367J203690J120036j716222l599787
5309G175967j894550Q85686J554130J48586k259212n294219o984981m036338K917295
5300g787636P806651N976475J26669l343440j871872J983544M762678M559789
5292A2212858Q19492m786821p816603m943413J002224K913727k184595q915783
$$ plain form
5284 -11698914 -21598392 -26451698 -26895328 -27982445 -31091967 -31273807 -23923301 -11937508
5276 -11937508 -3692562 -4160653 -9903741 -13122114 -9221484 -25723 9065397 14163269
5268 14163269 15726341 16864427 18790343 18815052 14245513 7544296 4832890 8326344
5260 8326344 12736408 11259882 3602052 -4348088 -7974625 -8316197 -8840326 -10636256 -12485140
5251 -12485140 -14009768 -16186096 -18634348 -18603511 -14091578 -6849247 -392189 4607498
5243 4607498 10640505 18538448 24912454 26245382 23485554 19990544 16622463 12495730
5235 12495730 9663208 12210239 19435173 24287329 21476024 14204676 9574505 9321545
5227 9321545 8831003 4591310 -1015239 -3061638 250337 6467851 12182378 16241582
$$ packed form
5284a1698914r899478m853306m43630j087117l109522j81840P350506J1985793
5276a1937508Q244946m68091n743088l218373L900630R195761R091120N097872
5268A4163269J563072J138086J925916K4709m569539o701217k711406L493454
5260H326344M410064j476526p657830p950140l626537l41572n24129j795930j848884
5251a2485140j524628k176328k448252L0837M511933P242331O457058M999687
5243D607498O033007P897943O374006J332928k759828l495010l368081m126733
5235A2495730k832522K547031P224934M852156k811305p271348m630171k52960
5227I321545m90542m239693n606549k046399L311975O217514N714527M059204
$$ plain form
5219 16241582 19517833 21686314 19349653 9367069 -5800772 -18800813 -24993918 -26843963
5211 -26843963 -28393916 -28153751 -21852411 -11134258 -4117689 -5626943 -10837400 -11453420
5203 -11453420 -5766038 511867 2111512 -407063 -3278982 -4572505 -4793321 -3959261
5195 -3959261 -858426 3824791 5473093 -748547 -13575977 -24963989 -27449126 -21620546
5187 -21620546 -14800515 -12521573 -12962480 -10521144 -3710044 2245263 1374143 -5485887
5179 -5485887 -11117109 -10550910 -6957964 -6424876 -8612778 -7130097 407849 7801719 8580790
5170 8580790 4789085 3239318 5950003 9560364 12647096 17425092 23460910 25384766
5162 25384766 19660931 10011447 3147991 1303293 1314234 -725134 -6079188 -13180252
$$ packed form
5219A6241582L276251K168481k336661r982584j5167841j3000041o193105j850045
5211b6843963j549953K40165O301340J0718153P016569j509254n210457o16020
5203a1453420N687382O277905J599645k518575k871919j293523k20816Q34060
5195c959261L100835M683217J648302o221640j2827430j1388012k485137N828580
5187b1620546O820031K278942m40907K441336O811100N955307q71120o860030
5179e485887n631222N66199L592946N33088k187902J482681P537946P393870P79071
5170H580790l791705j549767K710685L610361L086732M777996O035818J923856
5162B5384766n723835r649484o863456j844698J0941k039368n354054p101064
$$ plain form
5154 -13180252 -18792995 -20308307 -18278548 -15602906 -13268721 -8923427 -1546929 4506833
5146 4506833 3407629 -4669952 -13136936 -16786874 -17261939 -18955142 -21671681 -20873867 -15259890
5137 -15259890 -10229475 -11046990 -14978865 -14627864 -8635547 -3964368 -5971824 -11341937
5129 -11341937 -14243818 -14534354 -14325982 -10548650 1012211 15682434 22681654 19231760
5121 19231760 13879354 13205433 13376363 9462214 5317251 6945087 11785253 13233664
5113 13233664 12320952 15550063 22229229 23481186 15658976 6636653 4981213 8896261
5105 8896261 10512216 6987435 2319974 151516 -686286 -3485343 -9417564 -16711669
5097 -16711669 -22832447 -26687503 -28328042 -26714982 -19837963 -8904477 -295175 683067
$$ packed form
5154a3180252n612743j515312K029759K675642K334185M345294P376498O053762
5146D506833j099204q077581q466984l649938m75065j693203k716539P97814N613977
5137a5259890N030415q17515l931875L51001N992317M671179k007456n370113
5129a1341937k901881k90536K08372L777332J1560861J4670223O999220l449894
5121A9231760n352406o73921J70930l914149m144963J627836M840166J448411
5113A3233664r12712L229111O679166J251957p822210r022323j655440L915048
5105H896261J615955l524781m667461k168458q37802k799057n932221p294105
5097a6711669o120778l855056j640539J613060O877019J0933486Q609302R78242
$$ plain form
5089 683067 -2423370 -307184 9964463 20225254 21211194 13775336 6539951 4674311
5081 4674311 5244410 3243407 -1639197 -5700559 -6650064 -6282190 -7269633 -8077460 -3120912
5072 -3120912 10008257 24480334 28955687 19679766 5250446 -2380794 542632 8569327
5064 8569327 14519941 14911117 10383606 5086593 4778549 11150597 17790172 16026149 5974712
5055 5974712 -2218922 -146217 9688982 19355242 26010827 31475381 33794422 27211710
5047 27211710 12483561 301698 -531067 6097936 10284709 9965540 10554653 12580120
5039 12580120 9495533 56224 -6675532 -4560925 -936240 -5691945 -15270157 -17524366
5031 -17524366 -9717850 -901344 3311785 6997144 12281532 12393132 2520014 -10468459
$$ packed form
5089F83067l106437K116186J0271647J0260791R85940p435858p235385j865640
5081D674311N70099k001003m882604m061362r49505L67874r87443q07827M956548
5072c120912J3129169J4472077M475353r275921j4429320p631240K923426Q026695
5064H569327N950614L91176m527511n297013l08044O372048O639575j764023j0051437
5055E974712q193634K072705R835199R666260O655585N464554K319041o582712
5047B7211710j4728149j2181863q32765O629003M186773l19169N89113K025467
5039A2580120l084587r439309o731756K114607L624685m755705r578212k254209
5031a7524366P806516Q816506M213129L685359N284388J11600r873118j2988473
$$ plain form
5023 -10468459 -16279343 -13408362 -6660944 1661111 10310996 13758649 7769988 -1901290
5015 -1901290 -5360699 -2232512 -974679 -4938018 -8533462 -8903453 -11690450 -20437298
5007 -20437298 -28059047 -25670958 -15221228 -6627775 -4814574 -5591968 -3465915 1704360
4999 1704360 6319257 7469392 4631339 -628807 -5402394 -7092814 -5368371 -2479998
4991 -2479998 -1448955 -3390760 -6036584 -5687271 -1877783 965206 -1281774 -6551802
4983 -6551802 -9169863 -7980351 -7628810 -10742573 -13427462 -11206746 -5572067 -923867
4975 -923867 2126277 6052830 10737863 13117246 12237990 10640150 10145015 9686997 8381403
4966 8381403 7660609 8417208 8172285 3688761 -4153711 -10271794 -10739516 -7017637 -3958445
$$ packed form
5023a0468459n810884K870981O747418Q322055Q649885L447653n988661r671278
5015a901290l459409L128187J257833l963339l595444l69991k786997q746848
5007b0437298p621749K388089J0449730Q593453J813201p77394K126053N170275
4999A704360M614897J150135k838053n260146m773587j690420J724443K888373
4991b479998J031043j941805k645824L49313L809488K842989k246980n270028
4983f551802k618061J189512L51541l113763k684889K220716N634679M648200
4975i23867L050144L926553M685033K379383q79256j597840m95135m58018j305594
4966H381403p20794P56599k44923m483524p842472o118083m67722L721879L059192
$$ plain form
4957 -3958445 -4266342 -6100068 -6005973 -2790715 1976840 5833844 6855276 4770072 2147487
4948 2147487 3035205 8423893 14192897 15627740 12707120 8612559 4890683 1657141
4940 1657141 872614 4254450 8165299 6249956 -1413512 -6930176 -4697043 1590527
4932 1590527 4932276 4089479 3171522 5076290 8861415 11916073 12181202 9648595 7190598
4923 7190598 8034829 11486903 13576990 12318087 8988491 4192655 -2513516 -8424490
4915 -8424490 -8894756 -4292306 205544 3167171 7954109 13344706 12580418 6024136 4441456
4906 4441456 12652051 19917202 15933013 7120488 5546323 9792856 10299278 7171758
4898 7171758 7492456 9298456 4535118 -3901716 -4478013 3312095 7289101 2262706 -3467760
$$ packed form
4957c958445l07897j833726R4095L215258M767555L857004J021432k085204k622585
4948B147487Q87718N388688N769004J434843k920620m094561l721876l233542
4940A657141p84527L381836L910849j915343p663468n516664K233133O287570
4932A590527L341749q42797r17957J904768L785125L054658K65129k532607k457997
4923G190598Q44231L452074K090087j258903l329596m795836o706171n910974
4915h424490m70266M602450M497850K961627M786938N390597p64288o556282j582680
4906D441456Q210595P265151l984189q812525j574165M246533N06422l127520
4898G171758L20698J806000m763338q436834n76297P790108L977006n026395n730466
$$ plain form
4889 -3467760 -3308500 484478 6611278 16209216 22645083 17069287 7198502 11577826
4881 11577826 30463152 43273552 41573799 40901884 49991982 55687261 54433797 67485063
4873 67485063 96556098 93158593 15308292 -99253921 -163566680 -145503743 -98330597
4866 -98330597 -80051348 -85886501 -80722042 -60020811 -45065381 -40466339 -31729765 -16406914
4858 -16406914 -8125903 -10917444 -12663282 -6200412 656750 -802359 -9450205 -20107369
4850 -20107369 -29055205 -31790300 -24955396 -12982632 -5489139 -6463426 -11684646 -16508111
4842 -16508111 -20005371 -22000408 -22338295 -22656440 -23241962 -19647764 -8842999 3032206
4834 3032206 6611570 2077960 -1956699 -2083779 -3858280 -10511887 -16657254 -16852076 -13198613
$$ packed form
4889c467760J59260L792978O126800R597938O435867n575796r870785M379324
4881A1577826J8885326J2810400j699753o71915R090098N695279j253464J3051266
4873F7485063K9071035l397505p7850301j14562213o4312759J8062937M7173146
4866i8330597J8279249n835153N164459K0701231J4955430M599042Q736574J5322851
4858a6406914Q281011k791541j745838O462870O857162j459109q647846j0657164
4850b0107369q947836k735095O834904J1972764P493493r74287n221220m823465
4842a6508111l497260j995037l37887l18145n85522L594198J0804765J1875205
4834C032206L579364m533610m034659j27080j774501o653607o145367j94822L653463
$$ plain form
4825 -13198613 -9764315 -5265300 3077773 12208925 15739558 12719349 9426258 11853076
4817 11853076 18778438 23127948 19525866 9953548 1231963 -3184425 -6847940 -14092486
4809 -14092486 -22551919 -25555330 -21124504 -14706944 -12625500 -15890964 -20803355 -22804500
4801 -22804500 -19519662 -12893278 -8601503 -10554432 -15881169 -18279099 -16047684 -12974678
4793 -12974678 -11110125 -7520180 -129999 7516305 10524937 8853292 6103832 4191025
4785 4191025 2436539 776865 667205 2680581 5233354 6034784 3824344 -1036573 -6638051
4776 -6638051 -10330818 -10325722 -6701527 -936947 4908595 8532042 8114248 3582112 -3267049
4767 -3267049 -10319921 -16402734 -20818628 -22435168 -20061219 -13875021 -6255371 -639730
$$ packed form
4825a3198613L434298M499015Q343073R131152L530633l020209l293091K426818
4817A1853076O925362M349510l602082r572318q721585m416388l663515p244546
4809a4092486q459433l003411M430826O417560K081444l265464m912391k001145
4801b2804500L284838O626384M291775j952929n326737k397930K231415L073006
4793a2974678J864553L589945P390181P646304L008632j671645k749460j912807
4785D191025j754486j659674j09660K013376K552773Q01430k210440m860917n601478
4776f638051l692767N096L624195N764580N845542L623447m17794m532136o849161
4767c267049p052872o082813m415894j616540K373949O186198P619650N615641
$$ plain form
4759 -639730 1366424 1975900 5241833 12301561 19481994 22110670 19339435 13998501 8617875
4750 8617875 3493840 -1412115 -4592883 -4185927 -684604 2405218 1519755 -2979771 -6929954
4741 -6929954 -7764205 -8252541 -11939331 -16003743 -13608797 -4319820 3264296 2375311 -3225550
4732 -3225550 -5868452 -5186158 -6783911 -12291835 -17362220 -18875621 -18058865 -16164360 -12537075
4723 -12537075 -7791904 -4054204 -1223583 2348356 4859093 2026598 -5547489 -11298510
4715 -11298510 -11237070 -8702257 -7888026 -7353026 -3659429 2333337 6993946 9175182 10078688
4706 10078688 9706418 7130260 3456613 1623807 3342722 7599905 11599191 12738949
4698 12738949 11074523 9775126 10770630 10343371 3085734 -9152110 -17245868 -15963720
$$ packed form
4759f39730K006154O09476L265933P059728P180433K628676k771235n340934n380626
4750H617875n124035m905955l180768M06956L501323L089822q85463m499526l950183
4741f929954q34251m88336l686790m064412K394946R288977P584116q88985n600861
4732c225550k642902O82294j597753n507924n070385j513401Q16756J894505L627285
4723a2537075M745171L737700K830621L571939K510737k832495p574087n751021
4715a1298510O1440K534813Q14231N35000L693597N992766M660609K181236R03506
4706A0078688l72270k576158l673647j832806J718915M257183L999286J139758
4698A2738949j664426j299397R95504m27259p257637j2237844q093758J282148
$$ plain form
4690 -15963720 -10548209 -9058070 -12367133 -15552428 -15470664 -12605906 -8375035 -4926939
4682 -4926939 -5045260 -8150572 -9081340 -4914809 288592 2253152 3920762 9422834 14206166
4673 14206166 10303465 358310 -3692159 2160759 7559882 2895287 -7225683 -11826023
4665 -11826023 -8689696 -4098635 -1230533 2946593 9761950 14759085 13214356 5579398
4657 5579398 -3937057 -11406826 -15281722 -17088967 -20196326 -25311742 -27704433 -22607262
4649 -22607262 -13457162 -9964335 -16054966 -24216614 -25281012 -20185729 -17277561 -20234166
4641 -20234166 -24296037 -24032903 -19288538 -12462142 -5125076 531931 1615616 -1018952
4633 -1018952 -2194743 368636 2256238 -141665 -2689647 -141834 3712458 573325
$$ packed form
4690a5963720N415511J490139l309063l185295Q1764K864758M230871L448096
4682d926939j18321l105312r30768M166531N203401J964560J667610N502072M783332
4673A4206166l902701r945155m050469N852918N399123m664595j0120970m600340
4665a1826023L136327M591061K868102M177126O815357M997135j544729p634958
4657E579398r516455p469769l874896j807245l107359n115416k392691N097171
4649b2607262R150100L492827o090631q161648j064398N095283K908168k956605
4641b0234166m061871K63134M744365O826396P337066N657007J083685k634568
4633a018952j175791K563379J887602k397903k547982K547813L854292l139133
$$ plain form
4625 573325 -8864191 -14745685 -12762504 -10474572 -15265969 -23435499 -26768701 -24204640
4617 -24204640 -20464020 -17119964 -12169247 -6538886 -4163968 -5491610 -6203859 -3219497
4609 -3219497 1770574 5164349 4807979 677606 -4683033 -6581278 -2137292 6007929
4601 6007929 12364730 14565799 14161852 12299761 7936405 472623 -8497868 -16231267
4593 -16231267 -19848805 -17443679 -10820273 -5895781 -6943461 -11005894 -11288185 -5546282
4585 -5546282 2126987 6969055 7224241 3140495 -2904945 -5316254 509014 11556112
4577 11556112 18984217 17829978 11121486 3697299 -2971655 -7894663 -7931888 -2150147
4569 -2150147 4517549 6046489 2090109 -2689863 -4142571 -1091618 5557317 13301323
$$ packed form
4625E73325r437516n881494J983181K287932m791397q169530l333202K564061
4617b4204640L740620L344056M950717N630361K374918j327642p12249K984362
4609c219497M990071L393775l56370m130373n360639j898245M443986Q145221
4601F007929O356801K201069m03947j862091m363356p463782q970491p733399
4593a6231267l617538K405126O623406M924492j047680m062433k82291N741903
4585e546282P673269M842068K55186m083746o045440k411309N825268J1047098
4577A1556112P428105j154239o708492p424187o668954m923008l7225N781741
4569b150147O667696J528940l956380m779972j452708L050953O648935P744006
$$ plain form
4561 13301323 18822877 20278658 17765979 11002066 -401793 -12846045 -18969817 -15590300
4553 -15590300 -8608298 -5927970 -7580895 -7402947 -3150484 376892 -1182401 -5854693
4545 -5854693 -8904701 -9071528 -8751900 -9814333 -11702255 -13153162 -13924367 -14524645 -15312017
4536 -15312017 -16454846 -18243987 -20552171 -22018249 -21027839 -18296398 -17225147 -20043994
4528 -20043994 -24311017 -25110404 -20278219 -11589315 -1665024 7410098 12903218 12735261
4520 12735261 8784947 5433405 3787236 918197 -4137580 -8290910 -10580745 -15276932
4512 -15276932 -24488414 -31916465 -29775310 -19472014 -9498016 -4183301 -700717 3308319
4504 3308319 5877130 5815230 5577341 6230941 4335992 -2666120 -11361168 -16106841 -15439093
$$ packed form
4561A3301323N521554J455781k512679o763913j1403859j2444252o123772L379517
4553a5590300O982002K680328j652925J77948M252463L527376j559293m672292
4545e854693l050008j66827L19628j062433j887922j450907p71205o00278p87372
4536a5312017j142829j789141k308184j466078R90410K731441J071251k818847
4528b0043994m267023p99387M832185Q688904R924291R075122N493120j67957
4520A2735261l950314l351542j646169k869039n055777m153330k289835m696187
4512a5276932r211482p428051K141155J0303296R973998N314715L482584M009036
4504C308319K568811o1900k37889O53600j894949p002112q695048m745673O67748
$$ plain form
4495 -15439093 -11767332 -7023670 -1940234 2101171 4058704 5201536 6975812 7653216
4487 7653216 4461773 -1172039 -4156391 -2342339 636051 671302 -1451980 -2180970 -468105
4478 -468105 1821713 3303104 3781135 2310854 -2049455 -7274930 -9366879 -7289352 -4174740
4469 -4174740 -2692350 -2477081 -3621032 -8514071 -16704733 -21491141 -16816675 -5736594
4461 -5736594 3318898 7587471 11284737 16149022 17861649 13940966 8303537 4006555
4453 4006555 -2429199 -13722553 -23542379 -22689271 -11401721 1301598 9657197 15758009
4445 15758009 21741458 24411050 20685916 13410733 7753367 4691788 1753455 -1435001
4437 -1435001 -1956303 1932296 7379081 8891314 3408609 -6411148 -13834248 -13586391 -6249227
$$ packed form
4495a5439093L671761M743662N083436M041405J957533J142832J774276O77404
4487G653216l191443n633812k984352J814052K978390L5251k123282p28990J712865
4478d68105K289818J481391M78031j470281m360309n225475k091949K077527L114612
4469d174740J482390K15269j143951m893039q190662m786408M674466J1080081
4461e736594R055492M268573L697266M864285J712627l920683n637429m296982
4453D006555o435754j1293354r819826Q53108J1287550J2703319Q355599O100812
4445A5758009N983449K669592l725134p275183n657366l061579k938333l188456
4437a435001n21302L888599N446785J512233n482705r819757p423100K47857P337164
$$ plain form
4428 -6249227 2734098 7829863 6829788 1018843 -5928913 -9491646 -7076088 -296524
4420 -296524 6470729 10080489 10077742 6353353 -2234997 -15067611 -26745621 -29755214 -21860979
4411 -21860979 -9987759 -4439752 -8268884 -14068957 -12989196 -5156247 1804920 3102391
4403 3102391 847163 -2127162 -6220122 -10109252 -7975480 2713272 14659061 18466955
4395 18466955 14539750 10562873 8847461 4323239 -4284926 -9883692 -7436211 -2374388
4387 -2374388 -3162061 -9497627 -13437465 -10258385 -3380748 953960 238379 -3262027 -5639032
4378 -5639032 -5040825 -3068193 -2172220 -1905981 133396 3218141 2521112 -4625509 -13804235
4369 -13804235 -17555449 -13381221 -5979030 -2440531 -6178359 -13946953 -17932626 -12969773
$$ packed form
4428f249227Q983325N095765j000075n810945o947756l562733K415558O779564
4420b96524O767253L609760k747l724389q588350j2832614j1678010l009593P894235
4411b1860979J1873220N548007l829132n800073J079761P832949O961167J297471
4403C102391k255228k974325m092960l889130K133772J0688752J1945789L807894
4395A8466955l927205l976877j715412m524222q608165n598766K447481N061823
4387b374388p87673o335566l939838L179080O877637M334708p15581l500406k377005
4378e639032N98207J972632Q95973K66239K039377L084745o97029p146621r178726
4369a3804235l751214M174228P402191L538499l737828p768594l985673M962853
$$ plain form
4361 -12969773 -2700567 4171240 4716853 4648566 8097289 10039994 4340216 -5034753
4353 -5034753 -8788299 -6637276 -7958754 -16662666 -23988823 -20864143 -10683726 -3379445
4345 -3379445 -1320135 1225517 6586336 9918720 8126644 5367868 6009027 7287886
4337 7287886 3992456 -2624569 -6079426 -3694675 810778 4051687 7274619 12025803
4329 12025803 15640326 14218458 7721632 -709306 -8664711 -15057654 -18621681 -18857000
4321 -18857000 -17228675 -14634859 -9272201 -478806 6869281 6567283 -417225 -6318842
4313 -6318842 -6186490 -2655086 84985 2255771 5790635 9610475 10994858 9189350
4305 9189350 5040779 -510987 -5377172 -6857590 -5931630 -7558573 -13092169 -15881739
$$ packed form
4361a2969773J0269206O871807N45613o8287L448723J942705n699778r374969
4353e034753l753546K151023j321478q703912p326157L124680J0180417P304281
4345c379445K059310K545652N360819L332384j792076k758776O41159J278859
4337G287886l295430o617025l454857K384751M505453L240909L222932M751184
4329A2025803L614523j421868o496826q430938p955405o392943l564027k35319
4321a8857000J628325K593816N362658Q793395P348087l01998o984508n901617
4313f318842J32352L531404K740071K170786L534864L819840J384383j805508
4305I189350m148571n551766m866185j480418R25960j626943n533596k789570
$$ plain form
4297 -15881739 -9418300 2644881 10336772 9853361 6165222 3619833 702310 -4332163
4289 -4332163 -8998496 -11214523 -13554166 -18504973 -22676928 -20409536 -11705315 -2592113
4281 -2592113 1872461 1723831 -423440 -2718076 -4211107 -4144149 -2441690 167164 3152083
4272 3152083 6429025 9294392 10127915 7811710 3061453 -1862585 -4470473 -3356623
4264 -3356623 844419 5459182 7307685 4822466 -1013162 -7285244 -10547377 -8821420
4256 -8821420 -3703069 -24486 -1505316 -6380627 -9093921 -6861047 -2409194 863068
4248 863068 3549177 7252469 9412197 5859916 -1893031 -7083749 -6787956 -5727136 -8249135
4239 -8249135 -11053246 -8415486 -1463928 3263976 2988314 828991 -827124 -3367066
$$ packed form
4297a5881739O463439J2063181P691891m83411l688139k545389k917523n034473
4289d332163m666333k216027k339643m950807m171955K267392Q704221R113202
4281b592113M464574j48630k147271k294636j493031O6958J702459K608854K984919
4272C152083L276942K865367Q33523k316205m750257m924038k607888J113850
4264c356623M201042M614763J848503k485219n835628o272082l262133J725957
4256h821420N118351L678583j480830m875311k713294K232874M451853L272262
4248H63068K686109L703292K159728l552281p752947n190718K95793J060820k521999
4239h249135k804111K637760O951558M727904k75662k159323j656115k539942
$$ plain form
4231 -3367066 -7250238 -9389989 -7473948 -3036916 1878757 7490546 13329407 15993825
4223 15993825 12936798 6118469 -667577 -5736095 -8455171 -7338504 -2796769 408576
4215 408576 -2471310 -10262294 -17469152 -20617726 -19820979 -15639932 -8973748 -3848056 -5270669
4206 -5270669 -12302245 -16719802 -11381981 1617372 13128979 16133027 10940292 2208258
4198 2208258 -6438168 -13590500 -17619773 -16122802 -9202597 -1604080 1018378 -1958727
4190 -1958727 -5893338 -6874677 -5988225 -6978629 -11478270 -17364247 -20470047 -17810393 -11126676
4181 -11126676 -7193425 -11552045 -21175451 -26754705 -23836978 -18197608 -17688049 -22090837
4173 -22090837 -24817099 -22637720 -19498762 -20761489 -26743159 -32950143 -35421133 -34868134
$$ packed form
4231c367066l883172k139751J916041M437032M915673N611789N838861K664418
4223A5993825l057027o818329o786046n068518k719076J116667M541735L205345
4215D08576k879886p790984p206858l148574P96747M181047O666184N125692j422613
4206e270669p031576m417557N337821J2999353J1511607L004048n192735q732034
4198B208258q646426p152332m029273J496971O920205P598517K622458k977105
4190a958727l934611r81339Q86452r90404m499641n885977l105800K659654O683717
4181a1126676L933251m358620r623406n579254K917727N639370N09559m402788
4173b2090837k726262K179379L138958j262727n981670o206984k470990N52999
$$ plain form
4165 -34868134 -35088433 -37591235 -40048906 -41433653 -45047234 -52272607 -56825938 -52060281
4157 -52060281 -41808455 -35688915 -35162259 -34446522 -34371058 -41937460 -54632293 -61179862
4149 -61179862 -62397464 -72750116 -93459925 -107812037 -119355882 -166489713 -264115210
4142 -264115210 -348000550 -325241521 -186226223 -26368462 58704139 65539041 51798793
4135 51798793 49702843 47590927 36713778 31191989 38983808 46113641 40438779 29815007
4127 29815007 26394089 28301644 26653848 19774991 11937151 5707837 2245429 3498795
4119 3498795 9218250 16031195 21940681 27228503 30098746 27345295 20379458 14416411
4111 14416411 10634448 5582081 -629863 -2815387 471774 3428262 1105304 -4851151
$$ packed form
4165c4868134k20299k502802k457671j384747l613581p225373m553331M765657
4157e2060281J0251826O119540N26656P15737P5464p566402j2694833o547569
4149f1179862j217602j0352652k0709809j4352112j1543845m7133831r7625497
4142b64115210q3885340K2759029J39015298J59857761Q5072601O834902j3740248
4135E1798793k095950k111916j0877149n521789P791819P129833n674862j0623772
4127B9815007l420918J907555j647796o878857p837840o229314l462408J253366
4119C498795N719455O812945N909486N287822K870243k753451o965837n963047
4111A4416411l781963n052367o211944k185524L287161K956488k322958n956455
$$ plain form
4103 -4851151 -10899242 -15945461 -18422160 -15417662 -8367879 -4011421 -5558051 -7538524
4095 -7538524 -3486351 5164637 11639581 11974296 7373460 1590602 -1041140 2073033
4087 2073033 8565793 12571626 11350974 7903535 5969208 6056302 7472498 9709433 10188877
4078 10188877 5831021 -678322 -1649798 5133965 11913424 11051121 4653737 -653089
4070 -653089 -3500148 -6012973 -6276826 -346666 9473933 15292285 13024637 6153791 20761
4061 20761 -3055132 -2922169 -600486 893611 -1417807 -6284088 -8771523 -5900295 270850
4052 270850 5338106 6382603 3569343 294012 1290549 8059423 16455208 21049038 21059123
4043 21059123 19336175 16856861 12353470 7076832 5032133 6904699 7796344 3625213
$$ packed form
4103d851151o048091n046219k476699L004498P049783M356458j546630j980473
4095g538524M052173Q650988O474944L34715m600836n782858k631742L114173
4087B073033O492760M005833j220652l447439j934327Q7094J416196K236935M79444
4078A0188877m357856o509343r71476O783763O779459q62303o397384n306826
4070f53089k847059k512825k63853N930160R820599N818352k267648o870846o133030
4061B0761l075893J32963K321683J494097k311418m866281k487435K871228O171145
4052B70850N067256J044497k813260l275331R96537O768874Q395785M593830J0085
4043B1059123j722948k479314m503391n276638k044699J872566Q91645m171131
$$ plain form
4035 3625213 -3037111 -6434220 -5162768 -3203133 -3878742 -5335740 -2858409 5303523
4027 5303523 15124647 19937853 16561596 8236694 1196481 -1186043 -35800 2402577
4019 2402577 5530730 9004842 10523512 7169858 -1180895 -11226046 -19182255 -23262843
4011 -23262843 -23157948 -18902824 -11745076 -5010590 -1896271 -2452442 -4683794 -8376246
4003 -8376246 -14717659 -21344837 -21899409 -13707387 -2821591 2873651 3392032 4438708
3995 4438708 7213812 7206270 3453443 1362484 3154316 2327007 -6814475 -18849256 -23060100
3986 -23060100 -17219581 -9380566 -6876272 -9389563 -13326709 -17718258 -23579222 -30468125
3978 -30468125 -35746551 -36326605 -31285777 -24147583 -21296145 -25351569 -30968455 -30502715
$$ packed form
4035C625213o662324l397109J271452J959635o75609j456998K477331Q161932
4027E303523R821124M813206l376257q324902p040213k382524J150243K438377
4019B402577L128153L474112J518670l353654q350753j0045151p956209m080588
4011b3262843J04895M255124P157748O734486L114319n56171k231352l692452
4003h376246o341413o627178n54572Q192022J0885796N695242N18381J046676
3995D438708K775104p542l752827k090959J791832q27309r141482j2034781m210844
3986b3060100N840519P839015K504294k513291l937146m391549n860964o888903
3978c0468125n278426n80054N040828P138194K851438m055424n616886M65740
$$ plain form
3970 -30502715 -23358937 -15893781 -11980966 -8320248 -982008 7468176 10921033 7746899
3962 7746899 2366696 -611104 -804288 -136174 914454 3146134 5662232 5683930 2538488
3953 2538488 36250 2310741 7764152 10221488 6847110 1772113 36814 890688
3945 890688 15133 -3927257 -8706413 -13112087 -17844619 -21705441 -20826916 -13297805 -2365326
3936 -2365326 6259422 9056177 6308400 707763 -4801313 -8600874 -10493911 -10645689
3928 -10645689 -9487275 -8668935 -9919713 -11975052 -11200204 -7040385 -4084088 -6168227
3920 -6168227 -11233548 -15178566 -17720093 -20206111 -20789125 -17659587 -14875857 -17878611
3912 -17878611 -23878212 -24321624 -17745624 -12265373 -12696352 -13083327 -7110360 342147 -960831
$$ packed form
3970c0502715P143778P465156L912815L660718P338240Q450184L452857l174134
3962G746899n380203k977800j93184O68114J050628K231680K516098K1698l145442
3953B538488k502238K274491N453411K457336l374378n074997j735299Q53874
3945H90688q75555l942390m779156m405674m732532l860822Q78525P529111J0932479
3936b365326Q624748K796755k747777n600637n509076l799561j893037j51778
3928a0645689J158414Q18340j250778k055339P74848M159819K956297k084139
3920f168227n065321l945018k541527k486018n83014L129538K783730l002754
3912a7878611n999601m43412O576000N480251m30979l86975N972967P452507j302978
$$ plain form
3903 -960831 -12229285 -23533094 -25521095 -18895675 -12174577 -12791553 -20348288 -27184646
3895 -27184646 -26211060 -18546910 -11610836 -9802144 -10637624 -10670537 -10237795 -9932275 -7400982
3886 -7400982 -1801579 2430803 1028183 -3643635 -6173110 -5883056 -6304402 -8610588 -10461614
3877 -10461614 -10600448 -10188472 -9745747 -8427327 -6387807 -5069880 -5316458 -7140080 -10381800
3868 -10381800 -13967153 -16277596 -17598059 -19221689 -18841480 -11937925 -671883 5077422
3860 5077422 1022023 -3741406 -132411 5900180 2679624 -7126570 -9180406 485914
3852 485914 10015502 10698917 8011727 8915181 10827754 10370565 11672353 17019792 19233573
3843 19233573 13675481 8997032 13891478 20487550 15089973 858448 -5795390 -486602
$$ packed form
3903i60831j1268454j1303809j988001O625420O721098o16976p556735o836358
3895b7184646R73586P664150O936074J808692q35480l2913M32742L05520K531293
3886g400982N599403M232382j402620m671818k529475K90054m21346k306186j851026
3877a0461614j38834M11976M42725J318420K039520J317927k46578j823622l241720
3868a0381800l585353k310443j320463j623630L80209O903555J1266042N749305
3860E077422m055399m763429L608995O032591l220556r806194k053836R666320
3852D85914R529588O83415k687190R03454J912573m57189J301788N347439K213781
3843A9233573n558092m678449M894446O596072n397577j4231525o653838N308788
$$ plain form
3835 -486602 3114084 -4552105 -14921274 -15800288 -8667425 -3288347 -2824112 -2850539 -704424
3826 -704424 1578403 1429880 -2178745 -8820725 -15344448 -17232904 -14096744 -10527968 -9121608
3817 -9121608 -7355375 -4563254 -6041862 -14733469 -24190529 -27172931 -27358135 -33826855
3809 -33826855 -45646066 -51139525 -43503946 -29210895 -18390964 -13400556 -10198522 -5758394
3801 -5758394 -191350 4946039 7074275 3800497 -3993087 -12623322 -20345582 -28024562
3793 -28024562 -33625829 -31110014 -18650193 -3904233 4012552 5443120 7969916 14764443
3785 14764443 20760698 20753068 16179592 11769222 8933318 5362666 -240338 -5561647 -7330839
3776 -7330839 -5784985 -5277386 -9223309 -15112217 -17309694 -15309765 -15170203 -20108766 -23928785
$$ packed form
3835d86602L600686p666189j0369169q79014P132863N379078M64235k6427K146115
3826g04424K282827j48523l608625o641980o523723j888456L136160L568776J406360
3817i121608J766233K792121j478608q691607r457060k982402j85204o468720
3809c3826855j1819211n493459P635579J4293051J0819931M990408L202034M440128
3801e758394N567044N137389K128236l273778p793584q630235p722260p678980
3793b8024562n601267K515815J2459821J4745960P916785J430568K526796O794527
3785A4764443N996255p630m573476m410370k835904l570652n603004n321309j769192
3776g330839J545854N07599l945923n888908k197477J999929J39562m938563l820019
$$ plain form
3767 -23928785 -19182902 -9327604 -5695835 -12219108 -20094396 -19859163 -12618451 -5612223
3759 -5612223 -1920798 285405 1915770 2182313 1841711 1954521 473281 -4783483 -10275969
3750 -10275969 -9516295 -2662394 1998813 -1380232 -8360878 -10162564 -4451086 3290988
3742 3290988 7155975 5936334 1816317 -2475770 -4736584 -3912753 -595276 3993881
3734 3993881 9321394 14885286 19115363 20741941 20794431 21210216 21596188 19519278 14182031
3725 14182031 7587098 1637116 -3485457 -7250074 -7873370 -5197728 -2000427 -182134
3717 -182134 2006630 5976564 8284065 4495600 -3249955 -7407643 -4562834 501390
3709 501390 1826342 -617650 -3071891 -3542519 -2278436 150834 2007035 572545 -3169479
$$ packed form
3767b3928785M745883R855298L631769o523273p875288K35233P240712P006228
3759e612223L691425K206203J630365K66543l40602J12810j481240n256764n492486
3750a0275969P59674O853901M661207l379045o980646j801686N711478P742074
3742C290988L864987j219641m120017m292087k260814Q23831L317477M589157
3734C993881N327513N563892M230077J626578N2490M15785L85972k076910n337247
3725A4182031o594933n949982n122573l764617o23296K675642L197301J818293
3717a82134K188764L969934K307501l788465p745555m157688K844809N064224
3709E01390J324952k443992k454241m70628J264083K429270J856201j434490l742024
$$ plain form
3700 -3169479 -3193006 3424947 9818441 7124947 -2508113 -8038592 -4903369 -411011 -1448824
3691 -1448824 -4630886 -3513933 868493 3252073 3348531 4440593 5517864 2587715 -2930917
3682 -2930917 -4601866 -698156 3052750 2424282 592234 2248638 6771613 10846768
3674 10846768 13976619 17288086 19487786 18026992 12910124 6348635 111879 -4083934
3666 -4083934 -3562404 2255047 8852622 10366161 6057397 68481 -4515791 -7637134
3658 -7637134 -8704027 -5905611 -638044 1608566 -2317140 -8804656 -12590014 -13988444
3650 -13988444 -17316466 -23348763 -27387232 -25028987 -16506256 -4732089 7520743 16974370
3642 16974370 19723408 14993762 7594946 3470753 3021599 1525072 -3451675 -7803082
$$ packed form
3700c169479k3527O617953O393494k693494r633060n530479L135223M492358j037813
3691a448824l182062J116953M382426K383580R6458J092062J077271k930149n518632
3682b930917j670949L903710L750906o28468j832048J656404M522975M075155
3674A0846768L129851L311467K199700j460794n116868o561489o236756m195813
3666d083934N21530N817451O597575J513539m308764n988916m584272l121343
3658g637134j066893K798416N267567K246610l925706o487516l785358j398430
3650a3988444l328022o032297m038469K358245Q522731J1774167J2252832R453627
3642A6974370K749038m729646p398816m124193m49154j496527m976747m351407
$$ plain form
3634 -7803082 -5895355 1486825 6544841 2510426 -8652053 -17602124 -16767771 -7400102
3626 -7400102 2878412 8373136 9436747 8884050 7370775 3948309 -960903 -5527103
3618 -5527103 -8296251 -8163016 -4434205 265643 -753373 -11271428 -24700967 -28834891
3610 -28834891 -19586768 -5540513 3186007 5858866 7595055 9599088 8679014 4423985
3602 4423985 912369 841625 2178268 1651359 -1211430 -4166348 -4379371 -589869 5014031
3593 5014031 7939854 6606995 5051005 7511772 11886912 12492172 8211294 3276303
3585 3276303 544568 -628130 362159 5919263 13974546 17095540 11527745 2553546
3577 2553546 -3028387 -5555400 -9109364 -13276679 -14147209 -11566023 -9507328 -9531726 -8922553
$$ packed form
3634g803082J907727P382180N058016m034415j1162479q950071Q34353R367669
3626g400102J0278514N494724J063611n52697j513275l422466m909212m566200
3618e527103k769148J33235L728811M699848j019016j0518055j3429539m133924
3610b8834891R248123J4046255Q726520K672859J736189K004033r20074m255029
3602D423985l511616p0744J336643n26909k862789k954918k13023L789502N603900
3593E014031K925823j332859j555990K460767M375140O05260m280878m934991
3585C276303k731735j172698R90289N557104Q055283L120994n567795q974199
3577B553546n581933k527013l553964m167315q70530K581186K058695k4398O09173
$$ plain form
3568 -8922553 -5975295 -3092396 -3486306 -7626226 -13682630 -19214384 -22116791 -21963168 -20396546
3559 -20396546 -18514484 -14987248 -9292677 -5165527 -6652151 -11359510 -12564666 -8740466
3551 -8740466 -5903115 -8415515 -12258507 -11127042 -5753547 -2646366 -5226537 -10434995
3543 -10434995 -13682952 -13562124 -11258727 -8068713 -4402494 184211 6095329 11713735
3535 11713735 13276615 8987743 2694115 585843 3992744 8357987 9978911 10270912
3527 10270912 11466325 11662699 7993642 2646018 892149 3225560 4143471 222446
3519 222446 -4792035 -5833194 -4174493 -5114820 -9619310 -12794407 -10840270 -5524879 -524976
3510 -524976 3188951 6047134 6651001 3231397 -2495355 -6120321 -5907026 -5181973 -7921506
$$ packed form
3568h922553K947258K882899l93910m139920o056404n531754k902407J53623J566622
3559b0396546J882062L527236N694571M127150j486624m707359j205156L824200
3551h740466K837351k512400l842992J131465N373495L107181k580171n208458
3543a0434995l247957J20828K303397L190014L666219M586705N911118N618406
3535A1713735J562880m288872o293628k108272L406901M365243J620924K92001
3527A0270912J195413J96374l669057n347624j753869K333411R17911l921025
3519B22446n014481j041159J658701r40327m504490l175097J954137N315391M999903
3510e24976L713927K858183O03867l419604n726752l624966K13295P25053k739533
$$ plain form
3501 -7921506 -13237335 -16373950 -15160005 -12886145 -12835637 -12020695 -4604604 8151557 16517568
3492 16517568 14249624 7905397 8804172 17945816 25542934 25171639 20886820 18201772
3484 18201772 15636171 10466276 7018306 11604868 21480129 26116972 19885105 8134134
3476 8134134 -108473 -869634 4493472 13181197 22145907 27670716 26702240 18990416 7820980
3467 7820980 -1056396 -2564816 3445342 11371087 15242501 14676954 13666459 14300188 14642138
3458 14642138 13033238 11518622 13427075 18815053 23445888 22353433 14989165 6962774
3450 6962774 4752193 7641466 7694467 144991 -9187422 -10786839 -3437851 5425881 9602596
3441 9602596 8625829 3296346 -6354327 -17178440 -22972061 -21007310 -14238968 -5681898
$$ packed form
3501g921506n315829l136615J213945K273860N0508Q14942P416091J2756161Q366011
3492A6517568k267944o344227Q98775R141644P597118l71295m284819k685048
3484A8201772k565601n169895l447970M586562R875261M636843o231867j1750971
3476H134134q242607p61161N363106Q687725Q964710N524809r68476p711824j1169436
3467G820980q877376j508420O010158P925745L871414n65547j010495O33729L41950
3458A4642138j608900j514616J908453N387978M630835j092455p364268q026391
3450F962774k210581K889273N3001p549476r332413j599417P348988Q863732M176715
3441I602596r76767n329483r650673j0824113n793621J964751O768342Q557070
$$ plain form
3433 -5681898 4103631 12222388 12802983 5311702 -1914110 -1576958 3228198 4700634 1662498
3424 1662498 -701454 133420 1543928 1416759 910472 1556888 3546723 6361860 7709495
3415 7709495 3485579 -6762320 -15864792 -15901539 -8409858 -2117138 -605939 1283144
3407 1283144 7268293 12591606 11301549 5977125 5086061 12539447 23746823 31021597
3399 31021597 29957864 21414123 10152739 1494754 -2697132 -4851614 -7623254 -10173982
3391 -10173982 -10410405 -9832457 -12868325 -20492860 -27253586 -27016346 -20392594 -13751785 -11173244
3382 -11173244 -10616824 -9078251 -7772077 -8815720 -9571110 -5739004 428275 1109422 -6090510
3373 -6090510 -13828472 -15299451 -13805693 -16683829 -23339116 -26326406 -23306012 -20900633
$$ packed form
3433e681898R785529Q118757N80595p491281p225812L37152M805156J472436l038136
3424A662498k363952Q34874J410508j27169n06287O46416J989835K815137J347635
3415G709495m223916j0247899r102472l6747P491681O292720J511199J889083
3407A283144N985149N323313j290057n324424q91064P453386J1207376P274774
3399C1021597j063733q543741j1261384q657985m191886k154482k771640k550728
3391a0173982k36423N77948l035868p624535o760726K37240O623752O640809K578541
3382a1173244N56420J538573J306174j043643p55390L832106O167279O81147p199932
3373f090510p737962j470979J493758k878136o655287k987290L020394K405379
$$ plain form
3365 -20900633 -25086731 -33052725 -37189852 -33684433 -24855653 -15702638 -10473457 -10788284
3357 -10788284 -14772575 -18319826 -18116509 -13579535 -6798030 -1659594 -1586067 -5941610 -9803839
3348 -9803839 -9688504 -8049275 -9088199 -11982882 -12715227 -11252527 -11116183 -11863766 -8635617
3339 -8635617 -1159127 3050872 -1723652 -11232393 -16758130 -15340840 -10687233 -6881753
3331 -6881753 -5120247 -4465077 -2352204 3789176 12687852 19369090 21638379 23137776
3323 23137776 26824463 29507790 27571863 24199510 24444993 25802197 21347205 11496178
3315 11496178 4615123 4615607 5388810 620120 -7093522 -11007978 -9273702 -4782851 240812
3306 240812 4780247 6880890 5768822 4436189 5649029 6624463 2376958 -6085184 -11802981
$$ packed form
3365b0900633m186098p965994m137127L505419Q828780R153015N229181l14827
3357a0788284l984291l547251K03317M536974O781505N138436P3527m355543l862229
3348i803839J15335J639229j038924k894683p32345J462700J36344p47583L228149
3339h635617P476490M209999m774524r508741n525737J417290M653607L805480
3331f881753J761506O55170K112873O141380Q898676O681238K269289J499397
3323B3137776L686687K683327j935927l372353K45483J357204m454992r851027
3315A1496178o881055M84P73203m768690p713642l914456J734276M490851N023663
3306B40812M539435K100643j112068j332633J212840R75434m247505q462142n717797
$$ plain form
3297 -11802981 -10836997 -6564310 -3167908 831565 8959988 19419708 25771084 24544741
3289 24544741 18614501 12578210 7984461 4495576 3021952 5004680 9582447 13872306
3281 13872306 16027350 16291126 15067327 11942510 7383286 3768136 3262742 5329672
3273 5329672 7707534 9771761 13583874 20698876 28369612 30378715 23019944 10255155
3265 10255155 1462592 2882507 11713039 19428974 20365327 16209525 12877038 14388403
3257 14388403 19492317 23068093 21168419 15750967 13648836 19276186 29019743 34535779
3249 34535779 30661467 18132326 486149 -17424340 -28533518 -27085992 -15547153
3242 -15547153 -3846330 1255483 2729949 6353585 11173892 11741891 7352065 3126367
$$ packed form
3297a1802981R65984M272687L396402L999473Q128423J0459720O351376j226343
3289B4544741n930240o036291m593749l488885j473624J982728M577767M289859
3281A3872306K155044K63776j223799l124817m559224l615150n05394K066930
3273E329672K377862K064227L812113P115002P670736K009103p358771j2764789
3265A0255155q792563J419915Q830532P715935R36353m155802l332487J511365
3257A4388403N103914L575776j899674n417452k102131N627350R743557N516036
3249C4535779l874312j2529141j7646177j7910489j1109178J447526J1538839
3242a5547153J1700823N101813J474466L623636M820307N67999m389826m225698
$$ plain form
3234 3126367 2090447 1585202 -1070825 -3923498 -4121708 -3282012 -5715988 -12374726 -19402240
3225 -19402240 -22838568 -22693688 -21528933 -20450746 -18225766 -14245521 -10585601 -9901741
3217 -9901741 -12038325 -13894219 -12235655 -5968240 3053446 10071912 10137874 3512080 -3069359
3208 -3069359 -3935413 -1827308 -3026378 -6340837 -3910807 5825814 13713808 12495692
3200 12495692 7166555 6877511 11801028 15037298 13756438 10789540 7469621 2782399
3192 2782399 -1198347 -646526 2802281 2813940 -2977628 -11162438 -19633006 -29350734 -37711779
3183 -37711779 -37712765 -27124640 -12557432 -1006114 7194943 13715293 16708962 15079637
3175 15079637 13386978 16448834 22041649 24523271 23445695 22974176 24049554 22726530
$$ packed form
3234C126367j035920n05245k656027k852673j98210Q39696k433976o658738p027514
3225a9402240l436328J44880J164755J078187K224980L980245L659920O83860
3217i901741k136584j855894J658564O267415R021686P018466O5962o625794o581439
3208c069359q66054K108105j199070l314459K430030R736621P887994j218116
3200A2495692n329137k89044M923517L236270j280860k966898l319919m687222
3192B782399l980746N51821L448807J1659n791568q184810q470568r717728q361045
3183c7711779r86J0588125J4567208J1551318Q201057O520350K993669j629325
3175A5079637j692659L061856N592815K481622j077576m71519J075378j323024
$$ plain form
3167 22726530 16511669 7805351 82593 -5925547 -10986040 -14709467 -15603210 -12886988
3159 -12886988 -7781386 -3408647 -2958392 -7134041 -13633866 -19334884 -22280123 -21851665
3151 -21851665 -18922380 -16285235 -16821763 -20122836 -22367517 -20211658 -13425221 -3923104
3143 -3923104 5243330 9866635 7089455 -737844 -7554285 -10018753 -9439864 -6717329
3135 -6717329 -57806 9853695 16894962 15729088 8245568 315499 -5449822 -10389827
3127 -10389827 -15574125 -20311593 -23124812 -21642749 -14009369 -3063822 4129791 4445686
3119 4445686 3136895 6124391 11518563 14063135 14405714 16710803 19017760 14520968
3111 14520968 3487125 -3738244 1057675 13840895 23668323 24391617 18139012 10335252
$$ packed form
3167B2726530o214861q706318p722758o008140n060493l723427q93743K716222
3159a2886988N105602M372739M50255m175649o499825n701018k945239M28458
3151b1851665K929285K637145n36528l301073k244681K155859O786437R502117
3143c923104R166434M623305k777180p827299o816441k464468N78889K722535
3135f717329O659523R911501P041267j165874p483520p930069n765321m940005
3127a0389827n184298m737468k813219J482063P633380J0945547P193613L15895
3119D445686j308791K987496N394172K544572L42579K305089K306957m496792
3111A4520968j1033843p225369M795919J2783220R827428P23294o252605p803760
$$ plain form
3103 10335252 4795364 2577012 3108637 5881580 10742877 15994972 17860328 14205890
3095 14205890 7681066 2429552 -1038692 -4340120 -6167627 -3676230 1415509 3540742
3087 3540742 1160610 -1040238 597471 4214538 7426372 11621503 17424237 20132057
3079 20132057 14952001 4716805 -2583481 -3316753 -1060792 -75665 -176843 622866 1955687
3070 1955687 2316736 2482233 4392550 6898869 6114562 1644316 -475112 5433999 16258477
3061 16258477 22622994 19838560 11853548 3568845 -5024530 -13994071 -18512584 -14620546
3053 -14620546 -6548108 -2001334 -1949598 -1034516 3191602 7706473 10170519 11267048 10538978
3044 10538978 6105240 -342755 -4131983 -4897543 -7902531 -16037804 -25348641 -30603676
$$ packed form
3103A0335252n539888k218352N31625K772943M861297N252095J865356l654438
3095A4205890o524824n251514l468244l301428j827507K491397N091739K125233
3087C540742k380132k200848J637709L617067L211834M195131N802734K707820
3079B0132057n180056j0235196p300286p33272K255961R85127j01178P99709J332821
3070A955687L61049J65497J910317K506319p84307m470246k119428N909111J0824478
3061A6258477O364517k784434p985012q284703q593375q969541m518513L892038
3053a4620546Q072438M546774N1736R15082M226118M514871K464046J096529p28070
3044A0538978m433738o447995l789228p65560l004988q135273r310837n255035
$$ plain form
3036 -30603676 -30894797 -27960311 -23501346 -19863195 -18665340 -17125242 -10900066 -2346816
3028 -2346816 -1506 -7049562 -16256911 -19961122 -19350753 -19563138 -21246535 -22387985 -23737719
3019 -23737719 -26399359 -27604747 -24729712 -20708301 -20012288 -21689079 -21465719 -18370992
3011 -18370992 -14360254 -9906744 -5120508 -2854047 -5284850 -9327406 -10532291 -9450693
3003 -9450693 -8982250 -7989759 -3751950 1270566 2091762 -202994 697121 6847666 13630736
2994 13630736 17082931 17648438 16150151 12035047 6686099 2959208 318584 -4303962
2986 -4303962 -9955986 -11729740 -8709663 -5823319 -5540413 -3634045 3420342 11810661
2978 11810661 15195935 12649247 8232092 5394121 4846752 5700717 6146357 4828311 3007499
$$ packed form
3036c0603676k91121K934486M458965L638151J197855J540098O225176Q553250
3028b346816K345310p048056r207349l704211O10369k12385j683397j141450j349734
3019b3737719k661640j205388K875035M021411O96013j676791K23360L094727
3011a8370992M010738M453510M786236K266461k430803m042556j204885J081598
3003i450693M68443R92491M237809N022516Q21196k294756R00115O150545O783070
2994A3630736L452195N65507j498287m115104n348948l726891k640624m622546
2986d303962n652024j773754L020077K886344K82906J906368P054387Q390319
2978A1810661L385274k546688m417155k837971n47369Q53965M45640j318046j820812
$$ plain form
2969 3007499 3005930 3742890 1451562 -3896511 -7362183 -6609891 -6097059 -10076696 -15542374
2960 -15542374 -16904189 -14592447 -13380893 -13635518 -10104298 -77224 11839938 18860228
2952 18860228 19063378 15811211 13371300 13858258 16979730 20540304 21153215 16234692 6708529
2943 6708529 -2623454 -6950304 -6238910 -4800053 -5316678 -5314396 -1515570 4334141 7498904
2934 7498904 7343961 8350205 13314075 19043989 20364525 15686178 6976028 -3282309
2926 -3282309 -12769175 -18405738 -17240774 -8907357 2882747 11518328 12028001 6457024
2918 6457024 3295547 8532248 18135717 22893016 19932586 14920560 12879507 12498829
2910 12498829 11431465 11751004 16278685 23088959 27591028 27694253 23713442 15708117
$$ packed form
2969C007499j569P36960k291328n348073l465672P52292N12832l979637n465678
2960a5542374j361815K311742J211554k54625L531220J0027074J1917162P020290
2952A8860228K03150l252167k439911M86958L121472L560574O12911m918523r526163
2943F708529r331983m326850P11394J438857n16625K282L798826N849711L164763
2934G498904j54943J006244M963870N729914J320536m678347q710150j0258337
2926c282309r486866n636563J164964Q333417J1790104Q635581N09673n570977
2918F457024l161477N236701R603469M757299k960430n012026k041053l80678
2910A2498829j067364L19539M527681O810274M502069J03225l980811q005325
$$ plain form
2902 15708117 4735848 -4887591 -8429188 -5596846 -329063 3456326 4197416 2511605
2894 2511605 1177036 3889721 11208841 18382694 19663690 14583439 8187617 5438960
2886 5438960 6947340 9867924 11536334 11937741 12892116 14862706 15720363 14148624 12751570
2877 12751570 14552829 17302632 15794726 10067071 5972124 6053604 5612172 929072 -4276996
2868 -4276996 -5331563 -4619037 -6973012 -10586212 -9579095 -3984740 -138146 -1097090 -3045728
2859 -3045728 -2418393 -992722 -1583385 -2986328 -2192234 944509 3944890 5458081 6910002
2850 6910002 10496444 16083283 20396060 20171936 16215644 12504384 10721957 8495632
2842 8495632 4507834 1735100 2570778 4162004 2928231 922883 2351191 5614685
$$ packed form
2902A5708117j0972269r623439l541597K832342N267783L785389P41090j685811
2894B511605j334569K712685P319120P173853J280996n080251o395822k748657
2886E438960J508380K920584J668410M01407R54375J970590Q57657j571739j397054
2877A2751570J801259K749803j507906n727655m094947Q1480m41432m683100n206068
2868d276996j054567P12526k353975l613200J007117N594355L846594r58944j948638
2859c045728O27335J425671n90663j402943P94094L136743L000381J513191J451921
2850F910002L586442N586839M312777k24124l956292l711260j782427k226325
2842H495632l987798k772734Q35678J591226j233773k005348J428308L263494
$$ plain form
2834 5614685 5035977 262788 -2157530 2169474 9902581 15046162 15248258 11294061 4420221
2825 4420221 -3527773 -10294440 -15455353 -19825433 -21534488 -16306627 -3789441 9602576
2817 9602576 17019105 18241322 17894691 18432751 17796183 13373057 5840548 -1346978 -5279026
2808 -5279026 -6152836 -6681077 -8782275 -11155885 -10646171 -5505901 3139500 11834895 15996638
2799 15996638 12733479 4586230 -1463681 -1505161 499503 -1314670 -5846408 -6783235 -2384626
2790 -2384626 1883076 1354863 -1966489 -3324686 -1150714 2872302 6566801 8229968
2782 8229968 7352258 5703635 5375356 5132603 1727783 -4470322 -8739257 -8200681 -5302217
2773 -5302217 -3563986 -3340492 -3808870 -5866288 -10451587 -16284183 -21310459 -24412868 -24530441
$$ packed form
2834E614685n78708m773189k420318M327004P733107N143581K02096l954197o873840
2825D420221p947994o766667n160913m370080j709055N227861J2517186J3392017
2817I602576P416529J222217l46631N38060o36568m423126p532509p187526l932048
2808e279026q73810n28241k101198k373610N09714N140270Q645401Q695395M161743
2799A5996638l263159q147249o049911m1480K004664j814173m531738r36827M398609
2790b384626M267702n28213l321352j358197K173972M023016L694499J663167
2782H229968q77710j648623l28279k42753l404820o198105m268935N38576K898464
2773e302217J738231K23494m68378k057418m585299n832596n026276l102409j17573
$$ plain form
2764 -24530441 -20876129 -15411830 -11970949 -11103810 -8824215 -2399147 5680945 11520973
2756 11520973 14360058 14924896 12533225 6927006 614908 -3342519 -4020448 -1579878
2748 -1579878 3405054 7804434 7201027 2341197 422835 6071383 14443323 17651540
2740 17651540 15048473 12351535 13042890 15721140 18061794 18142687 13270029 3048644
2732 3048644 -6945764 -9919415 -6405558 -3277582 -4168594 -5917984 -5161740 -3187915 -2424148
2723 -2424148 -2567890 -2567340 -2867302 -3295743 -1790497 2260083 5940536 6547698 5239588
2714 5239588 4498103 4147203 3148321 3813342 9785759 19037918 22802659 14583399 -1298233
2705 -1298233 -13383144 -15239479 -10896912 -7431992 -5992200 -3288393 893870 2649207
$$ packed form
2764b4530441L654312N464299L440881Q67139K279595O425068Q080092N840028
2756A1520973K839085N64838k391671n606219o312098l957427o77929K440570
2748a579878M984932M399380o03407m859830j918362N648548Q371940L208217
2740A7651540k603067k696938O91355K678250K340654Q0893m872658j0221385
2732C048644r994408k973651L513857L127976q91012j749390P56244J973825P63767
2723b424148j43742N50k99962m28441J505246M050580L680453O07162j308110
2714E239588p41485l50900r98882O65021N972417R252159L764741q219260j5881632
2705a298233j2084911j856335M342567L464920J439792K703807M182263J755337
$$ plain form
2697 2649207 -138869 -5394242 -10643548 -14944595 -16607730 -13882943 -9241141 -8032763
2689 -8032763 -10989942 -13141729 -12376595 -13007612 -17131390 -18873063 -13067590 -4298233 -166010
2680 -166010 361990 3993718 11272961 16076215 15866509 14540358 15033495 16187007 17278122
2671 17278122 19018553 19684821 16666320 12019686 9954964 9102119 4824209 -957570
2663 -957570 -1403725 2551144 1285862 -8306686 -16659720 -15839304 -10688447 -8857263 -8348577
2654 -8348577 -3753387 2113277 2975257 875240 3008711 9586508 14506894 16191960
2646 16191960 18008892 18883868 13795563 4514030 -168150 2353197 4174054 -78583
2638 -78583 -4071279 522099 11427432 19663952 21910808 22129552 23010208 22439294 18641791
$$ packed form
2697B649207k788076n255373n249306m301047j663135K724787M641802J208378
2689h032763k957179k151787P65134o31017m123778j741673N805473Q769357M132223
2680a66010N28000L631728P279243M803254k09706j326151M93137J153512J091115
2671A7278122J740431O66268l018501m646634k064722q52845m277910n781779
2663i57570m46155L954869j265282r592548q353034Q20416N150857J831184N08686
2654h348577M595190N866664Q61980k100017K133471O577797M920386J685066
2646A6191960J816932Q74976n088305r281533m682180K521347J820857m252637
2638g8583l992696M593378J0905333Q236520K246856K18744Q80656n70914l797503
$$ plain form
2629 18641791 13726101 10485984 8472873 4823414 -1899857 -9189345 -11943220 -7196831
2621 -7196831 2424388 11441152 17411439 21278484 21921718 15495694 3088377 -5831240
2613 -5831240 -3274552 6365958 11294139 7337990 1926039 2727021 8731440 14799067
2605 14799067 19081370 21842728 21423504 16631012 10811653 8732951 10474717 12203242
2597 12203242 11872162 10464455 8746492 6799401 5922643 6862954 6917973 3372852 -840833
2588 -840833 -410401 3400385 3519097 -1711204 -4909644 -472435 7548253 13084117 17338651
2579 17338651 23726611 28465536 24901599 15216258 9192000 10947858 14375075 13213570
2571 13213570 8847182 5403065 2903283 -872788 -5631457 -9451116 -12119091 -14752967
$$ packed form
2629A8641791m915690l240117k013111l649459o723271p289488k753875M746389
2621g196831R621219R016764N970287L867045O43234o426024j2407317q919617
2613e831240K556688R640510M928181l956149n411951Q00982O004419O067627
2605A4799067M282303K761358m19224m792492n819359k078702J741766J728525
2597A2203242l31080j407707j717963j947091q76758R40311N5019l545121m213685
2588h40833M30432L810786J18712n230301l198440M437209Q020688N535864M254534
2579A7338651O387960M738925l563937r685341o024258J755858L427217j161505
2571A3213570m366388l444117k499782l776071m758669l819659k667975k633876
$$ plain form
2563 -14752967 -17602177 -19868196 -20142998 -16390043 -8088925 649393 3182006 -2528521
2555 -2528521 -10942602 -14563355 -10869892 -3231647 2494032 1662061 -5780331 -14396684
2547 -14396684 -18303597 -17668878 -17129472 -17847337 -16095744 -10913230 -7179957 -7785700 -8272014
2538 -8272014 -4150282 1015554 890484 -3506892 -5716737 -4140096 -3352890 -5210956 -5638658
2529 -5638658 -2123999 1545444 1174703 -1761937 -3630581 -4688204 -7170730 -9557106
2521 -9557106 -8040074 -3729248 -3174931 -9105372 -14345420 -9525636 4211587 15079544
2513 15079544 14412207 6182778 -111405 -2134021 -5098568 -11389489 -16267449 -15226195
2505 -15226195 -10537645 -7768148 -9102792 -12644178 -15702663 -16319579 -13558693 -8566197
$$ packed form
2563a4752967k849210k266019k74802L752955Q301118Q738318K532613n710527
2555b528521q414081l620753L693463P638245N725679q31971p442392q616353
2547a4396684l906913O34719N39406p17865J751593N182514L733273o05743m86314
2538h272014M121732N165836j25070m397376k209845J576641P87206j858066m27702
2529e638658L514659L669443l70741k936640j868644j057623k482526k386376
2521i557106J517032M310826N54317n930441n240048M819784J3737223J0867957
2513A5079544o67337q229429o294183k022616k964547o290921m877960J041254
2505a5226195M688550K769497j334644l541386l058485o16916K760886M992496
$$ plain form
2497 -8566197 -4034635 -1316551 367094 1316970 596049 -1222276 -1684626 -297153 387910
2488 387910 -882814 -2033681 -1881458 -2677519 -5928348 -9373194 -11091558 -12890934 -16017831
2479 -16017831 -17065380 -12475483 -4290522 2864363 7877265 11825890 13357498 10740183
2471 10740183 6748630 6101213 8886742 11379661 12725977 16111447 23385361 32410347
2463 32410347 39467112 41161568 35401434 24359426 14977291 12264436 13386600 12425807
2455 12425807 8910272 6723449 6895312 7671914 10011859 15852378 21560070 20711857 14007826
2446 14007826 9138591 9661120 11384456 11515327 13371151 18459933 21239643 17004691
2438 17004691 9671884 6495729 8868803 12745882 14674075 13313268 8332255 2008389
$$ packed form
2497h566197M531562K718084J683645R49876p20921j818325m62350J387473O85063
2488C87910j270724j150867J52223p96061l250829l444846j718364j799376l126897
2479a6017831j047549M589897Q184961P154885N012902L948625J531608k617315
2471A0740183l991553o47417K785529K492919J346316L385470P273914R024986
2463C2410347P056765J694456n760134j1042008r382135k712855J122164r60793
2455A2425807l515535k186823J71863P76602K339945N840519N707692q48213o704031
2446A4007826m869235N22529J723336J30871J855824N088782K779710m234952
2438A7004691p332807l176155K373074L877079J928193j360807m981013o323866
$$ plain form
2430 2008389 -775943 2073649 6820901 9304378 10436531 12881899 15288149 14115178
2422 14115178 9358577 4593609 2459167 2931630 4594500 5154229 2701033 -855750
2414 -855750 193124 8748282 20100112 26867567 27157570 24678610 22280981 19156833
2406 19156833 14196457 8997364 6761197 9370986 15331805 20098745 19825238 15575881
2398 15575881 12013534 11146477 10061002 6386945 2957776 4206190 9943011 15607763
2390 15607763 17467387 15215763 10649515 6233881 4407310 6290806 10859474 15776370
2382 15776370 18590595 17809957 14661141 13118713 15417872 18103458 16093938 10173150
2374 10173150 5823626 4624345 2459059 -2783426 -8029101 -11457980 -15292658 -19033095
$$ packed form
2430B008389k784332K849592M747252K483477J132153K445368K406250j172971
2422A4115178m756601m764968k134442M72463J662870N59729k453196l556783
2414h55750J048874Q555158J1351830O767455K90003k478960k397629l124148
2406A9156833m960376n199093k236167K609789N960819M766940k73507m249357
2398A5575881l562347q67057j085475l674057l429169J248414N736821N664752
2390A5607763J859624k251624m566248m415634j826571J883496M568668M916896
2382A5776370K814225p80638l148816j542428K299159K685586k009520n920788
2374A0173150m349524j199281k165286n242485n245675l428879l834678l740437
$$ plain form
2366 -19033095 -17205169 -8850419 -2509268 -5226210 -12174825 -14441637 -12255214 -12214728
2358 -12214728 -15077414 -15654406 -13391405 -13899989 -19109214 -23260441 -20501192 -11361204
2350 -11361204 -782170 6132735 6673896 3136520 2188069 7524007 14732235 17852720
2342 17852720 18148378 20183426 22123860 18273726 10038904 5252897 5894749 5271462 -487445
2333 -487445 -6167297 -5658486 527557 8835547 17147019 22670240 21949660 16658342 13516378
2324 13516378 14922760 15461443 11134358 5578042 2639957 -629239 -7472629 -13385862
2316 -13385862 -11802211 -4400920 1168901 1875491 1552752 3900015 8715765 14409059
2308 14409059 19501668 21855581 20166452 15999822 11789735 8251903 6426265 9645087
$$ packed form
2366a9033095J827926Q354750O341151k716942o948615k266812K186423M0486
2358a2214728k862686n76992K263001n08584n209225m151227K759249R139988
2350a1361204J0579034O914905N41161l537376r48451N335938P208228L120485
2342A7852720K95658K035048J940434l850134q234822m786007O41852o23287n758907
2333d87445n679852N08811O186043Q307990Q311472N523221p20580n291318l141964
2324A3516378J406382N38683m327085n556316k938085l269196o843390n913233
2316a3385862J583651P401291N569821P06590l22739K347263M815750N693294
2308A4409059N092609K353913j689129m166630m210087l537832j825638L218822
$$ plain form
2300 9645087 19054787 28687924 29784064 20103548 5733081 -5758626 -10830560 -9842806
2292 -9842806 -5623934 -2305113 -2224321 -3602972 -3563813 -2554304 -2668598 -2736747 369165
2283 369165 5314799 6012678 -328504 -8707707 -12670427 -12369999 -12984953 -16737365 -20257068
2274 -20257068 -19922575 -16451669 -12697499 -9296979 -5028301 -390540 2187840 2119365 2020779
2265 2020779 4042162 6899499 8069596 6946362 4039781 -686714 -6112032 -8778269
2257 -8778269 -6806726 -3336835 -2396556 -2950333 -1283511 2362623 4925066 7116717 12155446
2248 12155446 17603539 15971951 5917628 -3963194 -6208926 -3461486 -2182904 -3057889
2240 -3057889 -3077673 -2678291 -4547440 -7891244 -9396475 -8282275 -6038372 -3012579 654039
$$ packed form
2300I645087R409700R633137J096140r680516j4370467j1491707n071934R87754
2292i842806M218872L318821Q0792j378651L9159J009509j14294o8149L105912
2283C69165M945634O97879o341182q379203l962720L00428o14954l752412l519703
2274b0257068L34493L470906L754170L400520M268678M637761K578380o8475r8586
2265B020779K021383K857337J170097j123234k906581m726495n425318k666237
2257h778269J971543L469891R40279n53777J666822L646134K562443K191651N038729
2248A2155446N448093j631588j0054323r880822k245732K747440J278582q74985
2240c057889j9784L99382j869149l343804j505231J114200K243903L025793L666618
$$ plain form
2231 654039 2731522 1695555 14517 841226 3364806 4974288 5535864 5748168 4301723
2222 4301723 1255266 1161476 7322259 15333864 18121686 15451877 12572065 11262354 8705579
2213 8705579 4004491 -935870 -6441612 -14188396 -21310035 -22150193 -16518176 -9995350
2205 -9995350 -5732674 -2548390 -1296448 -5070544 -11404848 -12549082 -6708111 -1231102
2197 -1231102 -518959 1387372 10147767 19820394 20073190 10666491 1104244 -2007636 -437031
2188 -437031 1529968 1715410 -1460798 -9270932 -19448603 -26095198 -24738608 -16313419
2180 -16313419 -6189542 -586505 -2854215 -10891610 -18461638 -20762767 -18319795 -14366153
2172 -14366153 -10040348 -4345601 2339544 7446844 9039388 7976155 7329775 10192757
$$ packed form
2231F54039K077483j035967j681038Q26709K523580J609482N61576K12304j446445
2222D301723l046457r3790O160783Q011605K787822k669809k879812j309711k556775
2213H705579m701088m940361n505742p746784p121639q40158N632017O522826
2205i995350M262676L184284J251942l774096o334304j144234N840971N477009
2197a231102P12143J906331Q760395R672627K52796r406699r562247l111880J570605
2188d37031J966999J85442l176208p810134j0177671o646595J356590Q425189
2180a6313419J0123877N603037k267710q037395p570028k301129K442972L953642
2172a4366153M325805N694747O685145N107300J592544j063233o46380K862982
$$ plain form
2164 10192757 16919242 23691881 25372610 21064830 15469000 13603314 15817705 19056270
2156 19056270 20709332 19473385 14803121 7982335 1913854 -2477382 -7632171 -14560124
2148 -14560124 -19006738 -16239080 -8298582 -2245809 -1366459 -2065997 -111687 3620041
2140 3620041 5104871 2312890 -3187970 -7977809 -8778023 -4278720 3244637 8725300
2132 8725300 8320728 3217191 -1021350 335830 6100384 9729830 6055416 -2592908
2124 -2592908 -8270564 -5597332 3288917 11793979 14599667 10097440 561052 -7931622
2116 -7931622 -8432239 797003 14029463 23791188 27366862 26011167 20583095 11595033
2108 11595033 1753951 -5926906 -12097816 -19262857 -26117424 -27676713 -21791768 -12197222
$$ packed form
2164A0192757O726485O772639J680729m307780n595830j865686K214391L238565
2156A9056270J653062j235947m670264o820786o068481m391236n154789o927953
2148a4560124m446614K767658P940498O052773Q79350o99538J954310L731728
2140C620041J484830k791981n500860m789839q00214M499303P523357N480663
2132H725300m04572n103537m238541J357180N764554L629446l674414q648324
2124b592908n677656K673232Q886249Q505062K805688m502227r536388q492674
2116g931622n00617R229242J3232460R761725L575674j355695n428072q988062
2108A1595033r841082p680857o170910p165041o854567j559289N884945R594546
$$ plain form
2100 -12197222 -4172247 -17393 643046 -622794 -1188398 770425 3115724 1387254
2092 1387254 -4846262 -10226845 -10120030 -6081306 -2609976 -1354061 -1588280 -3886599 -9031316
2083 -9031316 -14130702 -13991438 -7080380 2654772 10575152 15635198 19236239 22162240
2075 22162240 24050184 24407643 22705123 18198247 10783499 1823511 -6352624 -11620434
2067 -11620434 -13011235 -11412400 -9210710 -7940204 -6149479 -1268846 5880546 10619242
2059 10619242 10010273 6802366 4989251 3022264 -4122423 -15670574 -22835788 -19189825
2051 -19189825 -9883851 -5676516 -8990786 -11203665 -4754966 6848076 13958967 12436377
2043 12436377 6723969 3109317 3788432 7207426 10526103 10599493 5194315 -4736132 -14879399
$$ packed form
2100a2197222Q024975M154854O60439j265840n65604J958823K345299j728470
2092A387254o233516n380583J06815M038724L471330J255915k34219k298319n144717
2083i031316n099386J39264O911058R735152P920380N060046L601041K926001
2075B2162240J887944L57459j702520m506876p414748q959988q176135n267810
2067a1620434j390801J598835K201690J270506J790725M880633P149392M738696
2059A0619242o08969l207907j813115j966987p144687j1548151p165214L645963
2051a9189825R305974M207335l314270k212879O448699J1603042P110891j522590
2043A2436377n712408l614652O79115L418994L318677P3390n405178r930447j0143267
$$ plain form
2034 -14879399 -20951214 -22036184 -20231546 -17678350 -14522471 -9444098 -1792941 6760942
2026 6760942 12878932 14232095 11369251 6683481 2189634 -1056171 -2367730 -1793294
2018 -1793294 -622236 51388 922201 2821708 3904660 1217950 -4456868 -8415739 -8269385
2009 -8269385 -7506025 -10329615 -15394827 -18029691 -16872643 -14234950 -10976222 -5922086
2001 -5922086 -475574 1565261 298467 441581 3090021 2473052 -4386748 -10170539 -6688860
1992 -6688860 1605103 2380025 -7154390 -16895124 -19262031 -18333517 -19519421 -19353730 -13018528
1983 -13018528 -5394179 -5473240 -13086424 -19621436 -20158750 -17121317 -13148608 -8525951 -5743935
1974 -5743935 -8602205 -15380406 -19827478 -20247378 -20670994 -21876002 -19580448 -14314512 -14101472
$$ packed form
2034a4879399o071815j084970J804638K553196L155879N078373P651157Q553883
2026F760942O117990J353163k862844m685770m493847l245805j311559N74436
2018a793294J171058O73624Q70813J899507J082952k686710n674818l958871J46354
2009h269385P63360k823590n065212k634864J157048K637693L258728N054136
2001e922086N446512K040835j266794J43114K648440o16969o859800n783791L481679
1992f688860Q293963P74922r534415r740734k366907R28514j185904J65691O335202
1983a3018528P624349p9061p613184o535012n37314L037433L972709M622657K782016
1974e743935k858270o778201m447072m19900m23616j205008K295554N265936K13040
$$ plain form
1965 -14101472 -21952188 -28599662 -24911903 -15349609 -10783293 -12388590 -11794099 -4952427
1957 -4952427 3290124 8345145 11276348 13512584 13354553 10742403 10104947 14807490 22122369
1948 22122369 26845951 27654496 27118821 26699012 24221784 16661116 4603401 -6751438
1940 -6751438 -11930597 -10709922 -8016301 -7892013 -9367390 -9063509 -5534507 249810 6246159
1931 6246159 9711210 8955168 6048505 4401483 2603191 -4054625 -13688354 -16573100
1923 -16573100 -8959713 -1135099 -3798337 -12201931 -13873998 -8013573 -5261344 -9466285
1915 -9466285 -12251103 -7576985 -312040 3371941 4203571 4154124 1877560 -1083722 1898628
1906 1898628 12547316 22803572 25774507 24604235 24660447 24360789 20807940 17444041
$$ packed form
1965a4101472p850716o647474L687759R562294M566316j605297N94491O841672
1957d952427Q242551N055021K931203K236236j58031k612150o37456M702543P314879
1948B2122369M723582Q08545n35675m19809k477228p560668j2057715j1354839
1940f751438n179159J220675K693621J24288j475377L03881L529002N784317N996349
1931F246159L465051p56042k906663j647022j798292o657816r633729k884746
1923a6573100P613387P824614k663238q403594j672067N860425K752229m204941
1915i466285k784818M674118P264945L683981Q31630m9447k276564k961282K982350
1906A898628J0648688J0256256K970935j170272N6212k99658l552849l363899
$$ plain form
1898 17444041 17766348 17444209 11643290 5025323 4874234 8640744 8793349 6821784 10841546
1889 10841546 20383229 25418067 21969864 17959951 20348481 25664622 27427821 25241387
1881 25241387 21929719 18020712 13767713 11555648 12012659 12005209 10036849 9211488 11246629
1872 11246629 12138074 8139903 2140844 -663909 -376746 -810044 -2478024 -1916449 3118145
1863 3118145 11559497 20947727 27892225 28065001 20119093 9517471 4584014 7856446
1855 7856446 13875889 15887507 12194407 5534343 -724341 -3922153 -1785363 6187579
1847 6187579 16526436 22708881 20000227 9831476 -1194211 -7059953 -6817393 -3555416
1839 -3555416 -584293 204163 -2026186 -6265057 -8886167 -6595261 -835182 3076545
$$ packed form
1898A7444041L22307l22139n800919o617967j51089L766510J52605j971565M019762
1889A0841546R541683N034838l448203m009913K388530N316141J763199k186434
1881B5241387l311668l909007m252999k212065M57011p450j968360q25361K035141
1872A1246629Q91445l998171n999059k804753K87163m33298j667980N61575N034594
1863C118145Q441352R388230O944498J72776p945908j0601622m933457L272432
1855G856446O019443K011618l693100o660064o258684l197812K136790P972942
1847F187579J0338857O182445k708654j0168751j1025687n865742K42560L261977
1839c555416K971123P88456k230349m238871k621110K290906N760079L911727
$$ plain form
1831 3076545 2038782 -1727754 -4412719 -4930447 -4203158 -2834524 -1785242 -3201110 -7535345
1822 -7535345 -11016300 -9196336 -2864683 2457693 3297413 1709383 896197 127537 -3403489
1813 -3403489 -9209600 -13426480 -14306802 -14389075 -15388541 -14138126 -7674588 -793722 -2686004
1804 -2686004 -14364437 -24780133 -23622852 -14119990 -7313129 -5908035 -1539095 10717274
1796 10717274 22685652 22948173 11906471 895279 -2143781 -194980 205663 -1605778
1788 -1605778 -1773566 345729 549926 -3779403 -9157976 -9935056 -4755428 3230685 10943331
1779 10943331 16663380 17533948 10842849 -325179 -7247895 -5052280 1145216 3625077
1771 3625077 2551205 3709440 7954908 9834862 6902098 3694195 4504912 7831664
$$ packed form
1831C076545j037763l766536k684965n17728P27289J368634J049282j415868m334235
1822g535345l480955J819964O331653N322376Q39720j588030q13186p68660l531026
1813c403489n806111m216880q80322q2273r99466J250415O463538O880866j892282
1804b686004j1678433j0415696J157281R502862O806861J405094M368940J2256369
1796A0717274J1968378K62521j1041702j1011192l039060J948801M00643j811441
1788a605778j67788K119295K04197m329329n378573p77080N179628P986113P712646
1779A0943331N720049Q70568o691099j1168028o922716K195615O197496K479861
1771C625077j073872J158235M245468J879954k932764l207903Q10717L326752
$$ plain form
1763 7831664 10474789 11958566 11923483 8248073 1722290 -1989386 100528 2570912 -981190
1754 -981190 -7624306 -8736605 -2861160 1890304 -591916 -6282084 -7290148 -2145414
1746 -2145414 3909520 6691379 7068880 7088257 5550711 68592 -7370339 -10266413 -5079785
1737 -5079785 3113773 5735052 999865 -4413527 -4326689 211468 4474192 6255664 5938594
1728 5938594 3861405 1025522 -35877 1601698 3182485 2131825 -325202 -2294515
1720 -2294515 -5037213 -9796613 -13560975 -12786191 -9295806 -7280149 -6016616 -1437065
1712 -1437065 5769558 9982709 9259432 8108916 9933645 12137459 11438165 9540710 10115765
1703 10115765 13068989 14901442 13149387 8578486 4240097 3020942 4442366 4013457
$$ packed form
1763G831664K643125J483777l5083l675410o525783l711676K089914K470384l552102
1754i81190o643116j112299N875445M751464k482220n690168j008064N144734
1746b145414O054934K781859L77501J9377j537546n482119p438931k896074N186628
1737e079785Q193558K621279m735187n413392Q6838M538157M262724J781472l17070
1728E938594k077189k835883j061399J637575J580787j050660k457027j969313
1720b294515k742698m759400l764362P74784L490385K015657J263533M579551
1712a437065P206623M213151p23277j150516J824729K203814o99294j897455N75055
1703A0115765K953224J832453j752055m570901m338389j219155J421424m28909
$$ plain form
1695 4013457 -1827137 -10622786 -16760920 -18346777 -17030361 -12512581 -3864821 3731947
1687 3731947 2004438 -7813540 -13604756 -8610935 -1529998 -3401469 -10939385 -12277906
1679 -12277906 -5241837 835708 723240 136738 4426031 9098095 6629808 -2498770
1671 -2498770 -10432549 -10936532 -4540750 3268669 6657317 3841912 -1561847 -4689661
1663 -4689661 -4793153 -4244463 -3179904 475789 5439246 7012580 4705021 4653186 10809896
1654 10809896 18150906 19302572 14515403 9783849 7596787 5616462 3367348 3612049
1646 3612049 6138735 6029595 543506 -6634028 -10608805 -11063905 -10100939 -7866374 -3947292
1637 -3947292 -296688 1555289 4424722 11840629 21085464 24669315 19449172 10116807
$$ packed form
1695D013457n840594q795649o138134j585857J316416M517780Q647760P596768
1687C731947j727509r817978n791216M993821P080937j871471p537916j338521
1679a2277906P036069O077545j12468n86502M289293M672064k468287r128578
1671b498770p933779n03983O395782P809419L388648k815405n403759l127814
1663d689661j03492N48690J064559L655693M963457J573334k307559n1835O156710
1654A0809896P341010J151666m787169m731554k187062j980325k249114K44701
1646C612049K526686j09140n486089p177534l974777m55100R62966K234565L919082
1637c947292L650604J851977K869433P415907R244835L583851n220143r332365
$$ [...]
##END NTUPLES=NMR SPECTRUM
##END=
