##TITLE=31Pdec_DE-70H_oil
 D2O, 64 sc
 2.11.2024
##JCAMPDX= 6.0         $$ Bruker NMR JCAMP-DX V2.0
##DATA TYPE= NMR SPECTRUM
##DATA CLASS= NTUPLES
##ORIGIN= UXNMR, Bruker Analytische Messtechnik GmbH
##OWNER= root
$$ XWIN-NMR		Version 3.5
$$ Sat Nov  2 14:52:26 2024 Russian Standard Time (UT+4h)  she@DPX200
##.OBSERVE FREQUENCY= 81.013821
##.OBSERVE NUCLEUS= ^31P
##.ACQUISITION MODE= SIMULTANEOUS
##.ACQUISITION SCHEME= undefined
##.AVERAGES= 64
##.DIGITISER RES= 17
##SPECTROMETER/DATA SYSTEM= spect
##.PULSE SEQUENCE= zgpg30
##.SOLVENT NAME= CDCl3
##.SHIFT REFERENCE= (INTERNAL, CDCl3, 0, 198.062)
##AUDIT TRAIL= $$ (NUMBER, WHEN, WHO, WHERE, WHAT)
$$ ##TITLE= Audit trail, XWIN-NMR		Version 3.5
$$ ##JCAMPDX= 5.01
$$ ##ORIGIN= Bruker BioSpin GmbH
$$ ##OWNER= she
$$ F:/spectra/data/she/nmr/P31/2/pdata/1/auditp.txt
$$ ##AUDIT TRAIL=  $$ (NUMBER, WHEN, WHO, WHERE, WHAT)
(   1,<2024-11-02 14:51:31.15 +0400>,<she>,<DPX200>,
      <created by zg, POWCHK disabled, PULCHK disabled
       configuration hash MD5:
       00 E9 B6 7A A2 85 ED C7 34 08 36 98 17 FE 4E 26
       data hash MD5: 32K
       3F C8 FF 6B 78 28 40 05 54 3D 84 10 1D 34 CE 29>)
(   2,<2024-11-02 14:51:33.62 +0400>,<she>,<DPX200>,
      <Start of raw data processing
       efp BC_mod = 2 LB = 1.5 FT_mod = 6 PKNL = 1 PHC0 = 2255.225 PHC1 = 98.88818 SI = 64K 
       data hash MD5: 64K
       6B F0 74 F6 6A 97 24 25 6B 10 93 93 1C 6F 4A 6E>)
(   3,<2024-11-02 14:51:54.78 +0400>,<she>,<DPX200>,
      <pk PHC0 = -43.96494 PHC1 = 120.8 
       data hash MD5: 64K
       5B A0 AD B1 74 1B 4A 3E 7E D7 86 DE 45 C7 E6 49>)
(   4,<2024-11-02 14:52:00.60 +0400>,<she>,<DPX200>,
      <abs ABSG = 5 
       data hash MD5: 64K
       54 B4 69 2F E5 2A C4 A2 B5 04 AD B7 D1 B4 31 E9>)
$$ ##END=
$$ 
$$ hash MD5
$$ BD A7 F9 3A 81 32 D2 82 D2 61 2E A7 7C 0A 4A A7
##$RELAX= 
##$RELAX= 
##$RELAX= 
##$RELAX= 
##$RELAX= 
##$RELAX= 
##$RELAX= 
##$RELAX= 
$$ Bruker specific parameters
$$ --------------------------
##$DU= <F:/spectra>
##$EXPNO= 2
##$NAME= <P31>
##$PROCNO= 1
##$TYPE= <nmr>
##$USER= <she>
##$AMP= (0..31)
100 100 100 100 100 100 100 100 100 100 100 100 100 100 100 100 100 100 
100 100 100 100 100 100 100 100 100 100 100 100 100 100 
##$AQSEQ= 0
##$AQ_mod= 1
##$AUNM= <au_zg>
##$AUTOPOS= <>
##$BF1= 81.014009
##$BF2= 200.13
##$BF3= 200.13
##$BF4= 200.13
##$BF5= 200.13
##$BF6= 200.13
##$BF7= 200.13
##$BF8= 200.13
##$BYTORDA= 1
##$CFDGTYP= 0
##$CFRGTYP= 5
##$CHEMSTR= <none>
##$CNST= (0..31)
1 1 145 1 1 1 1 1 1 1 1 1 1 1 1 1 1 1 1 1 1 1 1 1 1 1 1 1 1 1 1 1 
##$CPDPRG= <waltz16>
##$CPDPRG1= <>
##$CPDPRG2= <waltz16>
##$CPDPRG3= <>
##$CPDPRG4= <mlev>
##$CPDPRG5= <mlev>
##$CPDPRG6= <mlev>
##$CPDPRG7= <mlev>
##$CPDPRG8= <mlev>
##$CPDPRGB= <>
##$CPDPRGT= <>
##$D= (0..31)
0 1 0 0 0 0 0 0 0 0.06 0 0.03 2e-05 3e-06 0 0 0.0002 0 0 0 0 0 0 0 0 0 
0 0 0 0 0 0 
##$DATE= 1730544690
##$DBL= (0..7)
120 120 120 11 120 120 24 19 
##$DBP= (0..7)
150 150 150 150 150 150 150 150 
##$DBP07= 0
##$DBPNAM0= <>
##$DBPNAM1= <>
$$ [...]
##$SUBNAM3= <"">
##$SUBNAM4= <"">
##$SUBNAM5= <"">
##$SUBNAM6= <"">
##$SUBNAM7= <"">
##$SUBNAM8= <"">
##$SUBNAM9= <"">
##$SW= 400.765351723535
##$SWIBOX= (0..15)
0 1 3 0 0 0 0 0 0 0 0 0 0 0 0 0 
##$SW_h= 32467.5324675325
##$TD= 32768
##$TD0= 1
##$TE= 0
##$TE2= 300
##$TE3= 300
##$TEG= 300
##$TL= (0..7)
0 120 53 12 22 120 120 120 
##$TP= (0..7)
150 150 150 150 150 150 150 150 
##$TP07= 0
##$TPNAME0= <>
##$TPNAME1= <>
##$TPNAME2= <>
##$TPNAME3= <>
##$TPNAME4= <>
##$TPNAME5= <>
##$TPNAME6= <>
##$TPNAME7= <>
##$TPOAL= (0..7)
0.5 0.5 0.5 0.5 0.5 0.5 0.5 0.5 
##$TPOFFS= (0..7)
0 0 0 0 0 0 0 0 
##$TUNHIN= 0
##$TUNHOUT= 0
##$TUNXOUT= 0
##$USERA1= <user>
##$USERA2= <user>
##$USERA3= <user>
##$USERA4= <user>
##$USERA5= <user>
##$V9= 5
##$VALIST= <valist>
##$VCLIST= <CCCCCCCCCCCCCCC>
##$VD= 0
##$VDLIST= <DDDDDDDDDDDDDDD>
##$VPLIST= <PPPPPPPPPPPPPPP>
##$VTLIST= <TTTTTTTTTTTTTTT>
##$WBST= 1024
##$WBSW= 4
##$XGAIN= (0..3)
0 0 0 0 
##$XL= 0
##$YL= 0
##$YMAX_a= 14601
##$YMIN_a= -8042
##$ZGOPTNS= <>
##$ZL1= 120
##$ZL2= 120
##$ZL3= 120
##$ZL4= 120
##$ABSF1= 198.0616
##$ABSF2= -202.7028
##$ABSG= 5
##$ABSL= 3
##$ALPHA= 0
##$AQORDER= 0
##$ASSFAC= 0
##$ASSFACI= 0
##$ASSFACX= 0
##$ASSWID= 0
##$AUNMP= <proc_1d>
##$AZFE= 0.1
##$AZFW= 0.5
##$BCFW= 0
##$BC_mod= 2
##$BYTORDP= 0
##$COROFFS= 0
##$CY= -3
##$DATMOD= 1
##$DC= 0
##$DFILT= <>
##$DTYPP= 0
##$F1P= 0
##$F2P= 0
##$FCOR= 1
##$FTSIZE= 65536
##$FT_mod= 6
##$GAMMA= 0
##$GB= 0
##$INTBC= 1
##$INTSCL= 9.790993e-09
##$ISEN= 30
##$LB= 1.5
##$LEV0= 0
##$LPBIN= 0
##$MAXI= 10000
##$MC2= 0
##$MEAN= 0
##$ME_mod= 0
##$MI= 50
##$NCOEF= 0
##$NC_proc= -8
##$NLEV= 6
##$NOISF1= 182.463
##$NOISF2= 159.3651
##$NSP= 0
##$NTH_PI= 0
##$NZP= 0
##$OFFSET= 198.0616
##$PC= 4
##$PHC0= 2211.26
##$PHC1= 219.6882
##$PH_mod= 1
##$PKNL= yes
##$PPARMOD= 0
##$PSCAL= 0
##$PSIGN= 0
##$REVERSE= no
##$SF= 81.0140089999434
##$SI= 65536
##$SIGF1= 159.3651
##$SIGF2= -187.1042
##$SINO= 113.3802
##$SIOLD= 16384
##$SREGLST= <1H.CDCl3>
##$SSB= 0
##$STSI= 65536
##$STSR= 0
##$SW_p= 32467.5324675325
##$SYMM= 0
##$S_DEV= 0
##$TDeff= 32768
##$TDoff= 0
##$TI= <>
##$TILT= no
##$TM1= 0
##$TM2= 0
##$TOPLEV= 0
##$USERP1= <user>
##$USERP2= <user>
##$USERP3= <user>
##$USERP4= <user>
##$USERP5= <user>
##$WDW= 1
##$XDIM= 65536
##$YMAX_p= 276933293
##$YMIN_p= -213042661
$$ End of Bruker specific parameters
$$ ---------------------------------
##NTUPLES= NMR SPECTRUM
##VAR_NAME=  FREQUENCY,     SPECTRUM/REAL,   SPECTRUM/IMAG
##SYMBOL=    X,             R,               I
##VAR_TYPE=  INDEPENDENT,   DEPENDENT,       DEPENDENT
##VAR_FORM=  AFFN,          ASDF,            ASDF
##VAR_DIM=   65536,         65536,           65536
##UNITS=     HZ,            ARBITRARY UNITS, ARBITRARY UNITS
##FACTOR=    0.49542278885378, 1,            1
##FIRST=     16045.7642231865, 0,            0
##LAST=      -16421.768244346, 0,            0
##MIN=       -16421.768244346, -213042661,   0
##MAX=       16045.7642231865, 276933293,    0
$$ Real data points
##PAGE= N=1
##DATA TABLE= (X++(R..R)), XYDATA
$$ [...]
##PAGE= N=2
##DATA TABLE= (X++(I..I)), XYDATA
7443c61719l726209m098887j982262J077896L162651L190770J459012j43385L46034
7434a076099K229907K369910n30429l503863l176582o13540L29827j313216k541733
7425g825818r98211K075384M054134L817413J744791j074171k793082j904526
7417b904086N99937J805542N52094j100103j083041k03645l25490j217987j162391
7408e039170K24486J728896K625407L129342K902952J096822j610676k798465
7400B259594j323962O28196J19180k434681l585084j593894J031555J009700j185758
7391e075154k311994j082377O36127J333323J709021K148032J278167j095946
7383b460801k284212o69994P89571j425051n243370n088643k4622M463146M018367
$$ plain form
7443 -361719 -4087928 -8186815 -10169077 -9091181 -5928530 -2737760 -1278748 -1422133 -1076099
7434 -1076099 1153808 3523718 2993289 -510574 -3687156 -4300696 -3970869 -5284085 -7825818
7425 -7825818 -8824029 -6748645 -2694511 1122902 2867693 1793522 -999560 -2904086
7417 -2904086 -2304149 -498607 53487 -1046616 -2129657 -2333302 -2658792 -3876779 -5039170
7408 -5039170 -4814684 -3085788 -460381 2668961 5571913 6668735 5058059 2259594
7400 2259594 935632 1563828 1683008 -751673 -4336757 -5930651 -4899096 -3889396 -5075154
7391 -5075154 -7387148 -8469525 -7833398 -6500075 -4791054 -2643022 -1364855 -2460801
7383 -2460801 -4745013 -5415007 -4625436 -6050487 -11293857 -16382500 -16407122 -11943976 -7925609
7374g925609R53487L1415J680477K464678P34423j348371j341299K37471R79163
7365c534165j87536j729777j526948K81650J352533M62210m69136Q62987L358757
7356a129425L771595J449449q07739j019010m57678p56864j120741k01795J142151
7347H69943J023057o60903k289024k604621j477783M88165J945071J441923o47601
7338a911773j805692k82829K506229L724850K460896J52155j576325k291788k461419
7329a485696k662417k696165j320625K017413N107940M664496Q80505j972083
7321B533368r82887J543400J707565m91798j914532j143632K57316O77810J01342
7312B287952q23309j207155P0837K707055M069800K315176l56025l74928J735778
$$ plain form
7374 -7925609 -6972122 -6940707 -5260230 -2795552 -2061129 -3409500 -4750799 -4513328 -3534165
7365 -3534165 -3721701 -5451478 -6978426 -6696776 -5344243 -4882033 -5351169 -4488182 -1129425
7356 -1129425 2642170 4091619 3283880 2264870 1807192 1050328 -70413 -272208 869943
7347 869943 1893000 1232097 -1056927 -3661548 -5139331 -4651166 -2706095 -1264172 -1911773
7338 -1911773 -3717465 -4000294 -1494065 2230785 4691681 4843836 3267511 975723 -1485696
7329 -1485696 -4148113 -6844278 -8164903 -6147490 -1039550 3624946 4505451 2533368
7321 2533368 1550481 3093881 4801446 4309648 2395116 1251484 1508800 2186610 2287952
7312 2287952 1464643 257488 328325 3035380 7105180 9420356 9064331 8689403 10425181
7303A0425181J873956j410028m587071m231450j509969J90399j01773p61325o07973
7294g20053j06089j27847r50152k127717k483961q47966K240325M111328K409444
7285A397312k046688n666533n619175k549367N35542J783965K139569L159553
7277f865822M281469L754210J808775O86878J072924Q89297j134618l069152k907506
7268a483545j921950k309197l269868k558992o63269P6441j91879Q93253L354961
7259h074045M385786K979147J444231J260987Q84838p67165j832655o17314J327555
7250I91365J488789j02148j646069k347709k659329k989810l502552l996702l193649
7241a7957814J29784M501452O404603M627847J677559k03582j559796k734011
$$ plain form
7303 10425181 12299137 10889109 6302038 2070588 560619 751018 649245 -112080 -720053
7294 -720053 -826142 -953989 -1904141 -4031858 -6515819 -7363785 -5123460 -1012132 1397312
7285 1397312 -649376 -6315909 -11935084 -14484451 -13948909 -12164944 -10025375 -6865822
7277 -6865822 -2584353 1169857 2978632 3665510 4738434 5627731 4493113 1423961 -1483545
7268 -1483545 -3405495 -5714692 -8984560 -11543552 -12206821 -12130380 -12322259 -11429006 -8074045
7259 -8074045 -3688259 -709112 735119 1996106 2880944 2113779 281124 -336190 991365
7250 991365 2480154 2378006 731937 -1615772 -4275101 -7264911 -10767463 -14764165 -17957814
7241 -17957814 -17828030 -13326578 -6921975 -2294128 -616569 -820151 -2379947 -5113958
7233e113958j813385J639469L843616J514044k801977m047756j793961J23436
7225h450472J55261O38595K657963L745878K151099q1029l24037P18749M01614
7216A613621j956790m289534m291099j710550J466093K721907J359235p79730
7208e866847j374454n2477J823784L030146L148029K181205P60663r893q8605
7199C551551p90382k204358j984823J057440L787939K307692k304408n294050
7191a873399m779268l190225k180911m46098K269698L206049Q89750j913263k154792
7182a0172459q10733n69434j379176j177623L97363J773195K092703J822008J252334
7173f771822K51279q12336j166504l39880J656429L812864L794617L52113l524686
$$ plain form
7233 -5113958 -6927343 -5287874 -1444258 69786 -2732191 -6779947 -8573908 -8450472
7225 -8450472 -8295211 -7656616 -4998653 -1252775 898324 817295 493258 1212007 1613621
7216 1613621 -343169 -4632703 -8923802 -10634352 -9168259 -6446352 -5087117 -5866847
7208 -5866847 -7241301 -7293778 -5469994 -2439848 708181 2889386 3650049 3640156 3551551
7199 3551551 2761169 556811 -1428012 -370572 3417367 5725059 3420651 -1873399
7191 -1873399 -6652667 -9842892 -12023803 -12469901 -10200203 -6994154 -6104404 -8017667 -10172459
7182 -10172459 -10983192 -11552626 -12931802 -14109425 -13712062 -11938867 -9846164 -8024156 -6771822
7173 -6771822 -6520543 -7332879 -8499383 -8839263 -7182834 -3369970 424647 776760 -2747926
7164b747926l004700J678610M312872J148484l452745l534991l30382O09718j274397
7155f595457j361467J595864L174056P91284k179888k195971o78869l81367o24547
7146h456362K80231R65494o88069l157484k983229J63166L334219M546988M294805
7137a700241L272931J352649j056197k714120k829806j339732J507366M379590
7129H72440M750815J737740j738632k093190J30280J255808q0937j604703j733991
7120A495630j756552k483499k105434L79138K329904J031830j710833j868841
7112d688657P59171K180940R1831k952163l329426r37153J582672K519637K207178
7103b565970J464472P46460N27745J042428J618877J373556N38795N6391r1970
$$ plain form
7164 -2747926 -5752626 -4074016 238856 1387340 -2065405 -5600396 -5930778 -5321060 -6595457
7155 -6595457 -7956924 -6361060 -3187004 -2395720 -4575608 -6771579 -7450448 -7831815 -8456362
7146 -8456362 -8176131 -7210637 -7898706 -11056190 -14039419 -13876253 -10542034 -5995046 -1700241
7137 -1700241 1572690 2925339 1869142 -844978 -3674784 -5014516 -3507150 872440
7129 872440 5623255 7360995 5622363 3529173 3659453 4915261 4834324 3229621 1495630
7120 1495630 -260922 -2744421 -4849855 -4470717 -2140813 -1108983 -2819816 -4688657
7112 -4688657 -3929486 -1748546 -1656715 -4608878 -7938304 -8875457 -7292785 -4773148 -2565970
7103 -2565970 -1101498 -355038 172707 1215135 2834012 4207568 4746363 4802754 4710784
7094D710784r28972k683408m203534m567425m025245k799589m53992K477109L758514
7085h715758K162793j31875p6296J825525K167840j33146k019669q03679J898997
7076c825268K573676M50042k294394l790144l797984k504832j94878K015002K946207
7067h422573K903858K953812K845354J380620j162465k850358k679947j634360
7059f666059p28656K33298J293110J548770Q21253N30687J527507K335941J188182
7050B084033j089823k034972j049929k20087j391949l770508n027591m023262
7042a6524088j776630k0570O68913J105350K003624K737625K098297J55571j346411
7033a0898319p24133J909412M737963N671288L814812K45172k645739l347926
$$ plain form
7094 4710784 3781812 1098404 -3105130 -7672555 -11697800 -14497389 -14951381 -12474272 -8715758
7085 -8715758 -6552965 -6684840 -6761136 -4935611 -2767771 -2900917 -4920586 -5724265 -3825268
7076 -3825268 -1251592 -801550 -3095944 -6886088 -10684072 -13188904 -13383782 -11368780 -8422573
7067 -8422573 -5518715 -2564903 280451 1661071 498606 -2351752 -5031699 -6666059
7059 -6666059 -7394715 -7161417 -5868307 -4319537 -3498284 -2967597 -1440090 895851 2084033
7050 2084033 994210 -1040762 -2090691 -2310778 -3702727 -7473235 -12500826 -16524088
7042 -16524088 -18300718 -18321288 -17652375 -16547025 -14543401 -11805776 -9707479 -9551908 -10898319
7033 -10898319 -11622452 -9713040 -4975077 696211 4511023 4756195 2110456 -1237470
7025a237470k814127l010015m008214l859573j608202J104029K201261J592738
7017a1639573M74231n06521j150165q70174N41822K011853K461560K438447L076496
7008c162024L932289L438515J353510p50242j549094j223825n04660K39632N52395
6999B326496l04509k291308l909359l353194m29621K857245L842755J690535j561643
6990a132603k891755j374441J152103K482554K126945Q39789m96509q26225P08998
6981E88856L151940L868442J817959n98286p77345K43973m22447k719952l536842
6972A616298j438443J288250K091868J299350O23328M14493r9429j005198j552276
6963C238241j333396p69891o64734j502523k754674k990014j406527R64367K466782
$$ plain form
7025 -1237470 -4051597 -7061612 -11069826 -14929399 -16537601 -15433572 -13232311 -11639573
7017 -11639573 -11165342 -11671863 -12822028 -13692202 -13150380 -11138527 -8676967 -6238520 -3162024
7008 -3162024 770265 4208780 5562290 4812048 3262954 2039129 1534469 1774101 2326496
6999 2326496 2021987 -269321 -4178680 -7531874 -7961495 -5104250 -1261495 429040 -1132603
6990 -1132603 -4024358 -5398799 -4246696 -1764142 362803 1202592 706083 -120142 588856
6981 588856 3740796 7609238 9427197 8828911 8051566 8295539 7873092 5153140 1616298
6972 1616298 177855 1466105 3557973 4857323 5480651 5895144 5795715 4790517 3238241
6963 3238241 1904845 1134954 470220 -1032303 -3786977 -6776991 -8183518 -7219151 -4752369
6954d752369K812806K685251J955689J12013j797736j827380m6213J285099J016709
6945A443869N20093R31871J047885o15717l207027m552301l829650j962696j06000
6936a0329673J160114J657698J503849R56445J78829l99983J10359J734280K510048
6927i18034M93345l098876m727650k877410L32402K214039K107538N52884j650363
6918g572125k806955j358329J348517J931202j29101j327586M36581K411469J554006
6909e512321k95008P60248M520174O892431N256495O59084m396672p475009o470449
6900f061027j551981L432317M306237J314098j713065k515808k271897k578005
6892g639131l128482k698630o35079K621246N159262M577824J055742j729208
$$ plain form
6954 -4752369 -1939563 745688 2701377 2813390 1015654 -811726 -857939 427160 1443869
6945 1443869 1963962 2895833 3943718 3328001 120974 -4431327 -8260977 -10223673 -10329673
6936 -10329673 -9169559 -7511861 -6008012 -5051567 -4872738 -5272721 -5162362 -3428082 -918034
6927 -918034 -424689 -3523565 -8251215 -11128625 -10796223 -8582184 -6474646 -5921762 -7572125
6918 -7572125 -10379080 -11737409 -10388892 -8457690 -8586791 -9914377 -9477796 -7066327 -5512321
6909 -5512321 -5807329 -5047081 -526907 6365524 11622019 12281103 7884431 409422 -6061027
6900 -6061027 -7613008 -4180691 125546 1439644 -273421 -2789229 -5061126 -7639131
6892 -7639131 -10767613 -13466243 -14101322 -11480076 -6320814 -1742990 -687248 -2416456
6884b416456r12872J584784J936285j24729j852167k299670k775130l063151j333343
6875a1256449J916890L716789L109029K197893J947020O40970k204059l969439
6867c901356k808940m41321Q10042J197133J869249K259997J170573j034475k777961
6858c657059k707644l12403L271325N009423K783232j450956l820479l618498
6850d503059l029036k216056P61593M679732N127336J515736j161753j48084Q35822
6841A862231j356988l410598j540342J398218P17881j943058j852128J76052n16929
6832f465661l572924l701927N02174M511179N191174L988021K017945j617461
6824H52520n046616l607467K610244O878004M824217K72438j510605j404451k673563
$$ plain form
6884 -2416456 -3329328 -1744544 191741 67012 -1785155 -4084825 -6859955 -9923106 -11256449
6875 -11256449 -9339559 -5622770 -2513741 -315848 1631172 2272142 68083 -3901356
6867 -3901356 -6710296 -7151617 -6341575 -5144442 -3275193 -1015196 155377 -879098 -3657059
6858 -3657059 -6364703 -6677106 -3405781 1603642 4386874 2935918 -884561 -4503059
6850 -4503059 -7532095 -9748151 -8986558 -4306826 820510 2336246 1174493 1026409 1862231
6841 1862231 505243 -2905355 -4445697 -3047479 -2329598 -4272656 -6124784 -5948732 -6465661
6832 -6465661 -10038585 -13740512 -13238338 -8727159 -3535985 452036 2469981 852520
6824 852520 -4194096 -7801563 -5191319 1686685 6510902 6783340 5272735 3868284 1194721
6815A194721m016819k177964J304493J999168q8597p78914R99257J586113r60918
6806i39460l574436l061380m95420J412894K362505L401894L923529K438994n24177
6797D944943k553728k346457j165922j118679k692069m147077l222529L25279
6789a1976239L969205M804921K623497k52873k033794k911198l181197j836694
6781a0794372J607231N239774O523545N291754L322008J483409p25559l002113
6773H945677l916676l312847k875917l257856k669310Q804K436923J478378k229915
6764e392739m786043l907812j110556J109617K031459J988021R69385o79807j448233
6755a1226708k2432K968010N429820N734365L820074R88690j003126j258853n34974
$$ plain form
6815 1194721 -2822098 -5000062 -3695569 -1696401 -1784998 -2563912 -1564655 21458 -939460
6806 -939460 -4513896 -7575276 -8070696 -6657802 -4295297 -893403 3030126 5469120 4944943
6797 4944943 2391215 44758 -1121164 -2239843 -4931912 -9078989 -12301518 -11976239
6789 -11976239 -8007034 -3202113 -578616 -831489 -2865283 -5776481 -8957678 -10794372
6781 -10794372 -9187141 -3947367 2576178 7867932 11189940 12673349 11947790 8945677
6773 8945677 5029001 1716154 -1159763 -4417619 -7086929 -7078125 -4641202 -3162824 -5392739
6764 -5392739 -10178782 -14086594 -15197150 -14087533 -12056074 -10068053 -9098668 -9778475 -11226708
6755 -11226708 -11249140 -8281130 -2851310 2883055 6703129 7691819 6688693 5429840 4894866
6746D894866l07450j077489k247039l343031m170528l937435j837177J248439
6738a0776844L224545L418692L213161L565001L559430K142788k74276k656657
6730E415840m231914m018347j437642J831930K783789Q98730j185878j806388
6722a749880k232579k982121j631254K831661O505820N292046J022702j223516
6714E832879m50014k183j317892k079315q84062M38060J36941j223359k733001
6705b281946m270290m885413l087771L42368K649848K965835K967429L078186
6697b521754J517389j633394l099205j272074P85922j51923k508102k367262Q31734
6688a0418669L912487M292764K379564K32781m56545M09202J045165m00326l022759
$$ plain form
6746 4894866 4587416 3509927 1262888 -2080143 -6250671 -10188106 -12025283 -10776844
6738 -10776844 -7552299 -4133607 -920446 2644555 6203985 8346773 8072497 5415840
6730 5415840 1183926 -2834421 -4272063 -2440133 343656 1242386 56508 -1749880
6722 -1749880 -3982459 -6964580 -8595834 -5764173 741647 6033693 7056395 5832879
6714 5832879 5382865 5380682 4062790 1983475 1099413 1537473 1674414 451055 -2281946
6705 -2281946 -6552236 -11437649 -14525420 -14183052 -11533204 -8567369 -5599940 -2521754
6697 -2521754 -1004365 -2637759 -5736964 -7009038 -6223116 -6375039 -8883141 -11250403 -10418669
6688 -10418669 -6506182 -2213418 166146 398927 -57618 351584 1396749 996423 -2026336
6679b026336l674974j238079J521561J773711L78766o8207P09280Q79441k11871
6670a956708j196843q51264M68411J452897J061722m76733j511029p15138Q54141
6661b870544R32127n52498j349925o37780l07045j466477k416821j668501k79074
6652a0616538O54978K014970L919988L922509R07201j817552p36142K693883M502477
6643E445774L766217K064435l82945l603211m769311j448059K991475K726345
6635F790720j838684m304154j877883R33202k1243k591927k888167j181743K47390
6626f732489J446965L117206L514553J152162j413140o29680K381397L202915
6618F039889P73822j128324M30277L576461M559733K321482j297498m266351n648736
$$ plain form
6679 -2026336 -5701310 -6939389 -5417828 -3644117 -3265351 -3333558 -2624278 -1744837 -1956708
6670 -1956708 -3153551 -4004815 -3536404 -2083507 -1021785 -1498518 -3009547 -3724685 -2870544
6661 -2870544 -1938417 -2490915 -3840840 -4478620 -4785665 -6252142 -8668963 -10337464 -10616538
6652 -10616538 -9961560 -7946590 -4026602 -104093 803108 -1014444 -1750586 943297 5445774
6643 5445774 9211991 11276426 10893481 7290270 2520959 1072900 4064375 6790720
6635 6790720 4952036 647882 -1230001 -296799 -318042 -2909969 -5798136 -6979879 -6732489
6626 -6732489 -5285524 -2168318 1346235 2498397 1085257 455577 2836974 6039889
6618 6039889 6813711 5685387 6115664 9692125 14251858 16573340 15275842 11009491 5360755
6609E360755n094534k799752q7497J176596M00231j042003j555309j339070j728650
6600f709233k740808k671711n68869K274966M091107M540279L856400J714684
6592C786815j433656l414435k841845j378972j211902j532374l51116J350162
6584g027323R29813q95322m78991K710910M546439K300707j252102j932401L88326
6575g09944K625231K642542O24063j907182k850190j113312J292948Q63213k496990
6566a029621m721578l243568n51767l0948j090367j095076L14432J766662K923606
6557f758225L713319K721296n06394l222746k751156n25651L38478p115P95395
6548f202799K525536K608162O37668j008067j016348l92646L4393L91435K81063
$$ plain form
6609 5360755 266221 -2533531 -2621028 -1444432 -1044201 -2086204 -3641513 -4980583 -6709233
6600 -6709233 -9450041 -12121752 -12690621 -10415655 -6324548 -1784269 2072131 3786815
6592 3786815 2353159 -1061276 -3903121 -5282093 -6493995 -8026369 -8377485 -7027323
6584 -7027323 -6097510 -6992832 -7471823 -4760913 -214474 2086233 834131 -1098270 -709944
6575 -709944 1915287 4557829 5181892 3274710 424520 -688792 604156 1467369 -1029621
6566 -1029621 -5751199 -8994767 -9546534 -9577482 -10667849 -11762925 -11448493 -9681831 -6758225
6557 -6758225 -3044906 -323610 -830004 -4052750 -6803906 -7329557 -6991079 -6998194 -6202799
6548 -6202799 -3677263 -1069101 -431433 -1439500 -2455848 -2848494 -2814101 -2422666 -2141603
6539b141603o39792j125175k81679m6945k206394m060586j573572L646328N582791
6530b846627K408196j321307k091109j685415k103809j590418J116023L163687
6522d950779K060648J30250N40732J946115J231754q94079j390052j46614N43446
6513i28579N22607J467927K673712J427235k075357l938005j794940J877517K946415
6504B178532M27294k820224l233774n7150L733210M380101J614774j235954j989203
6495B997606k255937l816361m974004l447085q46210m65302j677188o31578L509611
6486a1606448O927966O520346L682135J629525J522939K261331K011499o58447
6478A2290846n044245p480691m861816O28856L248565Q97944k501163k896190
$$ plain form
6539 -2141603 -2781395 -3906570 -4188249 -4235194 -6441588 -10502174 -12075746 -8429418 -2846627
6530 -2846627 -438431 -1759738 -3850847 -5536262 -7640071 -9230489 -8114466 -4950779
6522 -4950779 -2890131 -2759881 -2219149 -273034 958720 64641 -1325411 -1472025 -928579
6513 -928579 -405972 1061955 3735667 5162902 3087545 -850460 -2645400 -767883 2178532
6504 2178532 2605826 -214398 -3448172 -3505322 227888 4607989 6222763 4986809 2997606
6495 2997606 741669 -3074692 -8048696 -11495781 -12341991 -12807293 -14484481 -15116059 -11606448
6486 -11606448 -4678482 1841864 5523999 7153524 8676463 10937794 12949293 12290846
6478 12290846 7246601 -234090 -5095906 -4467050 -1218485 -320541 -2821704 -5717894
6470e717894r80956N94395J475410K299221J924939o02161l112728k812042o65188
6461g597004R218j316296j994696q87749j3503o91316j063949Q85972L999651
6452h669672N533523M692614K709672M37370j928161l057300r72150L651798O581741
6443H979435M395365j009575m318399l134233l03103N65055m70591j216791j230476
6434B256687j704115k611618k654465j706333q82421k98085Q18542J748516O74650
6425d358642k019192l404436j908345O60757J954249J831282J297247Q56078J010534
6416d080468K276369L592184K915302M74003j059556p90066r82029k595730k928203
6407c178194l22184K182523J449731m69806R5794K020810J454716j297609k314526
$$ plain form
6470 -5717894 -6698850 -6104455 -4629045 -2329824 -404885 -1007046 -4119774 -6931816 -7597004
6461 -7597004 -7587786 -8904082 -10898778 -11786527 -11800030 -12491346 -13555295 -12669323 -8669672
6452 -8669672 -3136149 1556465 4266137 4703507 2775346 -281954 -1254104 2397694 8979435
6443 8979435 13374800 12365225 8046826 4912593 4609490 5174545 4703954 3487163 2256687
6434 2256687 552572 -2059046 -4713511 -6419844 -7302265 -7600350 -6781808 -5033292 -4358642
6425 -4358642 -6377834 -9782270 -11690615 -11029858 -9075609 -7244327 -5947080 -5091002 -4080468
6416 -4080468 -1804099 1788085 4703387 5177390 4117834 3327768 2345739 -249991 -3178194
6407 -3178194 -3500378 -1317855 131876 -337930 -242136 1778674 3233390 1935781 -378745
6398c78745q27111m8955j079804j345099m1903J54556j414813j262290K197709
6389d046455M967162L292387m83306j783461o39438m00329j557663j416555O96849
6380a370809K082884J037327o82588q47951R1365J78578j078140k215500j971223
6371d776057j104666j518936l394594m083596j287462L056669M328790J199499
6363g580353k353359k247164Q20955L481041M380726M237497L112025Q25924r98246
6354C679046o25797N90672o935j689032j187836J318269J291230l192127p359896
6345g182406n918750o42492K275976J055818q9015J649708L436532K074434l76834
6336c717029j4557K183141J662641k144170m281810j582157K592060L442088J305397
$$ plain form
6398 -378745 -1205856 -1254811 -2334615 -3679714 -3721617 -3567061 -4981874 -6244164 -4046455
6389 -4046455 920707 4213094 3729788 1946327 1306889 906560 -651103 -2067658 -1370809
6380 -1370809 712075 1749402 1066814 218863 310228 488806 -589334 -2804834 -4776057
6371 -4776057 -5880723 -7399659 -10794253 -14877849 -16165311 -13108642 -8779852 -7580353
6363 -7580353 -9933712 -12180876 -11359921 -7878880 -3498154 739343 3851368 4677292 3679046
6354 3679046 3053249 3643921 3636986 1947954 760118 2078387 3369617 177490 -7182406
6345 -7182406 -13101156 -13743648 -11467672 -10411854 -10500869 -8851161 -5414629 -3340195 -3717029
6336 -3717029 -3731586 -1548445 114196 -2029974 -6311784 -7893941 -5301881 -1859793 -554396
6327e54396k06526j63361l23839o39659P01119K939962K863965j8948k409835
6318B188482k456718k145111k845284k536587n5629J617190j51868k787557k170006
6309a1343088R24165K356998J288088P32485J819446K085053K92633j125859j49532
6300c119611J533817J462904K23867p8577M56597k6919j569014j793165N18312
6291b391789L000191K278328j581664m734305m133105j147669O62126M23939M95496
6282g128452K262608L905404L300187J028490r08974j655133j321007N1414J657397
6273A191934J649760l91072k105702j464824J36895P8318j496059k362148j867290
6264f630188j232002q57248j0731J049736J122176K90856M7024J051279K321120
$$ plain form
6327 -554396 -760922 -924283 -1248122 -1887781 -1186662 1753300 4617265 4598317 2188482
6318 2188482 -268236 -2413347 -5258631 -7795218 -7850847 -6233657 -6385525 -9173082 -11343088
6309 -11343088 -10418923 -8061925 -6773837 -6041352 -4221906 -2136853 -1844220 -2970079 -3119611
6300 -3119611 -1585794 -122890 100977 22400 478997 452078 -1116936 -2910101 -2391789
6291 -2391789 608402 2886730 1305066 -3429239 -7562344 -8710013 -8047887 -7623948 -7128452
6282 -7128452 -4865844 -960440 2339747 3368237 2459263 804130 -516877 -465463 1191934
6273 1191934 2841694 2450622 344920 -1119904 -983009 -904691 -2400750 -4762898 -6630188
6264 -6630188 -7862190 -8719438 -8730169 -7680433 -6558257 -6267401 -6220377 -5169098 -2847978
6255b847978K504945Q54179k261911m697161l877813k82483K370338K210888J897927
6246d129069L662872M842212K314464j454819j881597L36920R73557j60632J95250
6237D699158J485988j06383l543202l045986J934173M480120J012886k897791
6229D018963j833834R51896j30237l541404l859980p49006J619634J695616J417209
6220d11143J586906J363095J114749J539171J296664o77637k258955j323561K43871
6211B473160j76681r89366N65181K593892J304478j911035k145011P60496J671697
6202D146811j523967m697899m062810j143810Q14859J460340K129765K954190
6194G7479L161602K407488P79885r47758j107456P44933K026924J63973l106084
$$ plain form
6255 -2847978 -343033 511146 -1750765 -6447926 -10325739 -10608222 -8237884 -6026996 -4129069
6246 -4129069 -466197 4376015 6690479 5235660 3354063 3690983 4664540 4503908 4699158
6237 4699158 6185146 6078763 2535561 -510425 1423748 5903868 6916754 4018963
6229 4018963 2185129 3137025 3006788 -534616 -4394596 -5143602 -3523968 -1828352 -411143
6220 -411143 1175763 2538858 3653607 5192778 6489442 5811805 3552850 2229289 2473160
6211 2473160 2296479 1307113 1872294 4466186 5770664 3859629 1714618 2475114 4146811
6202 4146811 2622844 -2075055 -6137865 -7281675 -6466816 -5006476 -2876711 77479
6194 77479 3239081 5646569 6426454 5478696 4371240 5116173 7143097 7307070 4200986
6185D200986l641430p65961K154797K737686J557421o31998l479702m668696j513685
6176d050582M077479O481784L564989q24321k761761k610823k099496j372741
6168D04528r91961k722221n811640o272553k612804J216830J455182k66329m39424
6159a6040392Q50599J462277J359662J513957J039694p76557j615678Q27440M521149
6150f857849N594786L870286K245049J724836Q85721m80887r93130o59516p82375
6141D546921j079358k16585R54939J49648k209009l023507j227903Q07782J364648
6132F7576J638546K645988K857169Q25832k013762l181949k351261j060746l67548
6123i40155k49824n12486r81188j219464q78049k4611J117864K120885K015930
$$ plain form
6185 4200986 559556 -206405 1948392 4686078 6243499 5611501 2131799 -2536897 -4050582
6176 -4050582 26897 6508681 10073670 9249349 6487588 3876765 1777269 404528
6168 404528 -587433 -3309654 -9121294 -15393847 -18006651 -16789821 -15334639 -15600968 -16040392
6159 -16040392 -15189793 -13727516 -12367854 -10853897 -9814203 -10590760 -12206438 -11378998 -6857849
6150 -6857849 -1263063 2607223 4852272 6577108 7462829 6981942 5988812 5329296 4546921
6141 4546921 3467563 3250978 4205917 4355565 2146556 -876951 -2104854 -1297072 67576
6132 67576 1706122 4352110 7209279 8035111 6021349 2839400 488139 -572607 -940155
6123 -940155 -1189979 -1702465 -2683653 -3903117 -4781166 -4805777 -3687913 -1567028 448902
6114D48902J05063k611831l950130k941557p75019R72763J979455K670598L142575
6105i59181L084568K011550m37279l382330m268132j491730K484943L171132n2607
6096A60934k866417k310511r70324k043153l201216p047N949203P858815L351713
6087E921997j817996j983375R96142J937566L78146j82827J008145J076147j050552
6078F283393k886707k697237j752303j326915q91174m76834j484934l461557l184837
6069a1879105Q06160N231012N879970K488836k013761m997969n043849j834290
6061a1362996K500442M160484K260553M29047J372690K590951P82192k261332
6053D72031k491161k52868P60304j17059k91842N75305O3307j853474k163207
$$ plain form
6114 448902 553965 -2057866 -6007996 -8949553 -9724572 -8751809 -6772354 -4101756 -959181
6105 -959181 2125387 4136937 3699658 317328 -3950804 -5442534 -2957591 213541 160934
6096 160934 -2705483 -5015994 -5986318 -8029471 -11230687 -11237734 -5288531 2570284 5921997
6087 5921997 4104001 2120626 3116768 5054334 5432480 5249653 6257798 7333945 6283393
6078 6283393 3396686 699449 -1052854 -2379769 -3270943 -3747777 -5232711 -8694268 -11879105
6069 -11879105 -11072945 -5841933 38037 2526873 513112 -4484857 -9528706 -11362996
6061 -11362996 -8862554 -4702070 -2441517 -2012470 -639780 1951171 2733363 472031
6053 472031 -2019130 -2271998 -1511694 -1628753 -1920595 -1345290 -1281983 -3135457 -5298664
6044e298664k4209K001140K660000L335234L847872J940582j632293k589161J71871
6035D412372K154865J58968k931464l262512j694677r39748p98300L383M48270
6026b448843m99397r97719O55091K590791K414690J203683J017677R78882m45648
6017D469207j688780o43732J105156P26872r90348j372847q12024j580747k936942
6008c724185j985305J082583K859249J831287N926o20707j09062Q20375J509009
5999A669170J035314m75006j120060j04011K51387j887952m260156l843789j657675
5990a0392778l05117J008496M155924O671224M413041j103242l808482j669087
5982a030021J071326O44328k106388m681242n342841k561214L008619O208577
$$ plain form
6044 -5298664 -5322873 -3321733 -661733 2673501 6521373 8461955 6829662 4240501 4412372
6035 4412372 6567237 6726205 3794741 532229 -1162448 -2102196 -2900496 -2897113 -2448843
6026 -2448843 -2948240 -3945959 -3290868 -700077 1714613 2918296 3935973 4914855 4469207
6017 4469207 2780427 2136695 3241851 3968723 2978375 1605528 793504 -787243 -3724185
6008 -3724185 -5709490 -4626907 -1767658 63629 69555 -551152 -660214 160161 1669170
5999 1669170 2704484 2229478 1109418 1005407 1256794 -631158 -4891314 -8735103 -10392778
5990 -10392778 -10697895 -9689399 -5533475 1137749 5550790 4447548 639066 -1030021
5982 -1030021 41305 685633 -1420755 -6101997 -11444838 -14006052 -10997433 -4788856
5974d788856K666576l643467m511588M48840L174935L9050k733884J23651M472471
5965d752272M226651P13074j420486k289607m216143n267444k270174K431153
5957a2845248L773847J803503P41926J549387J271762p43889j500075M44726K897653
5948b606408L614006K374909m44894l889260n291989k795476J119283K215758
5940e704071N53259K24220K787850M814638L013260j425766m919254n408944l088095
5931i152903N78058L452773M037969K985421K064850J615240O29275q67032j595885
5922C747766j204652o13815j82587L67778L05530j344356l226528k620647L42964
5913d428547K197576J049598o64468q7796J706182J717828j31947r92775M28004
$$ plain form
5974 -4788856 -2122280 -5765747 -10277335 -9828495 -6653560 -6614510 -9348394 -9224743 -4752272
5965 -4752272 -525621 187453 -1233033 -3522640 -7738783 -13006227 -15276401 -12845248
5957 -12845248 -9071401 -7267898 -6525972 -4976585 -3704823 -4448712 -5948787 -5504061 -2606408
5948 -2606408 1007598 3382507 2937613 -951647 -6243636 -9039112 -7919829 -5704071
5940 -5704071 -5150812 -4926592 -2138742 2675896 5689156 4263390 -655864 -6064808 -9152903
5931 -9152903 -8574845 -5122072 -1084103 1901318 3966168 5581408 6210683 5343651 3747766
5922 3747766 2543114 1929299 1746712 2114490 2420020 1075664 -2150864 -4771511 -4428547
5913 -4428547 -2230971 -1181373 -1845841 -1933637 -227455 1490373 1358426 365651 793655
5904G93655J963072J229181j130906k709765k678030k189447j762332k38315K731710
5895c991177M759188L224794q49135l544533k802312m17753J141871J652044J781755
5886I54742J052279r62724k919986l220753k278890j518392j049804j56903P72077
5877i328354P97091L32886N12216R73193K54009j601286k636333j560377N57905
5868a1699050J602222P04345q72639q23948J754372M719969M706512J176413k654995
5859a386799l788325k746201j689832j063689p7518R31462R62508L13450k5901
5850h570845j98269p84374j185778o86503j09319k57255J29937K287450M373363
5841e001593L580052O91606p34200L72695J414904N37519r57481j422954j249282
$$ plain form
5904 793655 2756727 3985908 2855002 145237 -2532793 -4722240 -6484572 -6722887 -3991177
5895 -3991177 768011 3992805 3143670 -400863 -3203175 -3620928 -2479057 -827013 954742
5886 954742 2007021 1044297 -1875689 -5096442 -7375332 -8893724 -9943528 -10100431 -9328354
5877 -9328354 -8531263 -8198377 -7686161 -6712968 -6458959 -8060245 -10696578 -12256955 -11699050
5868 -11699050 -10096828 -9392483 -10265122 -11089070 -9334698 -4614729 91783 1268196 -1386799
5859 -1386799 -5175124 -7921325 -9611157 -10674846 -10752364 -9820902 -8858394 -8544944 -8570845
5850 -8570845 -8769114 -9553488 -10739266 -11425769 -11535088 -11792343 -11662406 -9374956 -5001593
5841 -5001593 -1421541 -729935 -1464135 -1091440 323464 860983 -96498 -1519452 -2768734
5832b768734j265945j059282q7492J254784K483481L388574L266765J650303n7172
5823F805282R3215J372301J021755j312311k611429j138314O57167j96857k671634
5814B019175l157435l67644L082351L678076N18133l877113n779249l761241j43253
5805g788200J669641R66814k02920k01346O35742J374939J592394J061503j8907
5796i10340n78099m5681L14915o55022j542898l42914J933849K762975K478614
5787C415399L227859L948930J295411l749926n575243k265822R94705p4591k413706
5778a196984j426054J145751O51426k167809k441907O41717K852433J997654N76234
5769F32461O27865Q53732L27223O30131K076337J631351k373222o259044n306180
$$ plain form
5832 -2768734 -4034679 -5093961 -5181453 -3926669 -1443188 1945386 5212151 6862454 6805282
5823 6805282 6898497 8270798 9292553 7980242 5368813 4230499 4887666 4690809 2019175
5814 2019175 -1138260 -1505904 1576447 5254523 5772656 1895543 -3883706 -7644947 -7788200
5805 -7788200 -6118559 -5151745 -5354665 -5556011 -4920269 -3545330 -1952936 -891433 -910340
5796 -910340 -1488439 -1534120 -1219205 -1874227 -3417125 -3760039 -1826190 936785 3415399
5787 3415399 6643258 10592188 11887599 8137673 2562430 296608 1291313 1216722 -1196984
5778 -1196984 -2623038 -1477287 -825861 -2993670 -5435577 -4793860 -1941427 56227 632461
5769 632461 1260326 2114058 2441281 3071412 5147749 6779100 4405878 -1853166 -7159346
5760g159346n49524K324653O16476k187798j763305J311352L232535K584589J362951
5751b27417R01146R6996j395504j483875N98857J695758o85703l392990j770776
5742e663508K447769K913192j426876m153360j058285L718026M625438K668142
5734D070538J791372J521046r83703m175437l607329P41026M099944L750126J499237
5725H706820o26334k474902l212370j347667J643160J921707j069902l286680
5717B53832j946859P19767J383394J88809o62236m34456J12061M27984K80989
5708C23285l90946p13847M50756K422003L147656K195636J118534M78072q13388
5699H217761k621595l184437k598675l346532n722981o161524k504189K092084
$$ plain form
5760 -7159346 -7708870 -5384217 -4767741 -6955539 -8718844 -7407492 -4174957 -1590368 -227417
5751 -227417 673729 770725 -624779 -2108654 -1509797 185961 -499742 -3892732 -5663508
5742 -5663508 -3215739 -302547 -1729423 -5882783 -6941068 -3223042 1402396 4070538
5734 4070538 5861910 7382956 6399253 2223816 -1383513 -642487 3457457 7207583 8706820
5725 8706820 8080486 5605584 2393214 1045547 2688707 4610414 3540512 253832
5717 253832 -1693027 -973260 410134 598943 -63293 -497749 -385688 42296 323285
5708 323285 -67661 -781508 -330752 2091251 5238907 7434543 8553077 9031149 8217761
5699 8217761 5596166 2411729 -186946 -3533478 -9256459 -15417983 -17922172 -15830088
5691a5830088L421365J979166J355716K713076L967753L339975J113058j274981
5683G85040k028669k27682K149932J529666k073639l992442j681698Q07907p77232
5674e508817l255466p07029N003215N607744j085031p129908n569060K96376K909551
5665i438425J252657L89253K651554M759978L631882P51659n75568K52982J024585
5656D700557Q9007j498671j469451M55471J805540N48285j917104k644067j400518
5647a330951o21192j171512j174898J61749P93836l98577j153613M13190K240307
5638b241661J526541o12300j048393L97630J434842J524265J838002J758623n07364
5629D070185l862046m885037l012241j314609j206394k87097K905330N625707
$$ plain form
5691 -15830088 -12408723 -10429557 -9073841 -6360765 -2393012 946963 2060021 785040
5683 785040 -1243629 -1471311 678621 2208287 134648 -3857794 -5539492 -4731585 -5508817
5674 -5508817 -8764283 -9471312 -4468097 1139647 54616 -7075292 -12644352 -12347976 -9438425
5665 -9438425 -8185768 -7796515 -5144961 -384983 3246899 3998558 3422990 3675972 4700557
5656 4700557 4789564 3290893 1821442 2276913 4082453 4630738 2713634 69567 -1330951
5647 -1330951 -1952143 -3123655 -4298553 -4136804 -3342968 -3741545 -4895158 -4481968 -2241661
5638 -2241661 -715120 -1327420 -2375813 -1978183 -543341 980924 2818926 4577549 4070185
5629 4070185 208139 -4676898 -7689139 -9003748 -10210142 -10497239 -7591909 -1966202
5621a966202M809077J459281j285236k234648k003506q82939O54156J011513m81163
5612i19667j862134j103182Q45611J703745J269952Q83619O24673m10987j741805
5603g10175j874449p81365O6477j6692l21096j69434M68578J348255J754719P84891
5593E49709j001212j527124k28210N56356r24221k894087l000365k077980j837595
5584a2384729r36270K436465N575033L973358j270470m008814j767565J111597
5576g271395O22061j394947j378812L96813J501753J478801J193333M31076j008358
5567e429675j752814q87993K10450J86992j13911J76687j14841j668849k346028
5558a1739982k66684K714349L627412K776482K327233K050250R8773k838352l830956
$$ plain form
5621 -1966202 2842875 4302156 3016920 782272 -1221234 -2104173 -1450017 -438504 -919667
5612 -919667 -2781801 -3884983 -3039372 -1335627 -65675 817944 1442617 1031630 -710175
5603 -710175 -2584624 -3365989 -3299512 -3316204 -3637300 -3806734 -3338156 -1989901 -235182 549709
5593 549709 -451503 -1978627 -2206837 -1650481 -2574702 -5468789 -8469154 -10547134 -12384729
5584 -12384729 -13320999 -10884534 -5309501 -1336143 -2606613 -6615427 -8382992 -7271395
5576 -7271395 -6649334 -8044281 -9423093 -9026280 -7524527 -6045726 -4852393 -4421317 -5429675
5567 -5429675 -7182489 -8070482 -7860032 -7673040 -7786951 -7610264 -7725105 -9393954 -11739982
5558 -11739982 -12006666 -9292317 -5664905 -2888423 -561190 1489060 1587833 -1250519 -5081475
5549e081475k035619M04523J806960K438143K529226J678566N35058L79511N96801
5540C251694q06691l581359m826016l210014j032765n29804l79156J899057N501194
5531c713860O907442M684935J442238J96067M35686n54127l104894m140445j633191
5522E19851J810568K021466r02260k587054n40093K396393K126699j226395l855525
5513b36350l167522m46414R58990q33668m135002m956848j363851L649106N350820
5504e180739L124676O35820J77173K90149k10149Q3815J525327J501144r41002
5495A006214k333686k78647J844463J05204l109997k730850P35811K393611J131236
5486a236641M91032J552565J111773j907072l755503j679322J942712L497444
$$ plain form
5549 -5081475 -7117094 -6712571 -4905611 -2467468 61758 1740324 2275382 2654893 3251694
5540 3251694 2445003 -1136356 -5962372 -9172386 -10205151 -10734955 -11114111 -9215054 -3713860
5531 -3713860 3193582 7878517 9320755 9516822 9952508 9398381 6293487 2153042 519851
5522 519851 2330419 4351885 3449625 862571 322478 2718871 4845570 3619175 -236350
5513 -236350 -3403872 -3850286 -2891296 -3724964 -7859966 -12816814 -14180665 -10531559 -5180739
5504 -5180739 -2056063 -1420243 -1243070 -952921 -1163070 -1079255 446072 1947216 1006214
5495 1006214 -1327472 -1606119 238344 343548 -2766449 -5497299 -4761488 -2367877 -1236641
5486 -1236641 -745609 806956 1918729 11657 -3743846 -5423168 -3480456 16988
5478A6988K614798P44494j498128l461151l643593j784818K76283J225887J770806
5469c738434K594255L077685K887136K449835J190381j926533n234009m896472
5461c596156k31017M196580L774439p57830m734864m850838j807417J001194P17439
5452f288470j943508l060043m28921K939229K900151M22465k98407Q80757M4753
5443d831994l032805l186218J790404O595050N773662J167980j948561k395702
5435f8184k361355k181449o47212J263013J400742K95100L17155J649789K240644
5426A908243J255239j68692j203418k038258k627721k501598j418382P92549L881057
5417b120981N880787M237032m24778l925913l613365j518649o87874r88307p96117
$$ plain form
5478 16988 2631786 3376280 1878152 -1582999 -5226592 -7011410 -6735127 -5509240 -3738434
5469 -3738434 -1144179 1933506 4820642 7270477 8460858 6534325 1300316 -3596156
5461 -3596156 -3827173 369407 4143846 3386016 -1348848 -6199686 -8007103 -7005909 -6288470
5452 -6288470 -8231978 -11292021 -11720942 -8781713 -5881562 -5459097 -5757504 -4876747 -4831994
5443 -4831994 -7864799 -11051017 -9260613 -2665563 3108099 4276079 2327518 -68184
5435 -68184 -2429539 -4610988 -5258200 -3995187 -2594445 -2299345 -1982190 -332401 1908243
5426 1908243 3163482 2994790 1791372 -246886 -2874607 -5376205 -6794587 -6002038 -2120981
5417 -2120981 3759806 7996838 7572060 3646147 32782 -1485867 -2173741 -3162048 -3958165
5408c958165k28808l0225M61371J578816J780255L55851p72680n03903q79133
5399b196621k949702l619443n07286L139972K999820M53247k59118P16935J70362
5390b051834j401345o97301J536632J192026j479788j509628K129524L948002
5382A666288M99960m198264n151506l478921l039546l716608k581686M32758K276685
5373a7290840J443814k61076m31580J522183M375627O066933N189772K660060
5365C274893J183219J987616K920374J080257l155057o028803m466057M59441
5357b744117M455496M312058R70224k025832k685178k025166j489422q42885N07408
5348a567414J913969K527272K390016J359255j085839l631892l350550k24622
$$ plain form
5408 -3958165 -4186973 -4217198 -3755827 -2177011 -396756 -40905 -813585 -1317488 -2196621
5399 -2196621 -5146323 -8765766 -9273052 -6133080 -3133260 -2680013 -2939131 -2222196 -2051834
5390 -2051834 -3453179 -4150480 -2613848 -1421822 -2901610 -4411238 -2281714 1666288
5382 1666288 2166248 -2032016 -7183522 -10662443 -13701989 -17418597 -20000283 -19567525 -17290840
5373 -17290840 -15847026 -16108102 -16539682 -15017499 -10641872 -4574939 614833 3274893
5365 3274893 4458112 6445728 9366102 10446359 7291302 1262499 -3203558 -2744117
5357 -2744117 1711379 6023437 6993661 4967829 2282651 257485 -1231937 -2074822 -1567414
5348 -1567414 346555 2873827 5263843 6623098 5537259 1905367 -1445183 -1669805
5340a669805J443994q44079l173509q02822M128943N589176K781752N79013J285582
5331I318245J920924M84147p93487l25009k78177k254460l990400l168973j196850
5322b84040m95864q38122q96902r72441j745485k385308k042357j424173j181784
5313a2266476n94358P28321J918786K873756M707610O748283N965791J555227
5305A1636940k524361k273319J010673K780965J212450j422205k468444j756519
5297F196180j020011j768161l502907l796716j178451K231360K991757J253012
5289A406063N67935K226863L150751R23973k360874l488708k498967j191821J88559
5280a076226J995458L001628K050246L32390m78294q48564j850285k690329k204117
$$ plain form
5340 -1669805 -225811 -1069890 -4243399 -5046221 -917278 4671898 7453650 8032663 9318245
5331 9318245 11239169 11723316 10929829 10604820 10326643 8072183 4081783 912810 -284040
5322 -284040 -779904 -1618026 -2514928 -3487369 -5232854 -7618162 -9660519 -11084692 -12266476
5313 -12266476 -12860834 -12132513 -10213727 -7339971 -2632361 4115922 10081713 11636940
5305 11636940 9112579 6839260 7849933 10630898 11843348 10421143 7952699 6196180
5297 6196180 5176169 3408008 -94899 -3891615 -5070066 -2838706 153051 1406063
5289 1406063 1973998 4200861 7351612 8275585 5914711 2426003 -72964 -1264785 -1076226
5280 -1076226 919232 3920860 5971106 6303496 5825202 4976638 3126353 436024 -1768093
5271a768093j211280r64910q96766l56771p33813k956545m600988k799167J179887
5262a5108446L533923L164948K097771J534465R12365L73850P05282R67643m68166
5253b286365k527937k480516n95196j49138k024360k940639o36025K406618K622766
5244h610792L60003j180211l92395J528215K731888K177353j70307k875692l497800
5235i929738j188959J735353K429121J165928N17848J241204J319289l79317j798844
5226d888115n67648K405322M127449L441109J771297M36915o21941j400818j335777
5217C367793q01741j066456j995811j869696m23847K39104q34827j515524k05383
5208e106388J068034l4187j855233j165442J568360K999773K091791Q08820J86477
$$ plain form
5271 -1768093 -2979373 -3944283 -4841049 -5197820 -5931633 -8888178 -13489166 -16288333 -15108446
5262 -15108446 -11574523 -8409575 -6311804 -4777339 -3864974 -3491124 -2785842 -1818199 -2286365
5253 -2286365 -4814302 -7294818 -7890014 -8039152 -10063512 -13004151 -13640176 -11233558 -8610792
5244 -8610792 -8250789 -9431000 -9823395 -8295180 -5563292 -3385939 -3556246 -6431938 -9929738
5235 -9929738 -11118697 -9383344 -6954223 -5788295 -5270447 -4029243 -2709954 -3089271 -4888115
5226 -4888115 -5455763 -3050441 1077008 4518117 6289414 6726329 6104388 4703570 3367793
5217 3367793 2566052 1499596 -496215 -2365911 -2789758 -2550654 -3385481 -4901005 -5106388
5208 -5106388 -4038354 -4072541 -5927774 -7093216 -5524856 -2525083 -433292 375528 562005
5199E62005n21679r93405M6176J728900J776283N71342P28804K251719K128861
5190H279006n25538k975106l479313l366441l367568k139058M195J90446k095640
5181i475017l226657q95079K343380L301948K331313J031862m18388j309849K26356
5172f090131L281907L759031Q08100p22884K227024N474717L934850o39247l093481
5163H939886k541933j554637q26930N6696o87013m043493o184828l094001K577852
5154g358401M770185K543972q7784j206617j917008j466348K056369O271206O001555
5145I607129R64192l477303m054315k945602k501010j776172J37789J862104K568899
5136C85711L322696M173323L367096O53486j816338k746116k766689j939073K49210
$$ plain form
5199 562005 40326 -953079 -906903 821997 2598280 3169622 3898426 6150145 8279006
5190 8279006 7753468 4778362 1299049 -2067392 -5434960 -7574018 -7569823 -7379377 -9475017
5181 -9475017 -12701674 -13596753 -11253373 -7951425 -5620112 -4588250 -5006638 -6316487 -6090131
5172 -6090131 -2808224 950807 1758907 1036023 3263047 8737764 12672614 12033367 8939886
5163 8939886 6397953 4843316 4016386 4073082 3386069 -657424 -6842252 -9936253 -7358401
5154 -7358401 -2588216 -44244 -132028 -1338645 -3255653 -4722001 -2665632 3605574 9607129
5145 9607129 10571321 7094018 3039703 94101 -2406909 -4183081 -4045292 -2183188 385711
5136 385711 3708407 7881730 11248826 11902312 10085974 7339858 4573169 2634096 2883306
5127B883306K064238P18523k819205m188458j915599N26929K45570j305455j777763
5118e567914j580746j890680j876444k77470K088787L215431K202130q1764j553113
5109e321783l73792K578781L559700N19978l325850l429218j91650K277677K536439
5100a169718K552416K747519J288830j455260k627329j728848j149717j244597
5092b786704J95131K677357K575366m15546j714221R15975L585531K594323o7358
5083G559854q00539J02079N01141L34211k7792j968469n342369n967792p22847
5074f332523O727368R371609N082873j830414o462386p649126o818989n273096
5066a3184684l302628p69330J974096L816557M010891L216136K452987J695855
$$ plain form
5127 2883306 4947544 5666067 2846862 -1341596 -3257195 -2730266 -2484696 -3790151 -5567914
5118 -5567914 -7148660 -9039340 -10915784 -11193254 -9104467 -5889036 -3686906 -3768670 -5321783
5109 -5321783 -5695575 -3116794 442906 962884 -2362966 -5792184 -5983834 -3706157 -1169718
5100 -1169718 1382698 4130217 5419047 3963787 1336458 -392390 -1542107 -2786704
5092 -2786704 -2591573 85784 2661150 2245604 531383 1447358 5032889 7627212 7559854
5083 7559854 6759315 6861394 7362535 7696746 7668954 5700485 358116 -5609676 -6332523
5074 -6332523 394845 9766454 14849327 13018913 6556527 -1092599 -7911588 -13184684
5066 -13184684 -16487312 -17256642 -15282546 -11465989 -7455098 -4238962 -1785975 -90120
5058i0120R15149J335951L356453M448861K290178r49560j175146J386388K714389
5049A4232543J548076P23860J531550J607908l28306k167287k395982k350772
5041A2401590l058173l646235l943498m622019m077228K9662N182695N438679
5033C705473J58050m181721l105142L68416J851841J596980J242275J0599k084399
5024d37628k090743R68398L371637K341973K1108j254875k561854l951846k243342
5015e837172K492248M253949K15823l330951m66571M322627L110321k737617n110845
5006c088188j819319J560509J423858J12250M8650M18626M93441J073096J837469
4997B060392J341180o0118p04954p06085j318261k000726j314250J35653O07029
$$ plain form
5058 -90120 825029 2160980 5517433 9966294 12256472 11306912 10131766 11518154 14232543
5049 14232543 15780619 16504479 18036029 19643937 19315631 17148344 14752362 12401590
5041 12401590 9343417 5697182 1753684 -2868335 -6945563 -6915901 -1733206 3705473
5033 3705473 3863523 -318198 -3423340 -3054924 -1203083 393897 1636172 1646771 -437628
5024 -437628 -2528371 -1559973 1811664 4153637 4174745 2919870 358016 -3593830 -5837172
5015 -5837172 -3344924 909025 1124848 -2206103 -2672674 1649953 4760274 2022657 -3088188
5006 -3088188 -4907507 -3346998 -1923140 -1810890 -1762240 -1343614 -850173 222923 2060392
4997 2060392 3401572 3341454 2636500 1930415 612154 -1388572 -2702822 -2567169 -1960140
4988a960140M766p34738j365643j169061J358433N031366N445387J235327k640960
4979E204737j804557J016286J005066q44528m88633J445362R38009k152327l960493
4970C58922k756783k31717K162109L551452K016210k480946n259363k247233L257598
4961a629751M433186L92952l512516l976064k822756j941677l92752K400480M434074
4952b614824L466540k90800m067665m478129j030586J978968J15895m259681m392286
4943a5572568N42107L775549J875051m5825K015958L887307J500210j250668O1953
4934c210926J946655k33665l274624k188252N27003K17698q88441J170652L377419
4925b556481J398909j407873k00910J620143j035105m268759j925286K401317
$$ plain form
4988 -1960140 -1955374 -2690112 -4055755 -5224816 -3866383 1164983 6610370 7845697 5204737
4979 5204737 3400180 4416466 5421532 4577004 4088371 5533733 6471742 4319415 358922
4970 358922 -2397861 -2629578 -467469 3083983 5100193 2619247 -2640116 -4887349 -1629751
4961 -1629751 2803435 3196387 -316129 -4292193 -7114949 -9056626 -9449378 -7048898 -2614824
4952 -2614824 851716 560916 -3506749 -7984878 -9015464 -7036496 -6920601 -11180282 -15572568
4943 -15572568 -15030461 -11254912 -9379861 -9425686 -7409728 -3522421 -2022211 -3272879 -3210926
4934 -3210926 -1264271 -1497936 -4772560 -6960812 -6433809 -6216111 -7104552 -5933900 -2556481
4925 -2556481 -1157572 -2565445 -2766355 -1146212 -2181317 -6450076 -8375362 -5974045
4917e974045J589863j938176j365328J392566L37089j810881J155853N567287
4909a045772L708670j379570j267527K203430J539399j010248J321585M322458
4901H392425k0208n920396k447667N027006K934667n182988m404117L656540L527445
4892E562707m977814o483933R55338L607119k40039J396870O804546J997001q453905
4883A67890n472285O675377M093940j0672325r493245O665349M412999j7069728
4875b0692028j7884738j38156k8582046j17740430j65504588p9022561P7075014
4868c52489533J50056789R6939579J9949649N854706K6122914K1917578J101051
4861c0547267L78650J2652643R086255m522874l907575O569002N916475l325166
$$ plain form
4917 -5974045 -4384182 -6322358 -7687686 -6295120 -5958031 -7768912 -6613059 -1045772
4909 -1045772 2662898 1283328 15801 2219231 3758630 2748382 4069967 8392425
4901 8392425 8372217 2451821 4154 5031160 7965827 2782839 -1621278 2035262 5562707
4892 5562707 584893 -5899040 -4943702 -1336583 -1576622 -179752 6624794 8621795 167890
4883 167890 -5304395 1370982 5464922 -5207403 -14700648 -8035299 -3622300 -20692028
4875 -20692028 -38576766 -38714922 -67296968 -185037398 -350541986 -429564547 -352489533
4868 -352489533 -202432744 -105493165 -85543516 -79688810 -53565896 -31648318 -30547267
4861 -30547267 -30168617 -17515974 -8429719 -12952593 -16860168 -10291166 -4374691 -7699857
4853g699857m081199J462553L1092m029857J537529J0038530O923955k391803
4845A790943k572719K923209n29535r855123r081672J793524P337525L372788
4837d821060M39708K022566N79156m693698n595665j412591k90217l114175k156366
4828a9042342L114387M327663n6434j851560J773330L786548P19752j576047J023505
4819g781198M541781M808617L023398J035120j325190k861729j968119j196226
4811a723546l960630p404686n915381o35230K353563K117049K840855M705498
4803g622508L530919n93528k678874j242379J90803K24331J075996K794529K785289
4794a535422J177650M85218M48208q15457j819159j65707J759914K97635k284069
$$ plain form
4853 -7699857 -11781056 -10318503 -10287411 -14317268 -12779739 -2741209 4182746 1790943
4845 1790943 -781776 2141433 1611898 -8243225 -17324897 -15531373 -8193848 -4821060
4837 -4821060 -4381352 -2358786 -1779630 -6473328 -12068993 -13481584 -13771801 -16885976 -19042342
4828 -19042342 -15927955 -11600292 -11656726 -13508286 -11734956 -7948408 -7228656 -8804703 -7781198
4819 -7781198 -3239417 1569200 4592598 5627718 4302528 1440799 -527320 -1723546
4811 -1723546 -5684176 -13088862 -19004243 -19639473 -17285910 -15168861 -12328006 -7622508
4803 -7622508 -4091589 -4685117 -7363991 -8606370 -8415567 -8191236 -7115240 -4320711 -1535422
4794 -1535422 -357772 127446 575654 -239803 -2058962 -2224669 -464755 -167120 -2451189
4785b451189j318751J655050J649470n00442j45077J678426R786l838529l585176
4776f846432O18027J876611j533097l521178j115522J133105J41711p32327J249181
4767h729921L485875L378157K109642P83496j333795l108365k049320L59432M6441
4758e058358k255694j851945J065570J133292k291399l052898J630690O549235
4750d131507O837973L860011J74008m133485p264471n296521N57146L306968M59454
4741e630424k001871K32601K859763J020368k412420k380668n192N19643q92162
4732h690362j630785j506529j614611j100860Q16083K428116K476849K398511
4724f423588K873463J925290p07440j554699J022404L534909L012467J582182
$$ plain form
4785 -2451189 -3769940 -2114890 -465420 -965862 -1110939 567487 577273 -3261256 -6846432
4776 -6846432 -6228405 -4351794 -5884891 -9406069 -10521591 -9388486 -9246775 -9979102 -8729921
4767 -8729921 -5244046 -1865889 243753 1027249 -306546 -3414911 -5464231 -5104799 -5058358
4758 -5058358 -7314052 -9165997 -8100427 -6967135 -9258534 -12311432 -10680742 -4131507
4750 -4131507 2706466 6566477 6740485 2607000 -4657471 -9953992 -9396846 -6089878 -5630424
4741 -5630424 -7632295 -7399694 -4539931 -3519563 -5931983 -8312651 -8317843 -7798200 -8690362
4732 -8690362 -10321147 -11827676 -13442287 -14543147 -13727064 -11298948 -8822099 -6423588
4724 -6423588 -3550125 -1624835 -2332275 -3886974 -2864570 670339 3682806 5264988
4716E264988J788597J806732n26021k989897k655141p08724M25598J195255K221794
4707E823181J362450k235768m885963l695746j564497k142198l372230j326196
4699a2036967K601293L939129K282583P80690L04253o97432j980402k064575j791007
4690h662435k703660l072293j79037M298098N732318K990602n71551k225342k326720
4681f720020j922959j207546l10163P87284K475346L771767K177280k261156n090230
4672h300397k957817J187202K149952k10155j855462j102911K21721J159825K611579
4663g096463M173693L976556J881395k24850j162080r93796J90677J437376N00295
4654B682803k658579l912261k64765M851518N875373K843317k7446j605273l780938
$$ plain form
4716 5264988 7053585 8860317 8334296 5344399 2689258 1980534 2406132 3601387 5823181
4707 5823181 7185631 4949863 63900 -3631846 -5196343 -7338541 -10710771 -12036967
4699 -12036967 -9435674 -5496545 -3213962 -2433272 -2129019 -2826451 -4806853 -6871428 -8662435
4690 -8662435 -11366095 -14438388 -14617425 -10319327 -4587009 -1596407 -2167958 -4393300 -6720020
4681 -6720020 -8642979 -9850525 -10160688 -9373404 -6898058 -3126291 -949011 -3210167 -8300397
4672 -8300397 -11258214 -10071012 -7921060 -8131215 -9986677 -11089588 -10867867 -9708042 -7096463
4663 -7096463 -2922770 1053786 2935181 2710331 1548251 554455 745132 2182508 2682803
4654 2682803 24224 -3888037 -4152802 698716 6574089 9417406 9389960 7784687 4003749
4645D003749n318100k693835K484975L791376m52667m124796k506798J047725
4637c768371J153489j614296k937640j541010M39582J648668K362471K540177
4629a716930J981896J431924J389374R79283k92115j112799l22788J227392K236414
4620E801651K655379K477006R42384j401584k167607o64161M27176o89887j580868
4611E799489K56949K281260L70383l914997m654724m54481K955793Q58797l772036
4602b73567m627843l82571M495627N699510K955205j199265l864859l308956k90038
4593g96757K098701J556503p30886k077237k109019k223581k012771K96883L503375
4584b494789L402960j169104n628124n481666k101854K69150P52332J372198K225101
$$ plain form
4645 4003749 -1314351 -4008186 -1523211 2268165 1815498 -2309298 -4816096 -3768371
4637 -3768371 -2614882 -4229178 -7166818 -8707828 -8268246 -6619578 -4257107 -1716930
4629 -1716930 264966 1696890 3086264 4065547 3773432 2660633 2337845 3565237 5801651
4620 5801651 8457030 10934036 11876420 10474836 8307229 7643068 8070244 7380357 5799489
4611 5799489 6056438 8337698 8708081 4793084 138360 -316121 2639672 3498469 -273567
4602 -273567 -4901410 -5283981 -788354 4911156 7866361 6667096 2802237 -506719 -796757
4593 -796757 1301944 2858447 2127561 50324 -2058695 -4282276 -6295047 -5998164 -2494789
4584 -2494789 908171 -260933 -5889057 -11370723 -13472577 -13203427 -12451095 -11078897 -8853796
4575h853796J467785n20779j160711l119O83222L9949k34162N50567R24661N47805
4565f558578J062095K392551J753204j809743n031740m729627j881211N83717
4557a4219332J595478J597510Q65700K76301J416865L778930M134906J020329
4549D66687k359307k215294P34897K769229K042606m84226l358471n291014m787603
4540a2482496j634479J995352L664007K980244P76665k172120m375862l930234
4532a5178923j248208Q59910J317854K050253L525142L001656q9113j374437J802874
4523e332992M972648K918095j885951l209280r36317k58643k277569k548910O48579
4514g910340L260045K276430k1887p89036q17080j527787j672276J92330K602968
$$ plain form
4575 -8853796 -7386011 -7906790 -9067501 -9070620 -8387398 -8347449 -8581611 -8031044 -7106383 -6558578
4565 -6558578 -5496483 -3103932 -1350728 -3160471 -8192211 -12921838 -14803049 -14219332
4557 -14219332 -12623854 -11026344 -10160644 -9884343 -8467478 -4688548 -553642 466687
4549 466687 -1892620 -4107914 -3373017 -603788 1438818 954592 -2403879 -7694893 -12482496
4540 -12482496 -14116975 -12121623 -8457616 -5477372 -4700707 -6872827 -11248689 -15178923
4532 -15178923 -16427131 -15567221 -14249367 -12199114 -8673972 -5672316 -5761429 -7135866 -5332992
4523 -5332992 -360344 2557751 671800 -2537480 -3473797 -3732440 -6010009 -8558919 -7910340
4514 -7910340 -4650295 -2373865 -2395752 -3184788 -4001868 -5529655 -7201931 -7009601 -4406633
4505d406633K925523N76661k725017m521730l199798K53116K440255J571637K79156
4496f806830J676861M100741L681992R03404l35536L73343l97183k961533l241740
4487c006481m7754K161936M85619j591742M6922L839534N615797M509494K309706
4478A4323031o6509k036485j969777K68611J639042r4854k787319l171254j507946
4469D596540n1904Q51057J818598J622888r21780l609770l194108n09630K70958
4460H72849k427169n416567n144067j963380R71328J759296J638112K859383N099818
4451a750397N114727J134958l599602m391118j722088o73602l080416m551181
4443a3518719j469903L088438L964364J337372o96475q98397j518245k884717
$$ plain form
4505 -4406633 -1481110 -904449 -3629466 -8151196 -11350994 -11097878 -8657623 -7085986 -6806830
4496 -6806830 -5129969 -1029228 2652764 3556168 3220632 3593975 3196792 235259 -3006481
4487 -3006481 -3054235 -892299 -406680 -1998422 -1951500 1888034 7503831 12013325 14323031
4478 14323031 14256522 12220037 10250260 10518871 12157913 12063059 9275740 6104486 4596540
4469 4596540 4544636 5395693 7214291 8837179 7915399 4305629 1111521 601891 872849
4460 872849 -1554320 -6970887 -12114954 -14078334 -13107006 -11347710 -9709598 -6850215 -1750397
4451 -1750397 3364330 4499288 899686 -3491432 -5213520 -5887122 -8967538 -13518719
4443 -13518719 -14988622 -11900184 -7935820 -6598448 -7294923 -8193320 -9711565 -12596282
4435a2596282k072324K089619O172260O043331J763433k686867l588256p60418
4427e635504K640858L326243J219694o78003m8608K017921K757817J168031j390546
4418E377903l208756l561425k459979l46589J770301K527888J106499j625122
4410d19280k991773r12047K795401L359480p95442m782010l203246K178070M797439
4401B6592K422374r50215k265742k873994l621562k305040J376502L611951K562982
4392b016152J808893L873273N060006J541246l551680m671388k237232o35687
4384h28721m50160R93178K970866J875434j916578l800854k140578l06406n79715
4375d183534j014027J58813J424570J197995N40363P09748Q61586j4604j147994
$$ plain form
4435 -12596282 -14668606 -12578987 -6406727 -363396 1400037 -1286830 -4875086 -5635504
4427 -5635504 -2994646 331597 1551291 873288 824680 2842601 5600418 6768449 5377903
4418 5377903 2169147 -1392278 -3852257 -4198846 -2428545 99343 1205842 -419280
4410 -419280 -3411053 -4323100 -1527699 1831781 1036339 -3745671 -6948917 -4770847 26592
4401 26592 2448966 1498751 -766991 -3640985 -7262547 -9567587 -8191085 -4579134 -2016152
4392 -2016152 -207259 3666014 8726020 10267266 6715586 2044198 -193034 -828721
4384 -828721 -1278881 -285703 2685163 4560597 2644019 -1156835 -3297413 -3603819 -4183534
4375 -4183534 -5197561 -5038748 -3614178 -2416183 -1875820 -1166072 -304486 -319090 -1467084
4366a467084j491666j368791j481892j730521j707870j206061j50737Q45292N14998
4357i244332r80095j166666J384773M067985L349512j51084k703664k652741j208708
4348i305020J069082M542355P384372O416633J869524k212120l194865k349424
4340D220537j531811q08941l20789j054745k362472j816623Q61290K563112J243146
4331I92704r57846j056346M28056P71116o25505j486589n8479K284316K500046
4322B791473k68361l168465l137897j366894j690168m201810m298193m9069L755047
4313a1634337K653458l68714k4479K378990J770082j268276j583879Q94920Q88316
4304f293919k083327j765587L960023Q130158M878165j891225m891170l299162
$$ plain form
4366 -1467084 -2958750 -4327541 -5809433 -7539954 -9247824 -10453885 -10604622 -9759330 -9244332
4357 -9244332 -10224427 -11391093 -10006320 -5938335 -2588823 -2739907 -5443571 -8096312 -9305020
4348 -9305020 -8235938 -3693583 3690789 10107422 11976946 9764826 6569961 4220537
4340 4220537 2688726 1879785 1558996 504251 -1858221 -3674844 -2813554 -250442 992704
4331 992704 34858 -1021488 -593432 177684 -447821 -1934410 -1992889 291427 2791473
4322 2791473 2523112 -645353 -3783250 -5150144 -6840312 -11042122 -15340315 -15389384 -11634337
4313 -11634337 -8980879 -9349593 -9374072 -6995082 -5225000 -6493276 -8077155 -7182235 -6293919
4304 -6293919 -8377246 -10142833 -6182810 1947348 6825513 4934288 43118 -3256044
4296c256044j156101k05117M23445M59864p23969j689782j112825l58445q07758
4287h426732j059825K58139J587907J303490O58183R61503R07116k21649r3164
4278d125032K400726L878935J532019j784756j922508J12125Q29126N71751J853284
4269C345670L558170K440133q61459k667467k326619k339907k972689j891540
4261c715708P57352J791698J79437j454395j338806q14055j122000j279906l62008
4252g358391O97934P39303P0829j40881Q31639K430386K720689M94289j941311
4243a455514p24419L498801N136333J776259j468114K55171L554978K195544k773245
4234I995794m937857k653481l26650l79503p88344p13866j929055l749339k729849
$$ plain form
4296 -3256044 -4412145 -4617262 -4193817 -3733953 -4457922 -6147704 -7260529 -7618974 -8426732
4287 -8426732 -9486557 -9228418 -7640511 -6337021 -5678838 -4717335 -3810219 -4031868 -4125032
4278 -4125032 -1724306 2154629 3686648 1901892 -20616 91509 920635 1492386 3345670
4269 3345670 6903840 9343973 8482514 5815047 3488428 1148521 -1824168 -3715708
4261 -3715708 -2958356 -1166658 -987221 -2441616 -3780422 -4594477 -5716477 -6996383 -7358391
4252 -7358391 -6660457 -5921154 -5850325 -5991206 -5159567 -2729181 -8492 485797 -1455514
4243 -1455514 -2179933 1318868 6455201 8231460 6763346 7018517 10573495 12769039 9995794
4234 9995794 5057937 2404456 2077806 1698303 909959 196093 -1732962 -5482301 -8212150
4225h212150J136215L447893K166535K95048L36895R14993L51685r14259k574040
4216c051185m579436m506813n0460N288813N087501k68235l272638n29008K698341
4207c183120J896963j8449M39229P29787j984359m346942k264372J665487K408413
4198d657363N83117K40414J520852J497348O8203o32138q45346j901527k027045
4189f153485J248791N731245O671307L471416j45267j748080j785568p01655J171939
4180G760643J790905k63986k500470j713417N54085J32472l080723n147541m240836
4171f708868k150222k4486K544492M105197K046097k299783l811858n14018L377930
4162c435519L260358M3831j875473o57343J044175j62159l738063n214455j820291
$$ plain form
4225 -8212150 -7075935 -3628042 -1461507 -1166459 -829564 85429 437114 -477145 -3051185
4216 -3051185 -7630621 -12137434 -12187894 -6899081 -1811580 -2079815 -5352453 -5881461 -3183120
4207 -3183120 -1286157 -1304606 -865377 -135590 -2119949 -6466891 -8731263 -7065776 -4657363
4198 -4657363 -4074246 -3833832 -2312980 -815632 -747429 -1379567 -2224913 -4126440 -6153485
4189 -6153485 -4904694 826551 7497858 10969274 10824007 9075927 7290359 6588704 7760643
4180 7760643 9551548 9287562 6787092 5073675 5627760 5760232 2679509 -2468032 -6708868
4171 -6708868 -8859090 -8883576 -6339084 -2233887 -187790 -2487573 -6299431 -6813449 -3435519
4162 -3435519 -175161 -131330 -2006803 -2664146 -1619971 -1782130 -5520193 -10734648 -12554939
4153a2554939K974227L557857L73322q13547J478551K131265p60076j699171J590910
4144c721601K181937l384696n726289J734476N930304r319927l3386897l6439635
4136h2132328j0499378J7289278K1316352R363849M494602J0397832J3003795
4129a6765998P342027K744109L694967L371415j717338n060022k138080K100144
4121f428776K243752O9073j016762j728238l041717k891675n22670J174783Q30670
4112a1311560J069310L050314L685034J322194p11924M39801K613236K794676
4104B951081J699121R30108l78957k590774l011004n7426L247074L511875J693581
4095G994679K90336q21051k129837j663056J178019K278927j456672n709409m045302
$$ plain form
4153 -12554939 -9580712 -6022855 -5649533 -6463080 -4984529 -2853264 -3613340 -5312511 -3721601
4144 -3721601 -1539664 -4924360 -10650649 -8916173 -2985869 -12305796 -45692693 -82132328
4136 -82132328 -92631706 -75342428 -54026076 -44662227 -40167625 -29769793 -16765998
4129 -16765998 -9423971 -6679862 -2984895 386520 -1330818 -6390840 -8528920 -6428776
4121 -6428776 -4185024 -4115951 -5132713 -6860951 -9902668 -12794343 -13317013 -12142230 -11311560
4112 -11311560 -10242250 -7191936 -3506902 -2184708 -2896632 -2456831 156405 2951081
4104 2951081 4650202 5580310 5201353 2610579 -400425 -457851 2789223 6301098 7994679
4095 7994679 8285015 7463964 5334127 3671071 4849090 7128017 5671345 -38064 -4083366
4086d083366J988350M420143K18976n106451o143571l977636j970715l33072J957734
4077a3029608L702176L508368K742731L201899L691995K033442q35497j852729
4069C162777l13791J481545J960337J996341K427257K251990M98107j803836k976965
4060H683762k961750k736360k234070o58852J261335J385583o64611k170677p28256
4051h23896K124390K746744N04425j280910j17006J996277J279321k591511n855176
4042b017342n216157j544857J598737K301441K030598K829735L913590K655562
4034F551307j008121l320534j392082K493696L698245J416448r21315j191604
4026F326040j060297k119880l009357k250454j052194q80303o21086J074672K568945
$$ plain form
4086 -4083366 -2095016 2325127 2544103 -2562348 -8705919 -12683555 -14654270 -14987342 -13029608
4077 -13029608 -9327432 -5819064 -3076333 125566 3817561 5851003 5015506 3162777
4069 3162777 2848986 4330531 6290868 8287209 10714466 12966456 13464563 11660727 8683762
4060 8683762 5722012 2985652 751582 92730 1354065 2739648 2075037 -95640 -823896
4051 -823896 1300494 4047238 4551663 3270753 3153747 5150024 6429345 3837834 -2017342
4042 -2017342 -7233499 -8778356 -7179619 -4878178 -2847580 -17845 3895745 6551307
4034 6551307 5543186 2222652 830570 3324266 7022511 8438959 7517644 6326040
4026 6326040 5265743 3145863 136506 -2113948 -3166142 -4046445 -4667531 -3592859 -1023914
4017a023914J465761j258701k509707j641317p09480o78626m80388K38092M35465
4008f162815L646l9635q6094j750518m264888l924508J099352P327544R310048
3999A512132N592785R3289k135937j3111K501792Q35878m233705o528161k107309
3990d482347M746875O425583J933174k305722j823816N09019L34372j548050j845259
3981A943829o69416m71168j103134l92123J219666R00710j522738k634627o73777
3972c402778J459092L28127k993423m229699j485010K337578L035091J01937k658882
3963g507967j762519J575559L091182J317490n02950N46184K473948J353021k601980
3954b018032n167084m046528j472285k33330m2505P00662J896760K468867K464066
$$ plain form
4017 -1023914 441847 -816854 -3326561 -4967878 -5677358 -6355984 -6836372 -6598280 -6162815
4008 -6162815 -6159169 -6198804 -6284898 -8035416 -12300304 -16224812 -15125460 -7797916 1512132
3999 1512132 7104917 7198206 5062269 5049158 7550950 8386828 4153123 -2375038 -4482347
3990 -4482347 264528 6690111 8623285 6317563 4493747 5002766 5337138 3789088 1943829
3981 1943829 1274413 803245 -299889 -692012 527654 1428364 -94374 -2729001 -3402778
3972 -3402778 -1943686 -1615559 -4608982 -8838681 -10323691 -7986113 -4951022 -4849085 -7507967
3963 -7507967 -9270486 -7694927 -4603745 -3286255 -3789205 -3243021 -769073 583948 -2018032
3954 -2018032 -7185116 -11231644 -12703929 -12937259 -12979764 -12279102 -10382342 -7913475 -5449409
3945e449409K331145J228830j632650m479172m311319j182347J097917j66272
3937a2563277k596947j674913K952115O439426M804418J56533j987432K02953
3929d267124K869662K106493o53469r03237K353211N009100L473807m35198k178472
3920G374773q06021J86980j519872l572595k863997n82822k01912j647205j496153
3911e128824P95315J324692j713751m173512k157069J371719R89304k401139k902177
3902a3995442R18764L863438K266391j250000l081975l552238l764902k262532
3894b0858496J530924M352308L555645J438936J233592J750114K77138j959556
3886h679395k093278j122179j823766k842172o57605L360830M011328O74824j337770
$$ plain form
3945 -5449409 -3118264 -1889434 -3522084 -8001256 -12312575 -13494922 -12397005 -12563277
3937 -12563277 -15160224 -16835137 -13883022 -7443596 -2639178 -2482645 -4470077 -4267124
3929 -4267124 -1397462 709031 55562 -847675 1505536 6514636 9988443 9553245 7374773
3920 7374773 6568752 6755732 5235860 1663265 -1200732 -1783554 -1985466 -3632671 -5128824
3911 -5128824 -4333509 -3008817 -4722568 -8896080 -11053149 -9681430 -8692126 -11093265 -13995442
3902 -13995442 -13076678 -9213240 -6946849 -8196849 -11278824 -14831062 -18595964 -20858496
3894 -20858496 -19327572 -14975264 -11419619 -9980683 -8747091 -6996977 -6719839 -8679395
3886 -8679395 -10772673 -11894852 -13718618 -16560790 -17218395 -13857565 -9846237 -9171413 -10509183
3877a0509183Q10729L331409K279358p43585k172188j645182n43104J152363L340877
3868d698506M033084K303493O28488J178209J947988p3855l568184m307376j171929
3859c728588K454478L217419J159067j592615l362330l654478k804765j566669
3851i878481n45032Q7018K79999N6341j73451n0575K4414l01506j19128J477064
3841i143337L143833K594895K88771q45958J09223Q42739M8318m40846N35631
3832b866731R01317q29625k182698m73444K409709K624616K02312j403155o33392
3823b251091Q10675J447765J564131J300277J14129j499102k076729j346095n85468
3814b521508p92138j845051l002313k955880n17176L122489M372082J722573j384836
$$ plain form
3877 -10509183 -9698454 -6367045 -4087687 -4831272 -7003460 -8648642 -9191746 -8039383 -4698506
3868 -4698506 -665422 1638071 2266559 3444768 5392756 5318901 1750717 -2556659 -3728588
3859 -3728588 -1274110 1943309 3102376 1509761 -1852569 -5507047 -8311812 -9878481
3851 -9878481 -10423513 -10336495 -10056496 -10000155 -10173606 -10224181 -10199767 -10501273 -10620401 -9143337
3841 -9143337 -5999504 -3404609 -3115838 -3961796 -3852573 -3009834 -2961516 -3402362 -2866731
3832 -2866731 -1965414 -2795039 -4977737 -5451181 -3041472 -416856 -214544 -1617699 -2251091
3823 -2251091 -1440416 7349 1571480 2871757 2985886 1486784 -589945 -1936040 -2521508
3814 -2521508 -3313646 -5158697 -8161010 -11116890 -11634066 -8511577 -4139495 -2416922 -3801758
3805c801758j011085J508894J787649p39457k348232j221761K30377M5432k60097
3796e810038J067577K874673L097144J753559L99765J08253Q20870J323990j94264
3787E441529l746233o111247m363079m44297J029902n71127j338346N94768K353231
3778g154899J666136M24561M55699o1977k596864m225963j707145K848496M553471
3769e798485K509019K02343J11984J313300J831993N33957k568728n386197m442396
3760a1693210O16492M750245L316378j200326k436292P64094L392503K415144
3752g4972N15794L55004L00668j377074k470941p06583J658044J244486p30321
3743a285895m87441J944816K855949R94623p04153j39465J043007Q73367O3817
$$ plain form
3805 -3801758 -4812843 -3303949 -1516300 -2255757 -4603989 -5825750 -5595373 -5549941 -5810038
3796 -5810038 -4742461 -1867788 1229356 2982915 3382680 3490933 4311803 5635793 5441529
3787 5441529 1695296 -4415951 -8779030 -9223327 -8193425 -8764552 -10102898 -9508130 -7154899
3778 -7154899 -5488763 -5064202 -4608503 -4670480 -7267344 -11493307 -13200452 -10351956 -5798485
3769 -5798485 -3289466 -3087123 -2975139 -1661839 170154 704111 -1864617 -7250814 -11693210
3760 -11693210 -11076718 -6326473 -3010095 -4210421 -6646713 -5882619 -2490116 -74972
3752 -74972 440822 795826 1096494 -280580 -2751521 -3458104 -1800060 -555574 -1285895
3743 -1285895 -1773336 171480 3027429 4022052 3317899 3178434 4221441 5094808 5158625
3734E158625k86806j178521l458179n187435m078722j318576j45171j174669j823905
3725a3493359l45366K075001L604311L768796K451841p66856m873000o864038
3717a4442670m760059j84106L478700M613376L857052K223688M72875l76398K92208
3708d825334J696716K557036K536155J730933j52790k387023k272664J602436
3700D85465N717229M647250j649470o877808o262913k368454o26458j502421p22548
3691i160128L495379P201959N813489K9931n085810n820033l008317M1087J231859
3682e260584Q50329K34514L83807J493447K753774K669560P12924j344189j260147
3673A233435K73812J56867k270760l465610q70151K596195K569051m1188p13884
$$ plain form
3734 5158625 4871819 3693298 235119 -4952316 -9031038 -10349614 -10494785 -11669454 -13493359
3725 -13493359 -13838725 -11763724 -8159413 -4390617 -1938776 -2705632 -7578632 -14442670
3717 -14442670 -19202729 -19386835 -15908135 -11294759 -7437707 -5214019 -4741144 -5117542 -4825334
3708 -4825334 -3128618 -571582 1964573 3695506 3542716 1155693 -1116971 485465
3700 485465 6202694 10849944 9200474 2322666 -3940247 -6308701 -6935159 -8437580 -9160128
3691 -9160128 -5664749 1537210 7350699 7380630 2294820 -3525213 -6533530 -6492443 -5260584
3682 -5260584 -4410255 -4175741 -3791934 -2298487 455287 3124847 3837771 2493582 1233435
3673 1233435 1507247 1664114 -606646 -4072256 -4942407 -2346212 222839 181651 -532233
3664e32233J058043R57923k505157m764726k205588J955747K575445K70673j90168
3655c380041K468111M419246K615782j353457m031482m192648l154175k450686
3647i059350k083218p58497K071794M542748M061013J049005r78047k01574Q87716
3638d68410m27548k646822k535019m25430L64385j229380k663478j829679K74400
3629a1586981J430965P74491q60214j738602o03541J491913J696514p07633k492450
3620a2595538r92675J439691R66974j310748j020219K022532L198225N66961k174344
3611i899141j866121j96159N50433J496449L722052M859792L067207J082952J962483
3602D779947L476895J613829k309528l402079j166430j22248k133164l600695
$$ plain form
3664 -532233 525810 1483733 -1021424 -5786150 -7991738 -6035991 -3460546 -3189873 -3380041
3655 -3380041 -911930 3507316 6123098 4769641 738159 -3454489 -6608664 -9059350
3647 -9059350 -11142568 -11901065 -9829271 -5286523 -1225510 -176505 -1154552 -1356126 -468410
3638 -468410 -895958 -3542780 -6077799 -6503229 -6138844 -7368224 -10031702 -11861381 -11586981
3629 -11586981 -10156016 -9381525 -10241739 -11980341 -12583882 -11091969 -9395455 -10103088 -12595538
3620 -12595538 -13588213 -12148522 -11181548 -12492296 -13512515 -11489983 -8291758 -7724797 -9899141
3611 -9899141 -11765262 -11961421 -11410988 -9914539 -6192487 -1332695 1734512 2817464 4779947
3602 4779947 8256842 9870671 7561143 4159064 2992634 2870386 737222 -2863473
3594b863473j971591m8852q53296k184977l11068L441043M213855Q37376k654510
3585b395493l075100j947382j864910k047864j48781L209866M765595L258344
3577b45725J061345M84495O62059m82056k744523l938609k912190o06468J505396
3568g216276K557732K211450R95238N33523J778780L068118J797557j712472m038833
3559b5183l096154q45302l32073j627638k366540j285832N59042J768180K305021
3550d946479L012633M134113M524340K485598j956922n769231n377319j026958
3542d920225K814542K532308m46714j981176o42381J107542P68418j101571k071715
3533c940972q98446J224459K030005N54351j792363k815028k130134j257005r46479
$$ plain form
3594 -2863473 -4835064 -4883916 -5737212 -7922189 -8233257 -4792214 -578359 259017 -2395493
3585 -2395493 -5470593 -7417975 -9282885 -11330749 -11479530 -8269664 -3504069 -245725
3577 -245725 815620 1300115 1962174 1480118 -1264405 -5203014 -8115204 -8721672 -7216276
3568 -7216276 -4658544 -2447094 -1451856 -918333 860447 3928565 5726122 4013650 -25183
3559 -25183 -3121337 -3966639 -4298712 -5926350 -8292890 -9578722 -9019680 -7251500 -4946479
3550 -4946479 -1933846 2200267 6724607 9210205 7253283 1484052 -3893267 -4920225
3542 -4920225 -2105683 426625 -20089 -2001265 -2643646 -1536104 -767686 -1869257 -3940972
3533 -3940972 -4839418 -3614959 -1584954 -1030603 -2822966 -5637994 -7768128 -9025133 -9971612
3524i971612L655K242559L779001K335120j113063l296520k766534q76249J175211
3515h488432L616575N713150M870674K11973m688408n321826j978727O35739j63174
3506e592456j636214j86306K868111L033191n14628l244215j498121K481611L937077
3497c51950J877870q67424k419969l181711k995344r21739J625611J437876j373012
3488g169792k529131Q596K426761R38931k024038j715174J227784K029148l23954
3479g130869j715754J97082K596424K405918M30242j246972k315004k513748l44389
3470i637070L678108N463096K438856j980279k623409L31992K300871J299668
3462A271833k22192n02635j023292k689598l330357j327947J169902J471525O99942
$$ plain form
3524 -9971612 -9967957 -7725398 -3946397 -1611277 -2724340 -6020860 -8787394 -9663643 -8488432
3515 -8488432 -4871857 841293 5711967 5923940 1235532 -4086294 -6065021 -5429282 -5592456
3506 -5592456 -7228670 -7414976 -4546865 -1513674 -2028302 -5272517 -6770638 -4289027 -351950
3497 -351950 1525920 658496 -1761473 -4943184 -7938528 -8860267 -7234656 -5796780 -7169792
3488 -7169792 -9698923 -9690327 -7263566 -6324635 -8348673 -10063847 -8836063 -6806915 -7130869
3479 -7130869 -8846623 -8649541 -6053117 -3647199 -3216957 -4463929 -6778933 -9292681 -9637070
3470 -9637070 -5958962 -495866 1942990 -37289 -2660698 -2328706 -27835 1271833
3462 1271833 1049641 547006 -476286 -3165884 -6496241 -7824188 -6654286 -5182761 -4482819
3453d482819J815806M534910N542113L491887O60121q16158j469733k303928k728902
3444D243297k283024k151016k911590k616441M05780M140269N020025K730360
3436F577660J42609j061625j684884k042958j142617M34442K28156k057272l362695
3427c969184k070390q90424k269151l778476j783675K248481L429613P67290j436306
3418i752222K7985L153236M195241K411830j82404j682982j422817K52238K013051
3409i86844K326749J080278k86561n61283J90110J259832J789982Q59614j374855
3400D297022k825788j609306J010337J870370K32807j422074j350565q45872j630706
3391b273775l140684l663559k498819o809K825942M126454K425104q71084k327476
$$ plain form
3453 -4482819 -2667013 1867897 7410010 10901897 11562018 10745860 9276127 6972199 4243297
3444 4243297 1960273 -190743 -3102333 -5718774 -5312994 -1172725 3847300 6577660
3436 6577660 6720269 5658644 3973760 1930802 788185 1222627 1450783 -606489 -3969184
3427 -3969184 -6039574 -6929998 -9199149 -12977625 -14761300 -12512819 -9083206 -8315916 -9752222
3418 -9752222 -9724237 -6571001 -2375760 36070 -146334 -1829316 -3252133 -2999895 -986844
3409 -986844 1339905 2420183 2133622 1572339 1762449 3022281 4812263 5671877 4297022
3400 4297022 1471234 -138072 872265 2742635 2975442 1553368 202803 -643069 -2273775
3391 -2273775 -5414459 -9078018 -11576837 -11583646 -8757704 -4631250 -2206146 -3077230 -5404706
3382e404706p72943J407576K177894K355843K828417K334719L30680p81645O86685
3373E162520K203265P14133j986049j649837J634892L334414J201925j912836
3365H702427k927674k678990l459676m971648m879476k138860J828017M679154
3357e846726M984131L018586L23767j678493k577479k419125j210570L18006O96825
3348d391078k48699n86779Q56640K220459J432891n4496O17734K742647K807514
3339E396833J69293j830534j183799K7757l56629j205256q18932j51986p89450
3330g42703j861925j517667R8607J570969K488927K937651K195079J15353j560431
3321C723860j487037r28318j376797j563237K10875K152386J118021j907602k592717
$$ plain form
3382 -5404706 -6177649 -4770073 -2592179 -236336 2592081 4926800 5257480 4475835 5162520
3373 5162520 7365785 8079918 6093869 4444032 6078924 9413338 10615263 8702427
3365 8702427 5774753 3095763 -363913 -5335561 -10215037 -12353897 -10525880 -5846726
3357 -5846726 -862595 2155991 2479758 801265 -1776214 -4195339 -5405909 -5087903 -4391078
3348 -4391078 -4639777 -5226556 -4369916 -2149457 -716566 -771062 -153328 2589319 5396833
3339 5396833 5566126 3735592 2551793 2579550 2222921 1017665 198733 46747 -742703
3330 -742703 -2604628 -4122295 -4023688 -2452719 36208 2973859 5168938 5284291 3723860
3321 3723860 2236823 1308505 -68292 -1631529 -1420654 731732 1849753 -57849 -2650566
3312b650566N9997J972246M36119j601911m43297K218494J826946j869000m152037
3303d203009j931114K323579M287879K900482J94451k118597l735031m262179
3295f543539k935820k10874J979884K416421K080237K536635L458728K873057
3287E654729j67708m015340n829020m218945m56634K649234L135578J456421l01582
3278b093267p12839l8565R94538K188257K897009J540383k097887n055496m166568
3269f544435o51184J042365n26913j776133K13305L057299K878927M24849l88833
3260b270753J056569J335098r07665k260284N9606L420668L514940Q69537j48011
3251D669705J689310K477677n75667m352419m147084p23854P80066j423658l323976
$$ plain form
3312 -2650566 -2590569 -618323 -182204 -1784115 -2227412 -8918 1818028 -50972 -4203009
3303 -4203009 -6134123 -3810544 477335 3377817 3572268 1453671 -2281360 -6543539
3295 -6543539 -9479359 -9690233 -7710349 -5293928 -3213691 -677056 2781672 5654729
3287 5654729 5487021 1471681 -4357339 -8576284 -9032918 -6383684 -3248106 -1791685 -2093267
3278 -2093267 -2806106 -2844671 -1850133 338124 3235133 4775516 2677629 -2377867 -6544435
3269 -6544435 -7195619 -6153254 -6680167 -8456300 -8242995 -5185696 -2306769 -1881920 -2270753
3260 -2270753 -1214184 120914 -786751 -3047035 -2987429 433239 3948179 4817716 4669705
3251 4669705 6359015 8836692 8261025 3908606 -238478 -962332 -182266 -1605924 -4929900
3242d929900j664880J012639Q63013q32639p4210K760687L360782P91621j000508
3233B86605j07814K83610j833718l160980j032581J190243k23901k175218L98057
3224f375697M972520M259922j930559n336705j336599M513400N107774J203126
3216E077182j780496j872725j040057o87794q17642j519608k011682m01216K719176
3207b334862L230841o26168m326632l122041P24850J633896n62242j176006J237862
3198e320502L228381K818434J850958J241071o74760l563909l956615q81123J792480
3189c465585J154895n66990l75023O83456L15342n72447R1876J375621Q93479
3180d65376r82044j782905p90814N95143J367318J262425k60163k728818l404403
$$ plain form
3242 -4929900 -6594780 -5582141 -4719128 -5551767 -5625977 -2865290 495492 1287113 286605
3233 286605 178791 462401 -1371317 -4532297 -5564878 -4374635 -4598536 -6773754 -6375697
3224 -6375697 -1403177 2856745 926186 -4410519 -5747118 -1233718 3874056 5077182
3216 5077182 3296686 1423961 383904 -303890 -1121532 -2641140 -4652822 -5054038 -2334862
3207 -2334862 895979 269811 -4056821 -7178862 -6454012 -4820116 -5382358 -6558364 -5320502
3198 -5320502 -2092121 726313 2577271 3818342 3143582 -420327 -4376942 -5258065 -3465585
3189 -3465585 -2310690 -2877680 -3252703 -2569247 -2253905 -2826352 -2734476 -1358855 -465376
3180 -465376 -1447420 -3230325 -4021139 -3425996 -2058678 -796253 -1056416 -3785234 -7189637
3171g189637k86974M134586N049555J363086k797985l007255P13173M328286L897943
3162F204778n48512m566734l714541Q56586L126465m3855m358760l918098O92884
3153f269787L904759L262989J547233J142372R83415R3565k9972J431291K254448
3144H320313L45795k803087l963076k168545O66673K101806J121349j246813k643687
3135b69272j782828k77493n69717k164755k191004J3830J588923M60561j559580
3126f751335j582061M24772K200149K252295R09776n73902r60738j03855N00433
3117c684466m08603j518350o24074J483584J819990J65440n09582M86408N5885
3108b733768k677866l478910M04220M833406M502339Q54136q48572N7500j16920
$$ plain form
3171 -7189637 -7476611 -3342025 1707530 3070616 272631 -2734624 -2021451 2306835 6204778
3162 6204778 5656266 1089532 -2625009 -1768423 1358042 1314187 -3044573 -6962671 -6269787
3153 -6269787 -2365028 897961 2445194 3587566 4570981 4664546 4634574 6065865 8320313
3144 8320313 8666108 5863021 1899945 -268600 398073 2499879 3621228 2374415 -269272
3135 -269272 -2052100 -2329593 -2899310 -5064065 -7255069 -7241239 -5652316 -5191755 -6751335
3126 -6751335 -8333396 -7908624 -5708475 -3456180 -2546404 -3120306 -4081044 -4184899 -3684466
3117 -3684466 -4093069 -5611419 -6235493 -4751909 -2931919 -2766479 -3276061 -2789653 -2733768
3108 -2733768 -5411634 -8890544 -8486324 -3652918 849421 1703557 854985 912485 795565
3099G95565k098716k661011r59357p7087j115624r34695K205077N128522M497104
3090D779778J715510K54362M42343k18147k739588m966274m089442O5271M234542
3081e21645M609164J260497j460666n08627J552791O45550k073059j919566J351435
3072B935874K467786j283729n715741n841725k382880O56592J727791J965988
3064e470044K026047J624363P70021n12903k127773k493394J79326L938455L946112
3055A880210n96109m196765k753879M09472K64215j773584p68141L119960M988195
3046E73574L210800J241502J233559J226301l43390k034971k670611l111813l355329
3037d030378j710688J477865K891769R52126j688976k264890j445117p85001J93303
$$ plain form
3099 795565 -1303151 -3964162 -4923519 -5000606 -6116230 -7050925 -4845848 282674 4779778
3090 4779778 6495288 6749650 7191993 6973846 4234258 -732016 -4821458 -4756187 -521645
3081 -521645 4087519 5348016 3887350 3378723 4931514 5577064 3504005 1584439 2935874
3072 2935874 5403660 4119931 -1595810 -7437535 -9820415 -9163823 -7436032 -5470044
3064 -5470044 -3443997 -1819634 -1049613 -1562516 -3690289 -6183683 -6004357 -2065902 1880210
3055 1880210 1284101 -2912664 -5666543 -5257071 -4992856 -6766440 -7534581 -4414621 573574
3046 573574 3784374 5025876 6259435 7485736 7142346 5107375 2436764 -675049 -4030378
3037 -4030378 -5741066 -4263201 -1371432 -419306 -2108282 -4373172 -5818289 -6603290 -6409987
3028f409987J787780J879261q42475l514054k445968J425511L814356L160476
3020a145100K065191K510737K837152P79944k642357m145427k351051N17332J292515
3011b81064n02386k231199j332401J656928L808622L177511O19574j693235k619432
3002F02918k633323k744397l130441k650984j66179L191708M218125J610322j319830
2993c022081l95818L358608M553107R44235l253599l386450o77273L87233j132836
2984b624874k086473p23020R53908Q73904p4129p8252O55495P31605P0722k02682
2974b503796J30055L7267q45149j308888l07097J275625J642736N27916n68110
2965a919441o61061n18564j078444j902999k181943k142102k166799j524413M20364
$$ plain form
3028 -6409987 -4622207 -2742946 -3585421 -7099475 -9545443 -8119932 -4305576 -1145100
3020 -1145100 920091 3430828 6267980 7047924 4405567 260140 -2090911 -1573579 -281064
3011 -281064 -783450 -3014649 -4347050 -2690122 1118500 4296011 4915585 3222350 602918
3002 602918 -2030405 -4774802 -7905243 -10556227 -10722406 -7530698 -3312573 -1702251 -3022081
2993 -3022081 -3417899 -59291 4493816 5438051 2184452 -1201998 -1879271 -1492038 -2624874
2984 -2624874 -4711347 -5434367 -4480459 -3606555 -3680684 -3758936 -3103441 -2371836 -2301114 -2503796
2974 -2503796 -2373741 -2336474 -3181623 -4490511 -4797608 -3521983 -1879247 -1351331 -1919441
2965 -1919441 -2580502 -3099066 -4177510 -6080509 -8262452 -10404554 -12571353 -14095766 -13675402
2956a3675402K557837L395467L296577L292065K510176l95979l615882l378571
2948f013712N81663L972777L557751Q84434r89938j464477j183821J37442K089958
2939A572077K314693j47427k292204j071635J813623K362725J94309j526484j295359
2930A924318p81727j237077j711761j287713m39381K09857L30552p83318l039476
2921f815726m156649k228167O78424P41118j754525k394810P76520M288376M383233
2912f482206J932717K14967L90694J346471J927925J192706j752209n953361q034528
2903a5216824n586095l20750L766655M560419K876725N40594r82743q99640L61905
2894a0899754J276150Q77315k07035r32477j066969o30429O27895K299549L013581
$$ plain form
2956 -13675402 -11117565 -7722098 -4425521 -1133456 1376720 980741 -2635141 -6013712
2948 -6013712 -5432049 -1459272 2098479 2982913 1992975 528498 -655323 -517881 1572077
2939 1572077 3886770 3739343 1447139 375504 2189127 4551852 4746161 3219677 1924318
2930 1924318 1142591 -94486 -1806247 -3093960 -3533341 -3323484 -2992932 -3776250 -6815726
2921 -6815726 -10972375 -13200542 -12522118 -11781000 -13535525 -15930335 -15153815 -10865439 -6482206
2912 -6482206 -4549489 -4334522 -3943828 -2597357 -669432 523274 -1228935 -7182296 -15216824
2903 -15216824 -20802919 -21123669 -17357014 -12796595 -9919870 -9379276 -10362019 -11261659 -10899754
2894 -10899754 -9623604 -8746289 -8953324 -9885801 -10952770 -11583199 -10955304 -8655755 -5642174
2885e642174J963587j96065k394411l767868l122110P1972L579687L905044J039760
2876d562578j044723k11068O86279j092608l133816j687034J850280K778564K60559
2867f156145j922022j550379m95589m41336j47214J554951L305093L561017K939045
2858F47421K504033J741228m3884j816293j964655n32519Q43424P76394n20301
2849A634848j315432j13702J985343J828770j312046l384438o33507M091497M278529
2840G059862r28081n057356l463508M48233J034505j436564k452388m76611J883460
2831c388448K657586K355187J392544o72599l016995l644766k237403o48654j03451
2822g306999Q4322O36531J101307J033535P45626M09536k15045q83618r81903
$$ plain form
2885 -5642174 -3678587 -3874652 -6269063 -10036931 -13159041 -13087069 -9507382 -5602338 -4562578
2876 -4562578 -5607301 -5818369 -5132090 -6224698 -9358514 -11045548 -9195268 -6416704 -6156145
2867 -6156145 -8078167 -9628546 -10124135 -10565471 -10712685 -9157734 -5852641 -2291624 647421
2858 647421 3151454 4892682 4848798 3032505 1067850 535331 1378755 2155149 1634848
2849 1634848 319416 205714 2191057 4019827 2707781 -676657 -1310164 2781333 7059862
2840 7059862 6131781 1074425 -2389083 -1940850 -906345 -2342909 -4795297 -5271908 -3388448
2831 -3388448 -730862 1624325 3016869 2344270 -672725 -4317491 -6554894 -7203548 -7306999
2822 -7306999 -7222677 -6586146 -5484839 -4451304 -3705678 -3296142 -3511187 -4394805 -5376708
2813e376708o05693k37489M46181J855773K846144J813374n31160j708537j163556
2804b661671j029786k386461l201517j514487J414762L095445L342875L588777
2796F47937L754629K361763m61085k425624k060297n13376L57096L36279K90259
2787B287581J98803q73123k890151m072137k720549N31902L073528L084838J319498
2778e9810k76349r73295j359589j606837j184793m56914q97026k799758m083759
2769a3698130k765770J57793J850639J312153K70509K80660O63843K38443k49589
2760a1939449R59420L672501N320814M028054J010400r83500r92273m94500r53928
2751c72461j981201k310480j515180l3809J633286K840302K696267J268052L24906
$$ plain form
2813 -5376708 -5982401 -6219890 -5773709 -3917936 -1071792 741582 210422 -1498115 -2661671
2804 -2661671 -3691457 -6077918 -9279435 -10793922 -9379160 -6283715 -2940840 647937
2796 647937 4402566 6764329 6303244 3877620 1817323 1303947 1661043 1997322 2287581
2787 2287581 2486384 1613261 -1276890 -5349027 -8069576 -7537674 -4464146 -1379308 -59810
2778 -59810 -336159 -1309454 -2669043 -4275880 -5460673 -5917587 -6814613 -9614371 -13698130
2769 -13698130 -16463900 -16306107 -14455468 -13143315 -12872806 -12592146 -11928303 -11689860 -11939449
2760 -11939449 -10980029 -7307528 -1986714 2041340 3051740 2068240 1075967 581467 -372461
2751 -372461 -2353662 -4664142 -6179322 -6213131 -4579845 -1739543 956724 2224776 2549682
2742B549682J386455L222433K937777k22440l741096n016873m120317k529186
2734e533565o79206J767069M212611N321545M569086K386075q10470m389730o574330
2725B69085n368413r99230L515259M959860K846008n00674k543192k934409l132252
2716c887958l723335l090152J24708L915697M518636J537140j044646l72546J277367
2707g45089M34596j881229j998267K45162J553058J202638K184757N023821N249296
2698A1268743O0690o196158p233601l178540M61834P90685N6365N13359J193846
2689b262777Q78993O51044J585643K441537J667244j7339q95127q72264j118193
2680B058761j894606k266585j616372l49961P31525J144103J024645R14315Q14932
$$ plain form
2742 2549682 3936137 7158570 10096347 9873907 6132811 1115938 -3004379 -5533565
2734 -5533565 -6212771 -4445702 -233091 5088454 9657540 12043615 11233145 6843415 269085
2725 269085 -5099328 -6098558 -2583299 2376561 5222569 4721895 2178703 -755706 -3887958
2716 -3887958 -7611293 -10701445 -10576737 -6661040 -2142404 -605264 -1649910 -2022456 -745089
2707 -745089 -310493 -2191722 -4189989 -3944827 -2391769 -1189131 995626 6019447 11268743
2698 11268743 11329433 5133275 -2100326 -5278866 -4817032 -4026347 -3969982 -3456623 -2262777
2689 -2262777 -1383784 -732740 852903 3294440 4961684 4944345 4049218 3176954 2058761
2680 2058761 164155 -2102430 -3718802 -4068763 -3337238 -2193135 -1168490 -254175 560757
2671E60757k39457k559774m095300k322429J827499M189785K538901o46170j996896
2662b743084j481541p03949O32708L261704M898301K339012l070995n893273l426631
2653f187748J033923K909249J464734j159651l271128l981886k480973P41996
2645a0931484L367801L763241K674808J083950j476677m554715n275534k216435
2637a3565045J326119J607990K54093J363025L951854K850135k473651n897603
2629a0583083l635535J64588L43472j455072p29436J711589J500736j199586j671275
2620a5553602J337146L477086K038328J02335J032862L130183L000932J055150
2612c79580P2208M00172J31554j072860j486109j78655K055894M195814N350902
$$ plain form
2671 560757 321300 -2238474 -6333774 -8656203 -6828704 -2638919 -100018 -746188 -2743084
2662 -2743084 -4224625 -4928574 -4295866 -1034162 3864139 6203151 3132156 -2761117 -6187748
2653 -6187748 -5153825 -2244576 -779842 -1939493 -5210621 -9192507 -11673480 -10931484
2645 -10931484 -7563683 -3800442 -1125634 -41684 -1518361 -6073076 -11348610 -13565045
2637 -13565045 -12238926 -10630936 -10376843 -9013818 -5061964 -2211829 -4685480 -10583083
2629 -10583083 -14218618 -14054030 -13710558 -15165630 -15895066 -14183477 -12682741 -13882327 -15553602
2620 -15553602 -14216456 -10739370 -8701042 -8598707 -7565845 -4435662 -1434730 -379580
2612 -379580 -307372 92800 224354 -848506 -2334615 -2513270 -457376 3738438 9089340
2603I089340M303671Q92721k670300m003212l547485l248423l055556j462975
2595c702219R61999J818460Q33984L26106J031074Q67994q01565j151463J509265
2586A693635M016572K383466k298573n201499l942899n06501K221032K900359
2578A265592J226873j935994l822626k100545J537733K778827L51699k398148
2570c096589k553806j350582j088943j001910R77558L894189M377343J348437
2562A505697k410888l792613k615749q31441o527m05582j573310k882724l738670
2553a6751807l684871k363552M01260M084614P186989Q044683O117268K428593
2545E463177j087048k730979k205001r50123o59360j123880n24956J554650K796648
$$ plain form
2603 9089340 13393011 14285732 11615432 7612220 4064735 816312 -2239244 -3702219
2595 -3702219 -2740220 -921760 -87776 238330 1269404 2137398 1335833 184370 1693635
2586 1693635 5710207 8093673 5795100 593601 -3349298 -3855799 -1634767 1265592
2578 1265592 2492465 556471 -3266155 -5366700 -3828967 -1050140 -698441 -3096589
2570 -3096589 -5650395 -7000977 -8089920 -9091830 -8114272 -4220083 157260 1505697
2562 1505697 -905191 -4697804 -7313553 -8144994 -8151521 -8557103 -10130413 -13013137 -16751807
2553 -16751807 -20436678 -22800230 -22398970 -18314356 -11127367 -3082684 3034584 5463177
2545 5463177 4376129 1645150 -559851 -1509974 -2169334 -3293214 -3818170 -2263520 533128
2536E33128J244680j394149j711073M89855J664858n06163l797102m428457j914871
2527i819294P60482J159374j41l12996J272802L314648L510011J317815j207189
2518d488j541060M63806K488745K527839R48925m64306o88580k00379j74970j383769
2508A971763l375995m543972l671924j514166J19468Q97138K077436L633690L272502
2499a134060j37674l745106l622173J16148L362176L244897J269317N83915J709610
2490A647050K189527n7425l927471n931341l882824M27530L063791K585374J459045
2481b426744K074631L168114K072599r10098k983771k964571k120739j200498
2473e291077L30437J817635J371895p72760j844395p70498J10928p35594j131455
$$ plain form
2536 533128 1777808 383659 -1327414 -837559 827299 321136 -3475966 -7904423 -9819294
2527 -9819294 -9058812 -7899438 -7899579 -8212575 -6939773 -3625125 -115114 1202701 -4488
2518 -4488 -1545548 -1081742 1407003 3934842 4883767 4419461 3730881 3530502 3355532 1971763
2508 1971763 -1404232 -5948204 -9620128 -11134294 -11014826 -10117688 -8040252 -4406562 -1134060
2499 -1134060 -1271734 -5016840 -8639013 -8522865 -5160689 -1915792 -646475 -62560 1647050
2490 1647050 3836577 3779152 -148319 -6079660 -9962484 -9534954 -6471163 -3885789 -2426744
2481 -2426744 -352113 2816001 4888600 3978502 994731 -1969840 -4090579 -5291077
2473 -5291077 -4960640 -3143005 -1771110 -2543870 -4388265 -5158763 -5047835 -5783429 -6914884
2464f914884J070865L953951M257378K136154L5209j507910l414650m650012l208453
2455h242352j62940J126380J10737l56380P43998N95487k472047n294189l826327
2446a7777633J258946N575455O490138N229001M015025L211269J723306q77800
2438H847707l308891l715201j843099M05620J103024L06677r16238k358603l826859
2429e305863l524087j06581L898196L992679k60520m168386m045255j446366L10987
2420a0655196P99899J294884J581641R59793O12780J897152L387226K462299q04445
2411A536033l716609m375956l119596j332720n77218j789987l574288k773358
2403a9723699J247253M754643M586878K797892L035374M336161K939114r30004
$$ plain form
2464 -6914884 -5844019 -1890068 2367310 4503464 4538673 3030763 -383887 -5033899 -8242352
2455 -8242352 -8405292 -7278912 -7168175 -7524555 -6780557 -6185070 -8657117 -13951306 -17777633
2446 -17777633 -16518687 -10943232 -4453094 775907 4790932 8002201 9725507 8847707
2438 8847707 5538816 1823615 -19484 386136 1489160 1795837 879599 -1479004 -5305863
2429 -5305863 -8829950 -8936531 -5038335 -1045656 -1306176 -5474562 -9519817 -10966183 -10655196
2420 -10655196 -9855297 -8560413 -6978772 -6018979 -5406199 -3509047 -121821 2340478 1536033
2411 1536033 -2180576 -6556532 -9676128 -11008848 -11586066 -13376053 -16950341 -19723699
2403 -19723699 -18476446 -13721803 -9134925 -6337033 -3301659 1034502 3973616 3043612
2395C043612l060767j939290n53581q07671p18982J385651L831081M422505L083955
2386H686513M86706k674624m184623j939890J786807J924926k005200m578047
2378b497432k588087L58266L12606q52590J83522K016167J651819L42068R40218
2369a33443K079671M86426k823469m089192l061245k287112j409736J928650O007072
2360c302378O001144J632689j847679j551483n66168j957243l996237l700764
2352i288119j224797J511687L329036L255464P96928j796918j051619K432658
2344b035680L890477J248624j867237j985503n21227q4169j27520N26197N50999
2335d05039q91918j420254M33995J543414j019666m364726l883028p43053J24061
$$ plain form
2395 3043612 -17155 -1956445 -2510026 -3317697 -4036679 -2651028 1180053 5602558 8686513
2386 8686513 9173219 6498595 2313972 374082 2160889 4085815 2080615 -2497432
2378 -2497432 -5085519 -4727253 -4414647 -5267237 -5083715 -3067548 -1415729 -1073661 -133443
2369 -133443 1946228 2432654 -390815 -4480007 -7541252 -9828364 -11238100 -9309450 -3302378
2360 -3302378 2698766 4331455 2483776 932293 366125 -1591118 -5587355 -9288119
2352 -9288119 -10512916 -9001229 -5672193 -2416729 -1619801 -3416719 -4468338 -2035680
2344 -2035680 1854797 3103421 1236184 -749319 -1270546 -1354715 -1482235 -956038 -405039
2335 -405039 -1296957 -2717211 -2283216 -739802 -1759468 -6124194 -10007222 -10750275 -10626214
2326a0626214j762729j878434J748955N700627O760006N784982M553134K620741
2318A2901068o63830l807806m873213l900084k353365j349590j033960o30276
2310e711056R30957L332136M420680K937940P05374P3621M03083k11262q82951
2301E998522P91694L826281M185782O08002l466890m731816l605778k020479p69878
2292H15440l23522j333783k856176k620956m02180J272107P76833p99130k205816
$$ plain form
2326 -10626214 -12388943 -14267377 -12518422 -6817795 -57789 5727193 10280327 12901068
2318 12901068 12237238 8429432 3556219 -343865 -2697230 -4046820 -5080780 -5711056
2310 -5711056 -4780099 -1447963 2972717 5910657 6616031 6689652 7092735 6881473 5998522
2301 5998522 6790216 10616497 14802279 15410281 11943391 7211575 3605797 1585318 815440
2292 815440 491918 -841865 -3698041 -6318997 -6721177 -5449070 -4672237 -5471367 -7677183
$$ [...]
##END NTUPLES=NMR SPECTRUM
##END=
