##TITLE=31Pdec_DE-70-2
 CDCl3, 64 sc
 30.10.2024
##JCAMPDX= 6.0         $$ Bruker NMR JCAMP-DX V2.0
##DATA TYPE= NMR SPECTRUM
##DATA CLASS= NTUPLES
##ORIGIN= UXNMR, Bruker Analytische Messtechnik GmbH
##OWNER= root
$$ XWIN-NMR		Version 3.5
$$ Wed Oct 30 14:58:29 2024 Russian Standard Time (UT+4h)  she@DPX200
##.OBSERVE FREQUENCY= 81.013821
##.OBSERVE NUCLEUS= ^31P
##.ACQUISITION MODE= SIMULTANEOUS
##.ACQUISITION SCHEME= undefined
##.AVERAGES= 64
##.DIGITISER RES= 17
##SPECTROMETER/DATA SYSTEM= spect
##.PULSE SEQUENCE= zgpg30
##.SOLVENT NAME= CDCl3
##.SHIFT REFERENCE= (INTERNAL, CDCl3, 0, 198.062)
##AUDIT TRAIL= $$ (NUMBER, WHEN, WHO, WHERE, WHAT)
$$ ##TITLE= Audit trail, XWIN-NMR		Version 3.5
$$ ##JCAMPDX= 5.01
$$ ##ORIGIN= Bruker BioSpin GmbH
$$ ##OWNER= she
$$ F:/spectra/data/she/nmr/P31/2/pdata/1/auditp.txt
$$ ##AUDIT TRAIL=  $$ (NUMBER, WHEN, WHO, WHERE, WHAT)
(   1,<2024-10-30 14:57:25.06 +0400>,<she>,<DPX200>,
      <created by zg, POWCHK disabled, PULCHK disabled
       configuration hash MD5:
       00 E9 B6 7A A2 85 ED C7 34 08 36 98 17 FE 4E 26
       data hash MD5: 32K
       16 70 F5 60 F1 50 B8 6C 1D 96 B4 1E A1 B6 AA D9>)
(   2,<2024-10-30 14:57:27.43 +0400>,<she>,<DPX200>,
      <Start of raw data processing
       efp BC_mod = 2 LB = 1.5 FT_mod = 6 PKNL = 1 PHC0 = 2377.866 PHC1 = 684.0884 SI = 64K 
       data hash MD5: 64K
       33 1C 24 F9 84 90 AE B9 43 72 86 84 76 EA CC 39>)
(   3,<2024-10-30 14:58:03.09 +0400>,<she>,<DPX200>,
      <pk PHC0 = -31.05797 PHC1 = 129.4 
       data hash MD5: 64K
       8C B4 B7 F7 1A 50 B8 8D B1 97 33 FA B4 53 F0 19>)
$$ ##END=
$$ 
$$ hash MD5
$$ A7 52 85 A3 59 3B A5 DE F0 F5 AA 87 71 D2 5E 9B
##$RELAX= 
##$RELAX= 
##$RELAX= 
##$RELAX= 
##$RELAX= 
##$RELAX= 
##$RELAX= 
##$RELAX= 
$$ Bruker specific parameters
$$ --------------------------
##$DU= <F:/spectra>
##$EXPNO= 2
##$NAME= <P31>
##$PROCNO= 1
##$TYPE= <nmr>
##$USER= <she>
##$AMP= (0..31)
100 100 100 100 100 100 100 100 100 100 100 100 100 100 100 100 100 100 
100 100 100 100 100 100 100 100 100 100 100 100 100 100 
##$AQSEQ= 0
##$AQ_mod= 1
##$AUNM= <au_zg>
##$AUTOPOS= <>
##$BF1= 81.014009
##$BF2= 200.13
##$BF3= 200.13
##$BF4= 200.13
##$BF5= 200.13
##$BF6= 200.13
##$BF7= 200.13
##$BF8= 200.13
##$BYTORDA= 1
##$CFDGTYP= 0
##$CFRGTYP= 5
##$CHEMSTR= <none>
##$CNST= (0..31)
1 1 145 1 1 1 1 1 1 1 1 1 1 1 1 1 1 1 1 1 1 1 1 1 1 1 1 1 1 1 1 1 
##$CPDPRG= <waltz16>
##$CPDPRG1= <>
##$CPDPRG2= <waltz16>
##$CPDPRG3= <>
##$CPDPRG4= <mlev>
##$CPDPRG5= <mlev>
##$CPDPRG6= <mlev>
##$CPDPRG7= <mlev>
##$CPDPRG8= <mlev>
##$CPDPRGB= <>
##$CPDPRGT= <>
##$D= (0..31)
0 1 0 0 0 0 0 0 0 0.06 0 0.03 2e-05 3e-06 0 0 0.0002 0 0 0 0 0 0 0 0 0 
0 0 0 0 0 0 
##$DATE= 1730285844
##$DBL= (0..7)
120 120 120 11 120 120 24 19 
##$DBP= (0..7)
150 150 150 150 150 150 150 150 
##$DBP07= 0
##$DBPNAM0= <>
##$DBPNAM1= <>
##$DBPNAM2= <>
##$DBPNAM3= <>
##$DBPNAM4= <>
##$DBPNAM5= <>
##$DBPNAM6= <>
##$DBPNAM7= <>
##$DBPOAL= (0..7)
0.5 0.5 0.5 0.5 0.5 0.5 0.5 0.5 
##$DBPOFFS= (0..7)
$$ [...]
##$SUBNAM2= <"">
##$SUBNAM3= <"">
##$SUBNAM4= <"">
##$SUBNAM5= <"">
##$SUBNAM6= <"">
##$SUBNAM7= <"">
##$SUBNAM8= <"">
##$SUBNAM9= <"">
##$SW= 400.765351723535
##$SWIBOX= (0..15)
0 1 3 0 0 0 0 0 0 0 0 0 0 0 0 0 
##$SW_h= 32467.5324675325
##$TD= 32768
##$TD0= 1
##$TE= 0
##$TE2= 300
##$TE3= 300
##$TEG= 300
##$TL= (0..7)
0 120 53 12 22 120 120 120 
##$TP= (0..7)
150 150 150 150 150 150 150 150 
##$TP07= 0
##$TPNAME0= <>
##$TPNAME1= <>
##$TPNAME2= <>
##$TPNAME3= <>
##$TPNAME4= <>
##$TPNAME5= <>
##$TPNAME6= <>
##$TPNAME7= <>
##$TPOAL= (0..7)
0.5 0.5 0.5 0.5 0.5 0.5 0.5 0.5 
##$TPOFFS= (0..7)
0 0 0 0 0 0 0 0 
##$TUNHIN= 0
##$TUNHOUT= 0
##$TUNXOUT= 0
##$USERA1= <user>
##$USERA2= <user>
##$USERA3= <user>
##$USERA4= <user>
##$USERA5= <user>
##$V9= 5
##$VALIST= <valist>
##$VCLIST= <CCCCCCCCCCCCCCC>
##$VD= 0
##$VDLIST= <DDDDDDDDDDDDDDD>
##$VPLIST= <PPPPPPPPPPPPPPP>
##$VTLIST= <TTTTTTTTTTTTTTT>
##$WBST= 1024
##$WBSW= 4
##$XGAIN= (0..3)
0 0 0 0 
##$XL= 0
##$YL= 0
##$YMAX_a= 8645
##$YMIN_a= -4175
##$ZGOPTNS= <>
##$ZL1= 120
##$ZL2= 120
##$ZL3= 120
##$ZL4= 120
##$ABSF1= 0
##$ABSF2= 0
##$ABSG= 0
##$ABSL= 0
##$ALPHA= 0
##$AQORDER= 0
##$ASSFAC= 0
##$ASSFACI= 0
##$ASSFACX= 0
##$ASSWID= 0
##$AUNMP= <proc_1d>
##$AZFE= 0.1
##$AZFW= 0.5
##$BCFW= 0
##$BC_mod= 2
##$BYTORDP= 0
##$COROFFS= 0
##$CY= -3
##$DATMOD= 1
##$DC= 0
##$DFILT= <>
##$DTYPP= 0
##$F1P= 0
##$F2P= 0
##$FCOR= 1
##$FTSIZE= 65536
##$FT_mod= 6
##$GAMMA= 0
##$GB= 0
##$INTBC= 1
##$INTSCL= 9.790993e-09
##$ISEN= 30
##$LB= 1.5
##$LEV0= 0
##$LPBIN= 0
##$MAXI= 10000
##$MC2= 0
##$MEAN= 0
##$ME_mod= 0
##$MI= 50
##$NCOEF= 0
##$NC_proc= -8
##$NLEV= 6
##$NOISF1= 182.463
##$NOISF2= 159.3651
##$NSP= 0
##$NTH_PI= 0
##$NZP= 0
##$OFFSET= 198.0616
##$PC= 4
##$PHC0= 2346.808
##$PHC1= 813.4884
##$PH_mod= 1
##$PKNL= yes
##$PPARMOD= 0
##$PSCAL= 0
##$PSIGN= 0
##$REVERSE= no
##$SF= 81.0140089999434
##$SI= 65536
##$SIGF1= 159.3651
##$SIGF2= -187.1042
##$SINO= 113.3802
##$SIOLD= 16384
##$SREGLST= <1H.CDCl3>
##$SSB= 0
##$STSI= 65536
##$STSR= 0
##$SW_p= 32467.5324675325
##$SYMM= 0
##$S_DEV= 0
##$TDeff= 32768
##$TDoff= 0
##$TI= <>
##$TILT= no
##$TM1= 0
##$TM2= 0
##$TOPLEV= 0
##$USERP1= <user>
##$USERP2= <user>
##$USERP3= <user>
##$USERP4= <user>
##$USERP5= <user>
##$WDW= 1
##$XDIM= 65536
##$YMAX_p= 351923133
##$YMIN_p= -58819846
$$ End of Bruker specific parameters
$$ ---------------------------------
##NTUPLES= NMR SPECTRUM
##VAR_NAME=  FREQUENCY,     SPECTRUM/REAL,   SPECTRUM/IMAG
##SYMBOL=    X,             R,               I
##VAR_TYPE=  INDEPENDENT,   DEPENDENT,       DEPENDENT
##VAR_FORM=  AFFN,          ASDF,            ASDF
##VAR_DIM=   65536,         65536,           65536
##UNITS=     HZ,            ARBITRARY UNITS, ARBITRARY UNITS
##FACTOR=    0.49542278885378, 1,            1
##FIRST=     16045.7642231865, 0,            0
##LAST=      -16421.768244346, 0,            0
##MIN=       -16421.768244346, -58819846,    0
##MAX=       16045.7642231865, 351923133,    0
$$ Real data points
##PAGE= N=1
##DATA TABLE= (X++(R..R)), XYDATA
$$ [...]
##PAGE= N=2
##DATA TABLE= (X++(I..I)), XYDATA
7466H114957J31818J180199j458034o382514q012417l868160K278281N549420
$$ 8114957 8246775 9426974 7968940 1586426 -6425991 -10294151 -8015870 -2466450
7458b466450N069053K688627j08824k072099j712993O52829K296823J480380k53492
$$ -2466450 2602603 5291230 5182406 3110307 1397314 2050143 4346966 5827346 5573854
7449E573854q36066o98728j130699j669473j481274j579748k983474l945071j873497
$$ 5573854 4737788 4039060 2908361 1238888 -242386 -1822134 -4805608 -8750679 -10624176
7440a0624176K567633N806327N601700K959365J82285j110109m54663J060893
$$ -10624176 -8056543 -2250216 3351484 6310849 6493134 5383025 4928362 5989255
7432E989255J252944n44024j939605n69824K017031K116019q32507l553256l717708
$$ 5989255 7242199 6698175 4758570 4188746 6205777 8321796 7489289 3936033 218325
7423B18325k435476j290024j7407J373475J111439j335184l025471j194733K331048
$$ 218325 -2217151 -3507175 -3524582 -2151107 -1039668 -2374852 -5400323 -6595056 -4264008
7414d264008L439900J606505J24655N49186N42855j510235l041857j030865K862542
$$ -4264008 -824108 782397 907052 1456238 1999093 488858 -2552999 -3583864 -721322
7405g21322M058821J320302j720390j715778K05535O85060j082033k575814j496306
$$ -721322 3337499 4657801 2937411 1221633 1427168 2112228 1030195 -1545619 -3041925
7396c041925J345009L057292K038787k31739j064001J4347O64257r34002l401473
$$ -3041925 -1696916 1360376 3399163 3167424 2103423 2117770 2782027 1848025 -1553448
7387a553448m198956l247683k269571j153434J853615N828556O583759K434959
$$ -1553448 -5752404 -9000087 -11269658 -12423092 -10569477 -4740921 1842838 4277797
7379D277797k262253k252892J744891M359125K604743j487762m623226n402657
$$ 4277797 2015544 -237348 1507543 5866668 8471411 6983649 2360423 -3042234
7371c042234l728114j98844L036839L268935K59012l249449m764598m376444l337801
$$ -3042234 -6770348 -6969192 -3932353 -663418 -404406 -3653855 -8418453 -12794897 -16132698
7362a6132698j838598Q19715M478432P168047O197962J126154m259037n050225
$$ -16132698 -17971296 -17151581 -12673149 -5505102 692860 1819014 -2440023 -7490248
7354g490248j503408M76405k504354n754338l191148K960851N001174J250961
$$ -7490248 -8993656 -8517251 -11021605 -16775943 -19967091 -17006240 -12005066 -10754105
7346a0754105j981150o78585J514043P45491o22623P62793K808191J906856m65641
$$ -10754105 -12735255 -13413840 -11899797 -11154306 -11776929 -11014136 -8205945 -6299089 -6764730
7337f764730m96432J213404R84031j440868k733279j511146L92064J683022K646580
$$ -6764730 -7261162 -6047758 -5063727 -6504595 -9237874 -10749020 -10356956 -8673934 -6027354
7328f027354K867265J732095Q75698K366950M634782L965727J52123l049620l418047
$$ -6027354 -3160089 -1427994 -552296 1814654 6449436 10415163 10567286 7517666 4099619
7319D099619k541946j976808q79914J175284K319760J227903n59587r76321l18679
$$ 4099619 1557673 -419135 -1299049 -123765 2195995 3423898 2864311 1887990 1569311
7310A569311j83781q59144j254809p39248j9058k94051j635747k236187k79889
$$ 1569311 1385530 526386 -728423 -1467671 -1486729 -1780780 -3416527 -5652714 -5932603
7301e932603K959074L747741J039832j240134M48440L793154M066073J319265
$$ -5932603 -2973529 774212 1814044 573910 1022350 4815504 8881577 10200842
7293A0200842l50515J24375l80806k878212m075750k184298j74368o45651j453956
$$ 10200842 9850327 9974702 9593896 6715684 2639934 455636 281268 -364383 -1818339
7284a818339L55149L389572M164855K341954M14596l57926p22684j114128j159433
$$ -1818339 -1463190 1926382 6091237 8433191 8847787 8489861 7767177 6653049 5493616
7275E493616r41678p88191l80456M17607P31147J00649l75023J27739L77067j013316
$$ 5493616 4551938 3763747 3383291 3800898 4532045 4632694 4257671 4385410 4762477 3749161
7265C749161k857836k630661m0130K413709K455733L30280j933247k566044j296116
$$ 3749161 891325 -1739336 -1779466 634243 3089976 3420256 1487009 -1079035 -2375151
7256b375151P67533K201491K248326Q89203j322684l023154k741383r74911k71171
$$ -2375151 -1607618 593873 2842199 3731402 2408718 -614436 -3355819 -4330730 -4601901
7247d601901j539853j931717Q62764L832238K277168k522182m272214q17519K909407
$$ -4601901 -6141754 -8073471 -7210707 -3378469 -1101301 -3623483 -7895697 -8713216 -5803809
7238e803809K698550N77336j51631l33014j596218j899816R32816M432482M821490
$$ -5803809 -3105259 -2527923 -2679554 -3012568 -4608786 -6508602 -5575786 -1143304 3678186
7229C678186K538892K01599k102148m799903n075131q49030L683672K850145j457549
$$ 3678186 6217078 6418677 4316529 -483374 -5558505 -6407535 -2723863 126282 -1331267
7220a331267k224776J604325L587552K85892l640296l200774J55510K692430L999965
$$ -1331267 -3556043 -1951718 1635834 1921726 -1718570 -4919344 -4763834 -2071404 1928561
7211A928561M703105L091544j558603n572466n142369j753364M76195Q56640J649241
$$ 1928561 6631666 9723210 8164607 2592141 -2550228 -4303592 -3827397 -2970757 -1321516
7202a321516L093655L049366J136729l64230l4495R52425J015278P0206j048184
$$ -1321516 1772139 4821505 5958234 5594004 5559509 6511934 7527212 7597418 6549234
7193F549234j556503j025119J14173N57023l70113j649281j929160j193720j41574
$$ 6549234 4992731 3967612 4081785 4638808 4268695 2619414 690254 -503466 -645040
7184f45040R78888J699069Q81900j313239k357921n27538J920374J531914r75490
$$ -645040 333848 2032917 2914817 1601578 -756343 -1283881 636493 2168407 1192917
7175A192917j475704J111685K753814L97987l004830k591615J154461K926344
$$ 1192917 -282787 828898 3582712 3980699 975869 -1615746 -461285 2465059
7167B465059J04734l860085m730832l052745j997892j772618K64161M321444O721222
$$ 2465059 2569793 -1290292 -6021124 -9073869 -11071761 -12844379 -12580218 -8258774 -1537552
7158a537552M965427J346745n38310o02585r71783j644263q96023O06868j79163
$$ -1537552 3427875 4774620 4236310 3633725 2661942 1017679 121656 728524 549361
7149E49361l829219o723062n580275j390611K622073M834191N335401M156076
$$ 549361 -3279858 -10002920 -15583195 -16973806 -14351733 -9517542 -4182141 -26065
7141b6065J603377q06427j843530k250674l141878l555195j749996J454107K988407
$$ -26065 1577312 770885 -1072645 -3323319 -6465197 -10020392 -11770388 -10316281 -7327874
7132g327874J590455m11588k78329J614784K670946J685990J39652j80954L40031
$$ -7327874 -5737419 -6149007 -6427336 -4812552 -2141606 -455616 -315964 -496918 -156887
7123a56887p1372j742735k738505j385855J361895L124906L021395K075317J132172
$$ -156887 -228259 -1970994 -4709499 -6095354 -4733459 -1608553 1412842 3488159 4620331
7114D620331Q9667p59703n54719L36768J39166j681884l141577k386952l61422
$$ 4620331 4709998 3950295 3395576 3732344 3871510 2189626 -951951 -3338903 -3700325
7105c700325N61128l83018j961184k688871j778068O06303K749068K254275q65140
$$ -3700325 -3139197 -3522215 -5483399 -8172270 -9950338 -9344035 -6594967 -4340692 -5205832
7096e205832l132949j597487K155244M246698L857258L491499M277362M351990
$$ -5205832 -8338781 -9936268 -7781024 -3534326 322932 3814431 8091793 12443783
7088A2443783K611297Q67200O63530N56281j284587l726711m384693l376653k800152
$$ 12443783 15055080 15922280 16585810 17142091 15857504 12130793 7746100 4369447 1569295
7079A569295l135674k758919j004148O84511J159927J088172J290355J374991
$$ 1569295 -1566379 -4325298 -5329446 -4644935 -3485008 -2396836 -1106481 268510
7071B68510J028172J003460J496816J018519j383079l924589m184583k656756
$$ 268510 1296682 2300142 3796958 4815477 3432398 -492191 -4676774 -7333530
7063g333530j864129k243544j637435O88513K396613J812296P75805J656484L430872
$$ -7333530 -9197659 -11441203 -13078638 -12390125 -9993512 -8181216 -7405411 -5748927 -2318055
7054b318055L244479O63308k126951l528555l511937k121186L69259K244835K010407
$$ -2318055 926424 1589732 -537219 -4065774 -7577711 -9698897 -9329638 -7084803 -5074396
7045e074396J010957J574933K774819J424438k387791m522389k709324L56664
$$ -5074396 -4063439 -2488506 286313 1710751 -677040 -5199429 -7908753 -7552089
7037g552089J571516J621680K342387L082528K552181J598149J118339l16187
$$ -7552089 -5980573 -4358893 -2016506 1066022 3618203 5216352 6334691 6018504
7029F018504l491176n567756l836076m86341M81473m91548O3856K059846J844279
$$ 6018504 2527328 -3040428 -6876504 -7362845 -6881372 -7372920 -7309064 -5249218 -3404939
7020c404939j141509k777311n43546K928513M228805L446504K335976J388123
$$ -3404939 -4546448 -7323759 -7867305 -4938792 -709987 2736517 5072493 6460616
7012F460616N11610k1196o93620k235456l154484j031905K703398L235596n98104
$$ 6460616 6972226 6951030 6257410 4021954 867470 -164435 2538963 5774559 5176455
7003E176455l830577k562056L59215L52343j783469k119245k74196Q51959K93924
$$ 5176455 1345878 -1216178 -856963 -504620 -2288089 -4407334 -4681530 -3829571 -3535647
6994c535647n19961j253907k294836k052477Q38461L526829K106871j599225j778593
$$ -3535647 -4055608 -5309515 -7604351 -9656828 -8818367 -5291538 -3184667 -4783892 -6562485
6985f562485K371525M959830K353040j530298j700980O99115J395004k34026j435628
$$ -6562485 -4190960 768870 3121910 1591612 -109368 589747 1984751 1750725 315097
6976C15097r89108m5586O53133J232337J292640O34530L50742R23806O22544j685618
$$ 315097 -674011 -719597 -66464 1165873 2458513 3093043 3443785 4367591 4990135 3304517
6966C304517l633226k282328J228693L225645K772453J848865Q69517j815667
$$ 3304517 -328709 -2611037 -1382344 1843301 4615754 6464619 7334136 5518469
6958E518469n562628o761661m014838n22975N60702J52765N10870J306281J148257
$$ 5518469 -44159 -6805820 -10820658 -11343633 -10782931 -10630166 -10119296 -8813015 -7664758
6949g664758Q34389J937565L468820L059518Q72523n28180j21134L33328o72300
$$ -7664758 -6830369 -4892804 -1423984 1635534 2508057 1979877 1858743 2192071 1519771
6940A519771k292153k850254j777842M75848K980599M331641L551317J475878
$$ 1519771 -772382 -3622636 -5400478 -4924630 -1944031 2387610 5938927 7414805
6932G414805m3498o39624j599380l110738l293232j187825R91644N19281j815240
$$ 7414805 7371307 6731683 5132303 2021565 -1271667 -2459492 -1467848 -948567 -2763807
6923b763807k393358N55005M615707N969982L441042o66453l006990k110613N29863
$$ -2763807 -5157165 -4602160 13547 5983529 9424571 8758118 5751128 3640515 4170378
6914D170378J936788O24012j771933k373046o58756P08519p32008l793240m760889
$$ 4170378 6107166 6731178 4959245 2586199 1927443 2635962 1903954 -1889286 -6650175
6905f650175j882062K477411M706756M014805K558184K025175J639427K1483k287628
$$ -6650175 -8532237 -6054826 -1348070 2666735 5224919 7250094 8889521 8911004 6623376
6896F623376l444370k947593k229303k310492k059180K16329L872543N826924
$$ 6623376 3179006 231413 -1997890 -4308382 -6367562 -6151233 -2278690 3548234
6888C548234L886972m07690l174973k464728j90238P66074L14399N48188J909971
$$ 3548234 7435206 7027516 3852543 1387815 1197577 1963651 2278050 2826238 4736209
6879D736209K223989K34359k043071k156714q30652n90936j808088k585185k115146
$$ 4736209 6960198 7194557 5151486 2994772 2164120 1573184 -234904 -2820089 -4935235
6870d935235j451833q56879P34370K818511K791330q7732k727547k420634r36311
$$ -4935235 -6387068 -7243947 -6509577 -3691066 -899736 -987468 -3715015 -6135649 -7071960
6861g071960j591747l731429l595022l21281K539365K437431J568728L096769
$$ -7071960 -8663707 -12395136 -15990158 -16311439 -13772074 -11334643 -9765915 -6669146
6853f669146N792717N389296P50283m083243m832890k005261N73225J013603Q82208
$$ -6669146 -876429 4512867 5263150 1179907 -3652983 -5658244 -5085019 -4071416 -3189208
6844c189208J538229J595911l94160k658923k230243M85150K062338J163994L23917
$$ -3189208 -1650979 -55068 -449228 -3108151 -5338394 -4853244 -2790906 -1626912 -1302995
6835a302995J571541L115246K392858J95539q08984j74910M01994L37554N81010
$$ -1302995 268546 3383792 5776650 5972189 5163205 4988295 5390289 5727843 6308853
6826F308853J133445P36762q01949k088671k146388j205647L63415K039380K397328
$$ 6308853 7442298 8179060 7377111 5288440 3142052 1936405 2299820 4339200 6736528
6817F736528O26298j393543j113133N59571J64200k733166m220716j788526J759271
$$ 6736528 7362826 5969283 4856150 5415721 5579921 2846755 -1373961 -3162487 -1403216
6808a403216K492184Q96600K55758J185103J106187j329599m219627n168192l982878
$$ -1403216 1088968 1985568 2241326 3426429 4532616 3203017 -1016610 -6184802 -10167680
6799a0167680k034222l44797J020916K336097L392095L389987K125020J044776
$$ -10167680 -12201902 -12546699 -11525783 -9189686 -5797591 -2407604 -282584 762192
6791G62192J675918K782568J305695k735309m827777j823588K915062L615689
$$ 762192 2438110 5220678 6526373 3791064 -1036713 -2860301 54761 3670450
6783C670450J48355j962919M35032M032355M136172N30337l480542n222677l926399
$$ 3670450 3818805 1855886 2290918 6323273 10459445 10989782 7509240 2286563 -1639836
6774a639836j90543L570548M039933Q18246k124703j301540J353134J337275j621389
$$ -1639836 -1830379 1740169 5780102 6598348 4473645 3172105 4525239 5862514 4241125
6765D241125l262911j387683J002022N17465j815880k791351j771131n90988j53021
$$ 4241125 978214 -409469 592553 1110018 -705862 -3497213 -5268344 -5859332 -6012353
6756f012353J95946N92421M92445L47515J128294K160192J690403j36794j145514
$$ -6012353 -5816407 -5223986 -4731541 -4384026 -3255732 -1095540 594863 458069 -687445
6747f87445m74686K96016K14579O43998K406368L615518K479395L31685n75108
$$ -687445 -1162131 -866115 -651536 -7538 2398830 6014348 8493743 8825428 8250320
6738H250320o58625j574680k556101j560017O25300J107287k38790l98421J570006
$$ 8250320 7591695 6017015 3460914 1900897 2526197 3633484 3394694 2996273 4566279
6729D566279K781349J460817j04420J55706L70564j507892l232985j756012Q44544
$$ 4566279 7347628 8808445 8704025 8859731 9230295 7722403 4489418 2733406 3577950
6720C577950j13350m076859n128297o90673M336355M480935R64637j207160p16073
$$ 3577950 3464600 -612259 -5740556 -6431229 -2094874 2386061 3350698 2143538 1427465
6711A427465m45902j732865k364777q39764R54300R96771M90789J636304L613597
$$ 1427465 981563 -751302 -3116079 -3955843 -3001543 -2004772 -1513983 122321 3735918
6702C735918L461780M95454k680454l854154l610691l214934k284707k25014J645531
$$ 3735918 7197698 7693152 5012698 1158544 -2452147 -5667081 -7951788 -8176802 -6531271
6693f531271J562824R7813n62038L63151J817396K956172L478419K456108m23966
$$ -6531271 -4968447 -4870634 -5432672 -5069521 -3252125 -295953 3182466 5638574 5214608
6684E214608k583863q60792L222151M137887M4511l792415k168038K493837L676915
$$ 5214608 2630745 1769953 4992104 9129991 9174502 5382087 3214049 5707886 9384801
6675I384801n5462l872744l965370j571179O98103K394638L597313L117478N97777
$$ 9384801 9329339 5456595 1491225 -79954 618149 3012787 6610100 9727578 10325355
6666A0325355j746975j656059J56132J130033O3144k059617l591052l567928k235096
$$ 10325355 8578380 6922321 7078453 8208486 8271630 6212013 2620961 -946967 -3182063
6657c182063q56631k59309N27503K758689M983237L839528j106220n590413n596106
$$ -3182063 -4038694 -4298003 -3770500 -1011811 3971426 7810954 6704734 1114321 -4481785
6648d481785k274161L06483P66634Q61509J193582N9863k812376m603907l283339
$$ -4481785 -6755946 -6449463 -5682829 -4821320 -3627738 -3567875 -6380251 -10984158 -14267497
6639a4267497q62231l67953r81234Q16031N349046Q104470N493235N7710k606735
$$ -14267497 -15129728 -15497681 -16478915 -15662884 -10313838 -2209368 3283867 3341577 734842
6630G34842j101490O83622l6856q95189J196962M289597L778748l85788l023937
$$ 734842 -366648 316974 280118 -615071 581891 4871488 8650236 8264448 5240511
6621E240511j098648J970054J588949j319383k242627j12969J446196n4913k421049
$$ 5240511 4141863 6111917 7700866 6381483 4138856 4025887 5472083 5417170 2996121
6612B996121k358070K6433K249688L163726L326468K691740N20356k375555l592089
$$ 2996121 638051 664484 2914172 6077898 9404366 12096106 12616462 10240907 6648818
6603F648818k116594L12088J703341K127986K372514J854823k02762k492902k803988
$$ 6648818 4532224 4844312 6547653 8675639 11048153 12902976 12700214 10207312 7403324
6594G403324j248644j25718m61762r60526q18118j018216j700123q57495K263126
$$ 7403324 6154680 6028962 5567200 4606674 3788556 2770340 1070217 212722 2475848
6585B475848M573522K743888j763216m117240k201263J289079K849452J966572
$$ 2475848 7049370 9793258 8030042 3912802 1711539 3000618 5850070 7816642
6577G816642N50855M30853J840985L109672K003005j271044l214076j344613J521347
$$ 7816642 8367497 8798350 10639335 13749007 15752012 14480968 11266892 9922279 11443626
6568A1443626M92888m042144o182622k777736J882264K055246j733751m083484
$$ 11443626 11936514 7894370 1711748 -1065988 816276 2871522 1137771 -2945713
6560b945713k008795K277758M978211M390557J324527j989426l462245l024604
$$ -2945713 -4954508 -2676750 2301461 6692018 8016545 6027119 2564874 -459730
6552d59730k529739k838696k365450p4360J823440P49139j895430k358750K7425
$$ -459730 -2989469 -5828165 -8193615 -8267975 -6444535 -5695396 -7590826 -9949576 -9922151
6543i922151K305411K749394K744684L080955K019866j073109l308175k226377
$$ -9922151 -7616740 -4867346 -2122662 958293 2978159 1905050 -1403125 -3629502
6535c629502R0180K7584j946146k227100o389J610977R32242K50528J306607J720470
$$ -3629502 -3539322 -3511738 -5457884 -7684984 -7691373 -6080396 -5148154 -4897626 -3591019 -1870549
6525a870549q14834l353424j212753M195271O032348J561479l635654l552616
$$ -1870549 -2685383 -6038807 -7251560 -3056289 2976059 4537538 901884 -2650732
6517b650732N9799J337173p01437j840046j82613J421393J055067Q57175K512443
$$ -2650732 -2590933 -1253760 -1955197 -3795243 -3977856 -2556463 -1501396 -644221 1868222
6508A868222L728178K061104p28488j267276N08227J977203J939528J302761O65092
$$ 1868222 5596400 7657504 6929016 5661740 6169967 8147170 10086698 11389459 12054551
6499A2054551j82601r05012r41064p16234q37552q60419m59685o10854j668093
$$ 12054551 11871950 10966938 10025874 9309640 8472088 7611669 7151984 6541130 4873037
6490D873037j722944N69408K830284J777066j596520l193834k003001j308140
$$ 4873037 3150093 3719501 6549785 8326851 6730331 3536497 1533496 225356
6482B25356k987462m346381k481811J149683K986426K294269J368482J777579
$$ 225356 -2762106 -7108487 -9590298 -8440615 -5454189 -3159920 -1791438 -13859
6474a3859K570448K058947n113k126711k417377n62532J387794J019204j388909
$$ -13859 2556589 4615536 4610423 2483712 66335 -496197 891597 1910801 521892
6465E21892k928613j710897Q17968K135133K037984K313184L580356M140249K350526
$$ 521892 -2406721 -4117618 -3299650 -1164517 873467 3186651 6767007 10907256 13257782
6456A3257782r55233l263735l224379j840414p16744r7695N23971O68830o00977
$$ 13257782 12302549 9038814 5814435 3974021 3257277 3159582 3683553 4352383 3751406
6447C751406k526880k995904j593744l26809l60763k75309Q93816J330045l59992
$$ 3751406 1224526 -1771378 -3365122 -3691931 -4052694 -4328003 -3434187 -2104142 -2464134
6438b464134j831192k87962K483400K417278k42761j127258J225719L074133J562738
$$ -2464134 -4295326 -4583288 -2099888 317390 74629 -1052629 173090 3247223 4809961
6429D809961j054924j498621k86088K25802j35281k10997l03221j171767j720985
$$ 4809961 3755037 2256416 1970328 2196130 2060849 1849852 1546631 374864 -1346121
6420a346121m56845J751564K788520K312890J481781N81353p51978j690926j084822
$$ -1346121 -1802966 -51402 2737118 5050008 6531789 7113142 6361164 4670238 3585416
6411C585416J23028k55273k228367l214067j657273O53728Q47630j447552l719902
$$ 3585416 3708444 3453171 1224804 -1989263 -3646536 -2992808 -2145178 -3592730 -7312632
6402g312632l447496p01474K294054L843609M228845M159301L048604L83439k069125
$$ -7312632 -10760128 -11461602 -9167548 -5323939 -1095094 3064207 6112811 6496250 4427125
6393D427125j864582L20420J137392n96094k267398j807887p68011j148390j823868
$$ 4427125 2562543 2882963 4020355 3424261 1156863 -651024 -1419035 -2567425 -4391293
6384d391293p89097J039168J305742L10442O35313L072942N335214M847988J351253
$$ -4391293 -5180390 -4141222 -2835480 -2525038 -1889725 1183217 6518431 11366419 12717672
6375A2717672k925949m735243k551577J176807K167880k58286k280069j549519
$$ 12717672 9791723 5056480 2504903 3681710 5849590 5591304 3311235 1761716
6367A761716o96235k146438l161394m88787L057802K431350r78874r57752L525784
$$ 1761716 1065481 -1080957 -4242351 -4731138 -1673336 758014 -220860 -1178612 2347172
6358B347172O427279L804642j180389m316009n638515o040756m138696k84741
$$ 2347172 8774451 12579093 11398704 7082695 1444180 -4596576 -8735272 -9020013
6350i020013J063764k397940n814038l301379L497923P799699O713481L126707
$$ -9020013 -7956249 -10354189 -16168227 -19469606 -15971683 -8171984 -1458503 1668204
6342A668204p8660k638135m033539k888215j49697R92788l40672j311982K26019
$$ 1668204 1589544 -1048591 -5082130 -7970345 -8120042 -7127254 -7467926 -8779908 -8553889
6333h553889K615997L190263J960979Q22274O34389P40720M32954m17318j581875
$$ -8553889 -5937892 -2747629 -786650 35624 670013 1410733 1843687 1426369 -155506
6324a55506k411200k121572q96915j07741o24732j398612o93769J393593K717336
$$ -155506 -2566706 -4688278 -5585193 -5692934 -6317666 -7716278 -8410047 -7016454 -4299118
6315d299118J843123J41284k2093J190963J186417q02973j664671J276919N347528
$$ -4299118 -2455995 -2314711 -2336804 -1145841 40576 -762397 -2427068 -1150149 4197379
6306D197379N150947r110m719653m444920q36190J573814J130495p78715k854645
$$ 4197379 9348326 9339216 4619563 174643 -661547 912267 2042762 1264047 -1590598
6297a590598m249837l493333j66349L233219L827822K120811Q51707R60177J240132
$$ -1590598 -5840435 -9333768 -9500117 -6266898 -2439076 -318265 533442 1493619 2733751
6288B733751J126848R07838k35066l192788o056302n482337j328258K885329M514452
$$ 2733751 3860599 4768437 4533371 1340583 -4715719 -10198056 -11526314 -8640985 -4126533
6279d126533M082920K861400J327059N99626J982633L864445K402966k901660
$$ -4126533 -43613 2817787 4144846 4744472 6727105 10591550 12994516 10092856
6271A0092856p273583o461450j993545J577440K374500J657525O04448m53841
$$ 10092856 2819273 -3642177 -5635722 -4058282 -1683782 -26257 578191 124350
6263A24350p39124L72446J947730K561475K138423J337770K07674j058103j369552
$$ 124350 -614774 -242328 1705402 4266877 6405300 7743070 7950744 6892641 5523089
6254E523089m56737M1147r73110j984414j257374K65334P58938O01568R62806
$$ 5523089 5066352 5107499 4134389 2149975 892601 1157935 1916873 2518441 3481247
6245C481247Q80552r77858k861480k014619M33503P14751j432119k087406N46298
$$ 3481247 4361799 3383941 522461 -1492158 -1058655 -343904 -1776023 -3863429 -3317131
6236c317131L249729K839324N47511p71918p91618o48695k53247P08404J011075
$$ -3317131 -67402 2771922 3319433 2547515 1755897 1107202 853955 1562359 2573434
6227B573434k41670j436294o37444J167234J432772j34697j450053j259894l67478
$$ 2573434 2331764 895470 258026 1425260 2858032 2723335 1273282 13388 -354090
6218c54090J58788J70227j56327o27708p75919m51836m29993j276725j969903
$$ -354090 -195302 -25075 -181402 -809110 -1585029 -2036865 -2466858 -3743583 -5713486
6209e713486r35162J666528L794718L684391J476359r96448j529556N85478L249737
$$ -5713486 -6648648 -4982120 -1187402 2496989 3973348 2976900 1447344 2032822 5282559
6200E282559L097229n14294l992568l448577N50863L753102L295760L85766j938973
$$ 5282559 8379788 7865494 3872926 424349 975212 4728314 8024074 8409840 6470867
6191F470867k142982r95467j25231k26409m67972J31666R34522N23029n62063
$$ 6470867 4327885 3332418 3207187 2980778 2512806 2644472 3578994 4102023 3539960
6182C539960o7849J982012K185650j121353m181874k720885J293413K225202o10182
$$ 3539960 3472111 5454123 7639773 6518420 2336546 -384339 909074 3134276 2524094
6173B524094j944963J051978M421406L832666J098687O00128K083771J432366
$$ 2524094 579131 1631109 6052515 9885181 10983868 11583996 13667767 15100133
6165A5100133k453510n717673n027267j874300N848m11635q94106K68030J739047
$$ 15100133 12646623 6928950 1901683 27383 33231 -378404 -1272510 -1004480 734567
6156G34567J265587n48503m42831K825775N747119M029234j494581n445612m495355
$$ 734567 2000154 1451651 1008820 3834595 9581714 13610948 12116367 6670755 2175400
6147B175400r02831J264171J048066K84824K11071L26682j24669j009128j486275
$$ 2175400 1272569 2536740 3584806 3869630 4080701 4407383 4282714 3273586 1787311
6138A787311q31688N57215J131419R9542j093237p79314J2467r13334k729598
$$ 1787311 955623 1512838 2644257 2743799 1650562 871248 883715 -29619 -2759217
6129b759217k192511R65847K855922J210772j130087q77620P01610M78901j338472
$$ -2759217 -4951728 -3985881 -1129959 80813 -1049274 -1926894 -1225284 -746383 -2084855
6120b084855k091295j003072N92533J975011K979932K538075K54306j801751j793712
$$ -2084855 -4176150 -5179222 -4586689 -2611678 368254 2906329 3160635 1358884 -434828
6111d34828j179258j978379k699085q35525J998870J980066n69335j532921K44059
$$ -434828 -1614086 -3592465 -6291550 -7127075 -5128205 -3148139 -3717474 -5250395 -5006336
6102e006336J433773K58341p48118L81103J769479J507461R51853J663975K271966
$$ -5006336 -3572563 -3314222 -4062340 -3681237 -1911758 -404297 547556 2211531 4483497
6093D483497J159858l34412j87923R61320J384084J360358K070512K783826J689075
$$ 4483497 5643355 5308943 5121020 6082340 7466424 8826782 10897294 13681120 15370195
6084A5370195j304480m504347o284723n574983j995427K643936M483769J644027
$$ 15370195 14065715 9561368 3276645 -2298338 -4293765 -1649829 2833940 4477967
6076D477967k736759l746947n30169L121169L671800J368395j184912k135024
$$ 4477967 1741208 -2005739 -2535908 585261 4257061 5625456 4440544 2305520
6068B305520j420916N9500J271631J253533n85413l529580n035311k620787K668050
$$ 2305520 884604 944104 2215735 3469268 2883855 -645725 -5681036 -8301823 -5633773
6059e633773O036801M102834o45560k895824j318110O07465L18797q04873q48751
$$ -5633773 403028 4505862 3860302 964478 -353632 253833 572630 -232243 -1080994
6050a080994l25156k49201j50028L99920P77370J094026K267176L212037J341120
$$ -1080994 -1406150 -1655351 -1805379 -1405459 -628089 465937 2733113 5945150 7286270
6041G286270k608522m105418j455683J075853k30111k937131l159245j951327
$$ 7286270 4677748 572330 -883353 192500 -37611 -2974742 -6133987 -8085314
6033h085314k133061k140003J033578N064622M932366J234314n99940P44289Q33197
$$ -8085314 -10218375 -12358378 -11324800 -6260178 -1327812 -93498 -693438 50851 884048
6024H84048k260876m406662k336716J314596K802795K598729K712150K453256
$$ 884048 -1376828 -5783490 -8120206 -6805610 -4002815 -1404086 1308064 3761320
6016C761320M15195k065162k848069k463006k657605l014782j814367P19025K443252
$$ 3761320 4176515 2111353 -736716 -3199722 -5857327 -8872109 -10686476 -9967451 -7524199
6007g524199K114213N40124o25463k31132J499701K743520J707517j007950k864345
$$ -7524199 -5409986 -4869862 -5495325 -5726457 -4226756 -1483236 224281 -783669 -3648014
5998c648014k505060r61538L74859J067324P32710q45655k239458j511434N30026
$$ -3648014 -6153074 -7114612 -6739753 -5672429 -4939719 -5785374 -8024832 -9536266 -9006240
5989i006240R05589r07187j927257m36778J373275J176713j63418r66989j344195
$$ -9006240 -8100651 -9007838 -10935095 -11371873 -9998598 -8821885 -8985303 -9952292 -11296487
5980a1296487j303251M79455L465435M258488J888276N34552L106990N677165
$$ -11296487 -12599738 -12120283 -8654848 -4396360 -2508084 -1973532 1133458 6810623
5972F810623L359026j289991j992727R51570J132126l350922o803122n012712
$$ 6810623 10169649 8879658 6886931 7838501 8970627 5619705 -1183417 -6196129
5964f196129j035248P68447R39325J666603J965211K96779j391921n09019J694396
$$ -6196129 -7231377 -6462930 -5523605 -3857002 -1891791 -1595012 -2986933 -3495952 -1801556
5955a801556K352113J660480J510218J286586p38265l000232k128437J345266
$$ -1801556 550557 2211037 3721255 5007841 4269576 1269344 -859093 486173
5947D86173L007824R24874j761241j716432L80509K020639K416372K020034P79837
$$ 486173 3493997 4418871 2657630 941198 1321707 3342346 5758718 7778752 8558589
5938H558589j085887k241158k025668j721763k380970k868846j943162p88315
$$ 8558589 7472702 5231544 3205876 1484113 -896857 -3765703 -5708865 -6497180
5930f497180j085056j648319J44320L863453N875868M221086J117365m67220o31631
$$ -6497180 -7582236 -9230555 -9086235 -5222782 653086 4874172 5991537 5524317 4892686
5921D892686j381844l117551m081032k796976K43301L181736M291884L059966
$$ 4892686 3510842 393291 -3687741 -6484717 -6241416 -3059680 1232204 4292170
5913D292170L87929k175912l416171k728052l07585K112386J871481j386329l892478
$$ 4292170 4680099 2504187 -911984 -3640036 -3947621 -1835235 36246 -1350083 -5242561
5904e242561j846499K908281M634121J624434j552275j311497k27305j805135
$$ -5242561 -7089060 -4180779 453342 2077776 525501 -785996 -1013301 -2818436
5896b818436m058631k988129L36571J658281R06366J849759M859810N995151L909438
$$ -2818436 -6877067 -9865196 -9528625 -7870344 -6963978 -5114219 -254409 5740742 9650180
5887I650180J837441J279979m89752m287758o076073l594266p92472j335713k256472
$$ 9650180 11487621 12767600 12277848 7990090 1914017 -1680249 -2472721 -3808434 -6064906
5878f064906O54426M837781M545901K02973k254322o55076R35938m32595k277626
$$ -6064906 -5410480 -572699 3973202 4176175 1921853 1266777 2202715 1770120 -507506
5869e07506j362634J564560L688529L665000J606113j867712n091822n974104
$$ -507506 -1870140 -305580 3382949 7047949 8654062 6786350 1694528 -4279576
5861d279576m334271k061073n42370L12822O17154L58165N97431K301286M148730
$$ -4279576 -8613847 -10674920 -11217290 -10904468 -10287314 -9929149 -9331718 -7030432 -2881702
5852b881702M224859L412406L705055L746244O22215l817435m038225K96037K465868
$$ -2881702 1343157 4755563 8460618 12206862 12829077 9011642 4973417 5269454 7735322
5843G735322j226985n256667l371173J661554K840685j20792j589221J32713J005360
$$ 7735322 6508337 1251670 -2119503 -457949 2382736 2261944 672723 805436 1810796
5834A810796p60608j780411l4251J574137O11892p91060j18923J246685J039951
$$ 1810796 1050188 -730223 -764474 809663 1421555 630495 511572 1758257 2798208
5825B798208J39324K82255L77542j380858l529890k978415K83212L135158L549025
$$ 2798208 2937532 3219787 3597329 2216471 -1313419 -4291834 -4008622 -873464 2675561
5816B675561K366259J174356O05286N95006N14622p16224l034166m236924k382437
$$ 2675561 5041820 6216176 6821462 7416468 7931090 7214866 4180700 -56224 -2438661
5807b438661J187541L053461J725351j236286l687716m520276l149224J95762
$$ -2438661 -1251120 1802341 3527692 2291406 -1396310 -5916586 -9065810 -8870048
5799h870048L335014L527972P97642j806413j879057m5000J681331K068725P22821
$$ -8870048 -5535034 -2007062 -1209420 -3015833 -4894890 -4939890 -3258559 -1189834 -467013
5790d67013j914033l793505k704582L61820J628313q9321r71217K239531O419386
$$ -467013 -2381046 -6174551 -8879133 -8517313 -6889000 -6978321 -7949538 -5710007 709379
5781G09379N534667q37314o323615n714440q81769K695607K807205J731815J888262
$$ 709379 6244046 5406732 -916883 -6631323 -7513092 -4817485 -2010280 -278465 1609797
5772A609797K638407J738491j301472m274218m779956l048938j374939r06393
$$ 1609797 4248204 5986695 4685223 411005 -4368951 -7417889 -8792828 -9699221
5764i699221n64474L21097M40758p00006n07007L091808O964209N686002o32677
$$ -9699221 -10263695 -9942598 -9501840 -10201846 -10708853 -7617045 -652836 5033166 4400489
5755D400489n406343l877405J115714L786709K708243N63709r03172j919410j909486
$$ 4400489 -1005854 -4883259 -3767545 19164 2727407 3291116 2387944 468534 -1440952
5746a440952K99512L282720L432158k17174l979933l932949q18929J193538J546
$$ -1440952 -1141440 2141280 5573438 5356264 1376331 -2556618 -3375547 -2182009 -2180463
5737b180463j927057j049716K340001M181162J953216j602692j800632J628357
$$ -2180463 -4107520 -5157236 -2817235 1363927 3317143 1714451 -86181 1542176
5729A542176L980066J856286k507463m569690k980575J34068K506784K974067
$$ 1542176 5522242 7378528 4871065 301375 -2679200 -2545132 -38348 2935719
5721B935719R07290k721700m548230k115211K230150L635628J113447j311325
$$ 2935719 3843009 1121309 -3426921 -5542132 -3311982 323646 1437093 125768
5713A25768m88543J769939K008085J11393j235545p21554J97125k35478j862078
$$ 125768 -362775 1407164 3415249 3526642 2291097 1569543 1766668 1531190 -330888
5704c30888l152677l104033k151176j261564m30296J215676L502492M525529L061225
$$ -330888 -3483565 -6587598 -8738774 -10000338 -10430634 -9214958 -5712466 -1186937 1874288
5695A874288O82323l29288m29514j715460l631020k951415R43694L884211K239495
$$ 1874288 2556611 2227323 1797809 82349 -3548671 -6500086 -5556392 -1672181 567314
5686E67314j823785l311998j312500L89761n25893j531628N04519M116629M853592
$$ 567314 -1256471 -4568469 -5880969 -5491208 -6017101 -7548729 -7044210 -2927581 1926011
5677A926011J378881k540201k794566J35146K442470K089814O45722K16990O97721
$$ 1926011 3304892 764691 -2029875 -1894729 547741 2637555 3283277 3500267 4197988
5668D197988Q32344K56971o97209j842091k566884j863908k71517j09652j955647
$$ 4197988 5030332 5287303 4590094 2748003 181119 -1682789 -1954306 -2063958 -4019605
5659d019605k780198k62377K783744J986812j563296k312998J509998N217719
$$ -4019605 -6799803 -7062180 -4278436 -2291624 -3854920 -6167918 -4657920 559799
5651E59799M649207J628134Q5499L40342L26356k23434k25572o3104p29950j388224
$$ 559799 5209006 6837140 6922639 7262981 7589337 7365903 7140331 7077227 6347277 4959053
5641D959053o96356L89055j01424j789783k470249j449875K0829J146170K080436
$$ 4959053 4262697 4651752 4550328 2760545 290296 -1159579 -1138750 7420 2087856
5632B087856K465373J776831Q31795Q27975J276100R72867L92337O74826Q42746
$$ 2087856 4553229 6330060 7161855 7989830 9265930 10238797 10631134 11305960 12148706
5623A2148706j073438m299116n752956m484898k671961j693957m51719J350058
$$ 12148706 11075268 6776152 1023196 -3461702 -6133663 -7827620 -8279339 -6929281
5615f929281J579631o89787k682857j557839J443762L038846K574736J936367
$$ -6929281 -5349650 -6039437 -8722294 -10280133 -8836371 -5797525 -3222789 -1286422
5607a286422J756345O87696j481794k580534r28410K040821L210332J375377j348352
$$ -1286422 469923 1157619 -324175 -2904709 -3833119 -1792298 1418034 2793411 1445059
5598A445059j902377R0150J713711N00355j886484j548715J963515M415513K747120
$$ 1445059 -457318 -367168 1346543 1846898 -39586 -1588301 375214 4790727 7537847
5589G537847l12093k32816K389533K660932j097911m646019l931025n20608J409512
$$ 7537847 7225754 6992938 9382471 12043403 10945492 6299473 2368448 1847840 3257352
5580C257352R63414L56696M47086n0875j228713j265609K24187R84762l73266
$$ 3257352 4220766 4577462 5024548 4973673 3744960 2479351 2703538 3688300 3315034
5571C315034j949329j396015N85925J624025J295202J193115K063443K933507
$$ 3315034 1365705 -30310 555615 2179640 3474842 4667957 6731400 9664907
5563I664907K793441J388345j251004m204098n108677k587916R22108J491743
$$ 9664907 12458348 13846693 12595689 8391591 3282914 694998 1617106 3108849
5555C108849q03784j707762Q45669L363208J936168j960388l836998k560557r34612
$$ 3108849 2305065 597303 1442972 4806180 6742348 4781960 944962 -1615595 -2550207
5546b550207p32851o26304O97832K284207K647283J697454K02789j011955r41129
$$ -2550207 -3283058 -3909362 -3211530 -927323 1719960 3417414 3620203 2608248 1667119
5537A667119P34974K284682J402247j391827k931054j779107j12988N5256P9358
$$ 1667119 2402093 4686775 6089022 4697195 1766141 -12966 -125954 -70698 8660
5528H660J899390M058527L500179L89310j983698k042658j685961k529878l133260
$$ 8660 1908050 5966577 9466756 9856066 7872368 5829710 4143749 1613871 -1519389
5519a519389j536319J355124K827571J787902m35151j995608j902188k12206J776394
$$ -1519389 -3055708 -1700584 1126987 2914889 2479738 484130 -1418058 -1630264 146130
5510A46130K222870J053644O81955K538215L880327J028354m385963o129933j695135
$$ 146130 2369000 3422644 4104599 6642814 10523141 11551495 7165532 1035599 -659536
5501f59536L597152L471485j104043m125449l013317o09012M60093P35675P11496
$$ -659536 2937616 6409101 5305058 1179609 -1833708 -2442720 -1982627 -1246952 -535456
5492e35456p86844l140468k740844J849770O297123N341433l33279n047803m956192
$$ -535456 -1322300 -4462768 -7203612 -5353842 943281 6284714 5951435 903632 -4052560
5483d052560j264694K640798M593422M274724K710503J488488J145173N05861
$$ -4052560 -5317254 -2676456 1916966 6191690 8902193 10390681 11535854 12041715
5475A2041715j285065k952924k913287j924248j775524k053290q15872J613390
$$ 12041715 10756650 7803726 4890439 2966191 1190667 -862623 -1678495 -65105
5467f5105K244741m86930m352998n960804m213489n46791K739100L761293K183056
$$ -65105 2179636 1692706 -2660292 -8621096 -12834585 -13381376 -10642276 -6880983 -4697927
5458d697927j21224o43313R65824K676431K793030J526615k63348k112386l218185
$$ -4697927 -4819151 -5462464 -4496640 -1820209 972821 2499436 2236088 123702 -3094483
5449c094483k524129m85467Q45082N25291m879N57975J287324J002077P50618
$$ -3094483 -5618612 -6104079 -5258997 -4733706 -4738585 -4180610 -2893286 -1891209 -1140591
5440a140591K152965M229358M308287J875753p43679j772229j885971k095606
$$ -1140591 1012374 5241732 9550019 11425772 10682093 8909864 7023893 4928287
5432D928287j894555r18476o30888k201902l789510k571159P01016K043628p1894
$$ 4928287 3033732 2115256 1484368 -717534 -4507044 -7078203 -6377187 -4333559 -4405453
5423d405453k252491j245156J171821J351348j70480J17718K305526K729952O74211
$$ -4405453 -6657944 -7903100 -6731279 -5379931 -5550411 -5432693 -3127167 -397215 276996
5414B76996K84624L478775N652804K360594l321877m906454j604967J800262K744257
$$ 276996 561620 4040395 9693199 12053793 8731916 3825462 2220495 4020757 6765014
5405F765014K953114L012786P23593l723925o017916l627219M20444K126255J537403
$$ 6765014 9718128 12730914 13454507 9730582 3712666 85447 505891 2632146 4169549
5396D169549O79153k62001j622516j898061k05093R69148q41076l463489k811270
$$ 4169549 4848702 4586701 2964185 1066124 861031 1830179 989103 -2474386 -5285656
5387e285656O14826K192681L51891r78030J349674M587162M062343j1186l040779
$$ -5285656 -4670830 -2478149 -2126258 -3104288 -1754614 2832548 6894891 6883705 3842926
5378C842926k557432q73816p05295j114080K59202K847864L784812K307220P59303
$$ 3842926 1285494 411678 -293617 -1407697 -1148495 1699369 5484181 7791401 8550704
5369H550704P53953R26678k27966j571429j379767n09417j072324k887362l683014
$$ 8550704 9304657 10231335 10003369 8431940 7052173 6542756 5470432 2583070 -1099944
5360a099944k453504m50964R78161J588790J451803Q63866Q63373K003177K887018
$$ -1099944 -3553448 -4004412 -3026251 -1437461 14342 878208 1741581 3744758 6631776
5351F631776J831720m00052j622686j550244j726617k477486k566797j777993
$$ 6631776 8463496 8063444 6440758 4890514 3163897 686411 -1880386 -3658379
5343c658379j110057m29057J176488K680559K050248K36496O33979L637963N359842
$$ -3658379 -4768436 -5197493 -4021005 -1340446 709802 946298 1580277 5218240 10578082
5334A0578082L250853l69611k200141k199286j852279j137309K93098J225745
$$ 10578082 13828935 13459324 11259183 9059897 7207618 6070309 6363407 7589152
5326G589152O14273n62485j068878j269529j642166j420869k88782N64964M95225
$$ 7589152 8203425 7640940 6572062 5302533 3660367 2239498 1950716 2515680 3010905
5317C010905M57985Q76667Q01988J84201K27019N83712m75461k160400j524797
$$ 3010905 3468890 4345557 5147545 5331746 5558765 6142477 5667016 3506616 1981819
5308A981819R30853Q95677k375044l753759n18672K731169J807386q5066J250294
$$ 1981819 2912672 3808349 1433305 -2320454 -2839126 -107957 1699429 1614363 2864657
5299B864657K970801O46055k734277j486319K182999J350834l509986m958102
$$ 2864657 5835458 6481513 3747236 2260917 4443916 5794750 2284764 -2673338
5291b673338j025101K043520Q34755l38084J698568L390408J652868l62219O97553
$$ -2673338 -3698439 -1654919 -820164 -1158248 540320 3930728 5583596 5221377 5918930
5282E918930K374516J175216j505646k862986l665418n009083m241125M69716
$$ 5918930 8293446 9468662 7963016 5100030 1434612 -3574471 -7815596 -7345880
5274g345880M840473L713016n34718r35051L479290O050551K390287l273804m195560
$$ -7345880 -2505407 1207609 672891 -262160 3217130 9267681 11657968 8384164 4188604
5265D188604j60598K937660J353429j958339k022594J092207K591787J45763k615358
$$ 4188604 4028006 6965666 8319095 6360756 4338162 5430369 8022156 8167919 5552561
5256E552561j790022N93874o2137l118871l294826R31836M685635L960141R39141
$$ 5552561 3762539 4356413 4294276 1175405 -2119421 -1187585 3498050 7458191 8397332
5247H397332l14621M24591J010312Q51117K88197j250955l370607l396365k44028
$$ 8397332 8082711 8507302 9517614 10368731 10656928 9405973 6035366 2639001 2394973
5238B394973K455136O57298m071409o333712l888100L46098K810626K853690J777069
$$ 2394973 4850109 5507407 1435998 -4897714 -8785814 -8439716 -5629090 -2775400 -998331
5229i98331Q78886P67357R16134j8945k084730k969690q29416K600355L850523
$$ -998331 -119445 647912 1564046 1545101 -539629 -3509319 -4338735 -1738380 2112143
5220B112143K199781Q5831p10710q82965j346007j542463r13374j70546J56327
$$ 2112143 4311924 4397755 3687045 2804080 1458073 -84390 -997764 -1168310 -1011983
5211a011983J006855L059017M627799L245681o44186l482910k995257j187446
$$ -1011983 -5128 3053889 7681688 10927369 10283183 6800273 3805016 2617570
5203B617570j224630k545320j871997J152515K892982J499675R6181J501463L038599
$$ 2617570 1392940 -1152380 -3024377 -1871862 1021120 2520795 2616976 4118439 7157038
5194G157038P41756l474649l941674J96552L723096L120577O89042m26216o75485
$$ 7157038 7898794 4424145 482471 679023 4402119 7522696 8211738 7785522 7110037
5185G110037j311381j131730R72436K996540K313455n68122k983413l401993k125029
$$ 7110037 5798656 4666926 5639362 8635902 10949357 10381235 7397822 3995829 1870800
5176A870800k38298Q40375L40821m86205J83042J542362J004054j259842j929680
$$ 1870800 1632502 2472877 2813698 2327493 2510535 4052897 5056951 3797109 1867429
5167A867429K18179K180998J459843n18571j611919k117785k477481j325846J419350
$$ 1867429 2085608 4266606 5726449 5207878 3595959 1478174 -999307 -2325153 -905803
5158i05803K717955O69394k184786k712295j547297o75644L46108K364601L571394
$$ -905803 1812152 2481546 296760 -2415535 -3962832 -4638476 -4292368 -1927767 1643627
5149A643627K200587O0560j97208P16681O54966L092K06803M65592m65237j235473
$$ 1643627 3844214 3904774 3707566 4424247 5079213 5082305 5289108 5754700 5289463 4053990
5139D053990l68982L26732j279929l336391k780735m62831P98936J275861K717673
$$ 4053990 3685008 4011740 2731811 -604580 -3385315 -3848146 -3049210 -1773349 944324
5130I44324L558271J114947k621056l059268m73220K06117k608664m643940k271113
$$ 944324 4502595 5617542 2996486 -62782 -536002 -329885 -2938549 -7582489 -9853602
5121i853602K921669P071168P699733L952639k714616p519360o293664j361093
$$ -9853602 -6931933 139235 7838968 11791607 9076991 1557631 -4736033 -6097126
5113f097126O17943k370675n148234l169754J463064M083534L796239K775387
$$ -6097126 -5479183 -7849858 -12998092 -16167846 -14704782 -10621248 -6825009 -4049622
5105d049622J873727J49836k245025l136711o49851L990681O326913K821072l887228
$$ -4049622 -2175895 -2026059 -4271084 -7407795 -8057646 -4066965 2259948 5081020 1193792
5096A193792o248169q85544N974175O106511L80112l045518p62536J995493O21112
$$ 1193792 -5054377 -5939921 34254 6140765 6520877 3475359 2712823 4708316 5329428
5087E329428k020862j300390J446018J428108j910315m075580j870350K465307
$$ 5329428 3308566 2008176 3454194 4882302 2971987 -1103593 -2973943 -508636
5079e08636M020532Q77806l557863m131882Q7859M621268N286836L239937K209954
$$ -508636 3511896 4389702 831839 -3300043 -3212184 1409084 6695920 9935857 12145811
5070A2145811K653052K019618l02442k180866k643341k978156l727927l753319
$$ 12145811 14798863 16818481 16516039 14335173 11691832 8713676 4985749 1232430
5062A232430k516506n68136J959490M559702M906801J614042k402162l111002
$$ 1232430 -1284076 -1852212 107278 4666980 9573781 11187823 8785661 5674659
5054E674659j131299k40249j078926j101925j01977m05342j676021j114080Q87957
$$ 5674659 4543360 4303111 3224185 2122260 2020283 1614941 -61080 -1175160 -287203
5045b87203J053346l12421O24949L688238L858252q5456k766782q81846J686968
$$ -287203 766143 453722 1078671 4766909 8625161 8539705 5772923 4891077 6578045
5036F578045R24860j081099j021732j30973p14780j652409j630455k312559l992560
$$ 6578045 7502905 6421806 5400074 5269101 4554321 2901912 1271457 -1041102 -5033662
5027e033662k802917K810806P216148M751472j798763n455577m652030k863141
$$ -5033662 -7836579 -5025773 2190375 6941847 5143084 -312493 -4964523 -7827664
5019g827664j386789J176191L757189L310255K22173j841093j493027p01777m64920
$$ -7827664 -9214453 -8038262 -4281073 -970818 -748645 -2589738 -4082765 -4784542 -5249462
5010e249462L39327J581606J380912k57006o89449J323541L437277K949859M98205
$$ -5249462 -4910135 -3328529 -1947617 -2204623 -2894072 -1570531 1866746 4816605 5314810
5001E314810r14459M2106J195097k41731l353719l922213k44623L628674L114473
$$ 5314810 4400351 4442457 5637554 5395823 2042104 -1880109 -2124732 1503942 4618415
4992D618415l98666k115728j342813j378748k672731k100865N07956J453114J25326
$$ 4618415 4219749 2104021 761208 -617540 -3290271 -5391136 -4883180 -3430066 -3304740
4983c304740M53673L329286M248104J441051m38148J325548K165032j669512n789069
$$ -3304740 -2851067 478219 4726323 6167374 5729226 7054774 9219806 7550294 1761225
4974A761225m514303p703J848533O29148J6185O04085M03761M1945J514091L535852
$$ 1761225 -2753078 -2760781 -912248 -283100 -266915 337170 740931 782876 2296967 5832819
4964E832819L250981R78033r32435j940929k382687j444222L54912M4125k678792
$$ 5832819 9083800 10061833 9129398 7188469 4805782 3361560 3716472 3760597 1081805
4955A081805l171653J051180N186260L987815l68417k464684j690622p19996J54418
$$ 1081805 -2089848 -1038668 4147592 8135407 7766990 5302306 3611684 2891688 3046106
4946C046106J594197J797404j34716j154219M85558J434890l43978r47174J949349
$$ 3046106 4640303 6437707 6302991 5148772 5634330 7069220 6725242 5778068 7727417
4937G727417L304119n57918m066108j583679K080794L8106l896282j880170L525363
$$ 7727417 11031536 10473618 6407510 4823831 6904625 6942731 3046449 1166279 4691642
4928D691642L686661r61766k489051K32990J167784l89863P62620M231948L779490
$$ 4691642 8378303 7416537 4927486 5160476 6328260 5938397 6701017 10932965 14712455
4919A4712455j000540l675128k189320q77598j057078L64972K859884K674105
$$ 14712455 13711915 10036787 7847467 6969869 5912791 6277763 9137647 11811752
4911A1811752R50883J864985L769580K160977n10447J035558L456320j56002o070616
$$ 11811752 12762635 14627620 18397200 20558177 20047730 21083288 24539608 24383606 18312990
4902A8312990m536967K887162N168403K51698l198280k125017j746000k067634
$$ 18312990 13776023 16663185 21831588 22083286 18885006 16759989 15013989 12946355
4894A2946355K112183P514779N416939j293477j368950M676286O243124L486164
$$ 12946355 15058538 22573317 27990256 26696779 25327829 30004115 36247239 39733403
4886C9733403N506364Q963524K815130o255078j367594J1013675Q007173o369493
$$ 39733403 45239767 54203291 57018421 50763343 49395749 60409424 68416597 62047104
4878F2047104l701451J5975272K0113577P065159J8070695N4990615M5820874
$$ 62047104 58345653 74320925 94434502 101499661 119570356 174560971 220381845
4871B20381845n1166391j55695826j52837652m8654594L9445088M1974571P776055
$$ 220381845 169215454 13519628 -139318024 -187972618 -148527530 -106552959 -98776904
4864i8776904L222613J9267910J5751734k641608n367976O233134Q398618N60591
$$ -98776904 -95554291 -76286381 -60534647 -63176255 -68544231 -62311097 -53912479 -53351888
4856e3351888N95003Q338565Q819063K565766K511017P374211M797415l806450
$$ -53351888 -52756885 -44418320 -35599257 -33033491 -30522474 -23148263 -18350848 -22157298
4848b2157298n390802J069571M242422J266781j56239J526547N05466k360922
$$ -22157298 -27548100 -26478529 -22236107 -20969326 -21125565 -19599018 -19093552 -21454474
4840b1454474n20681M294747M045509n48598j092789L010006L928742J49991j469102
$$ -21454474 -21975155 -17680408 -13634899 -14183497 -15276286 -12266280 -8337538 -8187547 -9656649
4831i656649Q09759O99950l662197n819937k282981K072032K773396J659148J451763
$$ -9656649 -8846890 -8146940 -11809137 -17629074 -19912055 -17840023 -15066627 -13407479 -11955716
4822a1955716J593521J682832K862648M135052K760181o96309k749268k675175
$$ -11955716 -10362195 -8679363 -5816715 -1681663 1078518 382209 -2367059 -5042234
4814e042234k807462l389870k399135l51708o6622j543245j828368k8429J768722
$$ -5042234 -7849696 -11239566 -13638701 -13990409 -14057031 -15600276 -17428644 -17457073 -15688351
4805a5688351K270938J844313M16803j768881k552279o63481J515094J560417
$$ -15688351 -13417413 -11573100 -11156297 -12925178 -15477457 -16140938 -14625844 -13065427
4797a3065427J044243K062733K681620N60066j832788j016882J105248L84424
$$ -13065427 -12021184 -9958451 -7276831 -6716765 -8549553 -9566435 -8461187 -8076763
4789h076763k359255l196338k094165j885727j981643M67765M292755N456982
$$ -8076763 -10436018 -13632356 -15726521 -17612248 -19593891 -19126126 -14833371 -9376389
4781i376389L750735K506783K463305J646685M21137P30754J159721j165394m413987
$$ -9376389 -5625654 -3118871 -655566 991119 1412256 2143010 3302731 2137337 -2276650
4772b276650m014656l83096J549376L40149p27078l96365q90423k111727r91736
$$ -2276650 -6291306 -6674402 -5125026 -4784877 -5511955 -5908320 -6798743 -8910470 -9902206
4763i902206K151161K815020m23868l453041l218218j603844r25330m38668O82316
$$ -9902206 -7751045 -4936025 -5359893 -8812934 -12031152 -13634996 -14560326 -14998994 -14316678
4754a4316678J237452P34715N03086Q26787N62948J73014J140988K188653P20461
$$ -14316678 -13079226 -12344511 -11841425 -11014638 -10451690 -10278676 -9137688 -6949035 -6228574
4745f228574j767395j127809J924433J802690k718914n390195j627966M521797
$$ -6228574 -7995969 -9123778 -7199345 -5396655 -8115569 -13505764 -15133730 -10611933
4737a0611933O315207L058141q59077k399273j686335K00187J925437J937451
$$ -10611933 -4296726 -1238585 -2097662 -4496935 -6183270 -5983083 -4057646 -2120195
4729b120195J98321j349866j393971o94066j00273O70432J401722R11409p88395
$$ -2120195 -1921874 -3271740 -4665711 -5359777 -5460050 -4789618 -3387896 -2476487 -3264882
4720c264882k078791k242853k203001k325797j866854q77298k12702L39471J344132
$$ -3264882 -5343673 -7586526 -9789527 -12115324 -13982178 -14859476 -15072178 -14732707 -13388575
4711a3388575J652508K25059p78403J240521M107115L286756n79686k045313N22966
$$ -13388575 -11736067 -11511008 -12289411 -11048890 -6941775 -3655019 -4234705 -6280018 -5757052
4702e757052K552708J206035j90671J437992L384735J909176j602471l254704
$$ -5757052 -3204344 -1998309 -2188980 -750988 2633747 4542923 2940452 -314252
4694c14252k384193j085673m56831m50541j341792k660023k614076p29862J023069
$$ -314252 -2698445 -3784118 -4240949 -4691490 -6033282 -8693305 -11307381 -12037243 -11014174
4685a1014174J446652J877149K950764K560948n82452l888799l887784m89708
$$ -11014174 -9567522 -7690373 -4739609 -2178661 -2761113 -6649912 -10537696 -11027404
4677a1027404L511246N350569L640649p56679m248099l733166j126021j247724
$$ -11027404 -7516158 -2165589 1475060 718381 -3529718 -7262884 -8388905 -9636629
4669i636629m371383n184674q55310M451165N721995L593786J672462J122702
$$ -9636629 -14008012 -19192686 -20047996 -15596831 -9874836 -6281050 -4608588 -3485886
4661c485886J179850J753090K344324J347854q06549j021840J319233K252006
$$ -3485886 -2306036 -552946 1791378 3139232 2332683 1310843 2630076 4882082
4653D882082p15284m278421m510297k573406j495791j001342K33388P25387q04371
$$ 4882082 4166798 -111623 -4621920 -7195326 -8691117 -9692459 -9459071 -8733684 -9538055
4644i538055j754272K58801K531484J391600j502431k016417k66279O46547M31155
$$ -9538055 -11292327 -11033526 -8502042 -7110442 -8612873 -10629290 -10895569 -10249022 -9817867
4635i817867R14802J501854N56823m62341N43600J602542j25123k344239q78063
$$ -9817867 -8903065 -7401211 -6844388 -7306729 -6763129 -5160587 -5285710 -7629949 -8508012
4626h508012K646324K975637J59298p38796J181004J032396l068051o395582n095033
$$ -8508012 -5861688 -2886051 -2726753 -3465549 -2284545 -1252149 -4320200 -10715782 -15810815
4617a5810815j484889P55963J723512K754362K953003J295838p93033j407818
$$ -15810815 -17295704 -16539741 -14816229 -12061867 -9108864 -7813026 -8606059 -10013877
4609a0013877n16743R60564K187699K009160J31502j265062j21470J742366J193081
$$ -10013877 -10530620 -9570056 -7382357 -5373197 -5241695 -6506757 -6628227 -4885861 -3692780
4600c692780o24596o5210K080736J307456k423618l687395n11471K217466J072725
$$ -3692780 -4317376 -4382586 -2301850 -994394 -3418012 -7105407 -7616878 -5399412 -4326687
4591d326687m98646J038824K932453J468678j174319q98032J252155J563713K38545
$$ -4326687 -4825333 -3786509 -854056 614622 -559697 -1457729 -205574 1358139 1596684
4582A596684m3854K11204j299514l287037k437400N61319J857251Q57208O90020
$$ 1596684 1552830 1764034 464520 -2822517 -5259917 -4698598 -2841347 -1984139 -1294119
4573a294119K224632K663431Q06805r81857j298994j833049l253178l028396J54776
$$ -1294119 930513 3593944 4400749 3418892 2119898 286849 -2966329 -5994725 -5839949
4564e839949L112845K339685q30210k341816j244503k53370j008441j743701k92953
$$ -5839949 -2727104 -387419 -1217629 -3559445 -4803948 -5057318 -6065759 -7809460 -8102413
4555h102413K673462M538920L778243J162112j427069k522986j762389Q0804J612039
$$ -8102413 -5428951 -890031 2888212 4050324 2623255 100269 -1662120 -1581316 30723
4546C0723J818990O83455j261772l424267m633983l084971J441774N565438N018295
$$ 30723 1849713 2533168 1271396 -2152871 -6786854 -9871825 -8430051 -2864613 2153682
4537B153682K40875l293174k121591M24971n48501l700319l341749J548637N259144
$$ 2153682 2394557 -898617 -3020208 -2595237 -3143738 -6844057 -10185806 -8637169 -3378025
4528c378025L520209p35187k286326p60675M39831p3098o47998k58766J63696
$$ -3378025 142184 -593003 -2879329 -3640004 -3200173 -3273271 -3921269 -4180035 -4016339
4519d016339m9795l35575l34862l11444M3674J424431L156082L220063P68682
$$ -4016339 -4066134 -4401709 -4736571 -5048015 -5004341 -3579910 -423828 2796235 3564917
4510C564917k421777l798245k788217j042412j86016j19875R5978L82488j47310
$$ 3564917 1143140 -2655105 -5443322 -6485734 -6671750 -6791625 -6695647 -6313159 -6460469
4501f460469j172958j038009N67561J579422P51235N2900J470062L030727J422690
$$ -6460469 -7633427 -8671436 -8103875 -6524453 -5773218 -5720318 -4250256 -1219529 203161
4492B03161k330027l810348j761532N41928J032263J354139K277366J560729j057952
$$ 203161 -2126866 -5937214 -7698746 -7156818 -6124555 -4770416 -2493050 -932321 -1990273
4483a990273j612316J587244L628415J26958m935949m551113M57301K656521n68104
$$ -1990273 -3602589 -2015345 1613070 1740028 -3195921 -7747034 -7289733 -4633212 -5201316
4474e201316l666327k083586J516409K743558J981687J818812J856089K52110
$$ -5201316 -8867643 -10951229 -9434820 -6691262 -4709575 -2890763 -1034674 -782564
4466g82564j842541j460614J413189L483949K459270n90742l172741l806559k423520
$$ -782564 -2625105 -4085719 -2672530 811419 3270689 2679947 -492794 -4299353 -6722873
4457f722873Q8960K298886L080212K360963P21710j374682l402617m420469l895629
$$ -6722873 -6633913 -4335027 -1254815 1106148 1827858 453176 -2949441 -7369910 -11265539
4448a1265539k621344j772737j095166Q07940L987655O068525M742944R09376
$$ -11265539 -13886883 -15659620 -16754786 -15946846 -11959191 -5890666 -1147722 -238346
4440b38346j936578j664398K20048Q57984l80301j627981j195251P22101K688068
$$ -238346 -2174924 -3839322 -3619274 -2761290 -3141591 -4769572 -5964823 -5242722 -2554654
4431b554654L194436J509945j292026k497905o21393K112930K178770l83566j987511
$$ -2554654 639782 2149727 857701 -1640204 -2261597 -148667 2030103 1646537 -340974
4422c40974q04026Q42566N66572n02033k00206J124123J909847K055873J764796
$$ -340974 -1145000 -302434 264138 -237895 -438101 686022 2595869 4651742 6416538
4413F416538j80575m002149o602889n046636j063096J322445J465300J682450
$$ 6416538 6235963 2233814 -4369075 -9415711 -10478807 -9156362 -7691062 -6008612
4405f008612K200901R90090j468902j866934N68143K528397J830300L99469L66281
$$ -6008612 -3807711 -2817621 -4286523 -6153457 -5585314 -3056917 -1226617 -827148 -460867
4396d60867P19172j1315q23637l98521L68445K94935P6336L31656j56438j836841
$$ -460867 258305 246990 -576647 -975168 -606723 -311788 -235452 96204 -60234 -1897075
4386a897075k361800l7357K656610K197371p20675k317113j229037L35844N47840
$$ -1897075 -4258875 -4296232 -1639622 557749 -162926 -2480039 -3709076 -3373232 -2825392
4377b825392j2851l47872l69585M4893R73686J159715q97370m135511n419021
$$ -2825392 -2838243 -3186115 -3555700 -3510807 -2537121 -1377406 -2274776 -6410287 -11829308
4368a1829308l458722k67683J907161L061964L991337M404311L802467K650973
$$ -11829308 -15288030 -15555713 -13648552 -10586588 -6595251 -2190940 1611527 4262500
4360D262500J337113o16717k906100l503661j288677J462818J513136q62986k234186
$$ 4262500 5599613 4982896 2076796 -1426865 -2715542 -1252724 260412 -602574 -2836760
4351b836760r54071P60102N84123m39103R638J641218K102462N97464j366581
$$ -2836760 -3790831 -3030729 -2446606 -2885709 -2876071 -1234853 867609 1465073 98492
4342I8492k563447l063566k638210o86301J632058J758795n47273k250292j368340
$$ 98492 -2464955 -5528521 -8166731 -8853032 -7220974 -5462179 -6009452 -8259744 -9628084
4333i628084K00216L38973N89721L029745N311491L313444j860925m315170j623533
$$ -9628084 -9427868 -9088895 -8499174 -5469429 -157938 3155506 1294581 -3020589 -4644122
4324d644122J756315J266587j395950j651551J043250L186842K694210R73035
$$ -4644122 -2887807 -1621220 -3017170 -4668721 -3625471 -438629 2255581 3228616
4316C228616j30417o54612j365201k209627k607274k206760r24029J101662L310153
$$ 3228616 3098199 2443587 1078386 -1131241 -3738515 -5945275 -6869304 -5767642 -2457489
4307b457489M825091M957558L739865K095976J046015K85954j637952m767040
$$ -2457489 2367602 7325160 11065025 13161001 14207016 14492970 12855018 8087978
4299H087978o485875m725348j454486l04330j217709p76459K037814M257541M042724
$$ 8087978 1602103 -3123245 -4577731 -4882061 -6099770 -6876229 -4838415 -580874 3461850
4290C461850L264770L113563J356370k948214n811329l578345R14463K036213
$$ 3461850 6726620 9840183 11196553 8248339 2437010 -1141335 -226872 1809341
4282A809341o02716k484515j434846K92363R90053J883475L686847M615893L201944
$$ 1809341 1206625 -1277890 -2712736 -2420373 -1430320 453155 4140002 8755895 11957839
4273A1957839L99487k040177l137985k406041l45774Q35670l83744j951042p42362
$$ 11957839 12357326 10317149 7179164 4773123 4427349 5263019 4879275 2928233 2185871
4264B185871K257773K895886K58455j846036r30893N17574o35004l420659m627095
$$ 2185871 4443644 7339530 7597985 5751949 4821056 5338630 4703626 1282967 -3344128
4255c344128l022850J85351L010771L347460L71553l246020l178918P94724L696927
$$ -3344128 -6366978 -6181627 -3170856 176604 548157 -2697863 -5876781 -5082057 -1385130
4246a385130K094115j052122j094406J445877K312345k2984l057654m399802l734570
$$ -1385130 708985 -343137 -1437543 8334 2320679 2297695 -759959 -5159761 -8894331
4237h894331j268599K398980M989308M313372J609354K78497R22450N63231k313670
$$ -8894331 -10162930 -7763950 -2774642 1538730 3148084 3426581 4349031 4912262 2598592
4228B598592m799949l403132J153513M937659N366237K936224o07249l667644
$$ 2598592 -2201357 -5604489 -4450976 486683 5852920 8789144 8181895 4514251
4220D514251m650758k762911K61748J071584j236660l264591j427758K876850
$$ 4514251 -136507 -2899418 -2637670 -1566086 -2802746 -6067337 -7495095 -4618245
4212d618245M677790K017873j587450k190650k27521J441074J872551J937827
$$ -4618245 59545 2077418 489968 -1700682 -1928203 -487129 1385422 3323249
4204C323249J713815Q25256J66655N52738P25727o13147k020148j494829q0645
$$ 3323249 5037064 5862320 6028975 6581713 7307440 6694293 4674145 3179316 3098671
4195C098671R1722r3375J365886K878826J257757k287597l358987j376752N6212
$$ 3098671 3190393 3097018 4462904 7341730 8599487 6311890 2952903 1576151 1632363
4186A632363j61183M30960J708483L86083l004892l438268O8732K181746L83173
$$ 1632363 1471180 1902140 3610623 3996706 991814 -2446454 -2377722 -195976 187197
4177A87197q18075J463099L006134N36752j801131J34723L032426K403161K96729
$$ 187197 -630878 832221 3838355 4375107 2573976 2708699 5741125 8144286 8441015
4168H441015J72547R465k433110l430071l6765K825549K77931l336321k015885
$$ 8441015 8613562 8623027 6189917 2759846 2723081 5548630 5826561 2490240 474355
4159D74355J162308N86217q59108J738603M137290O50281l217426J45932N106458
$$ 474355 1636663 2222880 1363772 3102375 7239665 7889946 4672520 4818452 9924910
4150I924910K723603n20489O367431J5266836J1079434M170058J9211871M7194776
$$ 9924910 12648513 12128024 18495455 33762291 44841725 49011783 68223654 115418430
4142A15418430M4069532o081031n8302351o2751766k8815522l334294l731650
$$ 115418430 159487962 153406931 95104580 32352814 3537292 202998 -3528652
4135c528652q023186j493993M178514O3929m054413j141028O91919l321512m401405
$$ -3528652 -11551838 -13045831 -8867317 -8803388 -12857801 -13998829 -13306910 -16628422 -21029827
4126b1029827J929950N892291J159860l552866o29395L379546J303185j433668
$$ -21029827 -19099877 -13207586 -12047726 -15600592 -16229987 -12850441 -11547256 -12980924
4118a2980924J577287M723015R65822m428908k903508K657916L982202J582671
$$ -12980924 -11403637 -6680622 -5714800 -10143708 -13047216 -10389300 -6407098 -4824427
4110d824427J497460L296192K359887j43892P3751J350507n42246l148708j176232
$$ -4824427 -3326967 -30775 2329112 2185220 2258971 3609478 3067232 -81476 -1257708
4101a257708L003809K456936k326854m027579m96728K715695K128476N47003N29788
$$ -1257708 1746101 4203037 1876183 -2151396 -2648124 67571 2196047 2743050 3272838
4092C272838P05553j07l47866k00808r82612k077814j391592L18551K65766j267093
$$ 3272838 3978391 3978284 3630418 3429610 2446998 369184 -1022408 -703857 -438091 -1705184
4082a705184j316027L86866J172294N10823M77828J039947r9564k385342k145580
$$ -1705184 -3021211 -2634345 -1462051 -951228 -473400 566547 466983 -1918359 -4063939
4073d063939J292930L699757J925679j781159l261532j593266P24245R16055j448339
$$ -4063939 -2771009 928748 2854427 1073268 -2188264 -3781530 -3057285 -2141230 -3589569
4064c589569l688135k302559K462624N657823L396277k036222n392117m839918
$$ -3589569 -7277704 -9580263 -7117639 -1459816 1936461 -99761 -5491878 -10331796
4056a0331796k141605J168839L893723L707849K03578k397581m31319L044571
$$ -10331796 -12473401 -11304562 -7410839 -3702990 -3499412 -5896993 -6328312 -3283741
4048c283741K592546q03232j526829J114387K105485l50062k141591p32659J199447
$$ -3283741 -691195 -1494427 -3021256 -1906869 198616 -151446 -2293037 -3025696 -1826249
4039a826249J426565J426912J921253R50861j318677j574092L73284J11263l533318
$$ -1826249 -399684 1027228 2948481 3899342 2580665 1006573 1379857 1491120 -2042198
4030b042198n056518p42773M674337M687001K92362k362247o61091K663382M192687
$$ -2042198 -7098716 -7841489 -3167152 1519849 1812211 -550036 -1211127 1452255 5644942
4021E644942K564128j453694m669435l599065N91404K331874n08737k905449m59502
$$ 5644942 8209070 6755376 2085941 -1513124 -921720 1410154 901417 -2004032 -2463534
4012b463534L161259J724690l572821n571054j426071M030808N261119J953442
$$ -2463534 697725 2422415 -1150406 -6721460 -8147531 -4116723 1144396 3097838
4004C097838k511024n046645m559646k084742J11546P23329L43341l74697j723125
$$ 3097838 586814 -4459831 -9019477 -11104219 -10992673 -10269344 -9926003 -10300700 -12023825
3995a2023825l005001k090751J211819L868882L832061K796940K446958J333936
$$ -12023825 -15028826 -17119577 -15907758 -12038876 -8206815 -5409875 -2962917 -1628981
3987a628981j301320k223011Q43588L979705K062196l114991n276140k955741
$$ -1628981 -2930301 -5153312 -4309724 -330019 1732177 -1382814 -6658954 -9614695
3979i614695o84951j284773k473033j670712N67478K732456L986858L146993j74251
$$ -9614695 -10299646 -11584419 -14057452 -15728164 -15160686 -12428230 -8441372 -5294379 -5468630
3970e468630l221247k743654J3221J041873Q8414O24732L039898L273491l05719
$$ -5468630 -8689877 -11433531 -11420310 -10378437 -10290023 -9665291 -6625393 -3351902 -3657621
3961c657621l686997l055881M02086L639097N625527N906371L338798j076433
$$ -3657621 -7344618 -10400499 -9998413 -6359316 -733789 5172582 8511380 7434947
3953G434947l666139l009917k067423k971775l416662j209267J276530R50028
$$ 7434947 3768808 758891 -1308532 -4280307 -7696969 -8906236 -7629706 -6679678
3945f679678p54677n52337J179582J668634O55910j3869k55491j230439k080648
$$ -6679678 -7434355 -7986692 -6807110 -5138476 -4482566 -4496435 -4751926 -5982365 -8063013
3936h063013j050460R24763J454110P81659Q73512J139256o18888l110985k186331
$$ -8063013 -9113473 -8188710 -6734600 -5952941 -5079429 -3940173 -4559061 -7670046 -9856377
3927i856377K373439N182360K542387k272655l837422j841007j98246o75949j082080
$$ -9856377 -7482938 -2300578 241809 -2030846 -5868268 -7709275 -7907521 -8583470 -9665550
3918i665550M22003K330245K118009k55936k413749k397856n54589J214440J493973
$$ -9665550 -9243547 -6913302 -4795293 -5051229 -7464978 -9862834 -10417423 -9202983 -7709010
3909g709010N13731m68486o23210k79021l81322j393400k614005k535685k64244
$$ -7709010 -7195279 -7663765 -8286975 -8565996 -8947318 -10340718 -12954723 -15490408 -15754652
3900a5754652L149692N245123M562006K256386P38584R21407J507768R22769q49633
$$ -15754652 -12604960 -7359837 -2797831 -541445 197139 1118546 2626314 3549083 2699450
3891B699450k572466l224120k726113j611796m79109L19248Q12932J293979J836869
$$ 2699450 126984 -3097136 -5823249 -7435045 -7914154 -7594906 -6781974 -5487995 -3651126
3882c651126J919193Q56425j156247k799292l004475k401653k510017l348748
$$ -3651126 -1731933 -875508 -2031755 -4831047 -7835522 -10237175 -12747192 -16095940
3874a6095940l048512o10465K088625K428995M64040j410756j739233j058584
$$ -16095940 -19144452 -19754917 -17666292 -15237297 -14773257 -16184013 -17923246 -18981830
3866a8981830J26427K055821L888829L641567J282783k50018J003706K842362
$$ -18981830 -18855403 -16799582 -12910753 -9269186 -7986403 -8236421 -7232715 -4390353
3858d390353K012460q14612k051998o76800M34097p74924k337548j411300J310573
$$ -4390353 -2377893 -3192505 -5244503 -5921303 -5487206 -6262130 -8599678 -10010978 -8700405
3849h700405K428391K82521l195563m873877l354276L61392L866897M844258K734605
$$ -8700405 -6272014 -5989493 -9185056 -14058933 -17413209 -17051817 -13184920 -8340662 -5606057
3840e606057n21140k148718j391267N4632Q55057K008171M655773O947493N484421
$$ -5606057 -6127197 -8275915 -9667182 -9612550 -8757493 -6749322 -2093549 4853944 10338365
3831A0338365J53709m832470n903018m134051k626790j866219l65279J411990
$$ 10338365 10492074 5659604 -243414 -4377465 -7004255 -8870474 -9235753 -7823763
3823g823763J314092l82359o63163J490840L265069K445987P32435M42268N55300
$$ -7823763 -6509671 -6892030 -7555193 -6064353 -2799284 -353297 379138 821406 1376706
3814A376706j062063l449552l899688k370011j209086j052628l43839J137857
$$ 1376706 314643 -3134909 -7034597 -9404608 -10613694 -11666322 -12010161 -10872304
3806a0872304J688388J139151J551852L278599L470664M26407l164069l718761
$$ -10872304 -9183916 -8044765 -6492913 -3214314 256350 682757 -2481312 -6200073
3798f200073j634313j06336l74347q20671j93145Q80969J657579K305521K667229
$$ -6200073 -7834386 -7940722 -8315069 -9135740 -9328885 -8447916 -6790337 -4484816 -1817587
3789a817587J802346m09591k461578k844336j703329l08694M46674N20372K80619
$$ -1817587 -15241 -424832 -2886410 -5730746 -7434075 -7742769 -7296095 -6775723 -6495104
3780f495104J17736J81054K44267J36726K96399J256970K453772K402619O55735
$$ -6495104 -6377368 -6196314 -5952047 -5815321 -5518922 -4261952 -1808180 594439 1250174
3771A250174j083279p43449J364012K554592R46212k052633l274361j618372P72336
$$ 1250174 166895 -576554 787458 3342050 4288262 2235629 -1038732 -2657104 -1884768
3762a884768J600158J390188J927188K621194J005715k722850m536017j865158
$$ -1884768 -284610 1105578 3032766 5653960 6659675 3936825 -599192 -2464350
3754b464350K214954L004004Q78607K98415K602479M056375K058019q25163j301151
$$ -2464350 -249396 2754608 3633215 3931630 6534109 10590484 12648503 11823340 10522189
3745A0522189l98479q97818k288211k023347k60699M93740k21189m19831M90603
$$ 10522189 10123710 9225892 6937681 4914334 4653635 5147375 4926186 4506355 4996958
3736D996958Q79382J38843l91495j81059k38273o59432m34559r3860j230230k813795
$$ 4996958 5876340 6015183 5623688 5442629 5204356 4544924 4110365 4016505 2786275 -27520
3726b7520j828011J247750J839954j666821m468401k190359K392391L531810O78128
$$ -27520 -1855531 -607781 1232173 -434648 -4903049 -7093408 -4701017 -1169207 -491079
3717d91079j970524k254017j790597j785465j382785j68062J081649K060040K565333
$$ -491079 -2461603 -4715620 -6506217 -8291682 -9674467 -9842529 -8760880 -6700840 -4135507
3708d135507J255463k131782m387013k399237J718241L236313J949471J945750
$$ -4135507 -2880044 -5011826 -9398839 -11798076 -10079835 -6843522 -4894051 -2948301
3700b948301M239120M957290K067403j210554j777531q44970l06170O36768K123132
$$ -2948301 1290819 6248109 8315512 7104958 5327427 4482457 4176287 4813055 6936187
3691F936187J100298l784528p980697o317763n38538K849177J200758j814022
$$ 6936187 8036485 4251957 -3728740 -10046503 -10585041 -7735864 -6535106 -8349128
3683h349128k031386N31904L175265L900490K611730P05835j10970L76771N40671
$$ -8349128 -10380514 -9848610 -6673345 -2772855 -161125 544710 433740 810511 1351182
3674A351182p59395k329097k311894q14468M41533L32736q62921j988198j543302
$$ 1351182 591787 -1737310 -4049204 -4863672 -4422139 -4089403 -4952324 -6940522 -8483824
3665h483824R81492L531838L056797k84357k600264j367383J294538K288531J942797
$$ -8483824 -7502332 -3970494 -913697 -1198054 -3798318 -5165701 -3871163 -1582632 360165
3656C60165K217043K827304K266143R50257J91895n44750k258625l682739l186416
$$ 360165 2577208 5404512 7670655 8620912 8812807 8268057 6009432 2326693 -859723
3647h59723k039249k249528k469618j65911L019088K776564r02118k994134p99210
$$ -859723 -2898972 -5148500 -7618118 -7784029 -4764941 -1988377 -2890495 -5884629 -6683839
3638f683839K244251K015427n62042j780857o60784N37201J51020p75494k59771
$$ -6683839 -4439588 -2424161 -2986203 -4767060 -5427844 -4890643 -4739623 -5515117 -5774888
3629e774888J744208K773445P65400k503819k735859J042180M311822L038606
$$ -5774888 -4030680 -1257235 -491835 -2995654 -5731513 -4689333 -377511 2661095
3621B661095n88028j819745o48156q39423k890493l348703j288816m8564j229787
$$ 2661095 2073067 253322 -394834 -1234257 -4124750 -7473453 -8762269 -8810833 -10040620
3612a0040620j934044r538K285347K290751R58321M45430R19696J946547L848124
$$ -10040620 -11974664 -11984202 -9698855 -7408104 -6449783 -6004353 -5084657 -3138110 710014
3603G10014N498879M114714k57257l256826j971864P88319Q05893j836044m322509
$$ 710014 6208893 10323607 10066350 6809524 4837660 5625979 6431872 4595828 273319
3594B73319n542621n663449l862965o4796L152495L765046L428729M188873M448053
$$ 273319 -5269302 -10932751 -14795716 -14860512 -11708017 -7942971 -4514242 -325369 4122684
3585D122684J982602j300776k011202r06457j194612k530110j794974P08434J163719
$$ 4122684 6105286 4804510 2793308 1886851 692239 -1837871 -3632845 -2924411 -1760692
3576a760692j209336k488705k07906L105091M157955K963040J004190j212167
$$ -1760692 -2970028 -5458733 -5666639 -2561548 1596407 4559447 5563637 4351470
3568D351470k835935k062318Q05030K203411k88446m217416n202300k297296J480774
$$ 4351470 1515535 -546783 258247 2461658 2173212 -2044204 -7246504 -9543800 -8063026
3559h063026K837980Q01094l172096o001746m902565j72717M548101O024498M578085
$$ -8063026 -5225046 -4423952 -7596048 -13597794 -18500359 -18673076 -14124975 -8100477 -3522392
3550c522392K404170K35153k214783l551561j526399K976636N543976L477005
$$ -3522392 -1118222 -883069 -3097852 -6649413 -8175812 -5199176 344800 3821805
3542C821805m17083j436257P63048K233634Q46304q49664j15781J539463J012632
$$ 3821805 3404722 1968465 2731513 4965147 5811451 4961787 4846006 6385469 7398101
3533G398101j270823k204448j026688N1169L8320K40582O62467o82067l468340
$$ 7398101 6127278 3922830 2896142 2947311 2985631 3226213 3888680 3206613 -261727
3524b61727m001869p81379K393371J815584p32246j425346m99554q05905k277720
$$ -261727 -4263596 -5044975 -2651604 -836020 -1568266 -2993612 -3493166 -4299071 -6576791
3515f576791k323829o64610N38394Q51917J790165L104727K819907J022568j42817
$$ -6576791 -8900620 -9565230 -9026836 -8174919 -6384754 -3280027 -460120 562448 419631
3506D19631l22726r98875j712698n54877J214215j19011m111935n212299p70324
$$ 419631 96905 -901970 -2614668 -3169545 -1955330 -2074341 -6186276 -11398575 -12168899
3497a2168899M467561N024942K032492J78780M69331L75512q07030j269088o07235
$$ -12168899 -7701338 -2676396 -643904 -465124 4207 379719 -427311 -1696399 -2303634
3488b303634m01374p72526K33915L101063N291811M299002N68046l374060n363986
$$ -2303634 -2705008 -3477534 -3243619 -142556 5149255 9448257 10016303 6642243 1278257
3479A278257m592192j510862K167204M044676K813752k66360k267558j546264
$$ 1278257 -3313935 -4824797 -2657593 1387083 4200835 3934475 1666917 120653
3471A20653M44947J073595O0703l80326P01640J256438k36534j700733o41589
$$ 120653 565600 1639195 1699898 1319572 2021212 3277650 3041116 1340383 698794
3462F98794J283322N02102k476224l452334j114115J008984K84134j295257r13873
$$ 698794 1982116 2484218 7994 -3444340 -4558455 -3549471 -3265337 -4560594 -5474467
3453e474467J005216K633301L550952L594705J850412r16179j684253N23128K504868
$$ -5474467 -4469251 -1835950 1715002 5309707 7160119 6243940 4559687 5082815 7587683
3444G587683J505107r03840k171905k781353l709394l259314n09345J163043j106526
$$ 7587683 9092790 8188950 6017045 3235692 -473702 -3733016 -4242361 -3079318 -4185844
3435d185844l889451k091574K488605L531895L54332j120502J721161M055868
$$ -4185844 -8075295 -10166869 -7678264 -4146369 -3792037 -4912539 -3191378 864490
3427H64490J850457j667035j544582J269720K228411L63955j139843l02974J370707
$$ 864490 2714947 1047912 -496670 773050 3001461 3365416 2225573 1922599 3293306
3418C293306J828033J061181K66478j51447r98907k799789m204770l029274L05003
$$ 3293306 5121339 6182520 6448998 6297551 5298644 2498855 -1705915 -4735189 -4430186
3409d430186K012334k67041l398242k626118J434954L603367J694982j093070
$$ -4430186 -2417852 -2684893 -6083135 -8709253 -7274299 -3670932 -1975950 -3069020
3401c069020j858181j330870k82512K334242N307235M299381j332482n335100
$$ -3069020 -4927201 -6258071 -6540583 -4206341 1100894 5400275 4067793 -1267307
3393a267307k704618K649434L521311k41380k749403j505410L13010L36821k41640
$$ -1267307 -3971925 -1322491 2198820 1957440 -791963 -2297373 -1984363 -1647542 -1889182
3384a889182q41544k851769n473175n041331m02679M903082P464569P383989N514304
$$ -1889182 -2730726 -5582495 -11055670 -16097001 -16499680 -11596598 -4132029 3251960 8766264
3375H766264J497648l327148n139450k733348o7399n90385k077017o95675K453729
$$ 8766264 10263912 6936764 1797314 -936034 -1003433 -1593818 -3670835 -4366510 -1912781
3366a912781L129706O00767j854660k346795k102201j813406k28182K704993M471074
$$ -1912781 1216925 1817692 -36968 -2383763 -4485964 -6299370 -6527552 -3822559 648515
3357F48515L166837o1821k765235l662771k770856q31275P92328J268969J694940
$$ 648515 3815352 3753531 988296 -2674475 -5445331 -6276606 -5484278 -4215309 -2520369
3348b520369L512959N331279L813171j298639n580929n211368j950953n17634
$$ -2520369 992590 6323869 10137040 8838401 3257472 -1953896 -3904849 -4422483
3340d422483k102005l122455n30014L796457N116340J523520l566665n063096
$$ -4422483 -6524488 -9646943 -10176957 -6380500 -1264160 259360 -3307305 -8370401
3332h370401j890853K038302K899410J420498O66634Q44726n07250l328274l915639
$$ -8370401 -10261254 -8222952 -5323542 -3903044 -3236410 -2391684 -2898934 -6227208 -10142847
3323a0142847n68537L051993K914653L63279m75951Q91748J531120P56676J087798
$$ -10142847 -10711384 -7659391 -4744738 -4381459 -4857410 -3965662 -2434542 -1677866 -590068
3314e90068L009495L117700n25545m567837m740279j858799k65794j344156j916697
$$ -590068 2419427 5537127 5011582 443745 -4296534 -6155333 -6421127 -7765283 -9681980
3305i681980N61499M026392M575917J692541j239184j387078K49999P62542n56187
$$ -9681980 -9120481 -5094089 -518172 1174369 -64815 -1451893 -1201894 -439352 -995539
3296i95539j472854j40568K262022L031328J284644j180961k104447j059466M32923
$$ -995539 -2468393 -2608961 -346939 2684389 3969033 2788072 683625 -375841 57082
3287E7082O39461n41096j452370p10231R40604J733201J561089J873546K686796
$$ 57082 696543 155447 -1296923 -2007154 -1066550 666651 2227740 4101286 6788082
3278F788082J936533j108668l987095m280389k709478j052314Q08636L099208
$$ 6788082 8724615 7615947 3628852 -651537 -3361015 -4413329 -3604693 -505485
3270e05485L645894Q56351k341908j833415J232457J981865l60209j377328Q74834
$$ -505485 3140409 3996760 1654852 -178563 1053894 3035759 2675550 1298222 2173056
3261B173056K469236K03998l144582l458772j334833K32741J121938K881058M407811
$$ 2173056 4642292 4846290 1701708 -1757064 -3091897 -2859156 -1737218 1143840 5551651
3252E551651L128790m76003l191685l489421k678485k032353j410516n80233J99250
$$ 5551651 8680441 8204438 5012753 1523332 -1155153 -3187506 -4598022 -5178255 -4979005
3243d979005P47655P38607k63134j343179m54394K281082L575758J557970q56837
$$ -4979005 -4231350 -3492743 -3755877 -5099056 -5553450 -3272368 303390 1861360 1004523
3234A004523j74170K088560J726485j543278l801202k813110n11203M61968m41511
$$ 1004523 830353 2918913 4645398 3102120 -699082 -3512192 -4023395 -3561427 -4002938
3225d002938k348588l648818k252167K005947N573253M716305N09350k533451
$$ -4002938 -6351526 -10000344 -12252511 -10246564 -4673311 42994 552344 -1981107
3217a981107k183539J13987K525463L880110K482819j810330m988649l041310
$$ -1981107 -4164646 -4050659 -1525196 2354914 4837733 3027403 -1961246 -5002556
3209e002556J679827L298240J257297L37699J608526N43208l909822n827939j738666
$$ -5002556 -3322729 -24489 1232808 1570507 3179033 3722241 -187581 -6015520 -7754186
3200g754186L073246K746809k77580m00645J801367J989779M07582Q57084L260583
$$ -7754186 -4680940 -1934131 -2211711 -2612356 -810989 1178790 1586372 2443456 5704039
3191E704039L799686J574410p07584k047287l608559m352768j934344J912661
$$ 5704039 9503725 11078135 10370551 8323264 4714705 361937 -1572407 340254
3183C40254K489697n98561k552233q98222J200204Q36799l16767M276O16971j99301
$$ 340254 2829951 2231390 -320843 -1219065 -18861 817938 501171 505447 1122418 923117
3173I23117j096669n2226K035014K856309J965769L80117j324884k608666k391358
$$ 923117 -173552 -225778 1809236 4665545 6631314 7011431 5686547 3077881 686523
3164F86523o89035P31076P73811L89171L67097M371o41408J21066K191450K211166
$$ 686523 -2512 728564 1502375 1891546 2258643 2263014 1621606 1742672 3934122 6145288
3154F145288j536530n168628l856603J063386L609387J221243k537512l547085
$$ 6145288 4608758 -559870 -4416473 -3353087 256300 1477543 -1059969 -4607054
3146d607054j839848J44071R54832M09993j175715k584299k295588o91065J2118
$$ -4607054 -6446902 -6302831 -5347999 -4938006 -6113721 -8698020 -10993608 -11684673 -11672555
3137a1672555q86860j167290Q65196L305073L128183O04246j099936l37304J160771
$$ -11672555 -12559415 -13726705 -12861509 -9556436 -6428253 -5824007 -6923943 -7261247 -6100476
3128f100476J071619n68183j754374q16686J991294M484299M289080J492516r46991
$$ -6100476 -5028857 -5597040 -7351414 -8168100 -6176806 -1692507 2596573 4089089 3142098
3119C142098p90547J53885j464082m945285n621045j602460K777884K700754n14176
$$ 3142098 2351551 2505436 1041354 -3903931 -9524976 -11127436 -8349552 -5648798 -6162974
3110f162974j809001K83104K585378K888475K490390K632138K229824N69741r06586
$$ -6162974 -7971975 -7688871 -5103493 -2215018 275372 2907510 5137334 5707075 4800489
3101D800489j241699j651627k725781k570551O773K820775L377447K537934K263158
$$ 4800489 3558790 1907163 -818618 -3389169 -3382396 -561621 2815826 5353760 7616918
3092G616918J625351j397486n333378o320543l689149r23631n83109j389507j219696
$$ 7616918 9242269 7844783 2511405 -3809138 -7498287 -8421918 -9005027 -10394534 -11614230
3083a1614230j81777N50510P24377N17895j44788o63429J74152K073282K762651
$$ -11614230 -11796007 -11245497 -10521120 -10003225 -10148013 -10811442 -10637290 -8564008 -5801357
3074e801357R17148j710914k290344q5048L221300N286015M453848P38123l422184
$$ -5801357 -4884209 -6595123 -8885467 -8970515 -5749215 -463200 3990648 4728771 1306587
3065A306587m600858j901181J802914L198757K108558N52843n67548j968051l663685
$$ 1306587 -3294271 -5195452 -3392538 -193781 1914777 2467620 1900072 -67979 -3731664
3056c731664m194525k604822J11480K106557K442200J439404L4467p78968m80506
$$ -3731664 -7926189 -10531011 -10419531 -8312974 -5870774 -4431370 -4396903 -5175871 -5656377
3047e656377M36249P99681J73739l33743N71551K181658J986301j149376m736984
$$ -5656377 -5220128 -4420447 -4246708 -4580451 -4008900 -1827242 159059 -990317 -5727301
3038e727301m988533j368206K618449L633843K090261O79460P06741J274793J174661
$$ -5727301 -10715834 -12084040 -9465591 -5831748 -3741487 -3062027 -2355286 -1080493 94168
3029I4168P9524j557079k485820j269479J649468L342455J699368j387009k377567
$$ 94168 173692 -1383387 -3869207 -5138686 -3489218 -146763 1552605 165596 -2211971
3020b211971j156846j005601l266645m961804l036099J257498L996807L313555
$$ -2211971 -3368817 -4374418 -7641063 -12602867 -15638966 -14381468 -10384661 -7071106
3012g071106R28063l00902P82552K838343L489274J888836k96151j193163j333318
$$ -7071106 -6143043 -6443945 -5661393 -2823050 666224 2555060 2258909 1065746 -267572
3003b67572k313873l443987k305635J087741L478980K719845M17962j020457j437167
$$ -267572 -2581445 -6025432 -8331067 -7243326 -3764346 -1044501 -626539 -1646996 -3084163
2994c084163j383128k22171J820001K065592j028925m310929l459501O89143K949285
$$ -3084163 -4467291 -4689462 -2869461 -803869 -1832794 -6143723 -9603224 -8914081 -5964796
2985e964796J036664j504903p85425K024304K970989J164318m21246K84666J439095
$$ -5964796 -4928132 -6433035 -7218460 -5194156 -2223167 -1058849 -1480095 -1195429 243666
2976B43666L24812k151614k377497M79368K511169L57709l519850l850104r285
$$ 243666 568478 -1583136 -3960633 -3481265 -970096 -612387 -4132237 -7982341 -7991626
2967g991626L083270J879964j541394l385134k903137j282673J026057L116454
$$ -7991626 -4908356 -3028392 -4569786 -7954920 -10858057 -12140730 -11114673 -7998219
2959g998219K498952j411949m619799k940726K190200N697825N517229L705852
$$ -7998219 -5499267 -6911216 -11531015 -14471741 -12281541 -6583716 -1066487 2639365
2951B639365J915850q5488j584328r33943Q73152N93211k061504l283823j023362
$$ 2639365 4555215 4469727 2885399 1951456 2824608 3417819 1356315 -1927508 -2950870
2942b950870J434961L15203k856882l419846j22499L472498L830184J406544o09602
$$ -2950870 -1515909 -1200706 -4057588 -7477434 -7599933 -4127435 -297251 1109293 499691
2933D99691j60281J713625K452025J159242l94372m42676O4074j015788l319816
$$ 499691 339410 2053035 4505060 5664302 5269930 4827254 4891328 3875540 555724
2924E55724m076237k220808j64315m18442k253788l000064j351047J799113M679434
$$ 555724 -3520513 -5741321 -5905636 -6324078 -8577866 -11577930 -12928977 -11129864 -6450430
2915f450430N701076M227838J414273m84215n10505J1024m94678j814171k658759
$$ -6450430 -749354 3478484 4892757 4408542 3898037 3909061 3414383 1600212 -1058547
2906a058547k401182j245294M19631J899914K161009Q32525j139284k355078k077671
$$ -1058547 -3459729 -4705023 -4285392 -2385478 -224469 608056 -531228 -2886306 -4963977
2897d963977m19979J747451K981796K398792Q00852l09549p05532j063430r46692
$$ -4963977 -5383956 -3636505 -654709 1744083 2544935 2235386 1529854 466424 -480268
2888d80268O84884K776777K577085k90416k582240j769212M94433J037605m70797
$$ -480268 204616 2981393 5558478 5268062 2685822 916610 1411043 2448648 1977851
2879A977851j838549j696062n93047L05364Q0754j410147k685184j694066J067536
$$ 1977851 139302 -1556760 -2149807 -1844443 -1763689 -3173836 -5859020 -7553086 -6485550
2870f485550K331014N39142j487488n02740K487804M013899K837204J68578k924628
$$ -6485550 -4154536 -3615394 -5102882 -5605622 -3117818 896081 3733285 3901863 977235
2861I77235n131642l853828J324235N450362L285582k836030n234269j343818
$$ 977235 -4154407 -8008235 -6684000 -1233638 2051944 -784086 -6018355 -7362173
2853g362173L239823L414180R31150l40635n02015j294424j755292n74049K49793
$$ -7362173 -4122350 -708170 222980 -117655 -619670 -1914094 -3669386 -4243435 -3993642
2844c993642j309055k735836o13730K897346K680031r19131k104109J224471M070366
$$ -3993642 -5302697 -8038533 -8652263 -5754917 -3074886 -3994017 -6098126 -4873655 -803289
2835h03289K322947r48894q22052J719376J949857q92565k906896j887067R3344
$$ -803289 1519658 570764 -251288 1468088 3417945 2525380 -381516 -2268583 -2175239
2826b175239R76909J660436L111768L707190J733887j504788l458965l867821
$$ -2175239 -1198330 462106 3573874 7281064 9014951 7510163 4051198 183377
2818A83377m156372m202621k434465P85601K479841Q46985k077689l010236j515260
$$ 183377 -3972995 -8175616 -10610081 -9824480 -7344639 -6497654 -8575343 -11585579 -13100839
2809a3100839J08200M56303O90971K200677M067055M106195J979346q0274j01604
$$ -13100839 -12992639 -12536336 -11845365 -9644688 -5577633 -1471438 507908 427634 326030
2800C26030J070687J146186k26902j108367n26880j06408j146619j896674j16673
$$ 326030 1396717 2542903 2316001 1207634 680754 574346 -572273 -2468947 -2585620
2791b585620K691985K680374o92148l548952l075928j096371m83479q29162k54439
$$ -2585620 106365 2786739 2094591 -1454361 -4530289 -5626660 -6110139 -6939301 -7193740
2782g193740P23927L92895m74301L69688K486420L001247J107916q38934j208730
$$ -7193740 -6469813 -6076918 -6551219 -6181531 -3695111 -693864 414052 -424882 -1633612
2773a633612j042685j302272j143958k24182M3354p76727o77234J404862K903298
$$ -1633612 -2676297 -3978569 -5122527 -5346709 -5303355 -6080082 -6757316 -5352454 -2449156
2764b449156Q92293l400709n902001m653516j262269J840630L388876L094351
$$ -2449156 -1556863 -4957572 -10859573 -15513089 -16775358 -14934728 -11545852 -8451501
2756h451501J691870R79619J926304K973701K022348k93648j410471o98785j79264
$$ -8451501 -6759631 -5780012 -3853708 -880007 1142341 848693 -561778 -1260563 -1439827
2747a439827j129563k280834k078997p09777R87201K735557L891185L059835J16017
$$ -1439827 -2569390 -4850224 -6929221 -7638998 -6651797 -3916240 -25055 3034780 3150797
2738C150797k592024k509674K63113L268372M172350K393962p48807k902097k761610
$$ 3150797 558773 -1950901 -1687788 1580584 5752934 8146896 7398089 4495992 1734382
2729A734382j787712k433623m213407l710423K88376M154641M176818J788519
$$ 1734382 -53330 -2486953 -6700360 -10410783 -10122407 -5967766 -1790948 -2429
2721b429R46981J956300J862143K49097j3741J513277J106867k919918o349583
$$ -2429 944552 2900852 4762995 5012092 4998351 6511628 7618495 4698577 -1651006
2712a651006m809006m10740J418426j75836j276259j03372O76862p20035j931064
$$ -1651006 -6460012 -6870752 -5452326 -5628162 -6904421 -7007793 -6330931 -7050966 -8982030
2703h982030n18619K008205K792646J870599J142629Q72723L0625j025010j056325
$$ -8982030 -9500649 -7492444 -4699798 -2829199 -1686570 -813847 -783222 -1808232 -2864557
2694b864557n25223q93262j614761p12797J418875J803626n21837k462048j140785
$$ -2864557 -3389780 -4283042 -5897803 -6610600 -5191725 -3388099 -3909936 -6371984 -7512769
2685g512769J956218L227623J757633l92851j579109j859087j474164m04761O49140
$$ -7512769 -5556551 -2328928 -571295 -964146 -2543255 -4402342 -5876506 -6281267 -5632127
2676e632127R06575J112190K487471M112539L744186J623640P89715K456151L653556
$$ -5632127 -4725552 -3613362 -1125891 2986648 6730834 8354474 9144189 11600340 15253896
2667A5253896J411726k769477n057758m467803l230403k796453k296398r55293
$$ 15253896 16665622 13896145 8838387 4370584 1140181 -1656272 -3952670 -4907963
2659d907963N20791J494662K268770K767381K136577L88096j079803j287311o75801
$$ -4907963 -4387172 -2892510 -623740 2143641 4280218 4668314 3588511 2301200 1625399
2650A625399R7354Q05566O98679j158025l796766m615048k894919j069840j019599
$$ 1625399 1722753 2528319 3226998 2068973 -1727793 -6342841 -9237760 -10307600 -11327199
2641a1327199j193904M99946K842558L099814J465297O94760J793342K968476
$$ -11327199 -12521103 -12021157 -9178599 -6078785 -4613488 -3918728 -2125386 843090
2633H43090K864178K091756J221393j40797j675174k211831k044699k932477m729481
$$ 843090 3707268 5799024 7020417 6879620 5204446 2992615 947916 -1984561 -6714042
2624f714042m508012p05816L929265N535007L727837J028399r18223k219127k662615
$$ -6714042 -11222054 -11927870 -7998605 -2463598 1264239 2292638 1374415 -844712 -3507327
2615c507327j332475J464466L686076L595708J505547o30979q37718J263965L715892
$$ -3507327 -4839802 -3375336 310740 3906448 5411995 4781016 3943298 5207263 8923155
2606H923155L657611M48268l130142l798229j476204R78942J322506M6800q85604
$$ 8923155 12580766 13029034 9898892 6100663 4624459 5603401 6925907 6972707 6087103
2597F087103l96684P19539O70510j262430l381666l230130r44465N97919o7975
$$ 6087103 5690419 6409958 7080468 5818038 2436372 -793758 -1738223 -1140304 -1208279
2588a208279o68117J036436L017330J623529k458987m498747k218859J370519
$$ -1208279 -1876396 -839960 2177370 3800899 1341912 -3156835 -5375694 -4005175
2580d005175K598158J493013K561j308678k554054k664149q13868J517565K157655
$$ -4005175 -1407017 85996 88557 -1220121 -3774175 -6438324 -7252192 -5734627 -3576972
2571c576972J059341l15134j365905k117348j704512M49847K603162K455738P22863
$$ -3576972 -2517631 -2832765 -4198670 -6316018 -8020530 -7570683 -4967521 -2511783 -1788920
2562a788920K74940J567440J783516o46587l406717l685672j940542l64625N64856
$$ -1788920 -1513980 53460 1836976 1190389 -2216328 -5902000 -7842542 -8207167 -7642311
2553g642311J718169K763495K517616J310397O39909N86343j86312j641459j852130
$$ -7642311 -5924142 -3160647 -643031 667366 1307275 1893618 1707306 65847 -1786283
2544a786283o8288J631245R81205j527003l537020l609240k015747K48274K030514
$$ -1786283 -1854571 -223326 757879 -769124 -4306144 -7915384 -9931131 -9682857 -7652343
2535g652343K384382J584287J178230J965121K657114J781778J43945k00541R90581
$$ -7652343 -5267961 -3683674 -2505444 -540323 2116791 3898569 4042514 3841973 4832554
2526D832554J773493O87707j620380l523359l969304k902733j186907J1345O08801
$$ 4832554 6606047 7293754 5673374 2150015 -1819289 -4722022 -5908929 -5897584 -5288783
2517e288783J734243L414635L444608N76409k475082k225336J71097M48818j910137
$$ -5288783 -3554540 -139905 3304703 3881112 1406030 -819306 -648209 -199391 -2109528
2508b109528k776622m09215J335495o02752l121522j800770K046229L606806J897228
$$ -2109528 -4886150 -5295365 -3959870 -4562622 -7684144 -9484914 -7438685 -3831879 -1934651
2499a934651L79603J181225K788550L263835K311177K40350k177122l159471k029064
$$ -1934651 -1555048 -373823 2414727 5678562 7989739 8230089 6052967 2893496 864432
2490H64432j167460k776545m622744k792361J850224M182136J944786j767784
$$ 864432 -303028 -3079573 -7702317 -10494678 -8644454 -4462318 -2517532 -4285316
2482d285316l573476l210775j248113K189144N176682M796114J776680J96989
$$ -4285316 -7858792 -11069567 -12317680 -10128536 -4951854 -155740 1620940 1817929
2474A817929J036124P31140j789321k113986J971065N016261J427341n385199
$$ 1817929 2854053 3585193 1795872 -318114 1652951 6669212 8096553 2711354
2466B711354p452306l516634L33268K77209j046384l49622J582428K408793J569684
$$ 2711354 -4740952 -8257586 -7924318 -7647109 -8693493 -9043115 -7460687 -5051894 -3482210
2457c482210l31556k527008l474034j910592P45326J615105N46300M05341K516481
$$ -3482210 -3813766 -6340774 -9814808 -11725400 -10980074 -9364969 -8818669 -8413328 -5896847
2448e896847M609470M431664K850817J877660J696045J350508Q62838R01706J087614
$$ -5896847 -1287377 3144287 5995104 7872764 9568809 10919317 11782155 12683861 13771475
2439A3771475N3810k762945n874269o515226l296505J547248L685339J484224
$$ 13771475 13825285 11062340 5188071 -1327155 -4623660 -3076412 608927 2093151
2431B093151j964021k985168j892277j249175j245877j27944J614588J396333
$$ 2093151 129130 -2856038 -4748315 -5997490 -7243367 -7371311 -5756723 -4360390
2423d360390q35587j815311J56399K724511L153546J583342p34814l431220n386871
$$ -4360390 -5195977 -7011288 -6854889 -4130378 -976832 606510 -128304 -3559524 -8946395
2414h946395m052021R09330N402171N249898J497822j269317r44111M82680Q33335
$$ -8946395 -12998416 -12089086 -6686915 -1437017 60805 -1208512 -2152623 -1669943 -836608
2405h36608L92807J25563l33132j440677j852942L39519M429790O670686M231622
$$ -836608 -443801 -318238 -651370 -2092047 -3944989 -3605470 824320 7495006 11726628
2396A1726628r59389l956325k702393m07724q79605l287978l763227j024342K334567
$$ 11726628 10767239 6810914 4108521 3700797 2821192 -466786 -4230013 -5254355 -2919788
2387b919788L816854L532848K549937J330813M04646L41282M42352n06473j860690
$$ -2919788 897066 4429914 6979851 8310664 8715310 9056592 9498944 8992471 7131781
2378G131781j832242q68326j457352l803811m794593k667835K67810J412412J523489
$$ 7131781 5299539 4431213 2973861 -829950 -5624543 -8292378 -8024568 -6612156 -5088667
2369e088667K258289K658012J041725j399301j992195n84379N56191K84824l06996
$$ -5088667 -2830378 -172366 869359 -529942 -2522137 -3106516 -2550325 -2265501 -2572497
2360b572497p8575P07104J060914K68784j427765k547475j750237K177K66390
$$ -2572497 -2651072 -1943968 -883054 -614270 -2042035 -4589510 -6339747 -6337570 -6071180
2351f071180j236154j916284l09333J707255K215450K078811K396474J964261
$$ -6071180 -7307334 -9223618 -9532951 -7825696 -5610246 -3531435 -1134961 829300
2343H29300M9870r66018Q54859L087512K441493K86492L68744K395299K648814
$$ 829300 879170 -86848 768011 3855523 6297016 6583508 6952252 9347551 11996365
2334A1996365L78417j334117j235595j549837l076506l374764j572991o95535
$$ 11996365 12374782 11040665 9805070 8255233 5178727 1803963 230972 -464563
2326d64563k685496m658402l166719L79345J783197K2547j879094j382276O31965
$$ -464563 -3150059 -7808461 -10975180 -10595835 -8812638 -8790091 -10669185 -12051461 -11419496
2317a1419496J723605J181103P01264J931171L738294K987970j187967n202830
$$ -11419496 -9695891 -8514788 -7813524 -5882353 -2144059 843911 -344056 -5546886
2309e546886m915331p78200L215331M902222N213306M433701J129048m116887
$$ -5546886 -10462217 -11240417 -8025086 -3122864 2090442 6524143 7653191 3536304
2301C536304p456273o308130k571911N56603K535009M158948M678796L010937
$$ 3536304 -3919969 -10228099 -12800010 -12243407 -9708398 -5549450 -870654 2140283
2293B140283L60225j067362j181433j549018k400233k287572o31123J228660J829547
$$ 2140283 2500508 1433146 251713 -1297305 -3697538 -5985110 -6616233 -5387573 -3558026
2284c558026J273882P65329R89917J173367l1594k307495l016429k69875L727406
$$ -3558026 -2284144 -1518815 -528898 644469 612875 -1694620 -4711049 -4980924 -1253518
2275a253518M659397J731792j245572j343648k34185n35957j169705N16953L615993
$$ -1253518 3405879 5137671 3892099 2548451 2314266 1778309 608604 1125557 4741550
$$ [...]
##END NTUPLES=NMR SPECTRUM
##END=
