##TITLE=31Pdec_DE-68_oil
 D2O, 24 sc
 8.10.2024
##JCAMPDX= 6.0         $$ Bruker NMR JCAMP-DX V2.0
##DATA TYPE= NMR SPECTRUM
##DATA CLASS= NTUPLES
##ORIGIN= UXNMR, Bruker Analytische Messtechnik GmbH
##OWNER= root
$$ XWIN-NMR		Version 3.5
$$ Tue Oct  8 14:55:39 2024 Russian Standard Time (UT+4h)  she@DPX200
##.OBSERVE FREQUENCY= 81.013821
##.OBSERVE NUCLEUS= ^31P
##.ACQUISITION MODE= SIMULTANEOUS
##.ACQUISITION SCHEME= undefined
##.AVERAGES= 24
##.DIGITISER RES= 17
##SPECTROMETER/DATA SYSTEM= spect
##.PULSE SEQUENCE= zgpg30
##.SOLVENT NAME= CDCl3
##.SHIFT REFERENCE= (INTERNAL, CDCl3, 0, 198.062)
##AUDIT TRAIL= $$ (NUMBER, WHEN, WHO, WHERE, WHAT)
$$ ##TITLE= Audit trail, XWIN-NMR		Version 3.5
$$ ##JCAMPDX= 5.01
$$ ##ORIGIN= Bruker BioSpin GmbH
$$ ##OWNER= she
$$ F:/spectra/data/she/nmr/P31/2/pdata/1/auditp.txt
$$ ##AUDIT TRAIL=  $$ (NUMBER, WHEN, WHO, WHERE, WHAT)
(   1,<2024-10-08 14:54:50.31 +0400>,<she>,<DPX200>,
      <created by zg, POWCHK disabled, PULCHK disabled
       configuration hash MD5:
       00 E9 B6 7A A2 85 ED C7 34 08 36 98 17 FE 4E 26
       data hash MD5: 32K
       10 51 FC F4 CF 8D 68 07 FC D2 32 49 C7 7A 59 6B>)
(   2,<2024-10-08 14:54:53.04 +0400>,<she>,<DPX200>,
      <Start of raw data processing
       efp BC_mod = 2 LB = 1.5 FT_mod = 6 PKNL = 1 PHC0 = 2657.749 PHC1 = 63.8875 SI = 64K 
       data hash MD5: 64K
       4C 42 B2 F1 6E 36 FD 9A 62 4A 4C 7D 3A E0 50 EC>)
(   3,<2024-10-08 14:55:11.14 +0400>,<she>,<DPX200>,
      <pk PHC0 = -29.58521 PHC1 = 0 
       data hash MD5: 64K
       C2 C5 5F B2 07 D9 3F 18 94 08 1B 14 F8 56 05 31>)
$$ ##END=
$$ 
$$ hash MD5
$$ 72 56 E3 58 F1 83 1A E2 BD 3A C5 AD 68 43 34 20
##$RELAX= 
##$RELAX= 
##$RELAX= 
##$RELAX= 
##$RELAX= 
##$RELAX= 
##$RELAX= 
##$RELAX= 
$$ Bruker specific parameters
$$ --------------------------
##$DU= <F:/spectra>
##$EXPNO= 2
##$NAME= <P31>
##$PROCNO= 1
##$TYPE= <nmr>
##$USER= <she>
##$AMP= (0..31)
100 100 100 100 100 100 100 100 100 100 100 100 100 100 100 100 100 100 
100 100 100 100 100 100 100 100 100 100 100 100 100 100 
##$AQSEQ= 0
##$AQ_mod= 1
##$AUNM= <au_zg>
##$AUTOPOS= <>
##$BF1= 81.014009
##$BF2= 200.13
##$BF3= 200.13
##$BF4= 200.13
##$BF5= 200.13
##$BF6= 200.13
##$BF7= 200.13
##$BF8= 200.13
##$BYTORDA= 1
##$CFDGTYP= 0
##$CFRGTYP= 5
##$CHEMSTR= <none>
##$CNST= (0..31)
1 1 145 1 1 1 1 1 1 1 1 1 1 1 1 1 1 1 1 1 1 1 1 1 1 1 1 1 1 1 1 1 
##$CPDPRG= <waltz16>
##$CPDPRG1= <>
##$CPDPRG2= <waltz16>
##$CPDPRG3= <>
##$CPDPRG4= <mlev>
##$CPDPRG5= <mlev>
##$CPDPRG6= <mlev>
##$CPDPRG7= <mlev>
##$CPDPRG8= <mlev>
##$CPDPRGB= <>
##$CPDPRGT= <>
##$D= (0..31)
0 1 0 0 0 0 0 0 0 0.06 0 0.03 2e-05 3e-06 0 0 0.0002 0 0 0 0 0 0 0 0 0 
0 0 0 0 0 0 
##$DATE= 1728384889
##$DBL= (0..7)
120 120 120 11 120 120 24 19 
##$DBP= (0..7)
150 150 150 150 150 150 150 150 
##$DBP07= 0
##$DBPNAM0= <>
##$DBPNAM1= <>
##$DBPNAM2= <>
##$DBPNAM3= <>
##$DBPNAM4= <>
##$DBPNAM5= <>
##$DBPNAM6= <>
##$DBPNAM7= <>
##$DBPOAL= (0..7)
0.5 0.5 0.5 0.5 0.5 0.5 0.5 0.5 
##$DBPOFFS= (0..7)
$$ [...]
##$SUBNAM2= <"">
##$SUBNAM3= <"">
##$SUBNAM4= <"">
##$SUBNAM5= <"">
##$SUBNAM6= <"">
##$SUBNAM7= <"">
##$SUBNAM8= <"">
##$SUBNAM9= <"">
##$SW= 400.765351723535
##$SWIBOX= (0..15)
0 1 3 0 0 0 0 0 0 0 0 0 0 0 0 0 
##$SW_h= 32467.5324675325
##$TD= 32768
##$TD0= 1
##$TE= 0
##$TE2= 300
##$TE3= 300
##$TEG= 300
##$TL= (0..7)
0 120 53 12 22 120 120 120 
##$TP= (0..7)
150 150 150 150 150 150 150 150 
##$TP07= 0
##$TPNAME0= <>
##$TPNAME1= <>
##$TPNAME2= <>
##$TPNAME3= <>
##$TPNAME4= <>
##$TPNAME5= <>
##$TPNAME6= <>
##$TPNAME7= <>
##$TPOAL= (0..7)
0.5 0.5 0.5 0.5 0.5 0.5 0.5 0.5 
##$TPOFFS= (0..7)
0 0 0 0 0 0 0 0 
##$TUNHIN= 0
##$TUNHOUT= 0
##$TUNXOUT= 0
##$USERA1= <user>
##$USERA2= <user>
##$USERA3= <user>
##$USERA4= <user>
##$USERA5= <user>
##$V9= 5
##$VALIST= <valist>
##$VCLIST= <CCCCCCCCCCCCCCC>
##$VD= 0
##$VDLIST= <DDDDDDDDDDDDDDD>
##$VPLIST= <PPPPPPPPPPPPPPP>
##$VTLIST= <TTTTTTTTTTTTTTT>
##$WBST= 1024
##$WBSW= 4
##$XGAIN= (0..3)
0 0 0 0 
##$XL= 0
##$YL= 0
##$YMAX_a= 3366
##$YMIN_a= -4784
##$ZGOPTNS= <>
##$ZL1= 120
##$ZL2= 120
##$ZL3= 120
##$ZL4= 120
##$ABSF1= 0
##$ABSF2= 0
##$ABSG= 0
##$ABSL= 0
##$ALPHA= 0
##$AQORDER= 0
##$ASSFAC= 0
##$ASSFACI= 0
##$ASSFACX= 0
##$ASSWID= 0
##$AUNMP= <proc_1d>
##$AZFE= 0.1
##$AZFW= 0.5
##$BCFW= 0
##$BC_mod= 2
##$BYTORDP= 0
##$COROFFS= 0
##$CY= -3
##$DATMOD= 1
##$DC= 0
##$DFILT= <>
##$DTYPP= 0
##$F1P= 0
##$F2P= 0
##$FCOR= 1
##$FTSIZE= 65536
##$FT_mod= 6
##$GAMMA= 0
##$GB= 0
##$INTBC= 1
##$INTSCL= 9.790993e-09
##$ISEN= 30
##$LB= 1.5
##$LEV0= 0
##$LPBIN= 0
##$MAXI= 10000
##$MC2= 0
##$MEAN= 0
##$ME_mod= 0
##$MI= 50
##$NCOEF= 0
##$NC_proc= -8
##$NLEV= 6
##$NOISF1= 182.463
##$NOISF2= 159.3651
##$NSP= 0
##$NTH_PI= 0
##$NZP= 0
##$OFFSET= 198.0616
##$PC= 4
##$PHC0= 2628.164
##$PHC1= 63.8875
##$PH_mod= 1
##$PKNL= yes
##$PPARMOD= 0
##$PSCAL= 0
##$PSIGN= 0
##$REVERSE= no
##$SF= 81.0140089999434
##$SI= 65536
##$SIGF1= 159.3651
##$SIGF2= -187.1042
##$SINO= 113.3802
##$SIOLD= 16384
##$SREGLST= <1H.CDCl3>
##$SSB= 0
##$STSI= 65536
##$STSR= 0
##$SW_p= 32467.5324675325
##$SYMM= 0
##$S_DEV= 0
##$TDeff= 32768
##$TDoff= 0
##$TI= <>
##$TILT= no
##$TM1= 0
##$TM2= 0
##$TOPLEV= 0
##$USERP1= <user>
##$USERP2= <user>
##$USERP3= <user>
##$USERP4= <user>
##$USERP5= <user>
##$WDW= 1
##$XDIM= 65536
##$YMAX_p= 341400712
##$YMIN_p= -46233985
$$ End of Bruker specific parameters
$$ ---------------------------------
##NTUPLES= NMR SPECTRUM
##VAR_NAME=  FREQUENCY,     SPECTRUM/REAL,   SPECTRUM/IMAG
##SYMBOL=    X,             R,               I
##VAR_TYPE=  INDEPENDENT,   DEPENDENT,       DEPENDENT
##VAR_FORM=  AFFN,          ASDF,            ASDF
##VAR_DIM=   65536,         65536,           65536
##UNITS=     HZ,            ARBITRARY UNITS, ARBITRARY UNITS
##FACTOR=    0.49542278885378, 1,            1
##FIRST=     16045.7642231865, 0,            0
##LAST=      -16421.768244346, 0,            0
##MIN=       -16421.768244346, -46233985,    0
##MAX=       16045.7642231865, 341400712,    0
$$ Real data points
##PAGE= N=1
##DATA TABLE= (X++(R..R)), XYDATA
$$ [...]
43268 769317 -1437974 -2601079 -2919726 -2888739 -2921091 -3071744 -3132444 -3103827 -3304496 -3747116
43258 -3747116 -3776682 -2829677 -1284188 46934 1089772 2471155 4302505 5680923 5593163
43249 5593163 3875380 1253436 -1051965 -1812235 -666991 1244650 2232445 1994320 1947834
43240 1947834 3165398 4691987 4743940 3182014 1813588 2193963 3922803 5363549 5408418
43231 5408418 4149540 2338511 806469 214978 700612 1559020 1684579 646475 -806231
43222 -806231 -1502490 -968903 393551 2022777 3650400 5040620 5767191 5573739 4720000
43213 4720000 3645159 2431752 978088 -329141 -585563 683527 2754062 4255571
43205 4255571 4533864 4180256 4070755 4192499 3835611 2849094 2119452 2501213 3677038
43196 3677038 4534624 4430581 3564574 2282534 738943 -607979 -875194 382305 2538647
43187 2538647 4517803 5739054 6069029 5263770 3221240 741999 -791811 -926857 -817393
43178 -817393 -1794666 -3481071 -4012720 -2232249 946819 3601292 4563326 3668536 1103518
43169 1103518 -2282867 -4398127 -3332728 88891 2560622 2014327 -44248 -1018727
43161 -1018727 -877989 -1631552 -3838895 -5674049 -5504113 -3596626 -952126 1853413 4101630
43152 4101630 4841589 4250382 3759646 3934290 3505239 1535829 -738025 -1620958 -1530737
43143 -1530737 -2223886 -3898137 -4651290 -2998718 75741 1902595 659093 -2741024
43135 -2741024 -5210728 -4537995 -1949937 -620095 -1459858 -2018437 -308882 2185933 2871843
43126 2871843 1712450 414605 -730463 -2559478 -4291299 -3951536 -1657764 82321
43118 82321 -176697 -1371809 -2522644 -4374092 -7297545 -9571922 -9311106 -6837011 -3924639
43109 -3924639 -1815333 -973450 -1502708 -2523881 -2227225 34315 2411395 2562309 435338
43100 435338 -2031116 -3397177 -3725229 -3500120 -2820031 -1756807 -660541 161894 735678
43091 735678 1335994 2206672 3209732 3843702 3963319 4199098 4968331 5411336 4414651
43082 4414651 2518694 1456295 1803997 2641602 3619780 5385902 7428711 7695689 5517406
43073 5517406 2953293 1799979 1130229 -471778 -2041828 -1792485 -126147 1221414
43065 1221414 1877660 2291357 1694153 -506401 -2129735 -405124 3293081 4347707 1275630
43056 1275630 -2024999 -1800496 640466 1539792 -32372 -1994198 -3008100 -3898946 -5665762
43047 -5665762 -8011861 -10001115 -10967905 -10652708 -9207606 -7108389 -4711526 -2211849
43039 -2211849 -259166 121912 -1237561 -3148084 -4316774 -4476610 -3920046 -2947241 -2459326
43030 -2459326 -3906945 -7396696 -10657387 -11315899 -9764449 -8385871 -8208222 -7841156 -5834861
43021 -5834861 -2630802 345423 2335499 3226531 2792931 1014766 -1172119 -2364437
43013 -2364437 -2044048 -961996 -157981 -69700 -661608 -1775436 -2854996 -2784851 -911215
43004 -911215 1670387 2724485 1334732 -842687 -1491405 -322609 1059654 1625189 1955536
42995 1955536 2631911 2913563 1874372 77566 -868907 -158276 1567348 3297103 4698326
42986 4698326 5927873 6810850 6574588 4586437 1394899 -1288799 -2092604 -1335960 -372162
42977 -372162 245381 1125458 2535547 3601007 3540148 2828953 2331625 1859621 524908
42968 524908 -1712260 -3693694 -4310226 -3551763 -2270014 -1307618 -917330 -749356 -320705
42959 -320705 423967 1028251 915136 -312611 -2728482 -5707782 -7771970 -7531194 -5039747
42950 -5039747 -1763746 834622 2135665 2022997 835499 -177084 380778 2270359
42942 2270359 3689040 3658346 3087871 2767103 1868723 -245198 -2153794 -2128465 -757818
42933 -757818 171228 712848 2428225 5213422 6767556 5644195 2952242 498315 -1076316
42924 -1076316 -1750613 -1394750 -395536 352758 806673 1864964 3536596 4464871 3983937
42915 3983937 3128791 2712252 1940573 35483 -2262397 -4038780 -5535581 -6742701 -6332114
42906 -6332114 -3882713 -1634316 -1656033 -2463587 -1182342 1763562 3263353 2526049 1975465
42897 1975465 2612713 2124864 -765682 -3322671 -2722173 -525861 -188191 -1698836 -2044759
42888 -2044759 -316792 1016053 185137 -1529745 -2477278 -3164277 -4648835 -6246920 -6553205
42879 -6553205 -5634030 -4670816 -4175001 -3935947 -4150878 -5155880 -6218451 -5855262 -3476881
42870 -3476881 91542 3655701 6430445 7934337 8050818 7254171 5998174 3924502
42862 3924502 573032 -3151945 -5399044 -5621854 -5333336 -5976991 -6973264 -6744516 -4984060
42853 -4984060 -2883917 -1476687 -745897 -264986 175132 644698 1063350 1003489 116770
42844 116770 -1131409 -1717396 -1206589 -214865 305317 -221405 -1845357 -3827539 -4430017
42835 -4430017 -2056834 2667494 6642986 7056362 4238593 1139721 154746 1140045 2433188
42826 2433188 2926161 2723930 2305547 1712471 703983 -523911 -1115936 -382006 1155547
42817 1155547 2032455 1536035 747791 1279493 3126035 4496990 3909074 1827243 -23348
42808 -23348 -443217 463718 1807432 2756973 3161822 3676743 4975753 6588075 7046728
42799 7046728 5734343 4080296 4061657 5699977 6952855 6137362 3574922 646398 -1776049
42790 -1776049 -3372182 -3732440 -2703678 -1081867 -41822 174834 385762 1253421 2490844
42781 2490844 3312440 3137665 1809063 -225764 -1690419 -1090078 1832351 5439485 7457205
42772 7457205 6888360 4512744 1751567 -527545 -2127904 -2965995 -2801003 -1563450 204652
42763 204652 1483203 1586307 824012 53509 -541559 -1833862 -4508493 -7658909 -9236467
42754 -9236467 -8070036 -5035577 -2036237 -276792 101822 -766814 -2701490 -4882598
42746 -4882598 -5986648 -5520022 -4514076 -4228779 -4469997 -3908521 -1901155 812690 3231965
42737 3231965 5012983 6011647 5818710 4371938 2436362 854820 -246931 -1036977 -1371721
42728 -1371721 -1262748 -1313870 -1817019 -1948682 -917632 494515 749889 -313345 -1459095
42719 -1459095 -2061561 -2668237 -3432152 -3632395 -3287084 -3581501 -4719704 -4859161 -2579518
42710 -2579518 733901 2601321 2798679 3254032 4880396 6215214 5478581 2762801 -167885
42701 -167885 -1444997 -410884 1766083 2770770 1317603 -1318850 -2762640 -2368876
42693 -2368876 -1530103 -1252463 -818118 770378 3237504 5470112 6494181 5601942 2735569
42684 2735569 -563114 -1851767 -538838 1023258 399825 -1796238 -3052602 -2617208
42676 -2617208 -2269709 -3486664 -5533614 -6844353 -6890095 -5957265 -4299888 -2588702 -2313531
42667 -2313531 -4330722 -7241864 -8504372 -7392803 -5868990 -6062494 -7671966 -8527191
42659 -8527191 -7217710 -4397942 -1735416 -374557 -445679 -1275866 -1747439 -1028805 609322
42650 609322 2039298 2600267 2726415 2958573 2991792 2379899 1645323 1677579 2182010 1795246
42640 1795246 -20283 -2079090 -2892449 -2322708 -1372305 -893004 -1014292 -1375510 -1347644
42631 -1347644 -407526 1047718 1522361 -147851 -3151724 -5223990 -5102587 -3902455 -3608710
42622 -3608710 -4651578 -5634938 -5286401 -3856823 -2362180 -1220998 -287487 294965 215467
42613 215467 -146517 67265 933332 1508634 1142632 276219 -370859 -577238 -212955 946640
42603 946640 2407437 3041548 2813983 3224681 4830932 5605911 3586486 197475 -1352221
42594 -1352221 -531838 200759 -394751 -612844 866443 2508801 2315634 636283 -1132104
42585 -1132104 -2889958 -4878906 -5804134 -4231899 -1106289 1239878 2092754 2416235 2395546
42576 2395546 1188002 -827560 -1743934 -667413 1116338 2134768 2394860 2401942 1987951
42567 1987951 1101973 622944 1227762 2130432 1956848 427696 -1672285 -3759400 -5682044
42558 -5682044 -6841789 -6230987 -3893592 -1679318 -1636672 -3652876 -5508450 -5647141 -5015219
42549 -5015219 -5209101 -5586800 -4027848 -590780 1718590 847837 -1421317 -2045545 -758448
42540 -758448 364146 304296 -164153 -565439 -1204319 -1639195 -878733 689768 1578776
42531 1578776 1614519 1996380 2723278 2390263 1138060 1077590 2519120 2529066 -681950 -4303265
42521 -4303265 -4620394 -2486337 -1902592 -3981439 -5718394 -4915405 -3094904 -2417398 -2379222
42512 -2379222 -1442377 -145011 -288791 -1721589 -2112227 -227296 2178717 2618052 1061627
42503 1061627 -284643 -76624 609343 218914 -971182 -1595820 -1536294 -1976656 -3212395
42494 -3212395 -4025935 -3744623 -3469933 -4340219 -5692927 -6053745 -5138272 -3750552 -2315462
42485 -2315462 -693608 840937 1433081 412773 -2193177 -5441046 -7446481 -6618708
42477 -6618708 -3700075 -1493408 -1507428 -2022118 -857522 1180880 1614066 179637 -971830
42468 -971830 -716628 -229633 -631454 -1563279 -2524043 -3545666 -4005104 -2891928 -1017766
42459 -1017766 -794590 -2735835 -4281605 -3471294 -1709212 -1097157 -964061 604310 3229647
42450 3229647 4892057 5249839 5564533 5665195 3844779 183133 -2608882 -2699491 -1538529
42441 -1538529 -1551337 -2920231 -3939636 -3522439 -2113604 -727873 -26010 90552 569201
42432 569201 2318276 4746084 5983667 5195928 3787577 3432564 3738134 3063508 1156432
42423 1156432 -324303 151954 2409402 4955687 6124308 5106407 2897805 1984938
42415 1984938 3764786 6287334 6105846 2675674 -878325 -2218930 -3026689 -5907864
42407 -5907864 -9595427 -10117210 -6564254 -2717641 -1855842 -2427138 -929633 2541485 4335862
42398 4335862 2490123 -645078 -1735541 -483327 947593 1232522 994720 1088030 1335003
42389 1335003 1283262 1178507 1522243 2078049 1947305 745811 -563763 -354168 1930242
42380 1930242 4863991 6279417 5454514 3566349 1839623 62650 -2386443 -4779794
42372 -4779794 -5608355 -4833088 -4202814 -4821091 -5547928 -4730169 -2683899 -1272360 -1451207
42363 -1451207 -2513062 -3686200 -5121848 -6880228 -8080025 -7816090 -6216923 -3964590
42355 -3964590 -1493744 596632 1141266 -387917 -2637373 -3550944 -2758674 -1725285 -1549912
42346 -1549912 -1855478 -2060702 -2327280 -2513458 -1435507 1617785 5321335 7452219 7263009
42337 7263009 5746301 3913285 2017112 446072 109225 1367660 3253437 4239680
42329 4239680 3491270 1256312 -1493407 -3637941 -4574017 -4518923 -3895310 -2521574 7967
42320 7967 3138174 5372710 5914757 5679369 6004577 6619707 5637320 1830644 -3417857
42311 -3417857 -6901802 -6540087 -3361935 -208717 1376467 2244583 3550673 4777551
42303 4777551 4813878 4071183 3907638 4181475 3128741 79416 -3234653 -4847630 -4783822
42294 -4783822 -4207566 -3500188 -2413541 -1331842 -983781 -1235541 -1371435 -1381008 -1833531
42285 -1833531 -2544091 -2515850 -1423681 -218091 76720 -549204 -1506162 -2477186 -3509857
42276 -3509857 -4674374 -5936962 -7088230 -7673087 -7350936 -6448834 -5778696 -5733549 -5880692
42267 -5880692 -5602866 -4833033 -3959145 -3249116 -2602505 -1736170 -395969 1563837 3996680
42258 3996680 6065115 6204541 3284341 -1611030 -5220850 -5143287 -2701903 -1367380 -2131579
42249 -2131579 -2296971 168637 3028277 2585098 -1093443 -4265694 -4453737 -2769424 -1113967
42240 -1113967 382484 2170791 3680150 4293663 4369775 3994902 2168697 -1347044 -4728970
42231 -4728970 -6302676 -6900284 -8152758 -9405640 -8602334 -5861042 -3837745 -4215435 -5749942
42222 -5749942 -6366435 -5595366 -4243489 -3015182 -2284648 -2227924 -2445458 -2180256 -1323934
42213 -1323934 -426914 437253 1667919 2762616 2451494 875168 95128 1347358 3149528
42204 3149528 3486216 2637701 2163415 2098196 1243806 -234578 -699699 374825 1662071
42195 1662071 2158293 2277911 2276516 1475660 -2801 -444862 1183933 3483150 4518020
42186 4518020 4315922 3919092 3057041 852554 -1686238 -2241234 -571408 715309 -406247
42177 -406247 -2824474 -4269630 -4489729 -4959741 -6208702 -7072321 -6495068 -4686604 -2220836
42168 -2220836 807142 4000154 5828719 4714204 1059456 -2507722 -3400768 -1423377
42160 -1423377 1414563 3193552 3668548 3568870 3096451 1760897 -594689 -3284349 -5324575
42151 -5324575 -6084542 -5492175 -4062209 -2661214 -1821561 -1426153 -1466167 -2620190 -5177145
42142 -5177145 -7750768 -8424320 -7284545 -6384596 -6721921 -6740948 -4774291 -1674875 278863
42133 278863 184617 -1092844 -2529774 -3460450 -3105500 -1292698 531307 585496 -932876
42124 -932876 -2231585 -2562247 -2859509 -3584778 -3730969 -2675016 -1524979 -1667501 -3012616
42115 -3012616 -4443937 -5075802 -4492984 -2861508 -1473265 -1977338 -4207428 -5901302 -5481817
42106 -5481817 -3936084 -2950682 -2574345 -2113454 -1951526 -2569802 -2831579 -1528036 -44370
42097 -44370 -999984 -4235243 -6571565 -6039742 -4111995 -2935409 -2515810 -1974136 -1772364
42088 -1772364 -2851403 -4584405 -5317729 -4490438 -2939964 -1544687 -703593 -694954 -1325047
42079 -1325047 -1498971 -315158 1533402 2477446 2039079 1030795 -35871 -1413282 -2787060
42070 -2787060 -2819538 -737496 2467696 5102226 6412387 6638430 6187102 5559147 5503921
42061 5503921 6198122 6535261 5341321 3322959 2637340 4100634 5897999 5875711 4257887
42052 4257887 2943808 2670809 2379226 1393649 628414 976227 1837145 2293239 2716133
42043 2716133 3886523 5209994 5342879 4349310 3734000 4251589 5067558 5328731 5181629
42034 5181629 4772617 3580168 1462018 -767574 -2530872 -4094404 -5167058 -4268308
42026 -4268308 -867235 2961782 4762420 4869780 5448045 6740776 6547443 3840791 759161
42017 759161 -189779 625221 1015266 320842 39530 1400597 3872162 6382136 8775331
42008 8775331 11266653 13159699 13185763 11199760 8792399 7756547 8273333 9075635 9170142
41999 9170142 8742582 8350907 8009980 7480068 6855581 6299527 5620439 4698640 3968155
41990 3968155 3849503 4038155 4051484 4158423 4899467 5853608 5876122 4717035 3590945
41981 3590945 3850918 5619503 7828586 9101322 8645714 6907890 5281964 4525837 3696958
41972 3696958 1566347 -1172060 -2404541 -1357292 567748 1989636 2983831 3679215
41964 3679215 3132795 893993 -1590823 -2642910 -2524647 -2485522 -2467958 -1485683 224428
41955 224428 1295290 1384541 1466245 1818674 1521891 512925 419823 2226369 4298860
41946 4298860 4100712 1357461 -1603748 -2486179 -1150743 810189 1864188 1692809 1013336
41937 1013336 650851 872672 1505622 2335178 3065107 3130362 2120360 434925 -950691
41928 -950691 -1493241 -1512127 -1609880 -2051708 -2661283 -2842975 -1811119 500921 2746444
41919 2746444 3268017 2196564 1565200 2762613 4666228 5129345 3693363 1712669 80717
41910 80717 -1773420 -4186506 -5733100 -4563833 -1006405 2259916 2998085 1701253 555900
41901 555900 681089 1313090 1536300 1572372 1815290 1645762 328674 -1383333 -1779920
41892 -1779920 -403297 1233883 1413842 3582 -1735018 -2460916 -1638484 203784 1674671
41883 1674671 1496730 -211150 -1838895 -1761862 207201 2841358 4657533 5070339 4786223
41874 4786223 5019872 5935679 6120529 4297455 1332132 -485316 -167782 1133548 2245156
41865 2245156 3513052 5481667 7351397 8082082 8295064 9642552 12443532 15069408
41857 15069408 15737864 14127800 11235997 8375225 6369096 5120113 3839756 2021006
41849 2021006 44336 -1505264 -2730858 -3996536 -4880464 -4401507 -2426578 -243453
41841 -243453 577686 -320595 -1836829 -2562003 -2157643 -1485559 -1194807 -569654 1421114
41832 1421114 4086037 5299832 4265912 2704319 2419018 2882594 2501885 1283729 618009
41823 618009 1013612 1774044 2593603 3622772 3969660 2199374 -1031837 -2655160 -696327
41814 -696327 3064135 5163853 4449732 2828150 2463274 3445648 4411016 4617639 4752611
41805 4752611 5710933 7079991 7434691 6168639 4285958 2976787 2249988 1746767 1983102
41796 1983102 3428831 4952991 4882606 3465123 2540032 2639448 2292054 747341 -506809
41787 -506809 -46969 1190814 1335355 323237 -141489 1192108 4006929 7061805 9070250
41778 9070250 9340630 8245831 6732767 5100305 3029498 1050296 646522 2122180
41770 2122180 3645760 3513159 2237747 1184353 271350 -1431173 -3699284 -5390157
41762 -5390157 -6026888 -5603469 -3586491 -12306 2979355 2948766 523384 -1112380 -410419
41753 -410419 807198 364981 -1376045 -2601027 -2593301 -2164952 -2456098 -3974371 -5975349
41744 -5975349 -6499481 -4258177 -851287 462234 -1073594 -2490272 -1248552 1046897
41736 1046897 967819 -1834859 -4363944 -4633449 -4018825 -4658226 -6230364 -6477624 -4127319
41727 -4127319 -277972 2866930 3939330 3071968 1141590 -1229762 -3806864 -6166130
41719 -6166130 -7538796 -7430846 -6042540 -3904043 -1539018 324363 919301 414277 180270
41710 180270 1297819 3087670 3882333 3052959 1518272 444369 327215 1261628 3012483
41701 3012483 4534364 4458159 2691812 817800 223706 434811 98164 -857886 -1122653
41692 -1122653 -35028 1340254 1623555 864048 154073 -124755 -787807 -2425157 -4208196
41683 -4208196 -4705656 -3644879 -2242653 -1710158 -1973780 -2165102 -1884639 -1419949 -1020335
41674 -1020335 -745456 -1036524 -2513759 -4737881 -5945270 -4873677 -2491029 -1017804
41666 -1017804 -1367394 -2486601 -3254581 -3899977 -5022792 -6175326 -6303257 -5081771 -3023655
41657 -3023655 -694322 1359311 2340057 1963148 1367670 2115852 4060961 5207103 4103377
41648 4103377 1587882 -287574 -388641 867133 2321472 2972386 2580164 1906051 1979017
41639 1979017 2800290 3274086 2719520 1774983 1353877 1433941 1517896 1612261 1938989 2189788
41629 2189788 1918668 1337863 1002316 1070926 1547735 2732694 4565181 5967931 5825159
41620 5825159 4334654 2532714 901633 -536466 -1204992 -372991 1587670 3577972
41612 3577972 5239581 6719352 7182703 5350601 1853024 -705013 -816428 211333
41604 211333 467245 -21060 -100308 338231 474768 184829 139037 564860 1096536 1735973
41594 1735973 2899201 4435896 5465649 5399308 4556915 3630459 2964831 2492792 2084932
41585 2084932 1824744 1936959 2304199 2126353 553892 -2118764 -4360974 -4894450 -3988646
41576 -3988646 -2978358 -2790074 -3235723 -3482820 -2909040 -1633535 -348150 479630 1095480
41567 1095480 1863330 2532886 2753755 2972434 3789235 4585774 4133389 2763793 2482045
41558 2482045 4346002 7095880 9157728 10633596 12231264 13502524 13570504 12687157 11615396
41549 11615396 10182473 7896348 5386469 3729813 2836472 2040810 1849884 3349186
41541 3349186 6001027 7783561 7677538 6459108 4881126 2774860 413189 -892032
41533 -892032 -414184 948945 1986844 2471931 2529987 1880483 539539 -677639 -1166939
41524 -1166939 -1181065 -779721 737069 3290764 4962184 3936006 936515 -1736321 -3247544
41515 -3247544 -4698129 -6541516 -7297369 -5649543 -2566317 -163067 864789 1446882
41507 1446882 2036473 1641098 -595171 -3753999 -5868115 -5904014 -4386994 -2389714 -730084
41498 -730084 -77488 -826332 -2393209 -3305308 -2586375 -746502 937990 1681444 1362460
41489 1362460 57885 -1872354 -3557464 -4232913 -4082893 -4019226 -4686126 -5954331 -7137285
41480 -7137285 -7427487 -6527419 -5176620 -4506455 -4493283 -3859627 -2167144 -1002066 -1845778
41471 -1845778 -3503130 -3282256 -565641 2343279 3097928 1674393 -420435 -2000039
41463 -2000039 -2702201 -2630554 -2110919 -1292215 111626 2019466 3164515 2290459 193059
41454 193059 -859401 -118774 644365 -221282 -1940902 -2560643 -1421373 622754 2582247
41445 2582247 3845802 3924233 2743072 962363 -628399 -1720363 -2126946 -1477545 153174
41436 153174 1900907 2978814 3373065 3265020 2505328 1229888 259170 215120 834087
41427 834087 1630597 2449193 2860297 2049134 90528 -1658879 -2322317 -2608756 -3133349
41418 -3133349 -2849814 -702480 2078105 3183296 2310295 1275417 1227185 1493543 1305244
41409 1305244 993690 1036718 1253821 1434029 1675853 1743563 1152734 227361 -35855 452956
41399 452956 590570 -91240 -509249 207739 1065497 489450 -1319270 -2553949 -2225196
41390 -2225196 -1339610 -1392072 -2504613 -3682088 -4523248 -5807508 -8059506 -10172623 -10360401
41381 -10360401 -8457938 -6318465 -5500434 -5457569 -4813952 -3655376 -3314360 -4179022 -5049377
41372 -5049377 -4860157 -3940611 -3145846 -2593549 -1785831 -398924 1505378 3606656 5270690
41363 5270690 5724143 4663577 2564845 314429 -1247772 -1548455 -599045 767582 1431527
41354 1431527 987573 8410 -657574 -553135 240530 1089379 1033582 -306624 -1956930
41345 -1956930 -2341014 -1032958 699842 1274950 310163 -1320485 -2451896 -2471831 -1624862
41336 -1624862 -697307 -164821 352475 1471469 2975978 3851865 3449038 2215343 1210543
41327 1210543 1141273 1769186 2050793 1211574 16068 346139 2806242 5394316 5630446
41318 5630446 3510067 1030521 -777613 -2544788 -4275502 -4497280 -2589671 -272379
41310 -272379 476685 -235889 -1146548 -1891013 -2623386 -2534011 -624535 2306223 4143400
41301 4143400 4075081 3380325 3345112 3631500 3246728 2193387 1466964 1870542 3246217
41292 3246217 4547286 4531555 2915351 1045444 802978 2452230 4147250 4123380 2900288
41283 2900288 2548635 4029224 6216081 7677228 8362053 8795528 8383512 5823792 1252971
41274 1252971 -3137311 -5170408 -4725079 -3270662 -2036945 -1264371 -723683 -197137 340544
41265 340544 523265 -71817 -998661 -1052256 31549 851630 361028 -294775 491161 1924914
41255 1924914 1754714 -113120 -1328996 -940890 -1097327 -3584243 -6657994 -7269127 -5255074
41246 -5255074 -3369634 -3712170 -5775401 -7683512 -7864908 -5674206 -1793864 1804663
41238 1804663 3331657 2826478 1750842 1143327 912743 711579 622509 956636 1903770
41229 1903770 3208692 3870662 2839319 640423 -570156 397204 1978489 2051567 1143007
41220 1143007 1562484 3669806 5190109 4616554 3253703 2964756 3571770 3738324 3162295
41211 3162295 2452886 1640813 304219 -1109234 -1376046 -72883 1707718 2402390 1410362
41202 1410362 -403424 -1395409 -686488 679020 667786 -1144297 -2577389 -1350639 1899735
41193 1899735 4314500 4430856 3743136 4200160 5409368 5390844 3400366 744249 -1065424
41184 -1065424 -1823218 -2100750 -2193906 -2080510 -1721782 -903781 616271 2319257 2984173
41175 2984173 2201258 1048058 293857 -1223972 -4824924 -8997158 -10308797 -7863506
41167 -7863506 -4941739 -4918580 -6856460 -6742752 -2462626 3924042 8605714 9450072 7057060
41158 7057060 3574175 911886 -390812 -927796 -1267117 -1472772 -1729533 -2451469 -3303214
41149 -3303214 -3183149 -2007745 -1438469 -2639982 -4278345 -4285650 -2868581 -1907821 -1763267
41140 -1763267 -804243 1662750 4013608 4595815 3823669 3115891 3032882 3426911 4398877
41131 4398877 6038157 7818702 9048626 9440622 8747258 6584261 3378717 955661
41123 955661 1281055 4541705 8706868 10962990 9849628 6552075 3950448 3730489 4647214
41114 4647214 4397269 2640996 807433 -548197 -2032491 -3018630 -1629892 1848560
41106 1848560 4101401 3188391 1686873 3005537 6205823 7443325 5632478 3439951
41098 3439951 2756470 2450063 1363219 528017 858354 1057707 -167450 -1607903 -1530163
41089 -1530163 -903164 -2098972 -4873106 -6250270 -4758614 -2473940 -1878184 -2586654 -2704566
41080 -2704566 -2034429 -1898987 -2342270 -1740239 351043 1819249 658298 -2135679 -3772641
41071 -3772641 -3249949 -2251234 -2453368 -3325822 -3214904 -1676307 151186 1108558 1160191
41062 1160191 986597 1040481 1334297 1952259 3291623 5422504 7360894 7621555 5784222
41053 5784222 2966967 364030 -1940349 -3951929 -4450417 -2242169 1502199 3911828
41045 3911828 3853558 3205321 4006451 5789790 6838198 6833049 6707842 6594141 5610831 3638921
41035 3638921 1953081 1832917 3395577 5822481 7860189 8106090 5885243 2250520
41027 2250520 -666137 -1754010 -1812531 -1989786 -2032064 -850856 1495111 3371451 3472211
41018 3472211 2471847 2003493 2255853 1696758 -435545 -2539704 -2683935 -1452217 -1135532
41009 -1135532 -2320760 -3189048 -2605705 -1947468 -2756014 -4222118 -4580215 -3823156 -3238872
41000 -3238872 -3003772 -2152680 -692054 48409 -662556 -2097079 -3343098 -4244457 -4863041
40991 -4863041 -5065015 -4867363 -4383183 -3458070 -2167882 -1325855 -1387869 -1306737 37848
40982 37848 1647691 1541986 -12771 -653074 355401 1062743 511994 851015 3804109
40973 3804109 7145756 7369053 4661756 2411508 2250755 2428478 1341521 -15810 -182486
40964 -182486 276959 -88272 -1314961 -2368874 -2954435 -3520457 -3876494 -3237664 -1788391
40955 -1788391 -1103595 -2450379 -5101357 -6764949 -5687495 -2328173 964667 2077639
40947 2077639 1143245 330553 1432208 3841348 5279668 4434316 2380053 1226687 1788113
40938 1788113 3010031 3529307 3227952 2948664 3014576 2689039 1355030 -287712 -912159
40929 -912159 -378408 -20952 -751914 -1667634 -1340199 95094 1318823 2053234 3418586
40920 3418586 5715043 7347370 6914894 5233007 4121638 4144815 4849003 6210863 7996299
40911 7996299 8419274 5852054 1876032 154769 1654492 3310966 2410813 -63672
40903 -63672 -1883660 -2912583 -3730552 -2986727 759121 5573044 7718934 6495950 4632367
40894 4632367 3808328 2840525 1008022 97690 1439765 3218063 2843887 577307 -1162872
40885 -1162872 -1114553 10917 1347885 2733928 3943036 4520835 4533051 4591692 5100348
40876 5100348 5959778 6652673 6140464 3450393 -713913 -3645265 -3186270 -317149 1992778
40867 1992778 2308701 1769345 1550679 880265 -1469861 -4645555 -6041988 -4333449 -1337193
40858 -1337193 -221730 -2044133 -4723527 -5668962 -4721913 -3748466 -3826600 -4131281 -3732942
40849 -3732942 -3130507 -3223426 -3731925 -3657520 -2811580 -2016277 -2073539 -3120848 -4576001 -5168343
40839 -5168343 -3673935 -462739 2190632 2286225 296191 -1602955 -2069767 -1436896 -441034
40830 -441034 644314 1606507 2088309 1983435 1345709 12959 -1853724 -3067879 -2374396
40821 -2374396 -145247 1991811 3333042 4682591 6467666 7671854 7452760 6672930
40813 6672930 6669406 7194017 6791177 4960103 2864350 1830046 1934253 2262075 1998910
40804 1998910 1042515 -128203 -997239 -1514017 -1990559 -2413010 -2195569 -1033316 246381
40795 246381 350744 -835296 -1830802 -1151037 968848 2796519 2902594 1435053 -273778
40786 -273778 -962471 -248506 1400696 3150024 4296674 4489293 3576350 1464880 -1536730
40777 -1536730 -4293009 -5376360 -4476056 -2940132 -2371287 -2808627 -2800754 -1238723 1367947
40768 1367947 3509240 4231412 4052622 4498273 6475228 8866165 9308325 6989639 4025430
40759 4025430 2996808 3654040 3584215 1959513 700062 1433357 3171962 4016646 3527818
40750 3527818 2096741 -516019 -4220106 -7247790 -7788462 -6460464 -5320377 -4809864
40742 -4809864 -3654372 -1665362 -476060 -999558 -2037195 -2248461 -1953586 -1954662 -1840051
40733 -1840051 -724124 1100474 2452127 2842082 2817456 2878888 2808021 2128600 800481
40724 800481 -667122 -1709653 -2318771 -2998618 -3902665 -4351213 -3748895 -2695852 -2378185
40715 -2378185 -2916918 -3184774 -2375539 -953483 124789 385823 -72944 -632477 -159026
40706 -159026 2042068 4938818 6409947 5665564 4161808 3577201 3788636 3578167 2537303
40697 2537303 1339259 615072 435758 668526 1205314 2025863 3382388 5440354 7321705
40688 7321705 7252912 4548977 1018240 -602817 438055 2312435 2894311 1912764 741078
40679 741078 766945 2352535 4918588 7411324 8665558 7927408 5661942 3746721 3995100
40670 3995100 5978063 7026641 5271058 2125335 527863 1028051 1284632 -238743
40662 -238743 -1864713 -1137822 1552193 3329448 2404830 -1090 -1322211 -313104 2127875
40653 2127875 4192644 4890700 4626726 4180511 3504341 2081235 242265 -836182 -650311
40644 -650311 -24166 19085 -785658 -2268559 -4021466 -5024371 -4420883 -3168322 -3409114
40635 -3409114 -5402655 -6714373 -5632106 -3702384 -3204506 -3668450 -3085228 -1350142 93211
40626 93211 1271388 3430971 5922372 6365945 4490055 2938819 3129578 2963529 409398
40617 409398 -2855511 -3692210 -1931903 -93028 596396 1429354 3419400 5376474 5503022
40608 5503022 3618096 1106228 -504389 -430487 1090322 2780713 3121042 1836930 358455
40599 358455 250781 1295310 1680949 214907 -2154559 -3402724 -2718974 -1174699 -145929
40590 -145929 240642 731982 1582402 2252238 2325888 2083120 1957271 1752120 696744 -1559529
40580 -1559529 -3940367 -4338645 -1786929 1763363 2891316 476608 -2915057 -4163642
40572 -4163642 -3125593 -1947250 -1830620 -2103160 -1929078 -1063126 940785 4225962 6990009
40563 6990009 6403996 2200930 -2181228 -3242069 -1144510 1226714 1905656 1347806 1004220
40554 1004220 1586600 2502798 2377263 575790 -1418372 -1067941 2133042 5652882 6867170
40545 6867170 5965851 4859256 4335653 3859698 3337969 3209398 3147287 2519103 2055777
40536 2055777 3186281 5430741 6261543 4252423 894361 -1520967 -2490582 -2779373 -2501295
40527 -2501295 -1132840 1071268 2914258 3442908 2548763 611614 -1671375 -3242253
40519 -3242253 -3346287 -2491777 -2210201 -3518206 -5801826 -7412323 -7327887 -6176260 -5585929
40510 -5585929 -6487190 -8183369 -9286503 -9321688 -8865028 -8207916 -6819146 -4594882 -2801073
40501 -2801073 -2781296 -4039275 -4646649 -3642136 -2084047 -1363351 -1355138 -1022358 -309491
40492 -309491 -331471 -1564308 -2816658 -2696299 -1659759 -1710366 -3879812 -6680563 -7625499
40483 -7625499 -6012532 -3543386 -2146297 -1902235 -1555726 -469909 783935 1568131 1845922
40474 1845922 1446396 -233466 -2929698 -4711132 -3818720 -1159089 350207 -814115
40466 -814115 -3239132 -4925344 -5848852 -7092930 -8499278 -8882488 -8272836 -8175842 -9177636
40457 -9177636 -9724867 -8166866 -5098261 -2686922 -2162570 -2882393 -3657378 -4116509 -4616954
40448 -4616954 -5418221 -6281186 -6670277 -6161213 -4733107 -2780755 -886717 422478 834750
40439 834750 392740 -476222 -1203367 -1409312 -1020436 -279306 204461 -262621 -1693125
40430 -1693125 -3086585 -3304815 -2198100 -491472 1187593 2555291 3173397 2606631 1204204
40421 1204204 -67695 -792304 -1369843 -1920293 -1798139 -657719 757712 1465575 1305175
40412 1305175 661209 -269784 -1394380 -2447091 -3319331 -4141322 -4621627 -4041883 -2497693
40403 -2497693 -1330196 -1493976 -2257599 -2566027 -3006482 -5033692 -8508788 -11437717 -12325504
40394 -12325504 -11605215 -10385092 -8844381 -6576364 -3951250 -2368351 -3024734 -5578558
40386 -5578558 -8216800 -9355539 -9216888 -9090904 -8999289 -7339989 -3657958 -478054 -675054
40377 -675054 -3576405 -5575359 -4683232 -2678225 -2215006 -3427057 -4413945 -3974315 -2617375
40368 -2617375 -1315765 -261778 1068910 2990633 4809231 5151332 3492279 1061575
40360 1061575 -515392 -1186185 -1990426 -2809249 -2228088 -126672 1220712 -205423 -3491550
40351 -3491550 -6027590 -6694562 -6499018 -6453138 -6268089 -5356800 -4057753 -3243379 -3072833
40342 -3072833 -2617316 -927231 1515590 2794526 1595049 -874053 -1829712 20899
40334 20899 3170468 5333664 5834649 5468829 4974110 4546219 4250379 3996288 3416323
40325 3416323 2396961 1363945 578776 -260698 -1191390 -1484081 -662907 676944 1777869
40316 1777869 2615916 3050902 2109097 -574813 -3365989 -4167095 -2854548 -763797 1654947
40307 1654947 4852305 8136803 9700451 9056429 7709785 6865782 6033406 4524965 2821028
40298 2821028 1608726 808789 503667 1575548 4193313 6540415 6357105 3440894 -196593
40289 -196593 -2312779 -2017327 46410 2364925 3681628 3869938 3427543 2294108 212099
40280 212099 -1698926 -1329528 1692951 5069090 6625681 6729026 6755993 6634733 5594856
40271 5594856 4135361 3170516 2054205 -273686 -2662028 -2749037 -606468 1078934 932125
40262 932125 649136 1986549 4196046 5698458 6359583 6522616 5421732 2486170 -867226
40253 -867226 -2701369 -3200683 -4058730 -5612789 -6368394 -5384632 -3550511 -2145275 -1330839
40244 -1330839 -551337 339968 764932 -41739 -2044964 -3714457 -3062763 -186677 2048860
40235 2048860 1222950 -1297933 -1925969 430140 3165597 3811409 2987800 2488259 2231916
40226 2231916 922710 -1199645 -2219290 -1179992 509057 706241 -1150354 -3669669
40218 -3669669 -5051141 -4807668 -4067995 -4160497 -5021810 -5448255 -4906236 -4314012 -4667752
40209 -4667752 -5667018 -6347905 -6444082 -6277374 -5700945 -4110862 -1526035 1013549 2311817
40200 2311817 2099496 1422400 2032602 4808403 8388815 10018389 8389860 5146128 2936099
40191 2936099 2590011 3018855 3213776 3096742 2681265 1708699 287221 -1026379 -1887622
40182 -1887622 -2205184 -1737320 -595685 75035 -835167 -2578200 -3028065 -1302025 1141170
40173 1141170 2328404 1722090 129519 -1221404 -1197675 465993 2432563 2909983 1978600
40164 1978600 1514747 2235829 2345410 197549 -3030220 -4760100 -4168999 -2488316 -962857
40155 -962857 -122867 -547271 -2538929 -4982130 -5997605 -5038814 -3325988 -2154658 -1851422
40146 -1851422 -2418664 -3889954 -5591043 -6134994 -4887081 -2863646 -1636422 -1695953 -2203327
40137 -2203327 -1999440 -589107 1587532 3567763 4547514 4206674 2621614 397834 -1152901
40128 -1152901 -948176 298851 498909 -1010228 -2176857 -990643 1511621 2714574
40120 2714574 2123707 1473572 1543372 1396329 1045664 2166226 5009351 6938538 5763556
40111 5763556 2847292 1103785 1270570 2052043 2798685 3857310 4891302 4991751 4248557
40102 4248557 3370793 2029366 -385667 -2489785 -1833703 1310526 3458070 2458478 544291
40093 544291 1102128 3944282 5986524 5759152 4802606 4632786 4708999 4210733 3870834
40084 3870834 4600653 5560110 5316090 4337081 4568731 6454784 7934243 6963417 3871769
40075 3871769 503577 -1967499 -3398134 -3672589 -2724041 -1423244 -1227158 -2570786 -4250213
40066 -4250213 -4639356 -3145131 -571163 1409701 1350669 -592829 -2409583 -2155606 -125274
40057 -125274 1718133 2345711 2531760 3058300 3492545 3282923 2749567 2255731 1677136
40048 1677136 1575781 3480176 7613364 11489369 12433210 10703856 8464554 6505747
40040 6505747 4134335 1821289 1271782 2341600 2305292 -521690 -4117137 -5091722 -2520665
40031 -2520665 1765851 5593915 7771695 7940174 6751064 5828651 6128961 6496051 5123326
40022 5123326 2328217 464618 861771 2223019 2663132 2122627 1722698 1557167 598727
40013 598727 -1199451 -2055151 -374255 3057268 5819599 6633028 6557585 7370807 9671367
40004 9671367 13031985 17114222 21591977 25331326 26802463 25567688 22727533 19763152
39996 19763152 17447811 15822553 14514534 13014374 11325062 10332672 10735095 11659349
39988 11659349 11431235 9848597 8394910 7783789 6759426 4236434 1281546 -373109
39980 -373109 -812066 -1424060 -2532540 -3078069 -2395650 -967310 405976 978806 -53628
39971 -53628 -2612822 -4863870 -4841703 -2990877 -1540450 -1255056 -606123 1355989 3224346
39962 3224346 3428574 2680781 2806241 4121594 5368101 5620353 5001649 3928519 2802309
39953 2802309 2233912 2594664 3382925 3657757 2954693 1446792 -238994 -920969 558443
39944 558443 3797020 6568578 7012968 5460335 3254562 807658 -1780676 -3173745
39936 -3173745 -2014245 538404 1670622 687701 -37349 1403837 3804117 4856920
39928 4856920 4304926 3567417 3216815 2504897 1107342 -75823 -88674 899848 1793244
39919 1793244 1611118 406993 -671862 -566628 288101 330673 -1043179 -2537211 -2718264
39910 -2718264 -1970180 -1727883 -2241603 -2237295 -743750 1747151 4162712 6105371 7789258
39901 7789258 9142596 9489404 8257873 5885144 3674885 2422023 1489587 -30645
39893 -30645 -1443234 -946705 1687745 4286441 4955220 4375002 4263946 4711099 4688066
39884 4688066 4385521 4993654 6354991 6814770 5607323 3604270 1392294 -1502866 -4864762
39875 -4864762 -7163821 -7705313 -7690947 -7877228 -6830174 -3246563 1319095 4198666 5316053
39866 5316053 6831188 9267442 10429186 8863619 6371975 5703187 6939447 7659994
39858 7659994 6240342 3702518 2169430 2319979 2809797 1979628 -192240 -2027376 -2041138
39849 -2041138 -586317 733048 1038649 926811 1177195 1413315 535029 -1829363 -4760491
39840 -4760491 -6854995 -7323657 -6408097 -5049043 -4185822 -4087528 -4115159 -3194437 -837641
39831 -837641 2063122 3639334 2682765 -26262 -2402409 -3210546 -3108322 -3333722 -3996894
39822 -3996894 -4293904 -3922507 -3341608 -2713110 -1525635 491491 2814670 4806484 6328322
39813 6328322 7301928 7232853 5710928 3115014 473492 -1152716 -1085641 524205 2298079
39804 2298079 2393699 425197 -1799793 -2215014 -815700 751442 1464387 1573782 1163097
39795 1163097 -282685 -2310707 -3094228 -1881051 -731711 -2079191 -5065006 -6265075
39787 -6265075 -4241087 -1451122 -822522 -2130647 -3172429 -3179860 -3059492 -2861454 -1338998
39778 -1338998 1559037 3690715 3243557 981812 -1045415 -1930950 -1846365 -587301 2051968
39769 2051968 4785156 5571663 4269690 3101028 3719854 4954078 4473607 1907560 -914780
39760 -914780 -2428164 -2694988 -2260360 -1088454 565124 1269487 -235449 -3055027 -4769440
39751 -4769440 -4251381 -2758027 -1841116 -1424480 -842950 -573640 -1346816 -2218208 -1471384
39742 -1471384 603960 1799524 1263255 741114 1746581 3456131 4685553 5980211
39734 5980211 7813690 8446490 6235341 3025838 2250601 3986771 4971684 3723502 2381669
39725 2381669 2501105 2303793 88236 -2353668 -2390897 -699940 174048 152235 1365879
39716 1365879 3995309 5455304 4163929 1574385 -331296 -1400841 -2116161 -1925583
39708 -1925583 -279440 1808520 2712559 2241279 1696911 2111159 3104571 3452004 2558178
39699 2558178 1468780 2104928 4886121 7548115 7499607 5190528 3643118 4462646 6035949
39690 6035949 6319901 5583455 5074528 4468847 2492193 -642364 -3134514 -3732174 -2759558
39681 -2759558 -1313038 -503087 -1042905 -2383155 -2655971 -770631 1766938 2512875 1344885
39672 1344885 586961 1902187 4515446 6618219 7084887 5651038 3004124 1124339
39664 1124339 1932393 4847547 6986900 6453221 4120829 1588113 -910421 -3413406
39656 -3413406 -4752231 -4001155 -2438620 -2210939 -3474698 -4415612 -3784450 -1970568 194308
39647 194308 2219046 3524242 3529156 2387616 793809 -833323 -2144127 -2294414 -852309
39638 -852309 973501 1404381 406070 -323508 343321 1993397 3961018 6020200 7557192
39629 7557192 7653827 6527248 5481324 4891022 3672993 1398098 -588363 -1069570 -604499
39620 -604499 -243548 91327 734708 981137 90841 -1284283 -2063196 -2394004 -3015668
39611 -3015668 -3675447 -3657175 -3381976 -3973692 -5461019 -6732860 -7110055 -6782986 -5934566
39602 -5934566 -4654177 -3530437 -3105110 -2861126 -1894567 -390892 772299 1638317 2974866
39593 2974866 4554318 5135707 4321024 3007765 1721216 -100169 -2690110 -5076814
39585 -5076814 -6219350 -6085941 -5194924 -3978384 -2864751 -2037345 -942699 889704 2469048
39576 2469048 2163809 144919 -1565555 -2005234 -2547016 -4378769 -6370055 -6818469 -6018279
39567 -6018279 -5482063 -5484143 -5046047 -3924253 -3067103 -3132944 -3722432 -4161661 -4244748 -4226441
39557 -4226441 -4656543 -5980002 -7749564 -8646237 -7938945 -6490191 -5593067 -5262202 -4512058
39548 -4512058 -2953128 -1173306 302463 1564597 2811892 3937482 4695310 4926706
39540 4926706 4700291 4394378 4317757 4154450 3392355 2414452 2187154 2504390 1814898 -346679
39530 -346679 -2006541 -1151409 1456420 3375933 3699231 3467863 3273993 2345599 272223
39521 272223 -1917173 -2990716 -2821439 -1998616 -883384 556938 2368270 4128028 4705016
39512 4705016 3154481 408527 -943300 212881 1499716 -77688 -3760575 -5622596
39504 -5622596 -3562603 336470 2826869 2848480 1124608 -1543188 -4145441 -5110655 -3829974
39495 -3829974 -1868823 -1249572 -1908557 -2067624 -961840 -69075 -1301617 -4517013 -7255204
39486 -7255204 -7105153 -4311715 -1563643 -802611 -957173 102377 1956534 1800871 -1530049
39477 -1530049 -5494099 -6734107 -4737362 -1525133 1257096 3575088 5784664 7401844
39469 7401844 7312789 4905024 1119924 -1709401 -1787003 220092 1916097 1878334 658112
39460 658112 -853720 -2505277 -3900457 -4062594 -3068187 -2522343 -3196127 -3563702 -2118525
39451 -2118525 116884 1078092 580343 -177212 -1202472 -3529861 -6646809 -8322190 -7448741
39442 -7448741 -5377586 -3896724 -3263106 -2791101 -2203895 -1756711 -1849703 -2950176 -5157516
39433 -5157516 -7563862 -8807468 -8516784 -7511203 -6462256 -5198651 -3524955 -1834838
39425 -1834838 -538947 427194 1225639 1849749 2400187 2964906 3115286 2327156 1130901
39416 1130901 978016 2481894 4413895 4925713 3352285 518037 -2243001 -4002977
39408 -4002977 -4566747 -4303862 -3653013 -2865764 -2356599 -2797834 -4177777 -5116925 -4140911
39399 -4140911 -1672493 167108 -100576 -1985988 -4112477 -5620704 -6237631 -5975106 -5282117
39390 -5282117 -4750347 -4297235 -3402148 -2355964 -2150279 -2643732 -2129133 334975 3293983
39381 3293983 4848538 5308920 6302047 7770253 7799138 5692234 3477284 3399977 5015980
39372 5015980 5956859 5125624 4013514 4740950 7532036 10453300 11274442 9311487 5741932
39363 5741932 2557101 1183146 1666657 2877146 3605297 3666175 3899226 5070517 7053806
39354 7053806 9271144 11546330 13998451 16228852 17208279 16141705 13156711 9146576
39346 9146576 5286915 2625860 1556420 1455776 1231417 453513 -328282 -514905 -347667
39337 -347667 -637634 -1820136 -3441973 -4476236 -4202744 -3053730 -2511090 -3737609 -6262687
39328 -6262687 -8416240 -9076997 -8518201 -7509222 -6270411 -4648147 -2728788 -685871
39320 -685871 1707204 4786705 8129155 10386404 10368306 8339663 5928288 4386478 3189544
39311 3189544 1127369 -1243132 -1607617 790786 3190108 2435348 -651288 -2251721
39303 -2251721 -859220 919181 703326 -16179 1523918 4894013 7093072 6820117 5615147
39294 5615147 4816737 3787295 1846858 -919 -523066 -205906 -450751 -1507453 -2364998
39285 -2364998 -2308270 -1494968 -132232 1797111 3702455 4242411 2791062 647069 -56708
39276 -56708 1292814 3183023 3936379 3589565 3268399 3273904 2781057 1392059 33433
39267 33433 -64937 1276197 3106033 4126040 3460078 1376809 -482034 -390792 1440678
39258 1440678 2820093 2116219 200134 -814133 -118614 1361707 2588450 3404652 4036254
39249 4036254 4504232 4637901 4108901 2508072 -64960 -2581518 -3808604 -3462487 -2344238
39240 -2344238 -1576524 -1990480 -3689044 -5583112 -5901910 -4014437 -1353267 320361 1090925
39231 1090925 2248970 3902439 4647572 3634910 1635477 -169660 -1277872 -1529033
39223 -1529033 -927712 -160142 -97236 -412156 16639 893528 294699 -2399228 -4883708
39214 -4883708 -4673795 -2354172 -503488 -198196 -325559 127220 998828 2160155 3992139
39205 3992139 6164818 7300245 6492231 4293336 1902444 294909 250132 1937313 4056873
39196 4056873 4701398 3676988 2656696 2323581 1006021 -2465282 -6032839 -6631375 -4333971
39187 -4333971 -2021667 -1178524 -399014 1583308 3741357 4606308 4247807 3066319 431773
39178 431773 -3620192 -6693758 -6289119 -3175083 -452925 474923 967848 2160000 3050118
39169 3050118 2257255 28554 -2339836 -3809526 -3653180 -1584095 1204413 2299766
39161 2299766 526423 -2601187 -4749391 -5247142 -4813466 -3822623 -2192077 -421003 643223
39152 643223 940239 1091977 1334261 1431448 1436195 1658763 2032398 2275713 2519283 3111854
39142 3111854 4043646 5095890 6090592 6441910 5263339 2792444 803494 394760 273482
39133 273482 -1185197 -3036004 -3055676 -1528440 -1234731 -3314638 -5521844 -5494826 -3701124
39124 -3701124 -1939989 -759713 130092 400218 -169955 -548414 197372 1082454 420308
39115 420308 -1567502 -2971014 -2836156 -2066336 -1654277 -1475333 -1193011 -1138804 -1666121
39106 -1666121 -2411307 -2795408 -2829031 -2998168 -3567335 -4168010 -3937130 -2195682 671767
39097 671767 3208078 4276716 4341199 4712306 5550604 5475887 3554369 942224 -246745
39088 -246745 560694 1907585 2445757 2624193 3464125 4283423 3102928 -353986 -3461122
39079 -3461122 -3593191 -1333645 635733 1269870 1943759 3479720 4461611 3472030 1453255
39070 1453255 472110 1085446 2273150 3362186 4664265 6400523 8047898 8760065 7897841
39061 7897841 5530647 2963068 2047091 3065102 3952538 2718044 37806 -1848324
39053 -1848324 -2282099 -2571754 -3411942 -3827637 -3192937 -2616522 -3263152 -4394501 -4247098
39044 -4247098 -2301511 280293 2136657 2758477 2198548 601772 -1600907 -3436427
39036 -3436427 -3932065 -3189162 -2601444 -3371374 -4764793 -4647965 -2168122 950041 2496133
39027 2496133 2280686 1475614 346020 -1627402 -3723917 -4142701 -2622011 -1155325 -1338229
39018 -1338229 -2484831 -3271239 -3799082 -4743394 -5583238 -5258682 -4044453 -3347282 -3823633
39009 -3823633 -4820389 -5560451 -5868387 -5716473 -4920822 -3454901 -1577787 304922 1577593
39000 1577593 1591941 448760 -769768 -1128284 -796450 -322837 415446 1681887 2898640
38991 2898640 3316049 3279698 3660946 4320030 4381806 3772800 3023496 1680619 -1294060
38982 -1294060 -5204708 -7489065 -6703764 -4199154 -2041461 -781952 -235595 -746092 -2114353
38973 -2114353 -2707542 -1559145 -253540 -578497 -1243932 360201 3471309 4150993 924570
38964 924570 -2623286 -2460642 935938 4211198 5893246 7005724 7955839 7632281 5732037
38955 5732037 3704377 2659010 1930230 534741 -1124695 -1896579 -1475979 -586131 37395
38946 37395 300324 559265 987706 1031409 -243596 -2788277 -4916175 -4868710 -2875413
38937 -2875413 -695951 747797 2009815 3283918 3523781 2205318 691653 671362 2023175
38928 2023175 3330433 3880695 3987802 3792909 3078985 2254437 2338042 3631777 5208265
38919 5208265 6089392 6369617 6768653 7423063 7615223 6795876 5599889 5348963 6256793
38910 6256793 6638229 4751416 1259369 -1256035 -1414960 -428246 117700 418251 1325884
38901 1325884 2383209 2621154 2515761 3322013 4834822 5696787 5891592 6919556 8989423
38892 8989423 9917355 7885363 3916971 406051 -1744865 -3151364 -3894356 -3156721 -984847
38883 -984847 971885 1166894 -25149 -822438 -171212 1099962 1305302 -245295 -2631426
38874 -2631426 -4350729 -4589000 -3540261 -2028006 -1041648 -1134862 -1869136 -2231285 -1956202
38865 -1956202 -1903880 -2595896 -3007265 -1726915 1009302 3404157 4112645 3343526 2089434
38856 2089434 1176061 1060305 1639882 2096083 1654725 584472 -223671 -585077 -1125078
38847 -1125078 -2118254 -3072056 -3407081 -2735683 -769453 1885143 3131480 1217220 -2646369
38838 -2646369 -5108323 -4546886 -2543790 -1019018 188820 1814799 3116414 3110927 2610900
38829 2610900 3031897 3861393 3341378 1513704 638335 2094227 4325013 4697933 2560956
38820 2560956 -367764 -2223083 -2758071 -2787166 -2614057 -1903319 -1105654 -1738063 -4172842
38811 -4172842 -6025579 -4523411 -335685 2866710 2998437 1692276 1118100 942072 45392
38802 45392 -745560 -67739 1044583 333085 -1931979 -2937720 -1388055 633805 688018
38793 688018 -813690 -1523397 -259404 1851217 2905457 2211897 804512 138336 310140
38784 310140 27669 -1341379 -2491894 -1860801 55350 1325154 1204660 765060 956624
38775 956624 1488045 1957691 2801773 4418598 6153500 6810132 5800633 3554021 1226405
38766 1226405 108697 782794 2639750 4459477 5352998 4940105 3206657 917215 -314950
38757 -314950 615937 2987815 5036981 5828086 5605415 4719749 3252732 1510797 -76197
38748 -76197 -1422755 -2410852 -2475236 -1447987 -244664 323077 695238 1291788 1067715
38739 1067715 -862562 -2981549 -3023381 -1429874 -656413 -1174853 -962427 693779 1850775
38730 1850775 1312629 531070 660338 356785 -1564510 -3573950 -3807092 -3149256 -3456359
38721 -3456359 -4111774 -3044149 -399958 1346974 691168 -1636144 -4509778 -7444525
38713 -7444525 -9660450 -10024232 -8544384 -6755593 -6152599 -6888739 -7946197 -7866759 -5620041
38704 -5620041 -1674238 1956060 3454812 2741681 842923 -1406986 -3229461 -3574519
38696 -3574519 -2334059 -1127185 -1366517 -2089523 -1221928 1478415 4290856 5884050 6118010
38687 6118010 4929690 2452247 238765 252243 2096413 3028503 1479297 -898458 -1491823
38678 -1491823 193580 2541270 3893742 3736526 2476983 790368 -1037779 -3230640
38670 -3230640 -5594703 -6851851 -5919623 -3658645 -2012005 -1345987 -151834 2239090
38662 2239090 4249030 4213674 2633180 1187278 503830 97421 -153412 250658 1356681
38653 1356681 2361443 2401526 1321922 -256673 -1333728 -1156160 255154 2184432 3736077
38644 3736077 4140481 2968840 648147 -1503722 -2467019 -2502478 -2222091 -1229571 1034277
38635 1034277 3481979 4203849 3251882 2702864 3345010 3275958 1038878 -1543992 -1489102
38626 -1489102 1334657 4049435 4180351 1810645 -1267719 -3125458 -2595784 6794
38618 6794 2848474 4131465 3721093 2583331 1064616 -1082954 -3161314 -3521608 -1636706
38609 -1636706 846632 1843693 1058539 -91618 -358963 153906 619385 776284 1233275
38600 1233275 2442786 3708758 3764657 2438721 1134240 1210041 2345006 3131518 3028409
38591 3028409 3019127 4284083 6704838 8821373 9090540 7285183 4826558 3498782 3614951
38582 3614951 3794478 2819393 1172028 176835 128996 159104 -230445 -438698 262638 1748121
38572 1748121 3277157 4160216 3962587 2620161 791378 -258797 311707 1926271 2911156
38563 2911156 2075949 33572 -1248638 -459805 1622353 3107399 3285521 3229117 3948980
38554 3948980 4906295 5059611 4602285 4541231 4913715 4655335 3305097 1769001 1122411
38545 1122411 1551990 2758239 4440956 5905342 6135790 5049636 3993872 4137081 4910467
38536 4910467 5017495 4578117 5061160 7124967 9758595 11868672 13517409 14928000 15403280
38527 15403280 14441146 13264669 13791003 16166093 18667268 20251182 21827493 24425246
38519 24425246 27462445 30016260 32875011 37789004 44971264 52809875 60263770 68391843
38511 68391843 79121155 93371642 110761884 130381362 151473494 174147149 199926340
38504 199926340 230757143 266304088 301920067 329585140 341400712 333418291 307753450
38497 307753450 271687850 233909900 200409329 173090313 151221978 133180148 117245576
38490 117245576 102456214 89400967 79214572 71392608 63815695 55519970 48017772
38483 48017772 42841258 39174976 35458333 32173676 30932942 31227399 30301748 26640798
38475 26640798 21837540 18323907 16640701 15812571 15281522 15249969 15582816 15499586 14515579
38466 14515579 13093575 12053607 11528866 10835803 9522725 8242573 8054328 8938398 9792658
38457 9792658 10111860 10712627 12191172 13599569 13630820 12436261 11202466 10504899 10231222
38448 10231222 10546044 11495660 12054209 11219151 9941607 10162225 11667376 11741373 8648647
38439 8648647 3828607 -324846 -3332902 -5919632 -7650157 -7132371 -4299145 -996984
38431 -996984 926610 1250325 997462 1186654 2168479 3629306 4873575 5264424 4676023
38422 4676023 3735131 3667048 5509623 8954282 12104530 13020495 11579210 9328976 7634449
38413 7634449 6676549 6130059 5732524 4964517 3297820 1277376 343960 926417 1652306
38404 1652306 1213644 52966 -803426 -1649292 -3379963 -5361658 -5687537 -3755945 -1235029
38395 -1235029 64318 214357 339860 600025 127764 -1192633 -2015071 -1150503 713168
38386 713168 1733775 1227839 365555 293095 512980 -70249 -1198726 -1544255 -715801
38377 -715801 199949 171983 -754223 -2056827 -3209000 -3337779 -1706192 926034 2605767
38368 2605767 2551425 2165576 2987341 4775259 6488280 7901987 8963692 8675540 6373407
38359 6373407 3513352 2374019 3149847 4011318 4067563 4467634 6021142 7347936 6529606
38350 6529606 3704581 905403 -299629 -113830 370971 525006 390528 59319 -582855
38341 -582855 -1410879 -1798010 -1258891 -228168 344720 235998 221801 958823 2198934
38332 2198934 3371788 4286017 4849631 4734413 3868251 2810124 2211837 2334988 3273087
38323 3273087 4874502 6200063 6161776 5224985 5176609 6327498 6407541 3722091 164276
38314 164276 -908604 907103 2893123 3176601 2648183 2662354 2944850 2690699 2214292
38305 2214292 2397426 3343754 4390383 4899992 4552745 3356921 1727250 245633 -673584
38296 -673584 -631065 754005 3060874 4907645 5485295 5598993 6118557 6281901 5080456
38287 5080456 3477160 3206809 3908941 3729234 2469147 1651882 1576090 1118869 703631
38278 703631 2400847 6409995 10608478 14524164 20228666 27952356 35086559 42090408
38270 42090408 54578129 74481751 92388599 95281046 81524096 62559134 49229688
38263 49229688 41859537 35365030 28445967 23547986 21123243 18841282 15732478 13403597
38255 13403597 12853324 12754335 11685724 10282067 10145114 11549820 13090050 13202514 11397024
38246 11397024 8112071 4066839 227803 -2008523 -1634412 624533 2638734 3128380
38238 3128380 2781904 2517662 1887167 530115 311 1975030 5152572 6364267 4972538
38229 4972538 3835694 5225211 7945551 9580953 9674609 9246542 8701932 7868541 7095126
38220 7095126 6798338 6566901 5852669 4877862 3967306 2904930 1860291 1758018 2546250
38211 2546250 2408769 283174 -2022618 -2130281 -525683 476877 433689 860246 1907035
38202 1907035 1848188 462354 218038 2770260 6357773 8223660 7987409 7017047 5906413
38193 5906413 4497769 3411070 3428030 3711098 2594726 246561 -1164347 -365656 1375084
38184 1375084 2130064 1685861 1249377 1650013 2773967 4286800 5939717 7224324 7493676
38175 7493676 6644194 5269068 3974688 2857995 1835795 1186961 1371058 2307350 3195584
38166 3195584 3315038 2850573 2624603 3069039 3825089 4368293 4513128 4081955 2712095
38157 2712095 631134 -816515 -378410 1372073 2449219 1867611 708107 222615 -158101
38148 -158101 -1765418 -4091097 -4694711 -2114708 2091073 4866110 4703701 2632056 584734
38139 584734 -506697 -1068904 -1960092 -3479824 -5144688 -6271093 -6661507 -6549755 -5905618
38130 -5905618 -4203065 -1217258 2143625 4269712 4293216 2947125 1837507 1893333 2664168
38121 2664168 3187595 3296208 3659841 4587597 5474625 5776818 5761106 5522988 4044709
38112 4044709 630493 -3082513 -4339632 -2734740 -639076 386184 1439887 3284681
38104 3284681 3914335 1698485 -738013 683467 5215919 7519415 4956030 1189192
38096 1189192 712585 2774538 3495695 1939767 663110 1012119 1260852 -113679 -1968996
38087 -1968996 -2403280 -1339714 -75573 534614 444095 -135969 -735191 -674842 170446
38078 170446 1106552 1529954 1501203 1035859 -355457 -2750795 -5133483 -6447927 -6867802
38069 -6867802 -7228294 -7639843 -7578095 -7036451 -6526977 -6001115 -4920976 -3678706 -3773200
38060 -3773200 -5751850 -7737880 -7128175 -3638899 215054 1777939 694982 -1415599
38052 -1415599 -2877678 -2989475 -1776587 319688 2427262 3531196 3092018 1276191
38044 1276191 -1317713 -3879626 -5551304 -5976635 -5778275 -5931648 -6441483 -6155892 -4253823
38035 -4253823 -1470350 685576 1691096 2389125 3565862 4672722 4382725 2368151
38027 2368151 129986 -361096 1131815 2748584 2663906 1070624 -531212 -1460971 -2204069
38018 -2204069 -2884031 -2825743 -2001704 -1553545 -2079565 -2519281 -1755586 -418223 66515
38009 66515 -504296 -1300213 -2062260 -3059590 -3761628 -3104934 -1166764 735240 1726122
38000 1726122 1897286 1072736 -1408014 -5108727 -7996609 -8343622 -6302916 -3122758 149717
37991 149717 2563530 3074915 1621166 -251379 -832397 44764 1365371 2352780 2730062
37982 2730062 2254572 1108864 414724 1234535 3052719 4110973 3359796 1475054 -74055
37973 -74055 -440871 80084 482149 45086 -757812 -569989 1262660 3738955 5248392
37964 5248392 5124962 3655581 1228157 -1527841 -3196136 -2517001 -61950 2050021
37956 2050021 2415357 1550332 674325 242814 105189 211651 425547 197573 -799888
37947 -799888 -1985448 -2473081 -2237112 -2095711 -2543634 -3151999 -3324679 -3218778 -3469238
37938 -3469238 -4114689 -4344835 -3618449 -2601442 -2301074 -2388292 -1389038 984880 2656453
37929 2656453 1432934 -1966580 -4355230 -3636636 -875671 1433506 2086466 1538301 497539
37920 497539 -739263 -1825752 -2277262 -2114672 -2013270 -2431438 -2846737 -2236175 -346131
37911 -346131 1795980 2902300 2867144 2784660 3414305 4187616 4244989 3972169 4552616 6006938
37901 6006938 6702316 5306871 2553439 462882 248899 1526829 3156528 4156939
37893 4156939 4053245 3172072 2655503 3400445 4685017 4551543 2156540 -721572 -1362562
37884 -1362562 761254 3402499 4411443 4341735 5360951 8079919 10680412 11316062 10244383
37875 10244383 8985084 8219909 7401431 6009080 4361156 3300754 3571056 5221066
37867 5221066 7165732 7781098 6546449 4639128 3265553 2100216 395197 -1070486
37859 -1070486 -719404 1333453 3128173 3377919 2649099 1734489 460826 -1207595 -2344375
37850 -2344375 -2291799 -1569997 -697836 683237 2471545 3107746 1344600 -1745787 -3866354
37841 -3866354 -4032900 -2879016 -1178558 474137 1013945 -404398 -3003229 -4905962
37833 -4905962 -5165121 -4341102 -3210961 -1967454 -689040 332259 773711 221002 -1613266
37824 -1613266 -3841618 -4374446 -2230273 790318 2254989 2273104 2651350 3443310 2808323
37815 2808323 397294 -1694097 -2004648 -1320144 -312134 1860636 5101834 7048136
37807 7048136 6465558 5984690 8601884 12638147 13266693 8841713 2944599 -256656 -350880
37798 -350880 346769 190195 -612063 -1010147 -278525 1209904 1926839 665431 -1664977
37789 -1664977 -2751266 -1828873 -802299 -1633733 -3597799 -4326647 -3119466 -1910886 -2735479
37780 -2735479 -5168240 -6910966 -6514179 -4758510 -3234432 -2340757 -1467755 -764181 -1417716
37771 -1417716 -3731541 -6033443 -6462054 -5170503 -3741723 -2942490 -2247918 -1296470 -463334
37762 -463334 136326 1025936 2389895 3628721 4241666 4392707 4320947 3940577 3331798
37753 3331798 2937965 2954695 3081192 3046927 2804256 2171739 1032717 -66835 -351647
37744 -351647 115120 728751 1673709 3706819 6433908 8256339 8550705 8446911 8692326
37735 8692326 8266223 6250239 3664771 1926394 585964 -1623892 -4200162 -5231146
37727 -5231146 -4165062 -2551598 -1917181 -2255150 -2768368 -2915471 -2520962 -1816276 -1468017
37718 -1468017 -1764834 -1986568 -1519730 -1143143 -1825384 -2591961 -1420521 1557552 3584706
37709 3584706 2637530 -264947 -2772662 -3709481 -3081749 -1206895 921361 1706375 813819
37700 813819 -10550 665819 1729268 1226705 -563299 -1638940 -1363374 -994456 -1138631
37691 -1138631 -764511 644801 1751072 1220615 -342711 -1434191 -1675528 -1661559 -1495743
37682 -1495743 -773941 261990 803907 832614 1382467 3051594 4933595 5558134 4567691
37673 4567691 3032274 2244531 2531477 3214318 3464420 3083357 2512447 2176067 1938291
37664 1938291 1322198 188104 -1061746 -2009913 -2653710 -3134261 -3409575 -3604865 -4311221
37655 -4311221 -5735984 -6636783 -5204611 -1535980 1732143 2217511 581639 -642699
37647 -642699 -542285 -530559 -1464275 -1917176 -426382 1846197 2334150 517564 -1351593
37638 -1351593 -1109197 913326 2759631 3241189 2805597 2486306 2692562 3054257 3050548
37629 3050548 2591022 2078765 2027043 2558721 3093691 2552111 302374 -2780402 -4654968
37620 -4654968 -4182458 -2596222 -2062292 -2916637 -3440249 -2475204 -874262 246321 1307632
37611 1307632 3213355 5555211 7181438 7776096 7541029 6079424 3261203 722757
37603 722757 600035 2697983 4585565 4716025 3884111 3333054 3123879 2969488 3093469
37594 3093469 3425068 3271791 2595409 2321832 2591236 2152594 555062 -551207 224869
37585 224869 1607291 1376543 -378667 -1637323 -1557153 -1246624 -1561305 -2079824 -2571813
37576 -2571813 -3652211 -5162639 -5319985 -2685689 1632659 4695566 4492842 1547983
37568 1547983 -1961886 -4186863 -4698681 -3999615 -2495682 -448957 1281289 1491628 139295
37559 139295 -1257656 -1501653 -1251290 -1707957 -2491985 -2179274 -589088 917792 1408058
37550 1408058 1298260 1158654 863718 253822 -456077 -1257043 -2327498 -3184178 -2972365
37541 -2972365 -1977889 -1689452 -2760337 -3941245 -3785940 -2604678 -1946497 -2707719 -4414283
37532 -4414283 -5988531 -6755466 -6933647 -7225754 -7596263 -6822139 -4118134 -796730 1066410
37523 1066410 1428438 2021593 3275466 3670213 2741672 2340491 3596733 4837366 4310531
37514 4310531 2986417 2430443 1655003 -1175921 -5170468 -7847646 -9059863 -10557804
37506 -10557804 -11972603 -10800899 -6938418 -3765165 -3357697 -3631512 -2086686 246382
37498 246382 957771 254323 24728 228707 -868139 -3322443 -5021596 -4715563 -3392050
37489 -3392050 -2260532 -1244560 -93423 607354 423876 -30682 -8471 345409 505311
37480 505311 380809 34458 -697873 -1616289 -1818330 -815868 375430 193013 -1436384
37471 -1436384 -2793109 -2305008 -210139 2022822 3433139 4176115 4608444 4490162 3455936
37462 3455936 1930355 1033554 1465347 2759336 3813255 4032947 3820867 4011436 4950224
37453 4950224 6117411 6568914 5714182 3728496 1380139 -371078 -710518 650887 3086341
37444 3086341 5159839 5469591 3606092 457330 -2219057 -2697756 -441313 3241053
37436 3241053 6071703 6730894 5613829 3548247 673571 -2633754 -4652853 -3715939
37428 -3715939 -591650 2052655 2922849 3518899 5680811 8859788 10728095 9774873 6490062
37419 6490062 2533714 -510870 -1956633 -2243302 -2157415 -1638879 30380 2640297 4636965
37410 4636965 4912620 4130704 3513939 3177960 2587447 1856618 1501578 1542446 1918635 3075006
37400 3075006 4871742 5643758 3997590 1166022 -199711 442319 933167 -450750 -3003259
37391 -3003259 -5238801 -6876170 -8257994 -9082619 -8840072 -7780640 -6594610 -5632520 -4956866
37382 -4956866 -4604379 -4464229 -4519816 -5256400 -6812706 -7705637 -5982510 -2206908 372499
37373 372499 -303329 -2538659 -3504002 -2988222 -2759040 -3308569 -3474296 -2892077 -2622128
37364 -2622128 -3123404 -3435472 -2856768 -1958760 -1368225 -778681 190624 1119379 1395878
37355 1395878 1063569 698447 947509 2146407 3645183 3753419 1551231 -1292361 -1935157
37346 -1935157 202418 2926881 4497666 5476200 6519063 6393472 3981646 873934
37338 873934 -160087 1306982 3137754 3452817 2014947 -632220 -3382590 -4186680 -1753418
37329 -1753418 2045145 3668325 2499634 1819191 4137118 7701844 9342703 8925964
37321 8925964 8650354 9138903 8986638 7853602 7266972 7866992 8218601 7336278 6411112
37312 6411112 6703599 7336711 6817989 5553407 4960814 4789662 3373830 473483 -2089761
37303 -2089761 -3113535 -3652695 -5057412 -6661853 -6703297 -4844468 -2485858 -793829 412994
37294 412994 1686076 2856234 3384847 3182393 2568069 1816363 1267114 1582224 3159339
37285 3159339 5197149 6008193 4715759 2291017 408366 -485256 -1312415 -2664740 -3850791
37276 -3850791 -4027478 -3483146 -3004011 -2464342 -1080426 1027798 2595108 2834239 2436157
37267 2436157 2462381 2955309 3305231 3457461 3918555 4754649 5356132 5280494 4779370 4323506
37257 4323506 3954504 3259465 1832287 -221159 -2110779 -2891139 -2417814 -1553949 -1114222
37248 -1114222 -925997 -428164 176610 212468 -155584 51581 1016654 1564215 826244 -404545
37238 -404545 -880778 -783647 -1233842 -2284887 -2797391 -2430487 -2348162 -3329326 -4397098 -4312373
37228 -4312373 -3425914 -2701932 -1661741 813475 3716524 4152676 1336342 -1428646 -527458
37219 -527458 3165780 5216510 3042907 -1533936 -5257789 -6851239 -6634864 -4780597
37211 -4780597 -1816613 263097 -321077 -2345984 -2368986 1080006 5437719 7075253 5356538
37202 5356538 2735330 1432407 1255071 759968 -490139 -1522248 -1428777 -512993 218603
37193 218603 204187 -518045 -2003146 -4387675 -6940331 -7990964 -6618121 -3994369 -2198343
37184 -2198343 -1908523 -2166776 -2250010 -2541474 -3235817 -3410539 -2254663 -468712 513456
37175 513456 303985 -285795 -620800 -921652 -1558470 -2305048 -2408832 -1089880 1832575
37166 1832575 5369756 7716474 7839902 6556748 5352569 4367419 2572220 5782
37158 5782 -1417403 -86429 3072215 5425261 5394829 3733185 2304022 2268103 3350866
37149 3350866 4223328 3508514 942571 -2213316 -4150614 -4034053 -2499693 -840830 9588
37140 9588 -121757 -779431 -1361287 -1774614 -2532808 -3837756 -4781423 -4166968 -2192428 -560251
37130 -560251 -587139 -1849789 -3080783 -3651608 -3501753 -2338736 -55216 2317241 3290282
37121 3290282 2742971 2068721 2213353 2583414 2429111 2257014 2848794 3554836 2844229
37112 2844229 414667 -2392404 -4388636 -5634497 -6351063 -5865513 -3629936 -727287
37104 -727287 789308 163038 -1207200 -1393315 101770 2205100 3538517 3423647 2060705
37095 2060705 326339 -699871 -558920 119747 323870 -136468 -542716 -396419 33828
37086 33828 585823 1822314 3955808 5672136 5216567 2711785 303528 -390526 -46877
37077 -46877 -298420 -1512066 -2759326 -3357686 -3376722 -2940683 -2196808 -2025888 -3631615
37068 -3631615 -6857781 -9603797 -9629489 -6830754 -3388261 -1680363 -2128900 -3020872 -2434420
37059 -2434420 -323391 1535041 1684620 514152 -706801 -1585169 -2541477 -3509467 -3891848
37050 -3891848 -3689007 -3451587 -3028342 -1690934 117169 566039 -1143795 -3230238 -3317081
37041 -3317081 -1328707 613344 726577 -912495 -3014165 -4380892 -4774183 -5032750 -5931760
37032 -5931760 -6597579 -5109978 -1546223 872607 -619434 -4454356 -6615039 -6033889
37024 -6033889 -5545351 -7061811 -8589429 -7616350 -5253204 -4599147 -6155603 -7386716 -6516003
37015 -6516003 -4407569 -2406928 -521908 1303695 1929515 620031 -1117446 -1042828 756354
37006 756354 1932746 1270468 549343 2097588 5370901 7229006 5495351 1228006 -2726480
36997 -2726480 -4555643 -4452063 -3623333 -3236718 -3993905 -5724157 -7153470 -6740315 -4203449
36988 -4203449 -1034379 734765 244978 -1591702 -2941697 -2590264 -996138 205285
36980 205285 31606 -730234 -747166 -177311 -462421 -1935450 -2853451 -1650979 711507
36971 711507 1864616 1141255 272591 820702 2090206 2226954 616274 -1645842 -3303277
36962 -3303277 -4104664 -4401490 -4304548 -3605407 -2223424 -450254 1083587 1585502 654486
36953 654486 -953221 -1480758 159408 2855232 4222371 3383552 2065416 2318081 3861595
36944 3861595 4732668 4150402 3359987 3482904 3938869 3747198 3297514 3699464 4987167
36935 4987167 6144410 6621420 6660744 6214563 4883175 3327138 3446087 6081717 9216716
36926 9216716 9745066 7062708 3848453 2858255 3767699 4002833 2265099 78211 -469926
36917 -469926 479877 986357 112794 -929140 -752988 131621 118008 -1109395 -2017354
36908 -2017354 -1120456 1354806 3955633 5473714 5482353 4002921 1489781 -906174 -1855951
36899 -1855951 -1025074 675917 2333446 4057797 6205801 8021304 8155546 6737543
36891 6737543 5787074 6723835 8216544 7672360 4561154 1005749 -997615 -1640914 -2083288
36882 -2083288 -2356164 -1516719 703521 3402655 5461914 6293975 5875311 4747821 3842985
36873 3842985 3603122 3333441 2117161 403041 -89794 1554088 3923653 4396798 1884086
36864 1884086 -1742552 -3256943 -1318148 2115301 4042870 3855769 3624041 4886532
36856 4886532 6472028 6371304 4654006 3060258 2258909 1213227 -637795 -2099852
36848 -2099852 -1722458 386679 2750234 3836039 2990296 960596 -222753 1128554
36840 1128554 4353795 6872937 7043674 5708271 4483157 3675576 2726394 1616544 580639
36831 580639 -848548 -3106742 -5246863 -5685919 -4302653 -2620797 -1790298 -1530602 -1415136
36822 -1415136 -2082299 -4328306 -7526335 -9793749 -9786396 -7973428 -6072884 -5369938 -5632401
36813 -5632401 -5616384 -4471620 -2456539 -419349 930173 1135519 -12659 -2188396 -4621840
36804 -4621840 -6786108 -8523650 -9250663 -7923955 -4570858 -1095131 560216 620967 716505
36795 716505 1303012 1299367 268452 -615554 -294055 727850 1314596 1082011 239983 -925267
36785 -925267 -1647971 -731993 1954553 4653423 5410274 4272357 3027863 3116737 4495906
36776 4495906 6132434 6837391 6012003 4392202 3711161 4816519 6488999 6957307 6097415
36767 6097415 5062412 4197583 2765298 666264 -1076797 -1888848 -2420044 -3307032 -4273955
36758 -4273955 -4900594 -5172005 -4834247 -3468363 -1798152 -1503778 -2795739 -3590470 -2395301
36749 -2395301 -663602 -540689 -1390165 -786794 1650891 3920829 5084542 6408290 8407476
36740 8407476 9316661 7911906 5761023 4861907 4730860 3922824 3017821 3456072 4156109
36731 4156109 2295433 -2254293 -5968706 -6112629 -3946897 -2249997 -1625692 -1041641 -488885
36722 -488885 -808512 -1536172 -1152279 499788 1920925 2372130 2844643 3969964 4546837
36713 4546837 3325600 1231209 451813 1725655 3676348 4698533 4477876 3565716 2447152
36704 2447152 1552038 1581038 3071585 5645852 8150592 9734486 10535030 11039037 11016507
36695 11016507 9774290 7705906 6762354 8374974 11199463 12208674 10302550 7555812
36687 7555812 6199921 5718363 4292059 2017737 555696 -137294 -2226964 -6307216
36679 -6307216 -9420195 -8473942 -4300179 -334460 1972652 4160772 7202138 9346860
36671 9346860 8709186 6455111 5712232 7726419 10416418 10845532 8291159 4635129 2259380
36662 2259380 1911083 2485700 2602442 2083087 1693853 1745712 1606191 706383 -609705
36653 -609705 -1604532 -2032559 -2087698 -1862384 -1311491 -451266 791044 2548405 4375421
36644 4375421 5062788 3767824 1153549 -1155987 -2074934 -1544881 21342 1898335 2860521
36635 2860521 1957431 -208128 -1798043 -1773978 -1020981 -1010536 -1867995 -2362602 -1606815
36626 -1606815 -198862 533080 273778 351776 2160094 4963294 6173575 4506914 2078664
36617 2078664 2054206 4516082 6248927 4915037 1892516 162731 673967 1985223 2632968
36608 2632968 2466127 1975629 1540491 1410697 1622073 1840205 1792451 1743240 2106321 2863886
36598 2863886 3834786 5079774 6404116 6937982 6084355 4574286 3662449 3510843 3395073
36589 3395073 3394081 4633617 7476290 10434577 11541904 10431580 8741070 8671211 11041731
36580 11041731 14291649 15569737 13502332 9792577 7350149 7036667 7288548 6815775
36572 6815775 6130664 5897862 5335614 3529928 1401846 874883 2335978 4132216 4599904
36563 4599904 3596256 1898495 73839 -1551298 -2450087 -2152680 -871772 586577
36555 586577 1675187 2642582 4020924 5710228 6932599 7183062 6797114 6262727 5438188
36546 5438188 4083969 2833195 2715896 3728862 4818465 5446013 6124334 6966410 6837291
36537 6837291 4910403 2307993 1031564 1572334 2586286 2714083 1660949 -452238
36529 -452238 -3546486 -6906095 -8957514 -8473742 -5647824 -1610893 2565354 5894552
36521 5894552 7208592 5977903 3367603 1449347 983226 784682 -213467 -1208799 -890929
36512 -890929 145882 33598 -1257548 -1258871 1650234 5700670 7874012 7496939 6166085
36503 6166085 5030913 4128194 3887927 4940679 6231257 5599936 2974676 988743 1439615
36494 1439615 2965627 3412968 2701175 1802246 543893 -1552112 -3392914 -3417060 -1955342
36485 -1955342 -604598 251741 1473502 3137546 4343380 4824023 5036686 4898670 4146808
36476 4146808 3597195 4106698 4600229 3362674 1140019 392543 1285706 1315548 -329108
36467 -329108 -1094812 735711 3053895 3381217 2879103 4038096 6108597 6158799 3945713
36458 3945713 2474923 3544262 5491948 6032965 5054436 3617410 1991752 -49582
36450 -49582 -2049157 -3046214 -2441495 -276427 2637005 4594008 3974193 951502 -2389512
36441 -2389512 -4093845 -3982755 -3068963 -2129600 -1349699 -743273 -285273 114731 394401
36432 394401 326636 -39214 -179937 444738 1864675 3523244 4560398 4370798 3223236
36423 3223236 2109761 1592461 1133396 71958 -1232013 -2047511 -2599527 -3627981 -4884669
36414 -4884669 -5355011 -4909541 -4331709 -3620517 -1919666 367614 1098293 -933706 -4108209
36405 -4108209 -5819829 -5099782 -2443174 1568765 5939973 8667946 8403906 6273209
36397 6273209 4482026 3596070 2804714 2279316 3121240 5008793 6095328 5722229 5268167
36388 5268167 5622915 5739880 4699345 3393117 2768101 1943811 -177473 -2504699 -2848242
36379 -2848242 -915329 1394659 2396537 1960837 830485 75120 992534 3967629 7308135
36370 7308135 8575709 7283134 5133872 3610463 2721797 2227866 2412959 3040795 3044588
36361 3044588 2128126 1446865 1800508 2330208 2091023 1845811 2914501 4887580 5871256
36352 5871256 4811199 2562270 805132 629151 1839659 2949547 2326787 147976
36344 147976 -1302540 -157072 2736009 4933436 5132717 3656398 1019689 -2241035
36336 -2241035 -4610980 -4400367 -1910072 598444 1440654 816103 -480801 -2039262 -3100859
36327 -3100859 -2571888 -735385 375615 -562963 -2290663 -2585996 -985915 1107238 2403496
36318 2403496 2864379 3305849 4623574 7050655 9665015 11085254 11000144 10362489 9824866
36309 9824866 8978748 7571709 6266209 5424517 4302219 2421338 702230 182452 567475
36300 567475 1061879 1580771 2070454 1886699 1161774 1372318 2831635 3111094 331471
36291 331471 -3140269 -3228896 70965 2539689 1560338 -901284 -1907537 -1300309 -455010
36282 -455010 370832 1642687 3053026 4023649 4646003 5013684 4744272 4073294 4125181
36273 4125181 5179483 6081087 6320488 7059987 8866239 10140282 9429658 7792964 7049360
36264 7049360 7043202 6675812 6457591 7726910 10131820 12173983 13622626 15025350 15373363
36255 15373363 13050032 9194091 7340271 8984383 11889559 13764338 15400361 18781547
36247 18781547 23946133 29511253 35154105 41829719 50090918 59646030 70417181 82996498
36239 82996498 98045704 115863535 136508402 159936159 185827504 212804102 237107699
36232 237107699 252476114 253063568 237738533 211420309 181971750 155817421 135572977
36225 135572977 120030200 105975504 91431905 77820847 67967437 61857457 56131594
36218 56131594 48468826 40491445 34931548 31695313 28723687 25466516 23143084 22120818
36210 22120818 21262542 19763706 17719747 14927902 11055662 7144042 5029235 4864168
36202 4864168 4979889 4684460 5323765 7711675 10284646 11120556 10478791 9921499 9845895
36193 9845895 9305044 7720913 5533799 3464367 2084168 1792750 2399782 3068938 3358975
36184 3358975 3848192 5069927 6497370 7407993 7997563 8581653 8482567 7141020 5755536
36175 5755536 6052706 7541152 7812117 5923148 3800468 3537387 4684444 5199108 4073657
36166 4073657 2009053 193731 -623491 -306042 576346 1040254 609339 -248534 -799662
36157 -799662 -707448 75121 1327985 2306046 2407034 2354595 3516524 5619256 6679472
36148 6679472 6059498 5804186 7383801 8806653 7325317 3878765 1982137 2563821 2917814
36139 2917814 1154328 -1274853 -2535939 -3115639 -3818236 -3409633 -687784 2565073 3292750
36130 3292750 1252628 -813673 -885214 452635 1926160 3494703 5625220 7807578
36122 7807578 8672874 7363738 4598296 2412087 2424440 4115338 5506394 5835728 6350183
36113 6350183 7760898 8616222 7817817 7173077 8932061 11733543 12065869 9653305 8098670
36104 8098670 9323064 10517596 8438256 4214400 1461981 1293425 1831070 1783333 1851082
36095 1851082 2564453 2903286 1771616 -368649 -1929488 -1718986 55251 1883943 2282941
36086 2282941 1435122 1061416 2258101 4224365 5687529 6493866 6795957 5848426 3186525
36077 3186525 202929 -1204991 -1108216 -1005909 -1295119 -1166502 -643696 -459389 114994
36068 114994 2751491 6673342 8254742 5431199 625377 -2301591 -2485847 -1819503 -1689763
36059 -1689763 -1971995 -2406745 -2891105 -2652401 -909134 1578031 3003304 2695473 1748957
36050 1748957 1483944 2181658 3163537 3211199 1270712 -2149265 -4645920 -4285487 -2038786
36041 -2038786 -473903 -300576 65922 1542469 3035775 3598796 3938169 4713120 5007769
36032 5007769 3870540 2115829 1190041 1235516 1579633 2099647 2594882 1795157 -1121119
36023 -1121119 -4600797 -6245867 -5967401 -5632003 -5693613 -4490901 -1417894 1457449 2143378
36014 2143378 1347791 878627 746889 -417698 -2777013 -4730041 -4783299 -2918308 -365276
36005 -365276 1145695 461355 -1605230 -2472226 -574978 2465792 3751112 2762111 1531492
35996 1531492 1381658 1451294 868536 458683 1273256 2925372 4614205 6571944 9042732
35987 9042732 10731199 9931193 6848676 3362925 657751 -1513561 -3213493 -3496635
35979 -3496635 -1797407 871683 2844344 3455789 3356173 3533354 4264196 4735944 3682258
35970 3682258 807349 -2464274 -4148513 -3527959 -1335442 1469352 4077470 5225359
35962 5225359 3772496 430002 -2341896 -2958769 -2252227 -1658462 -1035733 565087 2934710
35953 2934710 4972682 6306300 7145506 6983040 5168429 2706289 1674780 2409185 2789655
35944 2789655 990080 -2320202 -5161283 -6379650 -5815819 -3583823 -336838 2577199
35936 2577199 4315654 5303705 5994159 5760063 4121886 2206658 1523204 1783897 1406086
35927 1406086 -123562 -1825574 -2933918 -3469620 -3154872 -1419956 1214679 3299542
35919 3299542 4432065 5606322 7075475 7422915 5616304 2632061 63956 -1680127
35911 -1680127 -2825043 -3174715 -2875036 -3093013 -4482082 -5888553 -6093488 -5982501 -7231105
35902 -7231105 -9435263 -10449928 -9317070 -6999932 -4324706 -1210050 1775492 3080130
35894 3080130 2168356 336857 -1181463 -2496308 -3699668 -3750993 -1876537 1039463 3579605
35885 3579605 5342046 6314331 5819387 3612602 1344282 1232292 3358061 5668926 6766987
35876 6766987 7387815 8665237 10022873 9722200 7187091 4009872 2384705 2801696 3675402
35867 3675402 3340711 1958041 971937 1081972 1651576 2091357 2750452 3995200 5263411
35858 5263411 5687587 5160958 4339272 4043607 4880340 6730464 8299453 8020526 5879232
35849 5879232 3538325 2221426 1433992 285440 -1119144 -2417248 -3871667 -5362124
35841 -5362124 -5603513 -3808121 -1353076 -372162 -1250502 -2715113 -3647296 -3499552 -1878541
35832 -1878541 557065 1572472 -277407 -3229776 -4215939 -2731184 -716711 901310
35824 901310 2887928 4908514 4993126 2627746 -82546 -1352606 -1613222 -1515432 -470464
35815 -470464 1383063 2019719 200175 -2466461 -3913448 -4357635 -4755498 -4281523 -1779283
35806 -1779283 1514797 3284166 3475982 3921824 5046264 5319554 3939090 1919170 296138
35797 296138 -967090 -2029515 -2608098 -2538499 -1736154 143984 2714858 4110531 3000881
35788 3000881 888605 349426 1319428 1512036 427883 132027 1516523 2720363 2475892
35779 2475892 2243326 3184984 3509504 1322781 -1711681 -2392633 -571862 1090130 1387175
35770 1387175 1725694 2986553 4028461 4091389 4307057 5518683 6402609 5310672 2749014
35761 2749014 463465 -1062290 -2522664 -3651809 -2952560 125527 4002649 6487858
35753 6487858 6677002 5037318 2592428 667637 588015 2581824 5242693 6845813 6980546
35744 6980546 6253514 4882757 2684316 198102 -1547202 -2536449 -3641946 -4657845
35736 -4657845 -4136414 -2113235 -1303469 -3864132 -8085938 -10338027 -9687351 -8380200 -7903127
35727 -7903127 -7044289 -4552246 -1521325 232181 659822 891393 1224762 1150309 632385
35718 632385 -42964 -1193942 -3136814 -4923789 -5011061 -3177934 -675722 1492896 3234954
35709 3234954 4180904 3230599 61606 -3787013 -6233107 -6610982 -5626756 -3880495 -1500532
35700 -1500532 792473 1427341 -499155 -3943535 -6806107 -7853516 -7256608 -5676486
35692 -5676486 -3812727 -2773086 -3611973 -5882920 -7536986 -7016655 -4826117 -2443877
35684 -2443877 -595743 493135 209411 -1505779 -2939160 -2154013 357980 2293568
35676 2293568 2821230 3369639 4820692 5924118 5334770 3464151 1297612 -970323 -2960300
35667 -2960300 -3464348 -2322010 -1466822 -2293950 -3208969 -1849821 1132789 2726902 1579094
35658 1579094 -693232 -2030064 -1864227 -642383 679728 663826 -1139981 -2601582 -910441
35649 -910441 3542428 7181567 7727917 6625284 6143918 6203545 5543750 4282831 3441994
35640 3441994 3091785 2807681 3099682 4436081 5274760 3087196 -2333175 -8018789 -10817197
35631 -10817197 -10358678 -8659132 -7479438 -6638666 -4812767 -1700316 1031191 1523612
35623 1523612 284339 -151849 1481263 3490368 3784534 2895214 2803767 3513607 2916628
35614 2916628 235566 -2329238 -2254851 263008 2843393 3616854 2512750 551838 -1107287
35605 -1107287 -1611205 -710588 1186262 3398924 5248299 5973744 5047285 3000308 1370184
35596 1370184 1145140 1563141 1118989 -459858 -2021619 -2722954 -3001832 -3383015 -3096952
35587 -3096952 -844199 3164264 6787318 7948316 6595345 4321380 2497918 1398498
35579 1398498 856493 824867 1053034 1051727 934983 1663658 3716400 5961870 6740195 5879297
35569 5879297 4728574 4204856 3779930 2653145 982369 -591318 -1904875 -3068648
35561 -3068648 -3787788 -3580815 -2409924 -580499 1657932 3891213 5343467 5626058 5404078
35552 5404078 5528950 5703359 4922965 3228363 2003949 2246756 3450535 4676144 5857073
35543 5857073 7260190 8279022 7846675 6039297 4439287 4571077 6378186 8612310
35535 8612310 10651720 13556455 18794248 25644753 30451340 29538495 23109319 15361361
35527 15361361 10311070 8385756 7677996 7252877 7650410 8735302 9027065 7603534 5300272
35518 5300272 3399740 2165662 1318213 1039447 1667219 2934139 4186294 4959864 4909559
35509 4909559 3749331 1800671 39038 -961152 -1578288 -2174705 -2410778 -2277660 -2827732
35500 -2827732 -4547958 -5694951 -4051361 -349417 1844041 294763 -3276747 -5645836
35492 -5645836 -5903882 -5468616 -5134211 -4043554 -1840684 -157075 -766757 -3035741 -4542802
35483 -4542802 -4118258 -2976276 -2478749 -2111581 -759477 999807 1580801 1103163 1519786
35474 1519786 3576345 5438042 5405215 4472860 4650481 5859510 6378323 5742990 5151833
35465 5151833 5065964 4452244 2896468 1684124 1865482 2570646 2296958 972202 -230490
35456 -230490 -501851 -4378 620415 652451 -356891 -2001913 -3137453 -3069381 -2281576
35447 -2281576 -1623281 -1284564 -1025525 -874666 -965379 -998359 -464427 656161 1699901
35438 1699901 1787232 583644 -1090474 -1716146 -860696 -187297 -1506988 -3951681 -4743571
35429 -4743571 -3170174 -1875287 -3055008 -5143511 -5133978 -2941276 -1140295 -878445 -506874
35420 -506874 1374737 3654429 4517496 4075224 3923018 4803198 5848067 5986173 5315007
35411 5315007 4883513 5375081 6203629 6074793 4477362 2303876 790053 257795 295142
35402 295142 711398 1662216 3083024 4624596 5993953 6865280 6732106 5410658 3427590
35393 3427590 1405012 -557427 -2393925 -3608846 -4046818 -4393077 -4880254 -4283687 -1686790
35384 -1686790 1298667 1929821 -80780 -2216647 -2686890 -2438064 -2932811 -3699907 -3380683
35375 -3380683 -2025536 -956810 -934156 -1512489 -1847599 -1423332 -383210 388066 93177
35366 93177 -716904 -600196 559698 928726 -775488 -3191844 -3946659 -2607454 -682418
35357 -682418 712812 1622270 1925632 947208 -1175321 -2947244 -2996462 -1453210 492613
35348 492613 1815232 2203654 2054568 2256269 3422582 4967802 5386673 3817990 990209
35339 990209 -1652409 -3332464 -4087653 -4057386 -3394620 -2771415 -3073569 -4161553 -4582794
35330 -4582794 -3314400 -1544567 -1728611 -4614114 -8108439 -9731279 -9452864 -9168248 -9888651
35321 -9888651 -10730678 -10656011 -9916249 -9308686 -8970245 -8562640 -8055446 -7761631 -7944359 -8655614
35311 -8655614 -9548681 -9776168 -8726125 -6954095 -5561204 -4528378 -2797768 -416876
35303 -416876 729913 -691969 -3363877 -4812154 -4371161 -3460267 -3349012 -3883286 -4302616
35294 -4302616 -4214520 -3613453 -2713623 -1967295 -1838933 -2526377 -3991913 -5805500 -6762598
35285 -6762598 -5540459 -2443998 209485 301558 -1968934 -4745046 -6440726 -6281005 -4154585
35276 -4154585 -1335580 -341965 -2242885 -4692083 -4549636 -2056391 -256858 -386985 -342089
35267 -342089 1628247 4083060 4627939 3252490 1805992 1267371 1137032 892831 550800
35258 550800 -57215 -1376792 -3262369 -4591506 -4027621 -1286087 2120280 3709220 2381784
35249 2381784 -126781 -1054297 177316 1686516 2065966 2038151 2692269 3652296 3943128
35240 3943128 3358679 1917413 -752813 -4171334 -6309848 -5802513 -4121001 -3848638 -5193118
35231 -5193118 -5901034 -4532926 -2142777 -355021 819202 2504452 5110587 7693333
35223 7693333 8940839 8462570 7096111 5909610 5018141 3824926 2329354 1247126
35215 1247126 596320 -573603 -2343254 -3214206 -2486579 -2002637 -3627297 -5910044 -5609268
35206 -5609268 -2315841 839106 1428358 382361 -420913 -1030226 -2366991 -3890485 -4216762
35197 -4216762 -3323637 -2446501 -2054768 -1416217 -286782 212361 -1008732 -3335688 -4785667
35188 -4785667 -4031768 -1876678 -529143 -1366829 -3631168 -5460747 -5750033 -4534620 -2169159
35179 -2169159 760132 2861964 2629960 237268 -2210817 -2746391 -1324691 629498
35171 629498 1704056 1383330 420302 596998 3020975 6253568 7349678 5346842 2390850
35162 2390850 628466 -374355 -1740324 -2490427 -983186 1701882 2487522 544795
35154 544795 -1515374 -1346012 246251 1146817 1006130 1039118 1775458 2456146 2288287
35145 2288287 1293728 136721 -272084 593224 2072618 2652337 1666651 81656 -999315
35136 -999315 -1789774 -2889832 -3806932 -3826382 -3760528 -4978471 -6688188 -6201144 -2690101
35127 -2690101 1033260 1828374 85482 -1336786 -1210925 -1021067 -2099632 -3736241 -4800539
35118 -4800539 -5542342 -6529485 -6946677 -5545850 -2867282 -1017000 -1116846 -2120645 -2423480
35109 -2423480 -1650609 -458534 488903 651345 -588832 -3314570 -6372356 -7931380 -6899278
35100 -6899278 -3670686 280772 3320536 4530649 4170986 3239442 2408788 1633207 894758
35091 894758 705331 1315105 1913234 1431257 -22921 -1293723 -1712906 -1788785 -2274590
35082 -2274590 -3182169 -3861743 -3546428 -1816162 820373 2779036 2682657 1050518 -110248
35073 -110248 253732 1111217 1170674 761049 864266 1149995 511846 -708588 -690189 1266433
35063 1266433 3439141 3785760 2485770 1554770 2478284 4941385 7384286 8041000 5947786
35054 5947786 1995093 -1199804 -1567136 165701 1472377 1335677 1230104 2311496 3226225
35045 3226225 2177424 98573 -292298 1632376 3636176 4146882 4338232 5410867 5790383
35036 5790383 3328171 -747584 -2760983 -1475430 413249 301229 -1115804 -1916513
35028 -1916513 -2142540 -2866100 -3497546 -2602528 -908803 -788924 -2272195 -2049404 2108445
35019 2108445 7624697 9716322 7015080 2844639 993724 1757940 2607484 1610672 -667248
35010 -667248 -2181759 -1548460 820265 3277145 4456726 4266551 3429541 2332432 804111
35001 804111 -949496 -1913849 -1394836 -217142 88116 -610385 -623366 1395317 4622262
34992 4622262 7215274 8679303 9821726 10539813 9320480 5643125 1500462 -743016
34984 -743016 -1144380 -1405750 -1902005 -1277306 959255 3252787 4103851 3918820 3822790
34975 3822790 3830250 3445570 3222338 4193555 5993937 6942557 6215134 4924375 4674401
34966 4674401 5722044 6919919 7031029 5825735 4141383 2983652 2462099 1830781 846380
34957 846380 620677 2393126 5649209 8314165 8933110 7979350 6897499 6582720 7051877
34948 7051877 7932474 8862561 9823181 11300703 13694146 16528837 18985410 21367454 25020811
34939 25020811 30115591 34328029 34762665 30913485 24971396 19536119 15883362 14199247
34931 14199247 14273366 15478448 16744531 17108369 16172029 14061992 11417615 9448795 9279488
34922 9279488 10745226 12191244 11927979 9819667 7294323 6030529 6747459 8812276
34914 8812276 10600465 10535715 8313364 5085744 2206545 94244 -1282300 -1398502 207286
34905 207286 2351696 2654862 344792 -2401017 -2998014 -1604804 -413511 -346076 -287102
34896 -287102 293254 27749 -1956003 -3924900 -3488781 -855877 1470592 1873048 1026306
34887 1026306 311919 292214 852915 1549473 1594742 656702 -193337 440194 2124630 2973589
34877 2973589 2443458 2028462 2524165 2575616 1334822 774533 3174889 7288238 9400050
34868 9400050 8047594 5562395 4659113 5410238 6248774 6271964 5453245 3784438 1568470
34859 1568470 14002 292097 1975995 3200115 2551426 424733 -1524007 -1905591 -519610
34850 -519610 1805128 3860599 4682585 4162186 3388929 3839169 5518827 6339715 4428520
34841 4428520 878267 -1235418 -776096 241692 37416 -381792 362047 907200 -993355
34832 -993355 -4502245 -6440503 -5819602 -4843526 -5028010 -5108948 -3873882 -2580299 -2848688
34823 -2848688 -3932271 -3921597 -2498419 -852106 290910 1125777 1931501 2930965 4298033
34814 4298033 5383611 4912685 2979449 1656557 2269448 3244906 2350451 40216 -1430815
34805 -1430815 -1502241 -1694018 -2785324 -3856771 -4294671 -4627445 -4868392 -3971893 -1793984
34796 -1793984 -3569 20496 -917256 -1004870 326348 2156144 3483917 4198791 4946275
34787 4946275 6269338 7563802 7167898 4340542 864950 -610432 175815 948245 153717
34778 153717 -1330769 -2277470 -3038382 -4257608 -5227487 -5063208 -4414518 -4416345 -4728940 -4229691
34768 -4229691 -3103565 -2594727 -2918925 -3002432 -2326502 -1594762 -1346104 -1208062 -957181
34759 -957181 -1238184 -2645301 -4800059 -6747677 -7645841 -6821531 -3981209 94261 3684440
34750 3684440 5585750 6103243 6179955 6006634 5127386 3624092 2351326 1802474 1361928
34741 1361928 158429 -1620168 -2806244 -2633843 -1506768 -200631 1126788 2645554
34733 2645554 4072715 4949906 5388118 5574492 4730241 1921914 -1781970 -3475937 -1737886
34724 -1737886 1355406 2810504 2425143 2335981 3433495 4205973 3360345 1753220 855951
34715 855951 643059 157227 -658487 -934726 -383192 233659 240810 -47091 206211 1389225
34705 1389225 3163737 4938217 6362859 7299903 7466929 6461667 4374204 2133446
34697 2133446 811990 572157 598437 60952 -1115143 -2337792 -2868645 -2358514 -1215413
34688 -1215413 -290283 166326 895643 2358352 3468961 2687015 357963 -1279615 -864280
34679 -864280 433576 764041 123623 -52353 807469 1828058 2354115 3010303 4584930
34670 4584930 6482221 6961798 4981242 1519216 -1264302 -2322508 -2788742 -4208405
34662 -4208405 -6043952 -6056001 -3410902 -209551 881100 -387784 -2224496 -3388582
34654 -3388582 -4116135 -4894392 -5764196 -6850928 -8238810 -8998861 -7543647 -3593947 982862
34645 982862 3883114 4420255 3581850 2729536 2691955 3512251 4448262 4509498 3442502 2015963
34635 2015963 1171870 1247647 2116630 3462514 4579576 4517861 2980739 723672 -1345639
34626 -1345639 -3060248 -4581457 -5592772 -5537760 -4387624 -2602147 -558233 1388012
34618 1388012 2458201 1870122 14829 -1207677 205119 4269666 8339632 9067086
34610 9067086 5703253 1257408 -473993 970568 2599534 2095602 502071 -129551
34602 -129551 -215449 -1861706 -5314084 -8314894 -9116571 -8254087 -6782567 -4508779 -1095382
34593 -1095382 2330079 4123232 4192957 3967538 4473342 5335151 5598145 4744185 2808758
34584 2808758 158375 -2524141 -4336546 -4582535 -3264801 -1275810 -20295 -503124
34576 -503124 -2577137 -5141336 -6974472 -7170587 -5171298 -1277134 2760417 4689399
34568 4689399 3986791 2486725 2033702 2096934 787627 -2017175 -3948848 -3084847 -626221
34559 -626221 418350 -1003992 -2555199 -1225852 3127539 7602043 9318436 7918775
34551 7918775 5060129 2430474 776370 67473 -253356 -741318 -915845 661054 4251193
34542 4251193 7488323 7566914 4689726 1717066 389257 -169843 -809377 -559030 1151918
34533 1151918 2450099 1281506 -1400216 -2812749 -2139622 -1196582 -1544389 -2727547 -3442291
34524 -3442291 -2968620 -1347300 607341 1505377 789570 -269906 -291608 -77678 -1458868
34515 -1458868 -4096921 -5570664 -4882460 -3656648 -3153092 -2299226 21565 2553010 3210201
34506 3210201 1898598 339047 -63297 991461 3099396 5135562 5681598 4627130
34498 4627130 3547058 3488462 3463625 2340147 925423 447045 98037 -1684499 -4132478
34489 -4132478 -4761904 -3006512 -901076 179264 1149789 2783338 3814481 2932950 1161976
34480 1161976 596643 1618440 2825335 3201491 2989457 2624187 2051017 1254512 557921
34471 557921 119131 -254399 -510754 -55420 1530337 3628943 4841127 4290330 2534350
34462 2534350 894992 -110866 -1216952 -3027835 -4735938 -4927232 -3453785 -1683044
34454 -1683044 -820894 -783909 -961841 -1221338 -1523436 -1182935 538559 3148388 4957549
34445 4957549 4652940 2510238 -48133 -1714014 -1932225 -784444 1100892 2577186
34437 2577186 2692140 1838217 1685331 3287965 5545752 6336320 5027095 2920284 1223337
34428 1223337 -198471 -1685469 -2746501 -3041869 -3285289 -3992975 -4214987 -2876074 -707751
34419 -707751 701815 1358890 2654172 4787345 6181489 5819092 4560374 3524924 2593001
34410 2593001 1380186 546768 1075317 2875257 4869294 6007133 5814192 4640641 3725932
34401 3725932 4140336 5218680 5038892 3038644 1059079 944186 2160628 2914616 2735699
34392 2735699 2603312 3107649 3922994 4813560 5737366 5984848 4646484 2307887 1062085
34383 1062085 2081935 3897954 3919589 1450908 -1481552 -2471514 -1466634 -596439 -1200856
34374 -1200856 -1834228 -150672 3591186 6315358 5762371 2989326 475572 -949018
34366 -949018 -1972926 -2617100 -2005784 -119210 1812406 2838158 2955174 2098574 -185947
34357 -185947 -3503781 -6089673 -6331333 -4406835 -2035988 -975783 -1829905 -3709621 -4870349
34348 -4870349 -4273608 -2719624 -1914955 -2396901 -3108295 -3071140 -2474269 -1735359 -553494
34339 -553494 1268089 2762761 2580128 641191 -1677358 -2900944 -2537367 -1106765 264304
34330 264304 448273 -784392 -2416988 -3260810 -3362884 -3715900 -4508474 -4543317 -2961777
34321 -2961777 -850127 -131859 -1066695 -1941795 -1460638 -343766 77816 -135188 11302
34312 11302 726442 1520771 2491289 3802897 4049191 1305674 -3522478 -6511890 -5253504
34303 -5253504 -1908933 -112198 -328107 -344961 854234 2274315 3315773 4262831 4437228
34294 4437228 2601777 -386171 -1971499 -1676036 -1800370 -3270428 -3674084 -1356235 1179433
34285 1179433 704797 -1845827 -3065112 -2338523 -1948388 -2512352 -2103039 -390679 -51764
34276 -51764 -2545015 -5415629 -5864967 -4742924 -4612594 -5530150 -5439994 -3811592 -2127497
34267 -2127497 -1031648 324763 1757072 1425163 -1191177 -3744681 -3947977 -2551640
34259 -2551640 -1739576 -1731759 -1009298 686572 1842614 1833134 1984143 3132535 3844908 2425081
34249 2425081 -461020 -2720246 -3703180 -4450870 -5255863 -4764884 -2130252 1214551 2899383
34240 2899383 2124522 44521 -1911915 -3254475 -4047483 -4087379 -2867749 -224227 3159038
34231 3159038 5953685 7049264 6396134 5025467 4132188 4001273 3770231 2392752 59258
34222 59258 -1508213 -719164 1853003 3798819 3584777 2169644 1286291 1010215 260341
34213 260341 -874979 -1009417 256327 1546177 1752348 1453104 1472483 1278014 -37218
34204 -37218 -2029784 -3352938 -3401816 -2492469 -897013 1226673 3275396 4582702 5144516
34195 5144516 5163758 4359470 2779813 1766850 2634901 4573141 5488149 5048668 5065175
34186 5065175 6216231 6332624 3455638 -740669 -2606662 -1129478 1077276 1533596
34178 1533596 755672 534862 928124 550344 -781386 -1401268 -58823 2374849 4077227
34169 4077227 4384446 4028718 3754941 3518320 3001404 2313329 1972732 2360690 3173235
34160 3173235 3460356 2646556 1597035 1829516 3135110 3035821 -115153 -4222825 -5443746
34151 -5443746 -2965178 174031 1400900 1574656 2530504 3764587 3644085 2586257 2499006
34142 2499006 3445886 3328563 1245437 -972225 -1455477 -819987 -770353 -1428222 -1543695
34133 -1543695 -728635 53429 206803 377174 1064624 1283782 -367834 -3438532 -5406953
34124 -5406953 -4292247 -943947 2023466 3232033 3400884 3257115 2115694 -615154
34116 -615154 -3721853 -5342213 -5225541 -4535598 -3831967 -2676626 -1108811 -42451 41277
34107 41277 -392640 -955224 -1724422 -2362979 -2064206 -853693 120755 120418 -327481 -576547
34097 -576547 -810195 -1202759 -1131083 -62371 1469746 2448900 2284531 701104 -2280726
34088 -2280726 -5564413 -7252887 -6697705 -5385102 -4767516 -4206639 -2410713 -7284 1120516
34079 1120516 697615 427891 1405170 2769083 3264982 2681014 1244856 -1023883 -3575514
34070 -3575514 -5037923 -4593508 -2985711 -1482096 -510287 47828 -11184 -870628 -1936999
34061 -1936999 -2226604 -1211455 1227530 5016806 9216170 11840922 11721924 10357669
34053 10357669 10553848 13081855 15967957 17382950 17800493 18550064 19593032 20015192 19806680
34044 19806680 19635330 19295442 17890506 15442901 12874338 10291590 6776724 2328521
34036 2328521 -1293878 -2322989 -607760 2886165 6922401 9789001 9823776 7337748
34028 7337748 4843510 4157291 4393104 4046877 3578459 4022823 4363680 2882413 443485
34019 443485 -378016 698150 1448851 1248843 2215672 5148902 7365238 6536789 4244482
34010 4244482 3330576 3588271 2761926 620034 -736111 -157231 1359049 2632028 3415946
34001 3415946 3570401 2957577 2287156 2485067 3132894 2936706 1679535 284229 -872215
33992 -872215 -2076693 -2827435 -2064700 14152 2096836 3834893 5900742 7790424 7866814
33983 7866814 6345605 5891762 7818075 9696102 8649712 5528646 3637083 4229388
33975 4229388 5516363 5827013 5608698 5969507 6916354 7670782 7614046 6403174 4083849
33966 4083849 1600962 371580 717318 1321801 909703 14324 262418 2029606 3707202
33957 3707202 3715227 2642554 2604728 4559612 7052010 7947784 6797157 4938237 3715238
33948 3715238 3312296 3148951 2700812 1877778 1072925 828839 1138780 1351056 1158675
33939 1158675 1152787 1721033 2059932 1370121 466648 743257 1867305 2262828 1883768 2486735
33929 2486735 4617559 6345962 6051957 4729067 4201668 4560775 4845985 4907919 4906418
33920 4906418 4151790 2360300 1103651 1871594 3328357 2815923 385292 -1038533 216882
33911 216882 2538631 3824209 4251077 5059229 6124867 6206799 4774581 2422846 -20530
33902 -20530 -1968513 -3138254 -3807251 -4573988 -5408310 -5513961 -4575535 -3447478 -3017090
33893 -3017090 -2999626 -2502780 -1291246 99876 1084273 1396085 1258485 1600154 3393663
33884 3393663 6144132 7739685 6665199 3860444 1529179 617843 492905 650039 1329750
33875 1329750 2369310 2831605 2372704 1975452 2532037 3381253 3170847 1824117 675514
33866 675514 622796 1059103 1047943 808162 1212134 2140765 2374729 1353726 148256 88213
33856 88213 1093384 2136265 2793076 3268183 3232706 2082523 588997 861184 3803905
33847 3803905 7544228 9352998 8563704 6753870 5583318 5411944 5678670 5588588 4476142
33838 4476142 2358094 183842 -1108309 -1684899 -2275029 -2736930 -2158946 -499834 877610
33829 877610 778939 -400832 -1312086 -1207371 -392368 526627 1337433 2163039 2905427 2933722
33819 2933722 1727984 13594 -472576 844729 2051138 929120 -1739882 -2730163
33811 -2730163 -566202 2561121 3878412 3284529 2147296 521730 -2146362 -4389300
33803 -4389300 -3495754 725721 5070838 6560425 5309727 3133528 1100119 -333649
33795 -333649 -361526 1168746 2628935 2325001 1062742 1324612 3767028 6033385 5562888
33786 5562888 2461929 -1043209 -3123045 -3524424 -2830428 -1558784 -138579 771721 432483
33777 432483 -1292297 -3464670 -4701127 -4579421 -4077671 -4154282 -4294858 -3294952 -1308754
33768 -1308754 -33409 -574216 -2082014 -2998511 -2779442 -1727662 -8434 2102407 3551245
33759 3551245 3376338 2179661 1602844 2203933 2921946 2939566 2930135 3743562 4789332 4782677
33749 4782677 3610954 2399023 1936899 2061544 2498766 3152679 3376677 2235763 125805
33740 125805 -1038734 -266017 883557 506575 -590061 -13671 2192655 3013095 832890
33731 832890 -1745066 -1208581 2121855 4774378 4811029 3516762 2469172 1305745 -756652
$$ [...]
##END NTUPLES=NMR SPECTRUM
##END=
