##TITLE=31Pdec_DE-68_K
 DMSO-d6, 64 sc
 8.10.2024
##JCAMPDX= 6.0         $$ Bruker NMR JCAMP-DX V2.0
##DATA TYPE= NMR SPECTRUM
##DATA CLASS= NTUPLES
##ORIGIN= UXNMR, Bruker Analytische Messtechnik GmbH
##OWNER= root
$$ XWIN-NMR		Version 3.5
$$ Tue Oct  8 16:05:05 2024 Russian Standard Time (UT+4h)  she@DPX200
##.OBSERVE FREQUENCY= 81.013821
##.OBSERVE NUCLEUS= ^31P
##.ACQUISITION MODE= SIMULTANEOUS
##.ACQUISITION SCHEME= undefined
##.AVERAGES= 64
##.DIGITISER RES= 17
##SPECTROMETER/DATA SYSTEM= spect
##.PULSE SEQUENCE= zgpg30
##.SOLVENT NAME= CDCl3
##.SHIFT REFERENCE= (INTERNAL, CDCl3, 0, 198.062)
##AUDIT TRAIL= $$ (NUMBER, WHEN, WHO, WHERE, WHAT)
$$ ##TITLE= Audit trail, XWIN-NMR		Version 3.5
$$ ##JCAMPDX= 5.01
$$ ##ORIGIN= Bruker BioSpin GmbH
$$ ##OWNER= she
$$ F:/spectra/data/she/nmr/P31/2/pdata/1/auditp.txt
$$ ##AUDIT TRAIL=  $$ (NUMBER, WHEN, WHO, WHERE, WHAT)
(   1,<2024-10-08 16:04:00.35 +0400>,<she>,<DPX200>,
      <continue with go, POWCHK disabled, PULCHK disabled
       configuration hash MD5:
       00 E9 B6 7A A2 85 ED C7 34 08 36 98 17 FE 4E 26
       data hash MD5: 32K
       6D CE ED 4B 73 4F EC E9 6C 2A 41 87 B6 7A 56 D8>)
(   2,<2024-10-08 16:04:02.07 +0400>,<she>,<DPX200>,
      <Start of raw data processing
       efp BC_mod = 2 LB = 1.5 FT_mod = 6 PKNL = 1 PHC0 = 2628.164 PHC1 = 63.8875 SI = 64K 
       data hash MD5: 64K
       FC E7 43 A9 8A 9E F9 F2 BB 5D 25 DE 0F 18 C7 93>)
(   3,<2024-10-08 16:04:24.29 +0400>,<she>,<DPX200>,
      <pk PHC0 = 26.71738 PHC1 = 0 
       data hash MD5: 64K
       9E 53 F4 16 DF 03 21 2C 6E 8B B6 9A 66 43 43 46>)
$$ ##END=
$$ 
$$ hash MD5
$$ 5D 6F AC 64 5F 9A FC 93 54 2E E9 75 48 16 E9 A7
##$RELAX= 
##$RELAX= 
##$RELAX= 
##$RELAX= 
##$RELAX= 
##$RELAX= 
##$RELAX= 
##$RELAX= 
$$ Bruker specific parameters
$$ --------------------------
##$DU= <F:/spectra>
##$EXPNO= 2
##$NAME= <P31>
##$PROCNO= 1
##$TYPE= <nmr>
##$USER= <she>
##$AMP= (0..31)
100 100 100 100 100 100 100 100 100 100 100 100 100 100 100 100 100 100 
100 100 100 100 100 100 100 100 100 100 100 100 100 100 
##$AQSEQ= 0
##$AQ_mod= 1
##$AUNM= <au_zg>
##$AUTOPOS= <>
##$BF1= 81.014009
##$BF2= 200.13
##$BF3= 200.13
##$BF4= 200.13
##$BF5= 200.13
##$BF6= 200.13
##$BF7= 200.13
##$BF8= 200.13
##$BYTORDA= 1
##$CFDGTYP= 0
##$CFRGTYP= 5
##$CHEMSTR= <none>
##$CNST= (0..31)
1 1 145 1 1 1 1 1 1 1 1 1 1 1 1 1 1 1 1 1 1 1 1 1 1 1 1 1 1 1 1 1 
##$CPDPRG= <waltz16>
##$CPDPRG1= <>
##$CPDPRG2= <waltz16>
##$CPDPRG3= <>
##$CPDPRG4= <mlev>
##$CPDPRG5= <mlev>
##$CPDPRG6= <mlev>
##$CPDPRG7= <mlev>
##$CPDPRG8= <mlev>
##$CPDPRGB= <>
##$CPDPRGT= <>
##$D= (0..31)
0 1 0 0 0 0 0 0 0 0.06 0 0.03 2e-05 3e-06 0 0 0.0002 0 0 0 0 0 0 0 0 0 
0 0 0 0 0 0 
##$DATE= 1728388940
##$DBL= (0..7)
120 120 120 11 120 120 24 19 
##$DBP= (0..7)
150 150 150 150 150 150 150 150 
##$DBP07= 0
##$DBPNAM0= <>
##$DBPNAM1= <>
##$DBPNAM2= <>
##$DBPNAM3= <>
##$DBPNAM4= <>
##$DBPNAM5= <>
##$DBPNAM6= <>
##$DBPNAM7= <>
##$DBPOAL= (0..7)
0.5 0.5 0.5 0.5 0.5 0.5 0.5 0.5 
##$DBPOFFS= (0..7)
$$ [...]
##$SUBNAM2= <"">
##$SUBNAM3= <"">
##$SUBNAM4= <"">
##$SUBNAM5= <"">
##$SUBNAM6= <"">
##$SUBNAM7= <"">
##$SUBNAM8= <"">
##$SUBNAM9= <"">
##$SW= 400.765351723535
##$SWIBOX= (0..15)
0 1 3 0 0 0 0 0 0 0 0 0 0 0 0 0 
##$SW_h= 32467.5324675325
##$TD= 32768
##$TD0= 1
##$TE= 0
##$TE2= 300
##$TE3= 300
##$TEG= 300
##$TL= (0..7)
0 120 53 12 22 120 120 120 
##$TP= (0..7)
150 150 150 150 150 150 150 150 
##$TP07= 0
##$TPNAME0= <>
##$TPNAME1= <>
##$TPNAME2= <>
##$TPNAME3= <>
##$TPNAME4= <>
##$TPNAME5= <>
##$TPNAME6= <>
##$TPNAME7= <>
##$TPOAL= (0..7)
0.5 0.5 0.5 0.5 0.5 0.5 0.5 0.5 
##$TPOFFS= (0..7)
0 0 0 0 0 0 0 0 
##$TUNHIN= 0
##$TUNHOUT= 0
##$TUNXOUT= 0
##$USERA1= <user>
##$USERA2= <user>
##$USERA3= <user>
##$USERA4= <user>
##$USERA5= <user>
##$V9= 5
##$VALIST= <valist>
##$VCLIST= <CCCCCCCCCCCCCCC>
##$VD= 0
##$VDLIST= <DDDDDDDDDDDDDDD>
##$VPLIST= <PPPPPPPPPPPPPPP>
##$VTLIST= <TTTTTTTTTTTTTTT>
##$WBST= 1024
##$WBSW= 4
##$XGAIN= (0..3)
0 0 0 0 
##$XL= 0
##$YL= 0
##$YMAX_a= 2931
##$YMIN_a= -6123
##$ZGOPTNS= <>
##$ZL1= 120
##$ZL2= 120
##$ZL3= 120
##$ZL4= 120
##$ABSF1= 0
##$ABSF2= 0
##$ABSG= 0
##$ABSL= 0
##$ALPHA= 0
##$AQORDER= 0
##$ASSFAC= 0
##$ASSFACI= 0
##$ASSFACX= 0
##$ASSWID= 0
##$AUNMP= <proc_1d>
##$AZFE= 0.1
##$AZFW= 0.5
##$BCFW= 0
##$BC_mod= 2
##$BYTORDP= 0
##$COROFFS= 0
##$CY= -3
##$DATMOD= 1
##$DC= 0
##$DFILT= <>
##$DTYPP= 0
##$F1P= 0
##$F2P= 0
##$FCOR= 1
##$FTSIZE= 65536
##$FT_mod= 6
##$GAMMA= 0
##$GB= 0
##$INTBC= 1
##$INTSCL= 9.790993e-09
##$ISEN= 30
##$LB= 1.5
##$LEV0= 0
##$LPBIN= 0
##$MAXI= 10000
##$MC2= 0
##$MEAN= 0
##$ME_mod= 0
##$MI= 50
##$NCOEF= 0
##$NC_proc= -8
##$NLEV= 6
##$NOISF1= 182.463
##$NOISF2= 159.3651
##$NSP= 0
##$NTH_PI= 0
##$NZP= 0
##$OFFSET= 198.0616
##$PC= 4
##$PHC0= 2654.881
##$PHC1= 63.8875
##$PH_mod= 1
##$PKNL= yes
##$PPARMOD= 0
##$PSCAL= 0
##$PSIGN= 0
##$REVERSE= no
##$SF= 81.0140089999434
##$SI= 65536
##$SIGF1= 159.3651
##$SIGF2= -187.1042
##$SINO= 113.3802
##$SIOLD= 16384
##$SREGLST= <1H.CDCl3>
##$SSB= 0
##$STSI= 65536
##$STSR= 0
##$SW_p= 32467.5324675325
##$SYMM= 0
##$S_DEV= 0
##$TDeff= 32768
##$TDoff= 0
##$TI= <>
##$TILT= no
##$TM1= 0
##$TM2= 0
##$TOPLEV= 0
##$USERP1= <user>
##$USERP2= <user>
##$USERP3= <user>
##$USERP4= <user>
##$USERP5= <user>
##$WDW= 1
##$XDIM= 65536
##$YMAX_p= 192523727
##$YMIN_p= -201502966
$$ End of Bruker specific parameters
$$ ---------------------------------
##NTUPLES= NMR SPECTRUM
##VAR_NAME=  FREQUENCY,     SPECTRUM/REAL,   SPECTRUM/IMAG
##SYMBOL=    X,             R,               I
##VAR_TYPE=  INDEPENDENT,   DEPENDENT,       DEPENDENT
##VAR_FORM=  AFFN,          ASDF,            ASDF
##VAR_DIM=   65536,         65536,           65536
##UNITS=     HZ,            ARBITRARY UNITS, ARBITRARY UNITS
##FACTOR=    0.49542278885378, 1,            1
##FIRST=     16045.7642231865, 0,            0
##LAST=      -16421.768244346, 0,            0
##MIN=       -16421.768244346, -201502966,   0
##MAX=       16045.7642231865, 192523727,    0
$$ Real data points
##PAGE= N=1
##DATA TABLE= (X++(R..R)), XYDATA
$$ [...]
9578 5610001 4441600 4917657 4609398 2137468 -486202 -573549 1805214 3953709 3520952
9569 3520952 865319 -1517206 -1920443 -1394398 -1981468 -3319860 -2793557 292510 2705178
9560 2705178 1309181 -2143123 -2691763 1471326 6515638 7507274 3825685 -966815 -3643338
9551 -3643338 -4479917 -6118772 -10112677 -14916958 -17283465 -15639599 -11854183 -9315437
9543 -9315437 -9447742 -10661265 -10592323 -8480161 -5031050 -969927 3135708 5991816 6094120
9534 6094120 3917048 2523666 4453760 8139455 9119239 5574745 1157603 731510 4229649
9525 4229649 6882398 5420819 1672688 -749884 -965470 -307705 731424 2314529 2907358
9516 2907358 269799 -4724186 -7899762 -6601288 -2709833 405958 1961392 3033550
9508 3033550 3658644 3233066 2678892 3280588 3771920 1651021 -2365600 -4368546 -2698809
9499 -2698809 -354986 -467723 -2337636 -4091229 -6256965 -9462213 -10962251 -7633555
9491 -7633555 -1324118 2865128 3217424 2409754 2185481 1510000 605022 2073585 6227307
9482 6227307 9490058 9798646 9811208 12024292 14283560 13424090 10177234 6807133 2857848
9473 2857848 -2472739 -6323302 -5614974 -2891012 -3367370 -6878746 -8253420 -5878078 -4219440
9464 -4219440 -6254512 -8450129 -6004029 662060 7535205 12258205 14785458 14893668
9456 14893668 12154792 7639707 3420178 488034 -1763388 -4296550 -7091663 -8571062
9448 -8571062 -6675109 -1570712 3433112 5385991 5179132 5142642 4414661 549106 -4677345
9439 -4677345 -5885513 -1647173 3119325 4195033 3134947 2804431 2315139 133170 -1533410
9430 -1533410 -69116 2401798 1888553 -1211905 -3348173 -4043976 -6069865 -9765079 -11902440
9421 -11902440 -10883949 -9153158 -9356287 -11194773 -13015134 -13754640 -12482913 -8716237
9413 -8716237 -4217188 -2098782 -3092009 -4761172 -5165031 -4970280 -4972549 -4054416 -1313012
9404 -1313012 1738619 3041514 2719177 2124967 1319479 -366525 -1784753 -374615 4168744
9395 4168744 8293924 8157328 4260741 951373 977225 2200237 1135312 -1603615 -2078876
9386 -2078876 893024 3619868 2750788 -273531 -2192817 -2845096 -3964746 -4776656 -2668125
9377 -2668125 2076265 5819579 6409717 5501829 5241666 5336946 4629769 3299541 2030950
9368 2030950 701103 -701406 -1165658 95194 2498226 5060148 7362535 8698570
9360 8698570 7595274 3530058 -1661784 -5340585 -6647311 -6661706 -6383601 -5519700 -3360090
9351 -3360090 -306161 1895545 1783374 152962 -232632 2388231 6496517 8811858 7776850
9342 7776850 4689912 1848279 734530 1653450 3617417 4512530 2884522 12608 -1006324
9333 -1006324 1210637 4683738 6456144 5707585 3808269 1999915 89445 -2405750
9325 -2405750 -4549352 -4404148 -1525710 1914769 3723321 4698975 7046620 10011716 9959005
9316 9959005 5667882 573787 -1979302 -2817644 -3951320 -4584965 -3549140 -3062675 -5608889
9307 -5608889 -8729797 -7766407 -2946521 1151564 2790096 4454705 6841884 7251294 5411095
9298 5411095 5203197 7955113 9172929 5493404 474428 -735161 1053815 1413477 -543487
9289 -543487 -2235163 -3125886 -5229253 -8600113 -10669151 -10345850 -9249808 -8346640 -6388124
9280 -6388124 -2527070 1827100 4578543 4797779 2787203 -86422 -1549392 -149741
9272 -149741 2833676 4592024 4086432 2845019 2360175 2190890 1287132 127335 476881
9263 476881 2996213 5640586 5221324 1065321 -3600388 -5134536 -3848421 -3074392 -4053038
9254 -4053038 -4272032 -1681808 1926025 3371811 2112179 153002 -650404 271795 2505235
9245 2505235 4826244 6277067 7827288 11178761 15193228 16090634 12594877 8062332
9237 8062332 5524282 3671433 626257 -1262980 1477784 7230226 10391420 8222733
9229 8222733 3276678 -449540 -655784 3238824 9660372 14453597 13992866 9084721 3625468
9220 3625468 -64004 -2068728 -2065783 847462 5616776 9587493 11375585 10774927 6701158
9211 6701158 -1093084 -8704214 -10813990 -7359426 -3583421 -2658059 -2264481 231472 3321476
9202 3321476 4340653 3679716 3475375 4320498 5339253 5787100 5215299 3906327 3963217
9193 3963217 7505750 12919395 15803711 14749602 12911368 12459793 11354301 7981000
9185 7981000 5042529 5263648 6446064 5044300 2276502 1981012 3809935 3463170 -558084
9176 -558084 -5023941 -7419655 -9177362 -11985004 -14224888 -13259017 -9219069 -4649361 -1681734
9167 -1681734 -897438 -1768377 -2907197 -2760088 -1175324 366783 863901 1224256 2568145
9158 2568145 3968858 3402568 714426 -1875369 -2531774 -1766657 -1022095 -593429 -196654
9149 -196654 -564627 -2507008 -4637793 -4327870 -1566965 285341 -1056629 -3451286 -3232625
9140 -3232625 4327 3626657 5797398 6700603 6769721 6301508 6423449 7807284 8541278
9131 8541278 5929861 506426 -4370195 -7012705 -8540923 -9168858 -6838160 -968633
9123 -968633 5440125 9375920 11141498 12335915 12833535 11957284 10817249 11100337 12571471
9114 12571471 13599146 13300167 11823463 9528645 7080654 5419699 4891914 5528383 8202126
9105 8202126 13204219 17306598 15558115 7682949 -325808 -3246387 -2536093 -2659791 -4280530
9096 -4280530 -4546108 -2247596 931230 3265852 4015304 2646097 101405 -47371 5085941
9087 5085941 13515984 20057359 21766175 19623955 15894149 12363676 10189323 8825906
9079 8825906 6104727 1830366 -474142 1344719 3315665 232468 -6082887 -8812445
9071 -8812445 -6042156 -2693774 -1796119 -170770 4583353 8531007 7040379 1920432
9063 1920432 -1642650 -2461507 -3060821 -3928860 -2928521 -52722 1501591 -214613 -3418190
9054 -3418190 -5543386 -6394272 -7204866 -8143009 -8083961 -6319844 -3644193 -1615559 -767957
9045 -767957 283066 3338176 8033658 11551537 11358835 7544917 2158385 -2623714 -5006902
9036 -5006902 -3731207 613768 4995452 6369976 4920630 3729672 4926021 7146375
9028 7146375 7438147 5027882 2233407 1581096 2920558 4132666 4132679 3792903 3696841 2632041
9018 2632041 -459616 -4172574 -5979290 -5381939 -4068537 -3200313 -2369604 -1360340 -987636
9009 -987636 -1420013 -1246523 626037 3142379 4372979 4188364 4623794 7416089 11613016
9000 11613016 13977218 12018104 6603878 1142658 -1808773 -2356237 -1811321 -1114630 -1423303
8991 -1423303 -4203835 -8848177 -11730202 -10107226 -6107131 -4298794 -5792919 -7372511
8983 -7372511 -6285975 -3161408 72995 2482343 3692511 3528038 2901454 3133566 3821232
8974 3821232 3237757 1161398 -695859 -1202440 -508205 1637270 5332633 8140811 6830361
8965 6830361 2466241 195276 2426201 5644958 5852121 3651612 1569260 -149312
8957 -149312 -1929874 -2226018 -251580 1150729 -547885 -2673802 -760212 4390928 7573855
8948 7573855 6710929 5131446 5886433 7750723 8040836 6178923 2952028 -1275886 -5932915
8939 -5932915 -9400339 -10176254 -8129791 -4212458 153533 3429559 4895924 5214495 5125349
8930 5125349 4246515 2548633 2008269 4492172 8376068 9721763 6992562 2453654 -1264193
8921 -1264193 -3662637 -4939524 -4444335 -1870797 1453495 3606273 3679767 2054320 25497
8912 25497 -814493 -13205 948499 542761 -381187 360418 3044533 5731039 7173430
8903 7173430 7962248 8508359 8080539 6538951 5052999 4221714 3215456 1654179 650859
8894 650859 989417 1804593 2151913 2516787 3608266 4772607 4759987 3356055 1501267
8885 1501267 428495 968628 2759587 4004422 3271512 1660083 1629332 3498719 5037798
8876 5037798 5007993 4912671 6250546 8231434 9700214 11329161 13929825 16064709 15494358
8867 15494358 12188449 8100582 4614971 1860671 -9302 -529406 215576 1569293
8859 1569293 2963419 3981041 4504047 5488854 8428861 12924944 15983549 15245373 12000963
8850 12000963 9432692 8684005 8381574 7357176 5862480 4311900 2718749 1581708
8842 1581708 1788721 3192105 4222772 3144179 -773910 -6789684 -12557414 -15239508
8834 -15239508 -14067180 -11313648 -9528262 -8489929 -6334204 -2917163 -141492 698706
8826 698706 16577 -1372363 -2755785 -2955163 -1322092 768020 1538816 1797733 3790642
8817 3790642 7055426 8561564 7749759 7978378 11077872 13578070 11184151 4789887 -1073544
8808 -1073544 -4198979 -5780137 -6519418 -5410496 -2719211 -955762 -1616734 -3018994 -2590238
8799 -2590238 -8462 2796204 3858399 2974798 2016551 3296669 6706912 9172700 8539756
8790 8539756 7160044 9096860 14077508 17360048 16161246 12900762 10676267 8911550
8782 8911550 6057167 3776925 4794723 7977342 9219415 7017016 4193815 3839850
8774 3839850 5880565 7964921 7788199 4359736 -1158927 -5634067 -6596365 -4824494 -2975118
8765 -2975118 -2136084 -1550730 -1129827 -1768001 -3302966 -4644892 -5932554 -8018708 -9937930
8756 -9937930 -9975835 -9408935 -11464042 -15588214 -16669791 -11947645 -5270777 -2043198 -2914475
8747 -2914475 -5047456 -6665949 -7263876 -5989366 -3360684 -2423095 -4601306 -6430221 -4343736
8738 -4343736 -861077 -1415440 -6151494 -9789798 -9415630 -7560245 -7026858 -7304306 -7393110
8729 -7393110 -8020727 -9171370 -8800182 -6015349 -2895308 -1452254 -1152577 -882581 -1043927
8720 -1043927 -2257302 -4040863 -5918113 -7827242 -8725749 -7299381 -4890028 -4880711 -7952830
8711 -7952830 -10719826 -10380505 -7892107 -5128347 -2004135 1690535 4572556 5962060
8703 5962060 7246010 8931458 9148139 7187796 5453055 5441415 5056556 2829231 1409459
8694 1409459 3204483 5685091 5267686 3108470 2376907 2253066 -26389 -2992838 -2711433
8685 -2711433 113336 731930 -1882580 -3550055 -1888913 587435 1596834 2172154 2931399
8676 2931399 2116724 -484194 -2060476 -1559927 -1774812 -4070191 -5092413 -1855893 3421082
8667 3421082 6807373 7736550 7252839 4518670 -741662 -4929327 -4399446 -1134136 -242113
8658 -242113 -2772132 -5211991 -5511796 -5238137 -5571576 -5313133 -3842374 -2578212 -2214646
8649 -2214646 -1445671 166475 738315 -788794 -2297318 -1367850 1045549 1963972 578660
8640 578660 -855023 -98564 2640895 5504708 7053981 7137374 6398786 5486952 4612204
8631 4612204 3563558 2131095 696890 402957 2245523 5516470 7577859 6256462
8623 6256462 2577903 -76157 -105454 230878 -1994584 -6047540 -8079475 -5885096 -1568504
8614 -1568504 1005163 309887 -1985660 -3512782 -3604941 -3309676 -3804051 -5302341 -7326975
8605 -7326975 -9443366 -11402287 -12893259 -13566405 -13126268 -11250656 -8049619 -5014878 -4424844
8596 -4424844 -6635480 -8945784 -8857012 -7532105 -7585685 -8155126 -5795349 -811505 1459430
8587 1459430 -2022941 -6890375 -6972254 -2504372 1174899 1456768 638321 915023 1686377
8578 1686377 2428896 4291723 7442509 9885415 10345240 9772130 8813119 6505945 2948864
8569 2948864 575027 832336 1880310 1631656 978095 1754546 3437312 4404781 4845842
8560 4845842 5641813 5679990 3378617 149772 -811737 949747 2764376 3112056 3429125
8551 3429125 5168343 7827833 10696918 13775332 15691650 13490837 6597150 -1128064
8543 -1128064 -5678708 -7636379 -10028148 -12854132 -13164435 -10337427 -7626954 -7257956 -7037891
8534 -7037891 -4063047 401792 2702504 2349360 2408366 4122211 4521072 1115726 -3646954
8525 -3646954 -5401865 -3906974 -2890583 -4276377 -5987445 -6228245 -6554107 -8642161 -10696490
8516 -10696490 -9970977 -7159982 -5065404 -3859424 -1136740 3495321 7410945 9115161
8508 9115161 9985520 10742770 9671024 6367871 4013408 4931992 6454454 4773572 1093868
8499 1093868 -98362 2083584 4076499 3803350 3048987 3011380 1810826 -1450738 -3719614
8490 -3719614 -1968746 2288765 5236580 5567779 4406540 2335169 -327022 -1615214
8482 -1615214 236355 3508344 4653464 3041373 1151926 253349 -876107 -2692587
8474 -2692587 -3796907 -3983441 -5042264 -7074386 -7205738 -4068441 -722494 -452992 -2015619
8465 -2015619 -2246508 -1678604 -3800511 -9192001 -13947800 -14622326 -12150967 -9836114 -9209009
8456 -9209009 -8931634 -6850378 -2529713 1899489 3746658 3120408 3135780 5550948 7750531
8447 7750531 6357596 2566035 670962 1777671 2602911 873870 -1881931 -4093182
8439 -4093182 -6881655 -10938604 -14035666 -14419696 -13868673 -14225316 -13400235 -8624906 -1895688
8430 -1895688 1998503 1971135 1117252 1237676 1194353 885952 2340416 5560392 7271796
8421 7271796 5755726 3610034 3573229 4598090 4490144 3702083 3583755 3012427 16229
8412 16229 -4515483 -7707254 -8489220 -7977941 -6883094 -5152483 -3703022 -3929459 -5487435
8403 -5487435 -6533824 -6012920 -4099133 -1098047 2136207 3552071 2030500 -508856
8395 -508856 -1552311 -1676699 -2866762 -4056026 -2307488 1493336 2472545 -1410051 -6251801
8386 -6251801 -7817691 -6729353 -5639433 -4514226 -2008028 839577 1916887 1752085
8378 1752085 2566363 4251133 4307205 1751712 -1369501 -2653614 -1818885 -421563 -358663
8369 -358663 -2428881 -5337302 -6644847 -5570570 -3890102 -3214241 -3011777 -2657200 -3301482
8360 -3301482 -5370634 -6081582 -2584932 3485104 7757554 8738078 8526812 8519229 8030891
8351 8030891 7311230 8146241 10403374 11168292 8775040 5186169 3061328 2727568 3230217
8342 3230217 4071852 4535100 3413511 898546 -1117365 -1899061 -3016883 -5170901 -5952732
8333 -5952732 -2826958 3070289 8082557 10066100 9683518 8456311 6973128 4720016
8325 4720016 1058860 -3138961 -5113737 -3098204 541907 1468794 -948972 -2990859
8317 -2990859 -2422918 -1458289 -2066432 -2080802 786362 4086134 3893605 967745 -624931
8308 -624931 130435 540812 -595600 -1495447 -1389972 -1945628 -3793237 -5275866 -5805303
8299 -5805303 -6954056 -8672594 -7992429 -3994698 -1084917 -3904223 -10621049 -14740068
8291 -14740068 -13097593 -9037114 -7418198 -9159814 -11728944 -12897154 -12263252 -10230436
8283 -10230436 -7547853 -5743767 -6060168 -7221933 -5928045 -1078620 3632644 3506336
8275 3506336 -1106270 -4889290 -4094080 -631007 1355418 679176 -851494 -1702462 -1645676
8266 -1645676 -611707 1294235 3079331 3752305 3448388 2635031 1348070 387221 1482388
8257 1482388 4384774 5675785 3044237 -933484 -2360773 -1839490 -2893679 -5482485
8249 -5482485 -5531776 -1224766 4408764 8162097 10168928 11474724 11629979 10428458 8997916
8240 8997916 7410062 4067788 -715262 -3398435 -1691216 2065419 4115793 3582964
8232 3582964 1503339 -1810822 -5736026 -7908941 -6996810 -5423409 -6349395 -9036190 -10040899
8223 -10040899 -8173655 -5543873 -4224706 -4323229 -4936260 -4893097 -3133788 -375696 471412
8214 471412 -2139469 -5332864 -5025578 -1604597 582555 -701004 -3012540 -3090729 -465793
8205 -465793 3448916 7099086 8472068 5634782 -472368 -5402997 -5332330 -1078414 3377740
8196 3377740 5709083 7150773 9794557 13320871 15123551 13384203 9340566 6002963
8188 6002963 4926419 5192319 5539594 5894953 5998137 4319318 240245 -3806011 -4659806
8179 -4659806 -2499311 -433628 -192377 -501081 -50505 234362 -1045617 -3349572 -4741719
8170 -4741719 -4008803 -1602375 768908 1299254 -96846 -1007845 1096467 5451127 8418418
8161 8418418 7710226 4612997 1487691 -1020895 -3083746 -3758812 -1929304 1583827 4550329
8152 4550329 5663000 5033576 2819988 -897788 -4617958 -5459928 -1983845 3540884 6895072
8143 6895072 6225722 3801607 2848395 3391133 2667628 -418951 -3283304 -3225534 -1255645
8134 -1255645 -239366 -291199 1180981 4794784 7434815 6417898 3340905 2066858 4058216
8125 4058216 7227204 8693700 7450101 4819012 3222291 3969961 5551297 4903124 1196616
8116 1196616 -2593372 -3055911 -454544 1957497 2158126 1159327 556272 -16745 -2075729
8107 -2075729 -5709028 -8726947 -8540305 -4851532 -404931 1428396 152747 -1329814
8099 -1329814 -290941 2441282 3821982 2877148 1972109 3412122 6377121 8369634 8552289
8090 8552289 7949001 6807061 3933924 -522282 -3355605 -1269545 4771802 9829056
8082 9829056 10045895 6324599 2524091 1143172 1664291 2282459 1918018 573706 -1281202
8073 -1281202 -3237207 -5028989 -6118167 -5414298 -2251117 2022115 4435988 3288347
8065 3288347 -13663 -2818157 -4139981 -4674173 -4815748 -4217192 -2814012 -752407 2231168
8056 2231168 5664208 7126409 4484214 -650033 -4118495 -4340566 -3796770 -4643389 -5608115
8047 -5608115 -4855114 -3357305 -2959752 -2998762 -1739718 70431 297946 -415966 1008110
8038 1008110 5037635 7948691 6829675 3776819 2979060 5134941 7169617 6928842 5785338
8029 5785338 6184031 8441238 10945080 12306481 12118303 10356277 7461200 4828109 3803746
8020 3803746 3916674 3347976 1661389 741104 2035274 4086280 4376631 2931903 2263414
8011 2263414 3864422 6553824 8575254 9629240 10119138 9832002 8434229 6407282 4600621
8002 4600621 3449993 3206464 4180872 6042814 7410297 6769456 3604482 -1362453 -6380197
7993 -6380197 -9233754 -8749120 -5975511 -2873648 101246 3623592 6781563 7116431 4360055
7984 4360055 1865489 2524506 4967735 5883206 4738728 3745637 3876400 3551665 1477948
7975 1477948 -1273678 -2661409 -1933527 -142971 820468 -134625 -1829864 -1518253 1832876
7966 1832876 5612386 6369898 3956716 1094059 -705733 -2436410 -4619159 -5619050 -4278542
7957 -4278542 -2342769 -2292781 -3602439 -3110467 775098 5750350 8214650 7289549 5176263
7948 5176263 3963819 3781998 4694661 8330321 15206622 21411644 21400906 14889259 7891301
7939 7891301 5307314 5373792 3869317 1025096 516021 3178556 5934399 6702651 6581268
7930 6581268 6702128 6276782 4661430 2586653 472541 -1983634 -3907555 -3653776 -1953085
7921 -1953085 -1900578 -4700316 -8027074 -9686125 -10092178 -9922994 -8573691 -6784280 -7396199
7912 -7396199 -10769635 -12524436 -9302655 -4287715 -2974278 -5204566 -5847745 -2602742
7904 -2602742 1430861 3240531 3706960 4634157 5447478 4840332 3397850 2591904 2473200
7895 2473200 1809895 -284216 -3628415 -7058202 -8873430 -8166010 -5855895 -3458339 -1197373
7886 -1197373 1184650 2412173 1000900 -1365731 -814468 3215139 6121535 3639177
7878 3639177 -2811036 -8221452 -9813447 -8710863 -7221725 -6831276 -8112464 -10319182
7870 -10319182 -11280980 -9528294 -6346964 -4219110 -3714417 -3633740 -3617845 -4350704 -5353536
7861 -5353536 -5177367 -4377358 -5820973 -10681579 -15945712 -17493813 -14463420 -9204894 -4122032
7852 -4122032 -232167 1979226 2208056 807295 -1693460 -5401459 -10165857 -14152924
7844 -14152924 -15015970 -12882273 -10673098 -10562065 -11188814 -9582873 -5332856 -1504446 -1120437
7835 -1120437 -3615914 -5553257 -4614059 -1984435 -378098 -563623 -1113588 -1313429 -2364532
7826 -2364532 -4731353 -6042788 -3728097 983202 3990039 3298852 933203 -538855
7818 -538855 -1060088 -1492463 -1112448 1181443 4239307 5348474 3305320 -629202 -4447557
7809 -4447557 -6680386 -6439372 -3872223 -576640 1833142 3525008 5462633 6913045
7801 6913045 5960867 2932003 1221678 3373270 7640793 9960734 8696559 6112764
7793 6112764 5439125 7636126 11084122 13473717 13555348 11511619 8240839 4599575 1321703
7784 1321703 -794983 -1252824 -501062 246855 176451 -225322 376327 2592421 5063146
7775 5063146 5265606 2420954 -651733 -124024 3919945 6900588 5253678 732965 -2659314
7766 -2659314 -4214200 -6010462 -8065479 -7973879 -5610637 -4153027 -4974010 -5157872 -2449885
7757 -2449885 394118 -654027 -4893177 -7954672 -7584813 -5130707 -2055267 1632357
7749 1632357 5398417 7666915 8019782 7730646 7523477 6720707 5107566 3757875 3401607
7740 3401607 3654953 4345211 5746357 6826541 5258058 439158 -4978961 -7911329 -8086873
7731 -8086873 -7366018 -7027108 -7170772 -7865115 -9086035 -9786939 -8704041 -6451150 -5613197
7722 -5613197 -8020654 -12438302 -15574404 -15278925 -12347277 -9162877 -7093612 -5747144
7714 -5747144 -4468011 -3477093 -3080273 -2704866 -1603505 187752 2602845 6479821 12167574
7705 12167574 17510836 19081227 15876945 10465131 6081665 3954213 3839274 5349726
7697 5349726 7474296 8101306 5754232 1461065 -2291735 -4263201 -5210711 -6228491 -7380449
7688 -7380449 -8078369 -7966457 -6968815 -4806904 -1067988 3846819 8022023 9166891 7060194
7679 7060194 4112515 2513606 1559518 -717024 -3939472 -5661153 -5235713 -4810229 -5697681
7670 -5697681 -6416452 -5788588 -5339592 -6314392 -6609431 -3801495 296245 1631049 -267407
7661 -267407 -2065656 -2042418 -1865641 -2374040 -1641566 998499 2636848 1171340 -903992
7652 -903992 -340723 1479947 884184 -1617796 -1458570 3239405 8891783 11517197 11375801
7643 11375801 10923232 10822715 10240546 9303027 8792697 8183185 5980782 1801632 -3070349
7634 -3070349 -6657871 -6989194 -3160776 2726421 6018084 4228802 632119 653765 5008393
7625 5008393 9152224 9607188 7612015 5543933 3114769 -555927 -3663776 -3633617 -1040189
7616 -1040189 1174717 1602663 926285 -573069 -2953220 -4247525 -1610178 4187026 8255466
7607 8255466 7155100 2850547 -424252 -1316648 -1571203 -2773471 -5089740 -8224339 -11382508
7598 -11382508 -12698718 -10687188 -6225245 -1592167 2202843 5525058 7895510 7854080
7590 7854080 5489850 3087970 2175837 1456449 -957759 -4393646 -6389455 -6129685 -5367405
7581 -5367405 -5678479 -6227953 -5052889 -1676864 2520042 6069702 8491934 9692183 9436857
7572 9436857 7887934 5804772 3624543 1162076 -1021106 -1007965 2178535 6258679 7666927
7563 7666927 5960271 4277000 4873321 6335604 6370453 5227543 4405976 3663737 1863376
7554 1863376 -209243 -644883 327129 627966 -43278 299014 2213135 3479518 2739502
7545 2739502 1825197 2524158 3234688 1339897 -2552667 -5354311 -5620851 -4445992 -2795691
7536 -2795691 -589261 1550521 2189705 1381220 1065333 2401861 4319178 5347564 5287349
7527 5287349 4407684 2699669 816994 122915 762175 1271286 1168225 1986914 4079779
7518 4079779 4443702 459257 -5414091 -7832153 -5215362 -1208171 790228 1474061 2909822
7509 2909822 4793993 5395540 4259638 1886126 -1721329 -5875412 -7810009 -5324121
7501 -5324121 -621157 1146710 -2234873 -7602474 -10490104 -9718614 -6961985 -3663674
7493 -3663674 -224205 2713746 4121632 3765848 2373506 582333 -1464614 -3624938
7485 -3624938 -5639260 -7229108 -7463675 -4621958 1725124 8635424 11903322 11043964 10184449
7476 10184449 12463687 15382566 14246380 9115686 4980947 4822453 5971005 4876433
7468 4876433 2385799 1553722 2373120 2184251 466263 -276159 1405523 3928148 5393887
7459 5393887 5636279 4768036 2303568 -1099175 -3432717 -4219870 -5216408 -6731255 -5987343
7450 -5987343 -1533897 3216106 4123289 2289645 2258322 5196269 7727418 7508597 6196508
7441 6196508 6002746 6540256 6570062 6438398 7172059 8780383 10560686 11686899 10993175
7432 10993175 8070094 5140189 5527966 9182491 11934638 10594110 6792126 4341295
7424 4341295 4833714 7468060 10988392 13489141 12155766 6037221 -1792811 -7091507
7416 -7091507 -8632986 -7751376 -5384147 -2364200 -1219206 -3863087 -7699247 -7795649 -3576145
7407 -3576145 214246 455213 -26733 2532576 6463873 6876494 2901945 -945985 -782837
7398 -782837 2363806 5344454 7474809 10300845 14056442 16698074 16532345 14067477 10769905
7389 10769905 7476406 4876062 4093679 5243466 6361248 5638717 4134873 4088361 4804843
7380 4804843 3021799 -1947495 -6247461 -6208538 -2652124 1421183 5008356 8203599 9143767
7371 9143767 5677371 -423288 -4425289 -4136039 -1612427 868335 3488521 6742645
7363 6742645 9596941 11314089 12747465 14131077 13615525 9971824 5233396 2584906
7355 2584906 2538036 2974664 2290318 872404 -36416 538146 2944015 6285485 8365175
7346 8365175 7497111 4405511 1444059 77598 -27486 298729 820468 1571253 2329741
7337 2329741 2748700 2561594 1638415 408190 287260 2879541 8048448 13041191 14446109
7328 14446109 11539167 7166955 4539331 3623131 2137321 15237 473485 5202284
7320 5202284 10642709 11844114 9029491 7133921 8816962 11147087 10107851 5523407
7312 5523407 138992 -3587195 -4089992 -742011 4222560 5933796 2092110 -3290565
7304 -3290565 -4403224 -1089646 1503138 569361 -705478 1653354 6560154 9462517
7296 9462517 8090079 4251895 563828 -2346595 -4921318 -6599118 -6029564 -3106383
7288 -3106383 330645 2371164 3013302 3477777 3962005 3357252 1353600 -594960 -1145442
7279 -1145442 -687545 -59193 1237797 4058344 7547215 9746629 10181077 10384581 11588350
7270 11588350 12933933 12356915 8730441 3180123 -1291797 -1998511 748840 3517573
7262 3517573 3208472 268139 -2368756 -2776847 -1139141 1849332 5514482 8126712 7640451
7253 7640451 4546093 2282570 3380804 6225371 7121646 5084097 3080991 4237133
7245 4237133 7754214 9384510 5944796 -1158185 -7383793 -9822215 -9621380 -9434979 -9725962
7236 -9725962 -8800961 -5731970 -1596347 2154592 5158700 7702317 9858603 11287988
7228 11287988 11125557 8293710 3083334 -1812754 -3431369 -1864280 114525 932146
7220 932146 1751114 3444265 4305162 2517891 -684795 -2498348 -2319791 -1866561 -1938653
7211 -1938653 -1450997 -89873 311114 -1640056 -4436349 -5563301 -5167308 -5938758 -9194774
7202 -9194774 -12862146 -14278836 -13575826 -12726507 -12228993 -10984672 -9307878 -9316628 -11217006
7193 -11217006 -11671544 -8043068 -2582085 255615 -323672 -1146141 -212916 1032856 1047990
7184 1047990 755966 1489349 2793432 3787233 4666834 5270955 4073153 468615 -3549003
7175 -3549003 -5946354 -7397491 -9303612 -10493393 -8766486 -5157902 -3633030 -5987124
7167 -5987124 -9380581 -9956465 -7298040 -4178371 -2914553 -3178015 -3229607 -2477568 -2158646
7158 -2158646 -3258355 -4541970 -4083534 -2626711 -3220792 -6554193 -8997316 -7348794 -3605408
7149 -3605408 -2185255 -3716799 -4960375 -4346569 -3824399 -4697499 -5248557 -3979923 -2238438
7140 -2238438 -1717273 -1788000 -1452515 -1874045 -4392179 -7299106 -7164931 -2951964 3049914
7131 3049914 7937990 10240802 9898295 8134815 7207915 8532652 10785468 11076138 8155256
7122 8155256 3514562 -591161 -3115393 -4197600 -4340059 -4113139 -4106750 -4666076 -5529054
7113 -5529054 -5621509 -3652534 125760 2906135 1728854 -2453819 -4814670 -2060127 3547458
7104 3547458 7057720 6459755 3699744 1268880 22192 -184633 129812 167226 -86672
7095 -86672 619832 2695397 4181233 3424599 1987223 2026084 1999541 -1165923 -6274838
7086 -6274838 -8973552 -9047137 -11188729 -16494525 -18643686 -12536907 -2601535 2447913 457113
7077 457113 -3566587 -5793143 -6991385 -8159410 -8249392 -7352908 -7801300 -10408961 -12871717
7068 -12871717 -13390533 -12998002 -12810167 -11756917 -8918326 -5833769 -4439096 -4369894 -4190744
7059 -4190744 -3994139 -5001512 -7457017 -10345599 -12536564 -13193063 -11831128 -8911430 -5724861
7050 -5724861 -3116815 -1166406 -435256 -2065633 -5717045 -8643807 -8101237 -4213919 155111
7041 155111 1890440 -91088 -4012812 -6517157 -5841387 -3689096 -2679973 -2420255 -316576
7032 -316576 3773298 6551812 5739588 2808529 87122 -2129826 -3975673 -4267254 -2643252
7023 -2643252 -1221489 -1667376 -2431931 -1317546 924118 2100711 2165996 2651704 3703368
7014 3703368 4163644 3568447 1919690 -1132230 -4674079 -5916039 -3884495 -1838846 -2825084
7005 -2825084 -4670103 -3164105 1351476 4848311 5928823 6674021 7835450 8051751 7737443
6996 7737443 8746894 9855812 7813567 3744611 2996161 6908750 10133325 8573420
6988 8573420 4857855 2933748 2273407 1245686 1489765 4163716 5739821 2866191 -1497283
6979 -1497283 -2216668 27760 509605 -1423984 -1962493 64283 1656043 1630740 2469376
6970 2469376 4799010 5206527 1838960 -2159133 -3609570 -4119463 -6644075 -9903947 -9974790
6961 -9974790 -6178424 -1971361 -149566 66276 651204 1634825 1635780 577418 383534
6952 383534 2525406 5555851 6133584 2818603 -1966114 -4456857 -3444490 -851580 988442
6943 988442 1475172 1351998 1308061 1282344 708433 -608171 -1878860 -2281843 -2686121 -5158710
6933 -5158710 -9958911 -14322510 -15490260 -13813324 -11397118 -8857385 -5448302 -1654059
6925 -1654059 710449 1043569 706148 939309 1461002 1295936 -210418 -3197488 -6996279
6916 -6996279 -10188966 -11926376 -12677430 -12686029 -10788933 -6440701 -1836684 228264 -78473
6907 -78473 -590749 -1027653 -3022845 -6378878 -8413342 -7720523 -5897217 -4663802 -3735472
6898 -3735472 -2472829 -1170271 469953 3764248 8479124 11929608 12253400 10841353
6890 10841353 10029915 10079131 9929932 9211755 7787818 4955861 1106377 -1129866 447626
6881 447626 4522630 7628742 7969319 6399243 4543451 3753818 5133756 8366157 10624947
6872 10624947 8772735 3281657 -1374899 -934952 4696491 11830897 16431967 16796326
6864 16796326 13661331 8743864 3607091 -464046 -2593199 -3161514 -3990759 -6505817
6856 -6505817 -9758231 -11319257 -10107173 -7238135 -4220236 -1766200 -440827 -710752
6848 -710752 -1849621 -2475603 -2829251 -4759737 -8525284 -11418502 -10990178 -8222551 -5973003
6839 -5973003 -5396928 -5466033 -5109014 -4164525 -2694210 -817438 881983 1754063 1803955
6830 1803955 1560620 1607311 2397411 3724567 4302718 3156877 1646295 2386140 5509761
6821 5509761 7805381 6570142 2693197 -999005 -2567030 -1164234 3020272 7131787
6813 7131787 6442975 -340510 -8081711 -10359251 -6579211 -1385399 1726691 2913830
6805 2913830 2807013 719525 -3051275 -5958112 -5678046 -2389867 2022626 5623278 7000285
6796 7000285 5819115 3343465 1217611 -446086 -2535585 -4603297 -4753215 -2212683
6788 -2212683 1508131 4630109 7071647 9682138 12304483 13390799 11597279 7737556
6780 7737556 4818568 5135981 7153311 6742085 2296063 -2968551 -4974979 -3399194 -854240
6771 -854240 718255 833359 -608013 -2621766 -2756224 -163915 2097261 734432 -2887490
6762 -2887490 -4709333 -3865262 -2986326 -3283757 -3441017 -3407932 -4973948 -7757105 -8742781
6753 -8742781 -7205951 -6312742 -8030808 -9846345 -8622326 -4780286 -531610 3388958
6745 3388958 7051254 9743395 11181259 12310093 13186442 12228261 9155583 6150659 4276566
6736 4276566 1543176 -3110787 -6688268 -6006950 -2505091 -10196 486989 550257 292614
6727 292614 -1725009 -5181660 -7741477 -7979839 -6171954 -2682074 1958536 5836774 7079758
6718 7079758 6382323 5953763 6167688 5341801 2603360 -1081327 -4531563 -7023626 -7534890
6709 -7534890 -5346743 -1558073 1509908 2405352 1036110 -2097346 -5703949 -7717889
6701 -7717889 -7276451 -5792353 -4439055 -2078570 1999118 4949632 3360688 -1480110
6693 -1480110 -4890346 -5142649 -4938191 -6375511 -8195162 -8893819 -8995891 -8748291 -6785045
6684 -6785045 -3091265 -621914 -1619921 -4258290 -5233406 -4257513 -3733651 -4892013 -6381245
6675 -6381245 -6450621 -4933686 -2916089 -1342281 -206714 1039257 2333944 2824284 2440212
6666 2440212 2776025 5033479 7813867 8795867 8018843 7210516 6311713 3658282 -194441
6657 -194441 -2176355 -1225602 135091 229566 903031 3509868 5434641 3928220 1060038
6648 1060038 988978 3661536 5222082 4215733 3333973 4384378 5224840 3449253 465976
6639 465976 -387624 1622507 4131351 5173910 5304663 5938318 6906049 6650817 4565503
6630 4565503 2219137 1799784 3773344 6626504 8538999 8578729 6735609 4060804 2612139
6621 2612139 3627883 5444710 4987113 2107322 668406 3869846 9723262 12783020
6613 12783020 9774712 2381455 -4831471 -8168538 -7252921 -4919561 -4208941 -4839785 -3640652
6604 -3640652 903933 6141109 8505338 7684617 5917367 4693852 4214559 4817111 6570462
6595 6570462 8314774 9249301 10401098 12183237 11981625 7566219 1995531 975755 5040530
6586 5040530 8330200 6201947 423647 -4618903 -7204076 -7514315 -4903186 784599
6578 784599 6980567 10448264 10701163 9446559 7884475 6415225 5553523 5003107 3134159
6569 3134159 -457420 -3179018 -2546522 207657 2163493 3069249 4601616 6208655 5386875
6560 5386875 2188482 -140609 45086 444948 -1336172 -4126779 -5061814 -3234318 84673
6551 84673 3337984 5357181 5481461 4411562 3956670 4889722 6099567 6642046 7145647
6542 7145647 8107446 8436625 7282847 5961740 6184652 7276636 7021862 4706505 1573306
6533 1573306 -1389853 -4445557 -7943083 -11436594 -13932675 -14256688 -11848341 -8196962
6525 -8196962 -6422104 -7798193 -9572967 -8209352 -4136068 -1013880 -663376 -1292187 -851135
6516 -851135 551068 2174737 3878648 4679981 2645014 -2016395 -5779759 -5772760 -3465044
6507 -3465044 -2469744 -3917674 -5996164 -6982594 -6538482 -4730518 -2043059 -40451 139844
6498 139844 -118177 1609844 5077120 7203375 6128866 3556684 2272675 2999701 4773266
6489 4773266 6997639 9566136 11538362 11154294 7481788 1609807 -3932823 -7012809
6481 -7012809 -7442465 -6723930 -6124330 -5456968 -4200309 -2977122 -2720441 -2935245 -2434225
6472 -2434225 -1665326 -2427913 -4889403 -6732671 -6098328 -3766776 -1453762 409237 1825626
6463 1825626 1710895 -765813 -4033024 -5214472 -3280701 178213 3035264 4248742
6455 4248742 3800553 2439018 1357503 940913 143460 -1612669 -2518984 -330036 3872272
6446 3872272 6135590 4468306 1133694 -863056 -1498602 -2313782 -3073649 -2296577 -347750
6437 -347750 547259 -403299 -1349515 -658044 633604 423639 -1312292 -2304425 -782478
6428 -782478 2432378 4893929 5138635 3901473 2721836 1857231 326334 -2016581 -3668401
6419 -3668401 -3565317 -2921234 -3471390 -4553636 -4054034 -2295429 -2459080 -5938367 -9421523
6410 -9421523 -8657906 -3833179 1028418 3266367 3860966 4780359 6490334 8554123 10617335
6401 10617335 11947920 11623822 10038675 8813033 8393796 7147507 3808646 -438285
6393 -438285 -3379715 -4241526 -3867093 -3537812 -4416173 -6843004 -9255532 -9265618 -6873751
6384 -6873751 -4879885 -4703385 -3819464 498544 6680913 10775061 11425827 10010704 7207603
6375 7207603 3190945 453978 1859598 5297280 4754241 -1563584 -8079311 -9185811
6367 -9185811 -6311351 -4612686 -5473344 -6166826 -5339029 -4656705 -5118060 -5230987 -3779456
6358 -3779456 -2052307 -2116015 -4078060 -5914597 -5568118 -3047656 -625358 -436198 -1615993
6349 -1615993 -925556 3047758 7575957 8811730 5989192 1448270 -2144289 -3090632 -790444
6340 -790444 3152910 5137143 3494301 1404491 2909962 6419995 5773360 -1403638 -9755371
6331 -9755371 -12531873 -9374364 -5304912 -3625906 -2928139 -989700 1325368 1644774 65555
6322 65555 -668002 848568 2351779 906625 -2817508 -5168385 -4083905 -869462 2793447
6313 2793447 6977477 11459721 14096922 13391466 10862314 8662829 6565190 3795290
6305 3795290 2052648 3363886 6041319 6410707 4113549 2094336 1486577 470329 -1222459
6296 -1222459 -724873 3413161 8339194 10507660 9723982 7950019 6372633 5310403 5042591
6287 5042591 5214521 5033381 4860427 5557552 5807697 3068024 -1834929 -4477204 -2877537
6278 -2877537 -349124 -150831 -772600 580978 3044871 4099748 3806530 3387993 2069059
6269 2069059 -717556 -2282859 -306990 2352329 1369657 -1837359 -1888793 2136688 5601734
6260 5601734 5951981 5824720 7064127 6919351 2890456 -2763450 -6383555 -7638416 -7988570
6251 -7988570 -7115735 -4118953 -582265 613684 -1052806 -3302092 -3830135 -2293704 -173929
6242 -173929 523006 -807352 -2466846 -2631541 -2139827 -2965564 -4104631 -2270214 2415029
6233 2415029 4996832 2106309 -3087522 -4955625 -2231542 1800794 3919963 3040899
6225 3040899 -508295 -4721574 -6148925 -3318203 932443 3049857 3480224 4928656
6217 4928656 7202141 7532136 5693258 4894716 6809326 9012392 8711618 6488269 4827888
6208 4827888 4774013 5398754 5301746 3687617 1015567 -996237 -1291474 -1547183 -4508924
6199 -4508924 -9732636 -12914994 -10504661 -3519356 4086864 9306267 11348158 10734184
6191 10734184 8756071 6884846 5323644 2801755 -1145427 -4537668 -4849865 -2005352
6183 -2005352 1635329 3823277 4012487 2993807 2091308 2360082 3446501 3407102 683085
6174 683085 -3791438 -7331626 -8302364 -7342666 -5904245 -4683571 -3855694 -3863890 -5054517
6165 -5054517 -6735660 -7286365 -5438923 -1317997 3772668 8336707 11330791 12171074 10770777
6156 10770777 7918181 5212743 3988914 4200272 4605252 3946385 1746194 -1579249 -4678103
6147 -4678103 -5646274 -3579980 -35936 1969684 961862 -1606066 -3415377 -4018053 -4734319
6138 -4734319 -6250181 -7315272 -6088779 -2345913 1929929 4145581 3344070 893298
6130 893298 -1137050 -2101487 -2889570 -4088955 -4911799 -4381105 -2868822 -1629290 -1107651
6121 -1107651 -610699 311971 1110718 1357269 1809415 3254471 4541452 3306153 -582590
6112 -582590 -3649357 -2550548 1513008 4327164 4569599 5370210 8835931 12026352 11144778
6103 11144778 7589072 6027915 7362633 7840626 5475929 2983140 2709404 2679334 499054
6094 499054 -2021585 -1746620 504665 1462840 796070 847586 1571968 116213 -3979319
6085 -3979319 -7223429 -7256930 -5966301 -5505853 -4366443 -294328 5053956 7658671 6366507
6076 6366507 3710957 1977079 1140915 760170 1315768 2823205 3942830 3506771 1810648
6067 1810648 -278024 -2392074 -4146732 -4598687 -3189053 -681241 1530514 2632019
6059 2632019 2575530 1844852 1553447 2768048 4720971 4536452 222678 -6330206 -10805915
6050 -10805915 -10994335 -8497540 -5764996 -3228477 -352939 2075915 2541779 1066046
6042 1066046 -743609 -1703645 -1743193 -896245 667468 1550798 38683 -3174864 -4914847
6033 -4914847 -3338334 -394670 908896 446075 396781 1599964 2659791 2656720 2735718
6024 2735718 4288866 6859047 8653402 8439229 6463677 4062195 2633021 2500175 2684938
6015 2684938 2224563 1446382 1221470 1432018 1458480 1966607 4470835 8635581 11612295
6006 11612295 11091655 7953114 4895128 3365109 2980098 3230565 4235615 5729585 6411567
5997 6411567 4943351 1460812 -2152628 -3759940 -2963882 -1357825 -472262 -73988 726006
5988 726006 1574612 1819365 2890922 7249245 14337168 19968676 21074092 19072152 17038498
5979 17038498 15624579 13883551 12155422 11141171 9263919 4257826 -2832984 -8236256
5971 -8236256 -10187105 -10279217 -9807899 -7852685 -3947635 342765 4124168 8788344 14795877
5962 14795877 19088203 18467746 14247943 10780235 9959346 9753973 8072538 5632370 4417829
5953 4417829 5149530 7096095 9052606 9637895 7574831 2692452 -3499203 -8620119 -10876839
5944 -10876839 -10153101 -8267095 -7781101 -9530076 -11297367 -9972675 -5357917 -942513
5936 -942513 -347694 -3610488 -7508557 -8986675 -7577755 -4910331 -2928296 -2833071 -4812342
5927 -4812342 -7820749 -9766091 -8908701 -5629435 -2349409 -1181209 -1973029 -2990908 -2775041
5918 -2775041 -598363 3801291 9203635 12282297 10557606 6360531 5172019 8723369
5910 8723369 12324110 11207970 7208074 5882633 8448674 10597326 9307270 6791845
5902 6791845 6254074 6991387 6072920 2870964 -423137 -1706769 -597237 1905551 3840158
5893 3840158 3311036 652511 -1259718 -332454 2022645 3101528 2828164 3338789 5277054
5884 5277054 6992784 7538526 8061919 9427609 10411201 9491648 7187225 5425031 5316255
5875 5316255 6410955 7551896 7732276 6569257 4604168 3035356 2931034 4704494 7892858
5866 7892858 10905675 11675052 9708442 7001635 5518869 4400219 1768931 -1127496
5858 -1127496 -730723 3098966 5507513 2880813 -2144759 -4757833 -4735249 -5390557 -7221795
5849 -7221795 -7171926 -4360962 -2091056 -2533492 -3081017 -531289 3755282 5984983 5780445
5840 5780445 6720829 11115807 16659682 18977192 16190824 10365695 5068512 1911585
5832 1911585 -456320 -3796308 -7286060 -8461975 -7206567 -6686198 -9073509 -12200956
5824 -12200956 -12485297 -9833319 -7172883 -5921336 -4810441 -3241038 -2823996 -4504923
5816 -4504923 -6516898 -6822465 -5996418 -5953675 -6853757 -7061925 -5792483 -4194879 -3612745
5807 -3612745 -3866661 -3791429 -2952258 -2177020 -2232963 -2443948 -1442264 576550 1481546 -64195
5797 -64195 -2558389 -3741837 -3820710 -4640612 -6208596 -6558229 -5179170 -3870473 -3497335
5788 -3497335 -2717825 -1222001 -1331921 -4217905 -7028185 -6571556 -3947506 -2434108 -2232146
5779 -2232146 -727961 2831814 6351722 8170688 7984610 4838490 -1883621 -9043305
5771 -9043305 -11412997 -8179082 -4267386 -3572068 -4420395 -3907546 -3044230 -4245128 -6497606
5762 -6497606 -6913852 -5340450 -3701155 -2062901 832629 3946146 4769060 3573238 3118937
5753 3118937 4036557 4287207 3700590 4998968 8923224 12099084 11859237 9986116 9197678
5744 9197678 8798892 6879598 4560992 4460512 6110673 6341324 3879213 686523 -1173768
5735 -1173768 -1392688 -114943 2597199 5515253 6735472 6132370 5451001 5379888 4512918
5726 4512918 2090872 -132175 -83832 1918456 3871935 4340478 2877662 -454760 -4284110
5717 -4284110 -5537185 -2080377 3927762 6990626 3686296 -3335054 -7514373 -4621074
5709 -4621074 3349940 10360059 11947198 8419752 3020824 -1804864 -5657608 -8698638
5701 -8698638 -10448619 -10285885 -8292491 -5310080 -2477702 -484399 1143425 3407777
5693 3407777 5781560 5766654 1973686 -3107051 -5363752 -3744261 -610411 2198641 4845791
5684 4845791 6806399 6079770 2610616 -332665 -257396 1307005 1639323 612732 -586794
5675 -586794 -2069597 -3627026 -2729880 2165571 7790925 9442521 7265385 5284677 4995573
5666 4995573 4371722 2961662 2851806 3652002 1660075 -3838807 -7964561 -6805971 -2780015
5657 -2780015 -237844 796927 2636528 4517232 3750576 798419 -1112508 -856939 -169803
5648 -169803 134117 1174637 3169734 4785925 5628636 6469219 6636030 4179220 -488694
5639 -488694 -3786122 -3106539 140086 2666305 2781874 839744 -2045638 -4518446 -5429119
5630 -5429119 -4797890 -3613832 -2390522 -1040041 -252047 -1243580 -3499905 -4468248 -2597820
5621 -2597820 560939 2353940 2076502 960842 -17419 -1083598 -2690888 -4465628 -5256816
5612 -5256816 -4201609 -1961163 -521096 -1003497 -2058352 -1591281 168252 860802 -641889
5603 -641889 -2761892 -3688748 -3818493 -4731859 -6670292 -7919363 -6361654 -1565323 4039441
5594 4039441 6503186 4287975 669614 439113 4110812 7423410 6975220 4063727 2017213
5585 2017213 2006803 2980176 3761945 3381378 871133 -3262369 -6386685 -6296114 -3643907
5576 -3643907 -569318 1892628 3564823 3742611 2148300 321007 -98103 129821 -911055
5567 -911055 -3056934 -4289546 -4056782 -4116357 -5577203 -6909907 -5830225 -2236339 1385765
5558 1385765 2197463 -273486 -3337130 -3613958 -785674 1967162 1874495 -351824 -2364153
5549 -2364153 -3497247 -4442553 -4915024 -4000110 -2241207 -1201374 -1248209 -1651323 -2376368
5540 -2376368 -3749557 -4861125 -4548601 -3575396 -3525041 -3998449 -3538311 -2909965 -4286809
5531 -4286809 -7117141 -8239009 -6709768 -5035397 -4585066 -3466141 -680782 1212167
5523 1212167 111112 -1999372 -2287377 -1325900 -1099817 -1283411 -1035543 -2255036 -6692741
5514 -6692741 -11136009 -10215838 -3911032 2138560 4332262 4868263 6562460 8018463 6380380
5505 6380380 1892602 -2977199 -6856742 -9403464 -9685039 -7289221 -3903281 -1336488
5497 -1336488 1112097 4902885 8751669 9753702 7827429 6133142 6564435 7467096 6723862
5488 6723862 4534763 1741509 -2109146 -6862598 -9962472 -9407215 -7250437 -6997783 -8110952
5479 -8110952 -6692566 -2046670 1246257 -367051 -4155610 -4908669 -1855691 1368926
5471 1368926 2384768 2297059 2609447 3111932 3238754 2787356 709387 -4088585 -9749150
5462 -9749150 -11930770 -8859523 -3727416 -323987 1577318 4203577 7015648 7042275 3358443
5453 3358443 -1552501 -4949081 -6041275 -4932071 -1798318 2005240 3972158 2943652
5445 2943652 626786 -274651 1297525 4484386 7825624 10005362 10100927 8140960 5209328
5436 5209328 2448824 248162 -1263149 -1526576 -63209 2568610 4874274 5458458 3860116
5427 3860116 772592 -2333836 -4345710 -5651802 -7602178 -10372113 -12150815 -11379104
5419 -11379104 -9109169 -7668737 -7193736 -5395486 -1437057 1871637 1489167 -1396606
5411 -1396606 -2602735 -416225 2547534 3478795 2948450 2853983 2848325 1326489 -997268
5402 -997268 -1313236 1251904 4100519 4420157 2292918 -248723 -1857824 -2705977 -3797153
5393 -3797153 -6087079 -9140006 -10263472 -6695973 396152 5817178 5621051 1045509
5385 1045509 -4187183 -8584211 -12577010 -15137176 -14215984 -10546183 -7777730 -7763071 -8129940
5376 -8129940 -5996087 -2291377 -580115 -2432422 -5497536 -6088080 -2967663 1339692
5368 1339692 2854108 103857 -4342612 -6890799 -6940650 -6648135 -7198751 -7469742 -6733906
5359 -6733906 -6359010 -7556454 -9233932 -9615223 -8635339 -7289691 -5980524 -5109423 -5853341
5350 -5853341 -8247218 -9659536 -7679995 -3886599 -2141666 -3383742 -4802876 -4339877
5342 -4339877 -3166130 -2927958 -3255651 -3402049 -4053544 -5770370 -7423935 -7921163 -7904654
5333 -7904654 -8040282 -7309635 -5084083 -3294564 -3932309 -5555327 -5181358 -2891328 -1309748
5324 -1309748 -762509 1345172 5557887 8450118 7589489 5432799 5613640 7441883 7196346
5315 7196346 3922817 941435 1407431 4468590 6326005 3895265 -2688121 -10149935
5307 -10149935 -14632249 -14969944 -13293595 -12005402 -11160931 -9782893 -8393430 -8276493 -8897277
5298 -8897277 -8236349 -5703690 -2860972 -1029234 166080 1528138 3027655 4214132
5290 4214132 4729451 4220760 2833676 1740876 1956300 2799530 2897963 2343039 2121974
5281 2121974 1798339 -7764 -2858288 -4615970 -4537672 -3761908 -2522269 27251 2517304
5272 2517304 1542605 -3114202 -6941413 -6945048 -6192642 -8710521 -12627389 -12831141 -8904519
5263 -8904519 -5675531 -6093919 -7889265 -7911565 -5946911 -2987836 1025139 5964581 10275480
5254 10275480 12514548 12574876 10660973 7010114 3282781 1798183 2232225 1498699 -1534999
5245 -1534999 -3651166 -1814330 1943510 3040307 613387 -1712939 -1103618 1155244
5237 1155244 2176660 1312895 506603 1868992 5510367 9157183 9870016 6845356 2288155
5228 2288155 -1249994 -3578691 -5401205 -5184208 -573216 6674546 10674273 8450773
5220 8450773 4241707 3723275 6055121 5790335 1712477 -1253072 194917 2976781 3166164
5211 3166164 2083523 3019977 4933041 4080228 286151 -3116807 -4818360 -6313924 -7321049
5202 -7321049 -5306738 -430726 3533142 4500971 4169774 3707682 2159973 838623 3669380
5193 3669380 9888244 11948982 5667146 -2197498 -2580495 3229839 6523028 4397855
5185 4397855 2253011 3529972 4859793 3059841 194413 -1095216 -1834053 -3227962
5177 -3227962 -3560864 -1869004 -886953 -2973727 -6170058 -7370164 -6666972 -5716302 -4560307
5168 -4560307 -3088460 -3034878 -5260646 -7345794 -7235981 -7089863 -9676313 -12705624 -11226867
5159 -11226867 -5188978 -378429 -1141011 -5428940 -8177416 -7178893 -4330410 -2625373
5151 -2625373 -3167885 -4668722 -5365495 -5263471 -5714781 -6605012 -5666573 -1856961 2197592
5142 2197592 3168199 1391753 58449 699993 1922461 2551063 3544923 5929522 8571090
5133 8571090 9304449 7625498 5304877 4230508 3976842 2075964 -2757758 -8208234 -10486750
5124 -10486750 -8778368 -5859172 -4136615 -3406050 -3360613 -5456790 -10018512 -13644937 -12578621
5115 -12578621 -7799195 -4101276 -4443514 -7387908 -9830104 -10231157 -9304894 -9203707 -11684298
5106 -11684298 -15568374 -16887158 -13576234 -9144587 -8989651 -13331265 -16666702 -14680185
5098 -14680185 -9074875 -4607198 -3562655 -4532128 -5050529 -3908525 -1621910 229866
5090 229866 336095 -1205940 -3189473 -4523036 -4704906 -3613780 -1774069 -464045 -540168
5081 -540168 -1450408 -2300871 -3257925 -4688363 -5698614 -5305550 -4668126 -6149569 -9952869
5072 -9952869 -13357798 -13684712 -10721168 -6063303 -1504005 1541326 2316372 1141405 -979474
5063 -979474 -3254886 -5215562 -6548673 -7698900 -9820970 -12822730 -14279472 -12061779
5055 -12061779 -7512601 -4089163 -3154731 -3098909 -2419322 -1466893 -1005302 -1235280 -2626665
5046 -2626665 -5577489 -8679777 -9486614 -7957831 -7254836 -9923396 -14754683 -18543212 -19685163
5037 -19685163 -18934951 -17658160 -16479924 -15114294 -12872978 -9742015 -6932264 -5532099
5029 -5532099 -4987498 -4440642 -5238841 -9657743 -16502074 -20580115 -18310246 -12046087 -6839029
5020 -6839029 -4294090 -2029558 1508918 4525500 4782924 2874249 1127225 363742 -594214
5011 -594214 -2484486 -4382566 -5492774 -6677402 -8791310 -10421486 -9314754 -5951757
5003 -5951757 -3501029 -3636304 -4618760 -4713654 -5229314 -8040224 -11800974 -13349230 -12111893
4994 -12111893 -10505445 -10134512 -9971964 -8621772 -6497706 -5247984 -6185098 -9217469 -12159192
4985 -12159192 -11640030 -6480129 4705 2845749 690255 -3217773 -5193447 -4564392
4977 -4564392 -2908653 -1683947 -1383762 -1967076 -3257781 -4933060 -6095255 -5256863 -2038366
4968 -2038366 942895 -160190 -5705913 -11431908 -13320780 -11634519 -8654633 -4947763
4960 -4947763 -335817 3613161 5121094 4840574 4356910 3552739 1918140 573093 241254
4951 241254 -689951 -3158745 -5011699 -4992234 -6082439 -10359951 -13517040 -10247681 -2951127
4942 -2951127 1204417 459812 -852985 -798423 -1766666 -3804634 -3353475 -29599 1842065
4933 1842065 179066 -2265450 -3799989 -6379110 -10485680 -13082727 -12656474 -11227796
4925 -11227796 -9985921 -8220047 -7437909 -10332577 -14431177 -13505856 -7180880 -2487204
4917 -2487204 -3810840 -7951562 -11023690 -12938515 -12891536 -8534800 -2779424 -3217547 -10844886
4908 -10844886 -17234537 -16990574 -14882504 -16110230 -17995742 -16879289 -15237880 -15968453
4900 -15968453 -16947713 -16808422 -18610250 -22611240 -23658332 -21039006 -21894751 -29307471 -36829426
4891 -36829426 -40453508 -44606172 -49952598 -48763849 -40740914 -38621739 -47433765 -53846749
4883 -53846749 -48855369 -43990783 -49454296 -54882640 -51615995 -54092986 -73838202 -93147918
4875 -93147918 -97681003 -113555189 -164077119 -201502966 -143710010 9095734 150832578
4868 150832578 190334250 150381890 113100890 108916271 107273423 89628092 74684382
4861 74684382 74926683 75293108 63902912 50734284 45703959 43330293 38293548 35731341
4853 35731341 37727078 36657269 29384873 23616216 24127300 25704457 24646165 24724091 27150407
4844 27150407 26655371 22107676 19786087 21846304 22410456 19145298 17779019 20711945
4836 20711945 22013644 18891575 17698825 22500851 27192692 25747600 22062497 22504190
4828 22504190 25487657 25569994 22631994 20446050 20033686 19955835 20233178 21759849 24222124
4819 24222124 27126613 30143210 31306599 28737152 24736332 23355515 23630844 21177827
4811 21177827 16767815 15864552 18333119 16977051 9190397 1767298 60823 424085
4803 424085 -1326723 -1590755 4058133 11601496 13666597 9901745 5734060 3956519 3484914
4794 3484914 3828955 5258668 6393859 6039749 5474825 5542874 4482472 2209402 2992823
4785 2992823 9283034 16279446 17851842 15240922 14570634 17665836 20608310 20289212 17617079
4776 17617079 14725086 12931156 13069678 14654550 15296538 13523802 11137289 10534915 11322376
4767 11322376 11815715 11815565 11468150 9794666 7035382 5796340 6894120 6965520 3628159
4758 3628159 -68198 -434531 625954 -902372 -3902172 -3951814 -872328 1386660 1837667
4749 1837667 3577070 7284383 9109083 6830860 3785625 4285432 8061513 11414539
4741 11414539 11946109 10388649 8840065 8344154 7913319 5960654 2946968 1471106 2858135
4732 2858135 5265887 6590892 7337406 8612870 9404585 8677656 8348204 10657340 13690864
4723 13690864 13220164 8693586 4041844 2484022 3556461 5481820 7590862 9783981
4715 9783981 11852304 13887371 15730770 16069778 13769046 9838213 6449173 4530083
4707 4530083 3890277 4631617 6365576 7203470 6021361 4715733 5537790 7203549 6692360
4698 6692360 4105804 2375335 2550047 2903013 2787850 3819200 6470143 8561696 8220321
4689 8220321 6050304 3654813 2025793 1742205 2740225 3783540 4124473 5226059 8340905
4680 8340905 11081441 9785491 5139315 1676024 1253453 1017726 -1080395 -2922435 -2476953
4671 -2476953 -1656282 -2826660 -4152039 -1955105 3564822 8048398 8075281 4411606 346519
4662 346519 -1590222 -1254396 -348586 -456488 -1383962 -1731698 -868951 681591 2742733
4653 2742733 5944591 10309321 14537503 17083685 17140667 14822159 11577289 9886501 10745698
4644 10745698 11829910 10267121 6923653 5372253 6645871 8023867 7545694 6545118
4636 6545118 6568352 6907943 6909349 7805649 9981739 10877759 8307442 4123275 1945420
4627 1945420 2477987 3500219 3524747 3102612 3056917 3426276 3843430 3573716 1854297 -624485
4617 -624485 -1769632 -1067854 -1051705 -3852330 -7724940 -9440797 -8952606 -8766622 -9348821
4608 -9348821 -8423234 -4996435 -974383 1972771 4314070 6254123 6119462 3064311 -597341
4599 -597341 -2015139 -1572272 -1889238 -3789277 -5413442 -5171290 -3526824 -1497507 822435
4590 822435 3387822 5213450 5462706 4821814 4704574 5449688 6205608 6278183 5599894 4035643
4580 4035643 1398338 -1567706 -3209404 -2564694 -441986 1430569 1897560 969682 -310825
4571 -310825 -404498 1459449 4217698 5991432 6352232 6425485 6503909 5306299 2565506
4562 2565506 560058 1360610 3839788 5304420 5055741 4308970 3621975 2979675 3809572
4553 3809572 7797436 13309926 15873887 13360667 8544238 5382307 4686380 4692435 4103358
4544 4103358 3030782 2219570 2673134 4928649 7645834 8266088 6234405 4028121 3519485
4535 3519485 3023661 152240 -3742113 -4848941 -2257296 837827 1717351 1312545 1727766
4526 1727766 2884689 3424116 3373696 3766242 4401219 4173545 3416955 3694077 4874069
4517 4874069 4700792 2472377 1103597 3420380 7724291 9684397 8173713 6368922
4509 6368922 6712426 7772948 7500624 6958820 8423536 11373588 12959968 11761602 8853426
4500 8853426 5585749 2458945 83734 -813325 -645551 -578699 -603263 443730 2452860
4491 2452860 3042111 -69079 -6123380 -11202272 -11177018 -5423528 2084760 6381819 6768273
4482 6768273 7052809 9685719 11885817 9808463 4571509 762452 -31732 -383468 -1800572
4473 -1800572 -2364492 -752425 797365 -458654 -3971346 -6897766 -7259774 -4879100 -885196
4464 -885196 2484280 3194286 1695142 522665 904803 1533987 1412318 1611110 2901082
4455 2901082 3912397 3481633 2881611 3588519 4425512 3356556 1140962 747961 3366441
4446 3366441 6962363 8924794 8685491 7413553 6098614 4496962 1975039 -696870
4438 -696870 -1189906 1654166 5498011 6712895 4821481 2642579 1865381 1201406 -148538
4429 -148538 -273692 1976635 3752974 1625037 -2852141 -4236326 -152103 5286812 6154397
4420 6154397 1666393 -2775811 -1630488 4328445 8619543 6433783 -45374 -5059738
4412 -5059738 -6387072 -6281721 -6299522 -5132388 -2220769 271728 776720 535914 691392
4403 691392 140525 -1542585 -1907495 946131 5019416 7143952 6961870 5556266 2432833
4394 2432833 -2779760 -7346309 -7821183 -4676311 -1512251 -370362 -601102 -1485884 -2857253
4385 -2857253 -3518573 -2019743 944386 3234679 4135769 4369985 3809666 1668185 -1303098
4376 -1303098 -3244359 -3827306 -4441045 -5811704 -7141496 -7290085 -5359328 -998911 4204793
4367 4204793 6935919 5836108 3612625 3165428 3396816 1975965 475180 2444482 7050659
4358 7050659 9247439 6860150 3487705 3192580 5637517 7803053 7704878 5114297 1041553
4349 1041553 -2254282 -2767385 -1181723 -34461 -105097 242326 1940361 4015374 5904880
4340 5904880 8134903 9819011 8315799 2897423 -3339875 -6635380 -6093853 -3297952
4332 -3297952 -206194 1777880 2353821 2617136 3381861 3357538 1148363 -1285773 -403776
4323 -403776 3222318 4609261 1263600 -2911535 -2858774 1070524 4298001 3830611 396542
4314 396542 -3780108 -6755482 -7052324 -4300814 27611 3453127 4131062 1812487 -1818071
4305 -1818071 -3806622 -2519849 102176 514098 -1905570 -4228815 -4381922 -3914923 -5243590
4296 -5243590 -8068466 -9964852 -9199288 -5922140 -1839284 577378 55927 -1564967 -913916
4287 -913916 2818873 6990727 9083762 9070803 7660404 4758945 982927 -1540183 -1482864
4278 -1482864 215453 2259369 4441281 6200953 6180287 4730340 4486587 6571820 8435120
4269 8435120 7603554 5534173 5274016 6998360 8558937 9186131 9794171 10253220 9136188
4260 9136188 6369250 4096634 4361869 6951259 9646288 10047601 7562674 4129610 2373661
4251 2373661 2707858 3217650 2668419 2150858 3153636 5598028 8580157 11416119 13044874
4242 13044874 12227393 9636983 8116296 9416281 12051567 13646542 13879466 13686966 13104302
4233 13104302 11653788 9752099 8066157 6265388 3739892 819742 -1736818 -3643201
4225 -3643201 -4708471 -4572908 -3440287 -1936441 98754 3109405 5835735 5972889 3510514
4216 3510514 1107542 145402 -1093062 -3812455 -5718328 -3818013 1414326 6700910
4208 6700910 9726507 10701695 11036289 11565223 11507425 9089139 4322355 500966 676705
4199 676705 3252817 4171429 3066688 3312644 5900378 7951070 8185690 8833675 10455866
4190 10455866 10118773 7236966 6090949 9268014 13357739 14725571 14805426 15596495 14745611
4181 14745611 10180740 5459508 4850281 6356420 5302025 2179063 1259431 3437299
4173 3437299 5811470 6768960 6621520 4796680 994235 -2410822 -3248890 -2978423 -3482771
4164 -3482771 -3067925 257490 4403378 6377556 6746128 6767640 4975745 1231897 -378439
4155 -378439 2007612 3721607 1520593 -47204 2958940 6003956 5073038 5881924 13371957
4146 13371957 19930875 17476880 13565641 19281979 29217805 35032461 52250882 103055073
4138 103055073 168785710 192523727 145836401 68110116 18801315 10509551 12938490
4131 12938490 5982208 -2139387 -3133505 -3808142 -8332213 -8775946 -1471570 4344141 2247312
4122 2247312 -845072 2232185 6878264 6020929 2040504 1031078 2212926 1067776
4114 1067776 -1937388 -2891993 -1397195 -123432 247162 911987 1507520 566365 -1709318
4105 -1709318 -3745672 -4682243 -4587582 -3792121 -2898599 -2111219 -372409 3126037 6952268
4096 6952268 9139502 10085211 11015776 10736834 7550728 3374877 1595579 1546816 84287
4087 84287 -1781497 216109 5390953 7221099 2923836 -2035603 -2341845 -356849 -774999
4078 -774999 -2151023 495816 6833209 10661431 8235354 2942791 609102 2736364
4070 2736364 5741320 5667310 2366417 -1173462 -3022634 -4447567 -7073166 -9524038 -9127295
4061 -9127295 -6155024 -3637366 -2975783 -2421204 -383229 2180465 3466377 3027368 1683033
4052 1683033 726460 1252362 2765400 3051991 1361284 575115 3370884 7346170 7771804
4043 7771804 4676194 2816945 4385385 6416189 6530068 6579345 8560863 11004592 11918077
4034 11918077 11889876 11768529 10317234 6648266 2275665 -1396819 -4779988 -7309185 -6373605
4025 -6373605 -1692417 2555043 3140090 2338184 3712104 6318564 7066854 6209608 5926776
4016 5926776 5450256 2620365 -837486 -796133 2675629 5185992 5023155 5360072 8012088
4007 8012088 9757842 7743448 4860339 5888104 10295427 12804616 10608989 6599785
3999 6599785 4837229 5584920 6298714 5612573 4201278 2484971 -190215 -3735245 -6587434
3990 -6587434 -7693849 -7644359 -6655468 -3128566 3729721 10975026 14123849 11953816 6913155
3981 6913155 1289429 -4137296 -7688525 -6752935 -1809770 2251570 1074127 -4371360
3973 -4371360 -9423766 -10666446 -7959446 -3308961 632541 2282193 2792246 4764505
3965 4764505 8275523 10054275 8117542 5175846 5173172 7919447 9599695 7687195 3085321
3956 3085321 -1927147 -5664477 -7261467 -6865616 -5645944 -4490130 -3206297 -1969043
3948 -1969043 -2289386 -4857283 -7511972 -7450726 -4848151 -2320355 -1298004 -929788 -269830
3939 -269830 459570 796627 557784 -517580 -2134798 -2737019 -1157434 1170444 1486278
3930 1486278 -690251 -2924361 -3067580 -1471055 345696 1642119 2440012 2870180 3335847
3921 3335847 4492489 6448217 8500123 9858018 9982071 8153873 3635881 -3286260
3913 -3286260 -10868834 -16763112 -19199062 -17804966 -14002498 -10332793 -8452791 -7681572
3905 -7681572 -6149738 -3323269 -630109 489427 344523 360559 1113223 1592155 604699
3896 604699 -1381237 -2383384 -1151952 1295370 2925059 2854024 1479363 -677483 -2808153
3887 -2808153 -3271856 -1365967 627643 -267217 -3112796 -3628318 -309389 3114095 3144993
3878 3144993 1443615 1506463 2905316 2541379 262114 -874086 71262 53189 -3376779
3869 -3376779 -8397343 -11423145 -11520889 -10696858 -10662501 -10718993 -8869802 -4416699 884043
3860 884043 4444805 5446208 5159333 4754214 4037006 2786976 1866557 2008987 2728712
3851 2728712 3440191 4293159 4714625 2773747 -2105658 -7011509 -8290693 -5846875 -2876233
3842 -2876233 -1858836 -2569206 -3617255 -4167790 -4166859 -4133752 -4668612 -5540607 -5964870 -6274751
3832 -6274751 -7920035 -11014799 -13669332 -14770684 -15168082 -14731146 -11183985 -4303754 1631203
3823 1631203 2948131 1724879 2110098 3800841 3603833 1578068 460890 120485 -1853808
3814 -1853808 -4378438 -3527074 419476 2252895 -400091 -3859726 -4765385 -4527899 -5020029
3805 -5020029 -4747731 -2444909 -224233 230502 848616 3107579 4357180 2024704 -1581738
3796 -1581738 -2622863 -1226809 283698 2072318 5324340 8223542 8151463 6596455 7183215
3787 7183215 9538281 9753848 6859707 4351501 4648199 5982804 5852194 4195804 2015676
3778 2015676 -130357 -1032790 902772 4714000 6623300 4523817 912672 -345074
3770 -345074 1311166 3381715 4001430 3481550 2665655 1519208 -266903 -2192365 -3094591
3761 -3094591 -2405170 -1090501 -939000 -2583176 -4573559 -4910254 -3132841 -269575 2799344
3752 2799344 5862182 8395355 9267359 7854665 4741382 983503 -2658920 -5397339
3744 -5397339 -6158967 -4697052 -2791385 -3050269 -5701719 -7488053 -5324041 -790546 1209879
3735 1209879 -1004434 -3241341 -1404756 2131861 1623807 -3620492 -8047360 -7404382 -3480559
3726 -3480559 -113299 1669683 2417679 1658147 -473863 -1551141 34310 2104277 1836531
3717 1836531 307754 837031 4016520 7436187 9411321 9970716 8899904 5975447 2952477
3708 2952477 2500360 5010531 8424766 10632448 10053627 5371042 -2119947 -7097525 -5161725
3699 -5161725 1147691 5300955 5605627 6473183 10296253 13341721 12002286 8467304 6779940
3690 6779940 6919315 6710011 6721521 8738887 11071076 10099470 6100194 3238529 3295070
3681 3295070 3275646 604867 -2582434 -2555086 754955 4099386 5473893 5971231 7238337
3672 7238337 9137832 10563591 11075467 10573869 8264468 3584063 -1755642 -4156241 -1599578
3663 -1599578 3822511 7700837 7431770 4046379 376068 -1814686 -3000713 -4790186
3655 -4790186 -7583554 -9241745 -6891944 -574383 5978798 9226389 9459497 9241150 9407140
3646 9407140 8803835 7397604 6968122 8296247 9907478 10332881 9657895 8029299 4657425
3637 4657425 -382170 -4930420 -6788545 -5986708 -4020297 -1960360 -267474 787190
3629 787190 1592288 2831109 3602113 1484996 -3984722 -9420529 -11187786 -9767224 -8291131
3620 -8291131 -7674183 -5992471 -2537232 454295 928163 -490445 -2289377 -4344307 -6872913
3611 -6872913 -8706901 -8496244 -6757694 -5011700 -3532575 -1714700 -165473 -264399 -1512992
3602 -1512992 -1615691 -89453 338421 -2421888 -6278819 -7542370 -5997187 -4668263 -4809538
3593 -4809538 -4170293 -1012749 2962158 5213295 5438691 4088580 199747 -6260590 -11459077
3584 -11459077 -10859126 -5192755 62059 1653875 1881737 3964270 7243928 9062434
3576 9062434 9020342 8662660 8219731 6445187 3510885 1784599 3084037 6314993 8274539
3567 8274539 6263873 110922 -7535443 -12929611 -14003232 -11609598 -7831817 -3632682
3559 -3632682 1063888 5590930 8430482 9284413 9894722 11625224 12897078 10618527 4456289
3550 4456289 -1758922 -3993288 -2485937 -822361 -1109006 -2060922 -1994058 -1402770 -1520953
3541 -1520953 -2340954 -3535724 -5435426 -7162005 -5716723 266744 7067363 9254605
3533 9254605 5966342 950684 -2923017 -5585792 -6394300 -3240152 3465099 9412119
3525 9412119 11033988 9046596 5933561 2695612 -234635 -1788248 -2184280 -3486329
3517 -3486329 -6001003 -6721946 -3827612 -6865 1679892 2574683 5344383 8373781 7685514
3508 7685514 3321151 -505594 -1188022 170105 1923046 3132681 1952793 -2804681
3500 -2804681 -8076821 -8905582 -5336092 -2678354 -3552252 -4231797 -1265865 2624457 2884712
3491 2884712 111898 -1474400 -520901 675821 817195 979766 1420825 633870 -1604050
3482 -1604050 -3044933 -2048602 52649 789968 -590217 -3017089 -5219464 -6552047 -6968264
3473 -6968264 -6943727 -6960231 -6630057 -4892893 -1466730 2548392 5966590 8626323 10451616
3464 10451616 10316204 7472826 3979311 3631276 7361978 11313719 11374716 8589461 7533786
3455 7533786 9656964 11400459 9774878 6553496 4857301 4426014 3343988 2240611
3447 2240611 2839693 3596197 1263756 -3274289 -5261834 -3079646 -693389 -1370630 -3057984
3438 -3057984 -2653252 -1184347 -1114821 -1302440 1057671 5001780 6571308 4515453 1468775
3429 1468775 -438468 -1487770 -1530687 1051192 6109952 10253132 10364147 6804708 1909453
3420 1909453 -2822751 -6670564 -8619618 -8235658 -6767390 -6006271 -6550520 -7839695 -8900431
3411 -8900431 -8399703 -5352445 -859135 2184949 2423973 1800928 2421706 3042305 1064662
3402 1064662 -2658779 -3885479 -395252 4984472 7907687 7325958 5378472 3859278
3394 3859278 2774283 2056843 2809840 6038613 10890064 14866589 15777300 13376125 9245267
3385 9245267 5259050 2266192 233117 -800115 -589128 537745 1649566 2394304 3526773
3376 3526773 5687254 8281830 10298346 11629442 12633955 12895426 11650664 9233371
3368 9233371 6797444 4693576 2594324 1292057 2437465 5659751 7739437 6149714
3360 6149714 2253866 -551600 -952584 -370991 -306888 -917289 -1873876 -2755432 -2648178
3351 -2648178 -1115458 422011 91337 -1562587 -2165042 -1294730 -1264630 -3141059 -4490462
3342 -4490462 -3013240 -413845 -22684 -1667941 -1761576 1625891 6263603 8784694 8263765
3333 8263765 6244222 4965846 6164801 9729347 12473100 10132536 2463747 -4906523
3325 -4906523 -6066335 -1852436 1126217 -1193658 -5575975 -6488350 -3611322 -1596843
3317 -1596843 -3280477 -6453064 -8011377 -8201998 -8661760 -8483485 -5399601 -207262 3170377
3308 3170377 2658301 544620 -130405 417032 56071 -1425038 -2101160 -1142553 -279753
3299 -279753 -1578078 -4882512 -7961221 -8577584 -6189991 -2151215 1460945 3480978 4386972
3290 4386972 5450577 7205709 8690687 8086171 4434686 -761235 -4053255 -3255517 -176585
3281 -176585 1128990 -762905 -2905830 -1959623 1458826 3827191 3206256 959403 -712184
3272 -712184 -1274020 -1551211 -2087493 -2489970 -2098129 -1057635 -599910 -1754116 -3719937
3263 -3719937 -4472735 -3380696 -1992433 -1478786 -841316 910932 2351121 1633419 -144082
3254 -144082 -327320 885934 406986 -2956283 -6626430 -8333170 -9310963 -11409178 -13104484
3245 -13104484 -11089096 -5002175 1785108 5942075 6823224 5297487 1941526 -2520609
3237 -2520609 -6009962 -5850292 -1335628 4763004 8057976 6595636 2859878 1038082
3229 1038082 2445208 4603924 4781390 3005265 1034239 -191315 -770167 -369440 1848923
3220 1848923 5676482 9205630 10245767 8319178 5212607 3404833 3664915 4433139 4024003
3211 4024003 2884783 2626875 3336516 3562534 2945346 2818929 3698317 4328979 4210297
3202 4210297 4808019 6714602 7860776 6820389 5923176 8062965 11706696 12605850 10120054
3193 10120054 8212480 9536927 11863734 11812665 9410537 7041042 5979320 6154737 7824734
3184 7824734 10993684 13797339 13799640 11100849 8445059 7743560 7795865 6240207 2867134
3175 2867134 -160652 -1242859 -1312726 -2185821 -3726101 -3998523 -2182918 175870 1310853
3166 1310853 1078836 -150458 -2573164 -5338826 -5765721 -2681507 890438 1474311 492213
3157 492213 2050263 5906572 7472207 5639001 5245255 9032328 12083622 8793453 1817542
3148 1817542 -1447343 634537 2823185 1988617 1358053 4387486 9237311 11901089 11535800
3139 11535800 10163609 9466440 10116142 12306008 14783671 14899320 11543691 6762066 2938711
3130 2938711 3467 -2817041 -4288762 -2728704 806797 3450655 4176169 4316354 4830727
3121 4830727 5322424 5709008 6630508 7820803 7974575 6750707 5288759 4296892 3310842
3112 3310842 2463464 3208467 6108590 9205944 9970329 8199408 5956724 5194561 6299691
3103 6299691 8404307 10189613 10726239 10251347 9752198 9229178 7084638 2228140 -3647063
3094 -3647063 -7006667 -5734206 -894487 4371335 7043494 6064062 3298377 2280526
3086 2280526 4526995 7288677 6638380 2719179 -248537 376841 2615901 3837998 4989050
3077 4989050 8092029 11583514 12052217 10062801 10133495 14103842 18253720 18790947 16963227
3068 16963227 16099294 16095076 14143126 9528268 4413683 525859 -1847967 -1880094 1443544
3059 1443544 6413261 9043095 7769874 5537551 5833345 8430765 10514781 10546944 9317271
3050 9317271 7973255 6550360 4395948 1360433 -1395575 -1948719 275000 3202624
3042 3202624 4195766 3235753 2378197 2221433 1289941 -711027 -1878616 -1555718 -1906913
3033 -1906913 -4017559 -5072530 -2317579 2149266 3954632 2684256 2000883 3851220
3025 3851220 5967093 5614327 2976946 27374 -1642015 -1184952 1002280 2316896 -234217
3016 -234217 -5983683 -10249319 -9467355 -5199792 -1600656 -232859 795442 3203587 5888315
3007 5888315 6265740 3412291 -645364 -2869584 -2459111 -1730080 -3247029 -6591143 -8938614
2998 -8938614 -8472805 -5990960 -3311290 -1489287 -673973 -318022 729187 3082544 5598649
2989 5598649 6547994 5978439 5279549 4320927 1171346 -4519699 -9815917 -11492802 -9389812
2980 -9389812 -5612010 -1708399 1973156 5120322 7187236 8018816 7868584 7043024 5885098
2971 5885098 4576752 2856316 773948 -382209 703455 3146251 4504178 3953296
2963 3953296 3010209 2717927 2335215 1617715 1968679 3959254 5972709 6917343 7992882
2954 7992882 9792224 9956226 6282367 312638 -4856609 -8582078 -11532587 -12393048 -9699272
2945 -9699272 -6120442 -6542363 -11345552 -15258354 -13935097 -8541596 -2587278 2712329
2937 2712329 7850472 12057512 13495320 11784311 8747859 6785754 7039089 8607138
2929 8607138 9283400 7723641 4885846 2557081 993428 -480953 -1056835 982401 4856260
2920 4856260 6827662 4373371 -835866 -5288947 -7509081 -8320937 -8551475 -8067550 -6556481
2911 -6556481 -4081423 -1111497 1404451 2542262 2510027 2543796 3064084 2623450 -519767
2902 -519767 -6136586 -11882608 -15153582 -14842344 -11747969 -7698180 -4148339 -1525946 130026
2893 130026 528953 -286919 -1271103 -1129705 557528 3453753 6774953 8672528 6833131
2884 6833131 1606846 -2573109 -1425937 3885022 8099330 8259508 6187808 4684685
2876 4684685 4320799 4597610 5253616 5217062 2922416 -963823 -3584011 -4027017 -4867852
2867 -4867852 -7882978 -10759383 -10235331 -6394458 -1626781 2656351 5865483 6749659 4930625
2858 4930625 2547866 1615614 939680 -1493278 -4179724 -3535464 604891 4190501 4218894
2849 4218894 2244821 1826212 4392448 8444056 11457687 11938232 10465589 8980515 8630611
2840 8630611 8899314 9338790 10624802 12550385 12824263 10251474 7633985 8444206 11515172
2831 11515172 12517052 10433740 8772562 9790567 11368555 11119019 10136123 10407576 11317800
2822 11317800 11435758 11584906 12988056 13732698 10576967 4209591 -322539 619197 5077869
2813 5077869 8175004 7499866 4482837 1401238 -1008018 -2650225 -2612982 -400408 1819589
2804 1819589 407266 -5244246 -10889736 -11773491 -7977260 -3694041 -1770630 -1177909 55326
2795 55326 1862552 3191738 4209672 5864379 8125110 9888761 10103229 8199506 4176059
2786 4176059 -804692 -4562731 -5709811 -5007615 -4162575 -3734577 -3152490 -2402607 -2471602
2777 -2471602 -3896465 -5770533 -6683368 -6199613 -4960569 -3526086 -1531981 1940646 7318130
2768 7318130 13759733 19092819 20636999 17001701 9778305 2809336 -1387344 -4214920
2760 -4214920 -8715702 -14872992 -19083949 -18774912 -15413632 -11747627 -8172181 -3829418
2752 -3829418 441537 2939716 3965434 5192613 6697693 7266984 7360620 8831375 11379076
2743 11379076 12082718 9229471 4247174 -754638 -4782684 -6609622 -4710632 -125369
2735 -125369 3337224 3665660 2916010 2878498 1405385 -3644957 -9081796 -9359030 -4185672
2726 -4185672 1012930 2524433 2295252 3305346 4773479 4456992 3037473 2945772 4033288
2717 4033288 3650206 1033176 -1190051 -761611 1130328 2023205 1889977 2709225 5021973
2708 5021973 7013705 7152397 5881880 4110884 1776808 -928616 -2310779 -792439
2700 -792439 2852507 6219481 7734933 7303247 5297501 2426689 78372 -847231 -1240617
2691 -1240617 -2549685 -4622735 -6191595 -6902168 -7153665 -6595435 -4878499 -3252270 -2867962
2682 -2867962 -2055975 1458545 5678667 5592231 382163 -4445943 -4143347 -549616 1677163
2673 1677163 1574944 1376815 1889673 2120655 2185810 3019819 3756054 2482677 -623975
2664 -623975 -3514388 -5314883 -6731441 -7770247 -7592735 -6546985 -5960402 -5864513 -5090975
2655 -5090975 -3610187 -2621237 -2308137 -1645478 -485847 269368 615918 1405472 2323278
2646 2323278 2197560 1470156 1928471 3627440 4576846 4038625 3543474 3823852 3477423
2637 3477423 2001266 1512563 3527245 6158960 6703683 5408142 4475732 4552088 4397354
2628 4397354 3231620 1381966 -773919 -2582098 -2403363 725474 4823134 6435296
2620 6435296 4778450 2696112 2859052 4530538 5103435 3727144 2049506 1727227 2491005
2611 2491005 3061359 3187685 3924449 5877793 7935038 8394885 7151722 5976152 6373036
2602 6373036 7801113 8582655 8185008 7735415 8057797 7910288 5039189 -864575 -6908817
2593 -6908817 -9352966 -7152073 -2741224 512384 1011340 -656080 -2776948 -3570412 -2318174
2584 -2318174 -335746 -94759 -2515159 -5777507 -7697934 -8484120 -9822473 -11723997 -11892568
2575 -11892568 -8481333 -2414288 3306044 5935954 4771258 1541577 -882523 -932885
2567 -932885 427070 1356654 1525406 1936449 2890682 3581861 3766782 4420602 6145698
2558 6145698 7813288 7478282 4501860 713733 -586715 2378780 7288192 9224989
2550 9224989 6046068 1350944 406068 3811361 7347067 7745264 5947892 4172107 2571259
2541 2571259 513967 -826175 412404 3609009 5510346 3554808 -1557716 -6738827
2533 -6738827 -9251615 -8325105 -4635040 797113 6493233 9969758 9110963 4815827 789146
2524 789146 -479969 -166179 -195410 222677 2588999 5027558 3735616 -1553699 -6866918
2515 -6866918 -9274695 -9771585 -10021688 -9500465 -7640314 -6090602 -6481579 -7682416 -7408764
2506 -7408764 -5337962 -2927988 -1285233 -689314 -1070342 -1578647 -862883 949421 1885725
2497 1885725 1071037 511578 2255427 5156902 6439525 5444010 3794728 2584667 1488662
2488 1488662 423406 248588 1588670 3986550 6127359 6298703 3483006 -869639 -2968707
2479 -2968707 -165081 5819967 10281389 10111580 6242397 1772949 -1422608 -3960199
2471 -3960199 -7117718 -10229603 -10912900 -8484791 -5758202 -5648489 -7094423 -6915032 -4879527
2462 -4879527 -3407035 -2359501 1441440 8172530 12787952 11355881 6130250 1600997
2454 1600997 -1152391 -3033725 -3221896 -996555 1171558 655899 -869857 -22368 2766801
2445 2766801 4391099 4373661 4722932 5496539 5015478 4010030 5037245 7686770 8538354
2436 8538354 6214721 2688778 -569564 -3829904 -6287216 -6118754 -3937597 -2330158
2428 -2330158 -1450404 946044 4627457 6502120 5988315 6080408 7643707 7506721 4425892
2419 4425892 2226043 3943200 6892878 7028920 4825348 3221954 2563538 1295601 -480806
2410 -480806 -1621055 -2366841 -3170231 -2909043 -1206799 -636631 -3414691 -7451684 -8848279
2401 -8848279 -6997447 -4224709 -1796343 437959 1640858 810751 -566718 -34531 1926819
2392 1926819 2624402 1681635 1732887 4278786 7686413 9941454 10882455 10850797 9342932
2383 9342932 6293710 3286612 2238116 3368099 4960227 4850804 2276149 -1368166
2375 -1368166 -3974611 -5147839 -6244849 -7680710 -7872781 -5947580 -3718090 -3164865 -3340494
2366 -3340494 -1879789 1362391 4232082 5129483 4125356 2043030 258246 469230 2624093
2357 2624093 3972871 2347594 -527222 -1363933 2821 1044699 899020 994610 1435215
2348 1435215 289465 -2694723 -4772715 -3971426 -1739466 -408386 -72848 485864 1471573
2339 1471573 2262899 2716257 2889190 2398539 1236792 420689 706526 1252111 614944
2330 614944 -1158908 -2235425 -857952 2757253 6447481 8147393 7956838 7738651 8509874
2321 8509874 9100649 7999943 5584852 3519711 2659990 2567936 2491820 2005600 1493089
2312 1493089 2594998 6637564 11595531 12717365 8127250 1864872 -1106875 -948132
2304 -948132 -832721 -743233 2130003 7477272 11232556 11518669 10881591 11386328 11640451
2295 11640451 10519915 9897877 10966289 11023925 7128937 858864 -3554840 -4481565 -3840265
2286 -3840265 -3998896 -5916862 -9272427 -12304462 -12379626 -8727601 -4138313 -2399957 -4431783
2277 -4431783 -7879387 -9661540 -8017020 -3260379 2243187 5777336 6877483 7240024
2269 7240024 7596815 6509491 3169777 -703457 -3143335 -4107275 -3915141 -1840313 1702221
2260 1702221 3795542 2425057 -515183 -2113504 -2417766 -2671375 -1713804 1953152 5961480
2251 5961480 6531874 4743140 5584020 10078036 13043529 10574105 5705241 3877918 5863730
2242 5863730 8359108 9272300 8810984 6683210 2188998 -2784732 -4368456 -1674044 1201936
2233 1201936 -108441 -4986066 -9096144 -9978820 -9211063 -9068280 -9300348 -8299204 -5840526
2224 -5840526 -2993106 -175330 2888563 5559330 6320084 4505907 679162 -4484478
2216 -4484478 -10023149 -13673632 -13352355 -10090727 -7302837 -6554560 -6394609 -5950005 -6482094
2207 -6482094 -7749288 -6196250 226706 7847829 11255095 9870144 7344815 6030480
2199 6030480 5782328 7015056 10475860 14008901 13770455 9480629 4992870 2920578 2175052
2190 2175052 1657088 2478400 4745952 5671751 3363194 -153049 -2037172 -2389232 -2554915
2181 -2554915 -2046504 -19404 1922528 1358759 -1568903 -4859455 -7546321 -9378015 -8925198
2172 -8925198 -5156855 -297943 2052480 1638140 1512241 3190817 4865794 5016930 4693145
2163 4693145 4919247 4732975 3803037 4520424 8670313 13547279 14590969 11534207 8891563
2154 8891563 9760339 11871295 11369878 8551282 7491173 10574508 15486298 17933278 15931718
2145 15931718 10965686 6093320 3564663 3389848 3459682 1635300 -1722757 -3955593 -3347852
2136 -3347852 -1188048 356775 1328372 3175823 5359554 5074928 1171885 -3363487 -4364135
2127 -4364135 -1298982 2139168 2239861 -769240 -3196088 -1848290 2880471 7944011
2119 7944011 11319908 14016105 17979809 22713611 25194097 23334858 18545630 14236281
2111 14236281 12308969 11820423 10927414 9288188 7876818 6748714 4386423 341664
2103 341664 -2500283 -596522 5049977 8897538 7515378 3984427 3362050 5638853 6518192
2094 6518192 4296061 2061068 2544825 4370965 4951808 4276911 3847692 3985455 4313421
2085 4313421 5375612 7726601 10423455 12075434 12458980 11754874 9479223 5853561 3009244
2076 3009244 2750660 3821360 3350581 598790 -2453766 -3810372 -3058165 -764076 1803152
2067 1803152 2590470 466373 -2740498 -3683864 -1408051 1667150 2975285 2405527 1164424
2058 1164424 -197503 -1387502 -1174517 1800776 7087513 12146366 14126606 11787619
2050 11787619 6177604 -18925 -4070413 -4826391 -3062928 -238195 2846930 5899191
2042 5899191 8019453 7719820 4705701 1058698 -638261 -533177 -1427498 -4586768 -7092710
2033 -7092710 -5223600 340348 4986627 5728886 3921495 2082823 639167 -933991
2025 -933991 -1960038 -1331800 1007930 4724063 9640626 14261612 15737452 13441405 10968800
2016 10968800 12075584 15737533 17730783 16137236 12511715 8268723 3165208 -2289017
2008 -2289017 -5790968 -5724196 -2900325 868877 4374691 6675552 6746876 4336094 412824
1999 412824 -3460674 -5686958 -5208819 -2648735 -167415 1052349 2112489 3665282 3575833
1990 3575833 23798 -4387877 -5133154 -1832017 1769624 3543326 4562938 4800633 2173060
1981 2173060 -2534251 -4523063 -1588575 1938139 1094001 -3005235 -5757286 -5573310 -3977404
1972 -3977404 -1515105 2147129 5428501 6440265 6822467 10009576 15738053 19982504
1964 19982504 20692679 20103962 20559076 21233462 20311529 17825159 14850291 11861334 9185115
1955 9185115 7320432 5491720 1522494 -5190487 -11563188 -13273989 -9097530 -1982130
1947 -1982130 3774994 5725274 4166237 962699 -2105379 -4160816 -5050025 -4971476 -4295945
1938 -4295945 -3112291 -818614 2998950 7057769 8996412 8239556 7026267 7501752 8867156
1929 8867156 8668480 5949216 1860168 -1804974 -3327056 -1651222 1890131 3637125
1921 3637125 1540767 -1929550 -2987383 -1425585 359984 1913181 4597345 7572526
1913 7572526 8263454 7329218 8697544 13076507 15634243 12711908 7302044 4582032 4745365
1904 4745365 4035510 1167215 -1212116 -946747 1059458 2851028 3489711 2836888 1192514
1895 1192514 -565775 -1732358 -2406310 -2334955 -171778 4377410 8666782 9597278 7419174
1886 7419174 4878974 3223323 1635014 171673 -15521 106410 -2687539 -9221782 -15578135
1877 -15578135 -17330292 -14481100 -10552009 -8288354 -8021246 -8921719 -9686594 -8536901 -4497381
1868 -4497381 1191748 5990176 8167916 7306824 3674278 -1417217 -5274845 -5782057 -3900070
1859 -3900070 -2768169 -3917996 -5487381 -4594101 -609819 4269997 7056133 6463243 4077377
1850 4077377 2967741 4328029 5769420 4154317 -96579 -3233649 -2953643 -1039365
1842 -1039365 -475549 -1873730 -4029021 -6087621 -7223350 -5873227 -2030545 671556
1834 671556 -1660156 -7701905 -11823759 -11055883 -8195053 -6827954 -6329076 -4095982 -410093
1825 -410093 1990495 2076118 1363989 952427 309623 -846935 -1752482 -2215379 -3202551 -5124361
1815 -5124361 -6935639 -7493955 -6586399 -4274455 -692744 2908447 4434638 3330553 1653990
1806 1653990 1671524 3092575 3758010 2639567 1077800 962580 2362090 3368068 2333976
1797 2333976 39149 -997424 320588 2044252 1692321 -329120 -1367530 -334547
1789 -334547 955280 609835 -908797 -1968659 -1914537 -988747 699369 2873989 4523342
1780 4523342 4847968 4456809 4705238 5907319 6684289 5139450 938931 -3297151 -3370595
1771 -3370595 2205248 9435423 12291362 9411469 5477156 5144255 7665125 8916052
1763 8916052 6887210 3193325 349215 -474206 327161 1170744 427156 -1605466 -2683419
1754 -2683419 -1672126 -354002 -735948 -1974937 -1893368 -245062 1781348 4157638 7475350
1745 7475350 10601202 11728769 11438226 11896659 13131469 13029298 11227296 9912662 10003534
1736 10003534 9479504 6776482 3342080 1371284 1119330 1878956 3611319 5937883 7109201
1727 7109201 5715863 2543468 -287482 -1134715 483719 3369973 4548686 2020739
1719 2020739 -1701018 -1520866 3579554 8746790 9857671 8719833 9048048 10388350 9871516
1710 9871516 7737749 6615263 6456761 4772327 1648502 107919 1010529 1757708 1024380
1701 1024380 737855 1794102 1691417 -1200598 -4304526 -4651529 -3438022 -3602978 -4808902
1692 -4808902 -4249821 -1311039 1899146 4143636 6082593 7807445 8303899 7754106 7713406
1683 7713406 8312349 7708086 5247102 2923843 2508725 3300095 4103633 5292428 6912421
1674 6912421 6686697 2754688 -2612291 -5109600 -4062929 -2986854 -4010189 -4891588 -3167445
1665 -3167445 -557237 -608499 -3540544 -6306345 -7098972 -6908772 -6529449 -4902054 -1521938
1656 -1521938 1765633 3032230 2911347 3347106 4674407 5602447 5543897 5290664 5403602
1647 5403602 5300618 4242554 2334081 328116 -918762 -782651 619741 2165477 2559454
1638 2559454 1520798 -219431 -1802226 -2530415 -1777472 287044 2076801 2025702 854299
1629 854299 1066325 3587202 6055166 5341702 987445 -4647616 -8847033 -10243930 -8904200
1620 -8904200 -6037067 -3311179 -1329862 935356 4079021 6132657 4330973 -759691
1612 -759691 -4782016 -4284215 -519286 2585504 2997385 1639708 1905 -1225579 -1561741
1603 -1561741 -1052857 -1427489 -4716029 -9842943 -12574697 -10263113 -5075322 -884013 1604801
1594 1604801 4446530 8235288 11146574 12276319 13185180 15081695 16628036 16051453 13873561
1585 13873561 11890102 10631520 9669330 9560587 11246478 13642496 14092753 11935507 9776457
1576 9776457 9973893 11229384 10376578 6824884 3180405 1295014 -230706 -3357403 -6869882
1567 -6869882 -7401062 -3976455 433893 2554141 2443028 2357589 3154911 3518364 2419230
1558 2419230 653692 -491468 -884357 -1086689 -954586 306158 2594319 4108605 2934999
1549 2934999 -231731 -1780813 1052384 6214130 8447402 5680218 1943328 2229952
1541 2229952 5969486 8093323 5874893 1945409 341501 2058884 5218048 7517142
1533 7517142 7555103 5399925 2807571 1653043 1689622 1243797 197267 233332 1778856
1524 1778856 3138040 3463992 3984948 4995693 4324469 775089 -3184922 -4491877 -3503198
1515 -3503198 -2776776 -3430103 -4780879 -5917368 -5448488 -1563062 5020878 9806098 9104713
1506 9104713 4600261 640672 -1434621 -3125102 -4559396 -4371629 -2892401 -1544418
1498 -1544418 333258 4018540 7284482 6372553 2292735 353095 2456614 4629863
1490 4629863 3829309 2432262 3331759 4761885 3425597 -354924 -4058704 -7108407 -10234367
1481 -10234367 -12534947 -12377918 -10072733 -7135233 -4135519 -1487645 -819749 -2981905
1473 -2981905 -5830944 -6414728 -4505481 -1980443 238530 2616436 5333416 7945126
1465 7945126 9795379 9638003 6598129 2766236 2219452 5344471 7001471 3379805 -2054426
1456 -2054426 -3368336 -572575 1596086 1793594 3360171 7446670 10301033 8939130
1448 8939130 5190375 2179321 379635 -700989 -1219 3300074 7338192 9097607
1440 9097607 7441003 3622736 56280 -961555 888384 2822012 1663514 -1850906
1432 -1850906 -3763893 -2382228 -248538 386395 919965 3225298 5792809 5730941 2990964
1423 2990964 146689 -941681 -188315 1967512 4807494 6897826 7087584 5733514 4137009
1414 4137009 3475494 4678032 7826189 10989486 11606201 10080462 9804045 12171150 14055864
1405 14055864 12300172 8201877 4855632 2461065 -255010 -2016966 -780205 1509167
1397 1509167 613889 -3453773 -5955543 -4213506 -814359 1083973 1661787 1985757 1512241
1388 1512241 458132 1283773 4803864 7489533 5895461 1761878 -492079 357052 2280478
1379 2280478 4284715 6943751 9426377 9908868 8980938 9060111 10040809 8992715 4932652
1370 4932652 536282 -1968699 -3253676 -3780753 -1812271 2966317 6800736 6094404 2425643
1361 2425643 263210 1045593 2554222 3102062 3087814 2737615 1340375 -979674 -3031590
1352 -3031590 -4298542 -5084167 -5212903 -4540023 -4203735 -5108824 -5808517 -4498461 -2386246
1343 -2386246 -1888029 -2040875 395623 5276229 8901560 10194499 12234292 15977511 17468086
1334 17468086 14243901 9947047 8633711 8421062 5501239 1314575 239343 1993611
1326 1993611 1927102 -1649414 -5307947 -5691525 -2778358 1826170 5896771 6344913 2341167
1317 2341167 -1596480 -429468 3452874 2606921 -4158677 -8813848 -5084512 2954697
1309 2954697 7193256 6176347 4719599 5575024 6630012 5680281 3737600 2930034 3638975
1300 3638975 4490790 4117058 2808748 2601921 4785860 7374713 7092554 4276400 3017876
1291 3017876 5150650 7074223 4786295 -484669 -4447790 -5597136 -5950802 -7313744
1283 -7313744 -9610567 -11974779 -13013805 -10965865 -6045783 -1715250 -1131925 -3092631
1275 -3092631 -3880902 -2322388 -471611 3858 -639974 -1931663 -3638654 -4434901 -2706156
1266 -2706156 773622 2962921 1891834 -1539360 -5164169 -7484271 -8039389 -7314587 -6367929
1257 -6367929 -5590835 -4328601 -2687445 -2475294 -4560108 -6428116 -4796264 -176384 3521842
1248 3521842 3850877 2227679 1484086 2816407 5115994 5785062 2589995 -3636149 -8571468
1239 -8571468 -8336547 -3405310 2645073 6942931 8092523 5135075 -1027888 -6275962
1231 -6275962 -6828570 -3789610 -1158333 -166508 824627 1670642 351838 -2245388 -2258013
1222 -2258013 1156241 4005906 3323907 980295 -137818 62460 967724 3350954 6745235
1213 6745235 8161471 6388928 4577750 5567879 7644609 8265772 8967136 12254317 15820154
1204 15820154 14785946 8953577 3368878 1588287 2246398 2824462 3291751 4708092 6720443
1195 6720443 7898110 7224332 4630732 1222675 -896642 -367949 1743821 3163481 3083430
1186 3083430 2356376 1491503 196254 -1286228 -2293897 -3353505 -5744109 -8859791 -9803164
1177 -9803164 -6877916 -2478426 -1052154 -4187750 -8633842 -9705039 -6364221 -2179728
1169 -2179728 -991127 -2657367 -4245839 -4522639 -5037467 -6693988 -7817626 -6802607 -4561149
1160 -4561149 -2671052 -749889 2398065 6213243 8946382 10092099 10546902 10827112 10543350
1151 10543350 9234849 6710884 3243830 244104 -394524 1322831 2991417 2761042
1143 2761042 1341739 -25068 -1586120 -3371016 -3597663 -1154952 2099986 4069667
1135 4069667 5653193 8322561 10281550 8815359 5343451 3981355 5398974 6250408
1127 6250408 5007970 4285086 6323751 9742389 12126006 12792899 11692270 8524461 4489420
1118 4489420 2251619 2578303 3330931 3072756 3101486 4440832 5536030 4842468 3239677
1109 3239677 1857361 -40043 -2676078 -3702171 -1460185 1563217 1767476 -359892
1101 -359892 -1416164 -716766 -1193926 -4430020 -8010610 -8936858 -7317836 -5311896 -4098423
1092 -4098423 -3403438 -2986917 -3048025 -3368981 -3178889 -2159376 -1076397 -1069319 -2448032 -4438457
1082 -4438457 -6006615 -6508527 -5588567 -3369294 -1285091 -1664942 -5149279 -9018599 -9552456
1073 -9552456 -5986500 -1045319 2007107 1551981 -2221581 -7053941 -8959615 -5666747
1065 -5666747 -20100 2809631 1990195 1755970 4553269 7182909 5943960 2199715 -325053
1056 -325053 -1101540 -2028353 -3155430 -3176588 -2915905 -4207581 -5861194 -4787448 -1181483
1047 -1181483 1258302 715886 -816081 -1656397 -2667882 -4149261 -4303326 -2771437 -2235977
1038 -2235977 -4002733 -5154159 -3226570 -932801 -2240490 -5650090 -6046370 -2703586
1030 -2703586 -637751 -2990434 -6327803 -5825424 -1984691 836858 679825 -459144 -530231
1021 -530231 257879 1328368 3241086 6078389 8096580 7504276 4654557 1184147 -2299009
1012 -2299009 -6175279 -9706026 -10642430 -7749237 -2961876 -104212 -1358537 -5257628
1004 -5257628 -8175025 -7664293 -4328018 -648575 1497878 1856842 1014251 -181497 -396452
995 -396452 1447135 4305677 5140760 2327971 -1881224 -3937899 -3474484 -3211492 -4425301
986 -4425301 -4761446 -1520587 4474556 9550372 10865844 8565985 5049876 2885348 2835399
977 2835399 3374789 2700887 1323900 1516387 3883453 6091698 6024161 4760369 4860667
968 4860667 6589224 7582119 6023089 2681748 -372933 -2091787 -3177788 -4938804 -7500215
959 -7500215 -9195866 -8281591 -5347133 -3103511 -3354642 -5139118 -6424349 -6548456 -6133676
950 -6133676 -5560175 -4559012 -2662162 655378 5411096 10046578 12158734 11292217 9806376
941 9806376 9864463 10854526 11057895 10355885 9484783 7927814 4764003 828886 -2043085
932 -2043085 -3311732 -3409098 -2051784 850193 3352984 3143492 778602 -1074818 -1269165
923 -1269165 -650234 464062 2250519 3164025 1319723 -1600203 -1590871 1580709 3382939
914 3382939 1236518 -1682186 -1880960 -1149403 -3118243 -6952303 -8698344 -7367972 -5427758
905 -5427758 -3888844 -1116315 3163674 6516069 7599602 8177753 9790186 11024672 10049858
896 10049858 7874084 6806522 6860170 5985765 3450758 867804 -362410 -849155 -1683244
887 -1683244 -2414901 -1752638 359692 2633438 4253393 5521147 6425103 5991275 4058036
878 4058036 2563738 3406270 5435082 5406931 2223572 -1392655 -2156628 83318 2646931
869 2646931 2905506 94966 -4558339 -8424033 -9136290 -6889854 -4368490 -3400393 -2800182
860 -2800182 -1029361 285644 -1827790 -6537358 -8914681 -6079549 -1315018 21694
852 21694 -2746000 -5380078 -4625928 -1648219 872474 2512659 4333993 6008658 5969969
843 5969969 3982826 1678696 520701 762470 2324066 4826361 6462008 4909273 325958
834 325958 -4281467 -6670829 -7548717 -8066398 -7535019 -5718654 -5052299 -7295692 -9452481
825 -9452481 -6930707 -404016 4394233 4194954 1787883 1019647 1794744 1935976 997999
816 997999 -98172 -926411 -833786 1570624 5937770 9057112 8555617 6058234 4374664
807 4374664 3383061 1508011 -344377 230296 2988970 5248073 6081388 7184790 9265678
798 9265678 10431002 8933028 5330408 1319806 -1669802 -2421754 -625379 1822780 2202272
789 2202272 273660 -1565955 -1732547 -886996 556553 3667530 8335364 11715731 11454596
780 11454596 8997996 7616006 8100833 8454028 7305344 5609488 4793432 4757141 4244799
771 4244799 2381694 -465553 -2802704 -2914100 -351146 3157123 4766021 3037077 -604622
762 -604622 -3302760 -3805885 -3652968 -4833725 -6679384 -6239940 -2014983 3902542 8157554
753 8157554 9529128 8968531 7366402 4992254 2692043 1814415 2632511 3928530 4243960
744 4243960 2767295 -537569 -4446522 -6575888 -5566330 -3068729 -2085545 -3486168 -5702610
735 -5702610 -7537467 -9181429 -10401494 -10130387 -8597459 -7697109 -8097391 -7806438 -4980026
726 -4980026 -756640 2071634 2255456 950251 289411 1790540 5078550 7597362 6947673
717 6947673 4162273 3012267 5141003 7749193 7547256 5235387 4052366 5126435 6522618
708 6522618 6340146 4679534 2564458 545062 -1327605 -3050704 -4291398 -4147071 -1944783
699 -1944783 1235816 2932614 2131891 700641 896908 2467143 3462718 2942636 1443276
690 1443276 -325857 -1651563 -1378366 1029962 4287620 6369621 6384174 4573717 1650710
681 1650710 -587203 450920 5037523 9318925 9045425 4548029 -305531 -3450350 -6076862
672 -6076862 -8910016 -10288054 -8996588 -6559075 -5306177 -5760714 -6976227 -8103524 -8743935
663 -8743935 -8868923 -8966229 -9256173 -8679029 -6071580 -2370489 123827 840818 1310512
654 1310512 2174437 2208650 1104806 746350 2311132 4241092 4774314 4650644 5453478
645 5453478 6899855 7866582 8780220 10643912 12481515 12130870 9450652 6737151 5672573
636 5672573 5326674 3616482 -139688 -4412837 -6799031 -6249062 -4103344 -2426201 -1455342
627 -1455342 40447 1843622 1893445 -166843 -1347256 701950 3777614 3803649 409530
618 409530 -2873057 -3497068 -2274335 -856223 579419 2580167 5369815 9013219 12891244
609 12891244 14879258 13123247 8980362 6024948 5590758 5561045 4298944 3154424 3581054
600 3581054 4185515 2889434 388064 -919378 -454313 292533 407435 370845 507123
591 507123 465100 242218 285103 639207 1165210 2182154 3547885 3688305 1328741 -2128812
581 -2128812 -3914737 -3482941 -2676624 -2206868 -538057 2802868 5309955 4688667 2181534
572 2181534 637867 447613 -442817 -3099673 -6266372 -8276861 -8492231 -6822220 -3518853
563 -3518853 269948 3138218 4874954 6065009 6294260 4482153 1367926 -281761 925844
554 925844 2867172 2561956 5148 -2049117 -1510647 1115663 3816271 4944784 4264773
545 4264773 3070238 3051502 4334157 5096701 3839435 1278308 -1000422 -2823704 -4827210
536 -4827210 -6301225 -5718933 -3394111 -1583762 -1415598 -1406229 174838 2757653 4073513
527 4073513 2448414 -1764796 -5967771 -6580262 -2254105 3842640 6861913 5917512 4670623
518 4670623 5546540 6403973 4944201 3309944 4669031 7234415 6239718 1393434 -2304554
509 -2304554 -2074770 -1272925 -3539942 -6680540 -5902416 -1125311 2753219 2450649 -47640
500 -47640 -901337 1019832 4037536 6370967 7467899 7364666 6042876 3641190 824351
491 824351 -1410767 -2492221 -2829822 -3250721 -3702409 -3064628 -766632 1923706 3096794
482 3096794 2497768 1673054 1723496 1888927 845832 -1392928 -3664838 -5250931 -6283079
473 -6283079 -6632704 -5504414 -2701582 461881 2402798 3092193 3699812 4528232 4470050
464 4470050 2930977 1210459 1073146 2598563 4391223 5473252 5967736 6189038 6132024
455 6132024 5852397 5442689 4616863 3150814 1681797 1180011 1684837 2494508 3430571
446 3430571 4682852 5449677 4276997 1179912 -1932869 -3521349 -3921045 -4140941 -4476934
437 -4476934 -4845398 -5079460 -4344110 -1936393 606229 237054 -3507653 -7206589 -7969621
428 -7969621 -6967554 -6413174 -5496583 -2714793 -332030 -1946983 -6056276 -6821831 -2224295
419 -2224295 2857587 3585642 1416290 799954 2690716 4558725 4792014 3784260 1908069
410 1908069 -476810 -1716433 -438786 1891882 2515174 1161027 -181680 -942204 -2519857
401 -2519857 -4950421 -6039547 -4788156 -2999806 -2082766 -728804 2232658 4712784 3763393
392 3763393 89799 -2479516 -1844816 364442 1880520 2624089 3453493 3932717 3086291
383 3086291 1542948 1128612 2286119 3286002 2421266 -71224 -2825314 -5029000 -6323494
374 -6323494 -5879526 -3125471 710640 3291577 3814968 3790711 4759396 6522166 8268093
365 8268093 9953877 11375907 11309291 9412316 8023330 9802947 13846706 16361508 15393745
356 15393745 12727548 10571235 8647933 5840149 2842888 1365815 1732389 2893415
348 2893415 4181619 5651900 7108374 7954756 7689844 5806024 1976238 -2714502 -5744804
339 -5744804 -5748175 -4277583 -3468005 -2920468 -1000584 1498826 1775425 -709281 -3109826
330 -3109826 -3257028 -2399494 -2536388 -3241279 -3070312 -2416677 -2671091 -3573951 -3643411 -2636249
320 -2636249 -1483398 -234999 1680351 3275989 2517402 -453289 -2727482 -2172052 171315
311 171315 2166103 3333154 4209159 4436941 3249369 1096519 -758549 -1875863 -2699188
302 -2699188 -3457307 -4120690 -4909661 -5632557 -5068471 -2454702 730050 1989207 784291
293 784291 -1050289 -1803500 -1414360 -576648 93606 -119539 -1346278 -1977749 -60510
284 -60510 3550279 5376951 3658389 631128 -801926 -729673 -748552 -714374 335823 1129194
274 1129194 -856943 -5336343 -8809940 -8735708 -5951669 -2524941 448896 2032302 881600
265 881600 -2702303 -5731097 -5442853 -2423121 628698 2339943 3292273 3994826 4144273
256 4144273 3753625 3316981 2660073 1057680 -1187357 -2606092 -2522913 -1971469 -1908153 -1519328
246 -1519328 613734 4204455 7236898 8151573 7123934 5103286 2571207 -237180 -2641604
237 -2641604 -3933407 -4232539 -4111988 -3434240 -1468412 1617724 4318530 5398751 5156125
228 5156125 4373210 2844586 94979 -3003757 -4818132 -5056521 -4748623 -3894941 -908491
219 -908491 4547360 9545153 10463318 7272640 3809702 3495723 5772370 7312867 6104825
210 6104825 3463525 2002826 2495877 3508313 3679163 3015565 1648302 -1066070 -4925187
201 -4925187 -7644569 -7210460 -4845262 -3481463 -3573176 -2914635 -799938 531469 -317712
192 -317712 -1390661 -432864 1809368 3428317 4428035 5445224 5186553 2248200 -1561290
183 -1561290 -2983256 -2038780 -1870898 -3752094 -5284216 -4249747 -1601267 386122 783196
174 783196 -103608 -1546571 -2196087 -894503 1453906 2568155 2019553 1796538 2910197
165 2910197 3776612 3186094 2472677 2959616 3422110 2302190 685264 638948 1944776
156 1944776 2973754 3689205 5063165 6227259 5112965 1899000 -756494 -1168347 -21354
147 -21354 1862311 4553150 7037414 6771122 2903986 -1661905 -3183395 -1189850 1619387
138 1619387 2769740 1874256 -400387 -3547755 -6878678 -8925322 -8270144 -5306817 -2676059
129 -2676059 -2981714 -5718488 -7388997 -5517161 -1667236 896961 1813080 3733981 7776038
120 7776038 11309995 11516646 9247872 7511245 7304946 7077334 5880357 4887678 5316091
111 5316091 6465161 6763267 5846071 4645561 3846766 3141743 2059020 924037 619573
$$ [...]
##END NTUPLES=NMR SPECTRUM
##END=
