##TITLE=31Pdec_DE-67rmoil3
 CDCl3, 24 sc
 4.10.2024
##JCAMPDX= 6.0         $$ Bruker NMR JCAMP-DX V2.0
##DATA TYPE= NMR SPECTRUM
##DATA CLASS= NTUPLES
##ORIGIN= UXNMR, Bruker Analytische Messtechnik GmbH
##OWNER= root
$$ XWIN-NMR		Version 3.5
$$ Fri Oct  4 16:28:58 2024 Russian Standard Time (UT+4h)  she@DPX200
##.OBSERVE FREQUENCY= 81.013821
##.OBSERVE NUCLEUS= ^31P
##.ACQUISITION MODE= SIMULTANEOUS
##.ACQUISITION SCHEME= undefined
##.AVERAGES= 24
##.DIGITISER RES= 17
##SPECTROMETER/DATA SYSTEM= spect
##.PULSE SEQUENCE= zgpg30
##.SOLVENT NAME= CDCl3
##.SHIFT REFERENCE= (INTERNAL, CDCl3, 0, 198.062)
##AUDIT TRAIL= $$ (NUMBER, WHEN, WHO, WHERE, WHAT)
$$ ##TITLE= Audit trail, XWIN-NMR		Version 3.5
$$ ##JCAMPDX= 5.01
$$ ##ORIGIN= Bruker BioSpin GmbH
$$ ##OWNER= she
$$ F:/spectra/data/she/nmr/P31/2/pdata/1/auditp.txt
$$ ##AUDIT TRAIL=  $$ (NUMBER, WHEN, WHO, WHERE, WHAT)
(   1,<2024-10-04 16:27:54.62 +0400>,<she>,<DPX200>,
      <created by zg, POWCHK disabled, PULCHK disabled
       configuration hash MD5:
       00 E9 B6 7A A2 85 ED C7 34 08 36 98 17 FE 4E 26
       data hash MD5: 32K
       CF 1D 30 DC 67 49 9F CA D8 96 9E 63 C2 64 59 AC>)
(   2,<2024-10-04 16:27:58.82 +0400>,<she>,<DPX200>,
      <Start of raw data processing
       efp BC_mod = 2 LB = 1.5 FT_mod = 6 PKNL = 1 PHC0 = 2658.133 PHC1 = 63.8875 SI = 64K 
       data hash MD5: 64K
       72 F3 3C A8 63 70 B5 F6 FD 1C 31 B8 AC DC 87 CD>)
(   3,<2024-10-04 16:28:15.93 +0400>,<she>,<DPX200>,
      <pk PHC0 = -0.3841687 PHC1 = 0 
       data hash MD5: 64K
       89 A5 67 EE 13 37 81 75 5F 88 A7 C5 78 7F C7 E6>)
$$ ##END=
$$ 
$$ hash MD5
$$ 90 52 DB FD EE F6 B8 69 EA 8D 41 2A 58 5B AA EF
##$RELAX= 
##$RELAX= 
##$RELAX= 
##$RELAX= 
##$RELAX= 
##$RELAX= 
##$RELAX= 
##$RELAX= 
$$ Bruker specific parameters
$$ --------------------------
##$DU= <F:/spectra>
##$EXPNO= 2
##$NAME= <P31>
##$PROCNO= 1
##$TYPE= <nmr>
##$USER= <she>
##$AMP= (0..31)
100 100 100 100 100 100 100 100 100 100 100 100 100 100 100 100 100 100 
100 100 100 100 100 100 100 100 100 100 100 100 100 100 
##$AQSEQ= 0
##$AQ_mod= 1
##$AUNM= <au_zg>
##$AUTOPOS= <>
##$BF1= 81.014009
##$BF2= 200.13
##$BF3= 200.13
##$BF4= 200.13
##$BF5= 200.13
##$BF6= 200.13
##$BF7= 200.13
##$BF8= 200.13
##$BYTORDA= 1
##$CFDGTYP= 0
##$CFRGTYP= 5
##$CHEMSTR= <none>
##$CNST= (0..31)
1 1 145 1 1 1 1 1 1 1 1 1 1 1 1 1 1 1 1 1 1 1 1 1 1 1 1 1 1 1 1 1 
##$CPDPRG= <waltz16>
##$CPDPRG1= <>
##$CPDPRG2= <waltz16>
##$CPDPRG3= <>
##$CPDPRG4= <mlev>
##$CPDPRG5= <mlev>
##$CPDPRG6= <mlev>
##$CPDPRG7= <mlev>
##$CPDPRG8= <mlev>
##$CPDPRGB= <>
##$CPDPRGT= <>
##$D= (0..31)
0 1 0 0 0 0 0 0 0 0.06 0 0.03 2e-05 3e-06 0 0 0.0002 0 0 0 0 0 0 0 0 0 
0 0 0 0 0 0 
##$DATE= 1728044874
##$DBL= (0..7)
120 120 120 11 120 120 24 19 
##$DBP= (0..7)
150 150 150 150 150 150 150 150 
##$DBP07= 0
##$DBPNAM0= <>
##$DBPNAM1= <>
##$DBPNAM2= <>
##$DBPNAM3= <>
##$DBPNAM4= <>
##$DBPNAM5= <>
##$DBPNAM6= <>
##$DBPNAM7= <>
##$DBPOAL= (0..7)
0.5 0.5 0.5 0.5 0.5 0.5 0.5 0.5 
##$DBPOFFS= (0..7)
$$ [...]
##$SUBNAM2= <"">
##$SUBNAM3= <"">
##$SUBNAM4= <"">
##$SUBNAM5= <"">
##$SUBNAM6= <"">
##$SUBNAM7= <"">
##$SUBNAM8= <"">
##$SUBNAM9= <"">
##$SW= 400.765351723535
##$SWIBOX= (0..15)
0 1 3 0 0 0 0 0 0 0 0 0 0 0 0 0 
##$SW_h= 32467.5324675325
##$TD= 32768
##$TD0= 1
##$TE= 0
##$TE2= 300
##$TE3= 300
##$TEG= 300
##$TL= (0..7)
0 120 53 12 22 120 120 120 
##$TP= (0..7)
150 150 150 150 150 150 150 150 
##$TP07= 0
##$TPNAME0= <>
##$TPNAME1= <>
##$TPNAME2= <>
##$TPNAME3= <>
##$TPNAME4= <>
##$TPNAME5= <>
##$TPNAME6= <>
##$TPNAME7= <>
##$TPOAL= (0..7)
0.5 0.5 0.5 0.5 0.5 0.5 0.5 0.5 
##$TPOFFS= (0..7)
0 0 0 0 0 0 0 0 
##$TUNHIN= 0
##$TUNHOUT= 0
##$TUNXOUT= 0
##$USERA1= <user>
##$USERA2= <user>
##$USERA3= <user>
##$USERA4= <user>
##$USERA5= <user>
##$V9= 5
##$VALIST= <valist>
##$VCLIST= <CCCCCCCCCCCCCCC>
##$VD= 0
##$VDLIST= <DDDDDDDDDDDDDDD>
##$VPLIST= <PPPPPPPPPPPPPPP>
##$VTLIST= <TTTTTTTTTTTTTTT>
##$WBST= 1024
##$WBSW= 4
##$XGAIN= (0..3)
0 0 0 0 
##$XL= 0
##$YL= 0
##$YMAX_a= 9196
##$YMIN_a= -8435
##$ZGOPTNS= <>
##$ZL1= 120
##$ZL2= 120
##$ZL3= 120
##$ZL4= 120
##$ABSF1= 0
##$ABSF2= 0
##$ABSG= 0
##$ABSL= 0
##$ALPHA= 0
##$AQORDER= 0
##$ASSFAC= 0
##$ASSFACI= 0
##$ASSFACX= 0
##$ASSWID= 0
##$AUNMP= <proc_1d>
##$AZFE= 0.1
##$AZFW= 0.5
##$BCFW= 0
##$BC_mod= 2
##$BYTORDP= 0
##$COROFFS= 0
##$CY= -3
##$DATMOD= 1
##$DC= 0
##$DFILT= <>
##$DTYPP= 0
##$F1P= 0
##$F2P= 0
##$FCOR= 1
##$FTSIZE= 65536
##$FT_mod= 6
##$GAMMA= 0
##$GB= 0
##$INTBC= 1
##$INTSCL= 9.790993e-09
##$ISEN= 30
##$LB= 1.5
##$LEV0= 0
##$LPBIN= 0
##$MAXI= 10000
##$MC2= 0
##$MEAN= 0
##$ME_mod= 0
##$MI= 50
##$NCOEF= 0
##$NC_proc= -5
##$NLEV= 6
##$NOISF1= 182.463
##$NOISF2= 159.3651
##$NSP= 0
##$NTH_PI= 0
##$NZP= 0
##$OFFSET= 198.0616
##$PC= 4
##$PHC0= 2657.749
##$PHC1= 63.8875
##$PH_mod= 1
##$PKNL= yes
##$PPARMOD= 0
##$PSCAL= 0
##$PSIGN= 0
##$REVERSE= no
##$SF= 81.0140089999434
##$SI= 65536
##$SIGF1= 159.3651
##$SIGF2= -187.1042
##$SINO= 113.3802
##$SIOLD= 16384
##$SREGLST= <1H.CDCl3>
##$SSB= 0
##$STSI= 65536
##$STSR= 0
##$SW_p= 32467.5324675325
##$SYMM= 0
##$S_DEV= 0
##$TDeff= 32768
##$TDoff= 0
##$TI= <>
##$TILT= no
##$TM1= 0
##$TM2= 0
##$TOPLEV= 0
##$USERP1= <user>
##$USERP2= <user>
##$USERP3= <user>
##$USERP4= <user>
##$USERP5= <user>
##$WDW= 1
##$XDIM= 65536
##$YMAX_p= 334515733
##$YMIN_p= -9768864
$$ End of Bruker specific parameters
$$ ---------------------------------
##NTUPLES= NMR SPECTRUM
##VAR_NAME=  FREQUENCY,     SPECTRUM/REAL,   SPECTRUM/IMAG
##SYMBOL=    X,             R,               I
##VAR_TYPE=  INDEPENDENT,   DEPENDENT,       DEPENDENT
##VAR_FORM=  AFFN,          ASDF,            ASDF
##VAR_DIM=   65536,         65536,           65536
##UNITS=     HZ,            ARBITRARY UNITS, ARBITRARY UNITS
##FACTOR=    0.49542278885378, 1,            1
##FIRST=     16045.7642231865, 0,            0
##LAST=      -16421.768244346, 0,            0
##MIN=       -16421.768244346, -9768864,     0
##MAX=       16045.7642231865, 334515733,    0
$$ Real data points
##PAGE= N=1
##DATA TABLE= (X++(R..R)), XYDATA
$$ [...]
43672C75670K9259k40296j89647R3080K09122M5958j50270j85067j07509l0564
43662a50264J2791L0002L8847P7545J44297J56256N8005p2515j12312m4050N2258
43651A90860J02831P4354k1318r6528n7257L2019j7106k20131l13502j07430J94706
43640b38502K47548L8603j37339j26918o3341n3496j1489J05878J59171O8201
43630a1684j9831K7275J02853P2981M0419J53161K78761J67561j07740j93987
43620E09769J9224K23453J61492m568m394Q3835j6500k84289l83729j63961J13548
43609B53880J55326J6416n6156J0160R4843J23711J23892R2830R345m3183L8489
43598H19553J58183R2245j63066l23340k05288N153L5409q0939j05086J5904J01744
$$ y = [375670, 404929, 164633, -25014, 68066, 277188, 323146, 172876, -12191, -119700, -150264, -137473, -107471, -68624, 8921, 153218, 309474, 367479, 294964, 182652, 138602, 190860, 293691, 368045, 346727, 250199, 192942, 224961, 207855, -12276, -325778, -433208, -238502, 9046, 47649, -89690, -216608, -279949, -333445, -344934, -239056, -79885, -11684, -31515, -4240, 98613, 171594, 212013, 365174, 643935, 811496, 703756, 509769, 528993, 752446, 913938, 909370, 904976, 988811, 972311, 688022, 304293, 140332, 253880, 409206, 425622, 369466, 379626, 474469, 598180, 722072, 814902, 824247, 781064, 819553, 977736, 1069981, 906915, 583575, 378287, 383440, 418849, 337910, 232824, 248728, 350472]
43587C50472N5392o969K1520P8485N7796n3595k12982l53252l41538q0959K77838
43576b07792M10819K19443j2815p963J18231M9960k53964n02138m54668j72302
43566h13189J19391K54166K01528N7400k1804K1300O3299j8094j28321p6257J22285
43555b18296K51136K09675J19778P3045k0206k29195m25455m38806k68597k8576
43545i75497K03811L77157M26498L68150L29271L59101L16802Q7107j94338k99560
43535I98502k23088j65208k38434l51149l64482k25776K8167K65688K99135Q6530
43525A09885j39608j21393O8971J24463m3663j82253q9898R7620J50253Q5363
43515E9740Q5949J93416K67778K06309N1030j04754j99497j97682r6242M8213
$$ y = [350472, 405864, 398895, 420415, 498900, 556696, 503101, 290119, -63133, -404671, -485630, -207792, 203027, 422470, 409655, 401692, 519923, 569883, 315919, -186219, -640887, -813189, -693798, -439632, -238104, -180704, -202508, -181208, -117909, -136003, -264324, -340581, -218296, 32840, 242515, 362293, 435338, 415132, 185937, -239518, -678324, -946921, -975497, -771686, -394529, 31969, 400119, 729390, 1088491, 1405293, 1492400, 1298062, 998502, 775414, 610206, 371772, 20623, -343859, -569635, -541468, -275780, 23355, 109885, -29723, -151116, -82145, 42318, -1345, -183598, -273496, -175876, -25623, 59740, 145689, 339105, 606883, 813192, 864222, 759468, 559971, 362289, 266047, 314260]
43505C14260J48332J47040M1454j13143k11717j81438q2976m9776r3223p3908
43495a55095O9709J80414Q3448j50835k73733j54583R0322K44149J93699J7852
43485A45347p8184L0668K17272K35910O6239l7936O4372J69915O7976r5209o9104
43474G17266M0442o9625l44189l88377q9556J89657J83389J00463J99636L32191
43464H71297K26322l5444j86818k40921l91328n55200m29544q417L33641L55622
43454f0790K26096J69794J32744j8511j88828j73087K6276J88951J47846m4464
43444D06027j98346j76180k6128O1743j5663j22872p4552O4265N0254j56851l01956
43433d90259j96981L1999J74367K16868K41395K11844O0181j25162j89508j27108
$$ y = [314260, 462592, 609632, 651086, 537943, 326226, 144788, 61812, 12036, -81187, -155095, -85386, 95028, 178476, 27641, -246092, -400675, -310353, -66204, 127495, 145347, 67163, 97831, 315103, 551013, 617252, 579316, 643688, 813603, 881579, 786370, 717266, 757708, 688083, 343894, -44483, -134039, 55618, 239007, 339470, 539106, 871297, 1097619, 1062175, 875357, 634436, 243108, -312092, -741636, -750053, -416412, -60790, 165306, 335100, 467844, 449333, 260505, 87418, 113694, 302645, 450491, 406027, 207681, 31501, 5373, 67116, 51453, -71419, -145971, -81706, -31452, -188303, -490259, -687240, -655241, -480874, -264006, -22611, 189233, 249414, 124252, -65256, -192364]
43423a92364n1448j4274O984J3438J4454P4482J89879K10653M6274j41957j39139
43412A6982J2212J00228P1307M3453M3916j1819r0149n3429O3699N2656j20040
43401A29016k07054l9404K16773K98915J75227j900j24127j67588j19213j713
43391A58932R7055J15739P9941K4432m7245q6467j4251J28853J83050Q3191o6906
43380F56324j85523l00905l76300k63305L7866K77892K89357K27526K81040L29105
43370I73077J44713j95466l88041l20425j50979j9231O8116Q4934k4117j80867
43360h286k17480j06458L4008J48753K54188K66841Q1570j63260j75884O3741
43350A77733K32022J18264j00831j81483j58552j73644j71595k8950J45538J20347
$$ y = [-192364, -243812, -258086, -251102, -237664, -223210, -148728, 41151, 251804, 298078, 156121, 16982, 29194, 129422, 200729, 244182, 288098, 276279, 186130, 132701, 196400, 249056, 129016, -78038, -117442, 99331, 398246, 573473, 571573, 447446, 279858, 160645, 158932, 255987, 371726, 451667, 476099, 428854, 342387, 328136, 456989, 640039, 723230, 656324, 470801, 169896, -206404, -469709, -431843, -153951, 135406, 362932, 643972, 973077, 1117790, 922324, 534283, 213858, 62879, 43648, 111764, 196698, 172581, -8286, -225766, -332224, -298216, -149463, 104725, 371566, 453136, 289876, 113992, 177733, 409755, 528019, 427188, 245705, 87153, -86491, -258086, -287036, -141498, -21151]
43340b1151q4226j85323m2332J31258O1738k06722l59192k00377J17850L02266
43330d86211K77258K29770K96890L54311K22475k5208j38913m5213O6688L9688
43320G91535m7536m8045K3799L3215r0876k93261m52865m61476l11029j26460
43310i82999l0630K2321J58241L30989L36705J28158p6517r8647l2695l7050n6441
43299c38565N7000K54138L28139K06902L4283l9156j7284qn0632j29891j30125
43288A74801j3064P8942m0001l07736m12340j87182J41977K56760J58019Q1390
43278f8434J05676R0712k2018q9545J543J64923K44165J87285M2983j06645j65045
43267C85600p3997R6225J76729O7225j57950l19959k86798q0717J24495J50518
$$ y = [-21151, -105377, -290700, -333032, -201774, -140036, -346758, -705950, -906327, -788477, -486211, -208953, 20817, 317707, 672018, 894493, 869285, 730372, 685159, 751847, 791535, 743999, 695954, 719753, 752968, 662092, 368831, -84034, -545510, -856539, -982999, -1013629, -991308, -833067, -502078, -165373, -37215, -113732, -212379, -245074, -282124, -338565, -281565, -27427, 300712, 507614, 541897, 502741, 485457, 485449, 434817, 304926, 174801, 161737, 240679, 200678, -107058, -519398, -706580, -564603, -307843, -149824, -68434, 37242, 127954, 105936, 16391, 17934, 182857, 427022, 614307, 657290, 550645, 385600, 311603, 407828, 584557, 651782, 493832, 173873, -112925, -193642, -69147, 81371]
43257H1371N541j17392p5137O3724J44435J17065K5245q5229j41871m5366J72834
43246A45220L01474K04486J3462r0860j46587k50325k80297p5250K03159K25583
43236B50065q547j69234j14566o4709j82364l22980l33669k80157k11416j0527
43226a448104L07979M48151K54216L5747J50676M43391M51580Q1203k75509k95024
43216A54306r0498M0099k830r3244q6781L9594J82472K03351O9770r9589j74263
43205A42387j57714j37501j44421j32765n4741R9435K74294L28645J51286j51645
43195B17260l23798k83891k12346k14669j23144J76515M40520L75481J05926J0323
43185A68177J64441K78573J76420J2123l6802j372L6135P8483R4856j5282k35485
$$ y = [81371, 86912, -30480, -105617, -41893, 102542, 219607, 244852, 159623, 17752, -27614, 145220, 446694, 651180, 664642, 573782, 427195, 176870, -103427, -178677, 24482, 250065, 241518, 72284, -42282, -106991, -289355, -612335, -946004, -1226161, -1437577, -1448104, -1140125, -691974, -437758, -402011, -251335, 192056, 643636, 724839, 449330, 154306, 63808, 103907, 101077, 7833, -78948, -39354, 143118, 346469, 416239, 316650, 142387, -15327, -152828, -297249, -430014, -484755, -385320, -111026, 217619, 368905, 217260, -106538, -390429, -602775, -817444, -940588, -764073, -323553, 51928, 157854, 168177, 332618, 611191, 787611, 799734, 762932, 761560, 797695, 876178, 971034, 955752, 720267]
43174G20267l88849l64298k27837o7100Q9188J67852R2176k6112J8586J74777
43164A88650J51977j11047k96185j79677M2914J10690Q1337R7847N5412j54863
43154a2945k97886r7598K52597L08926M2818j43745p1659r281j41325k34530m9779
43143d54407K37769K98218J06499j15682k57153l56596l80124k17346R9935L56142
43133f82745L65565J41720j35671k57712j37907R1813J82452M6286j15850n4291
43123e56340K10077M10167L51032R9453j42675k54079k48446j83467q4303L9466
43113c59115J44617J76178J48446J38910J53584P7222j43129l41473l19621j46555
43103d70936o6700j13319o3471J60629L24060K61244J56885K14315K78121R8328
$$ y = [720267, 331418, -32880, -260717, -327817, -238629, -70777, 21399, -4713, 13873, 188650, 340627, 229580, -66605, -246282, -203368, -92678, -11341, 86506, 141918, -12945, -310831, -408429, -155832, 153094, 195912, 52167, -19492, -28773, -170098, -404628, -454407, -216638, 81580, 188079, 72397, -184756, -541352, -921476, -1138822, -1038887, -682745, -317180, -175460, -311131, -568843, -706750, -614937, -432485, -386199, -502049, -556340, -346263, 63904, 414936, 514389, 371714, 117635, -130811, -314278, -398581, -359115, -214498, -38320, 110126, 249036, 402620, 479842, 336713, -4760, -324381, -470936, -537636, -650955, -714426, -553797, -229737, 31507, 188392, 402707, 680828, 779156]
43093G79156j95554k50629m5809Q5494j0227j22157r6574p8895j82157k36384
43083c53736q8130J05956J35824Q9530J73801L21320K72057l308k29472j96979
43073B26863j277J35203J26636N0295R097K4447L2547k0472p7321k3812J32764
43062F14970K37398J92315P4679j9478j07940j97239j91057q0932o1650k38029
43052B23037l62047j43643K66412M22715J95753q2783j23174j5747K6430k2841
43042C84112q8607j52472j79613r6063K8569p293j96383k28353O6685L99317L91319
43031C21218Q7725j70888k40500k31783j75539K0435K77591L37012J35483o1133
43021B99621k2872J34365J36375p9683l07857l20844r7365J60774K15866M0773
$$ y = [779156, 583602, 332973, 287164, 372658, 362431, 240274, 143700, 64805, -117352, -353736, -441866, -335910, -200086, -110556, 63245, 384565, 656622, 653314, 423842, 226863, 225586, 360789, 487425, 537720, 546817, 571264, 603811, 583339, 506018, 482206, 614970, 852368, 1044683, 1119362, 1099884, 991944, 794705, 603648, 522716, 461066, 223037, -139010, -282653, -16241, 406474, 602227, 519444, 396270, 380523, 406953, 384112, 295505, 143033, -36580, -132643, -104074, -111367, -307750, -536103, -469418, -70101, 321218, 408943, 238055, -2445, -234228, -409767, -389332, -111741, 225271, 360754, 299621, 276749, 411114, 547489, 467806, 159949, -160895, -258260, -97486, 118380, 159153]
43011A59153j44206j46874n0370n5725j45829j16487O1192J55372L5577j02218
43001c50415k7118J75525K35187Q0958j00114j55006j35127j48669j80057j29945
42991g34781K5266J81515K17029J27860K8833J4136N4368O3839J9301n4887j62827
42980b20348k86300l01987j07984J72737K98223K45128K30636L26152L00793K1315
42970F78365k30706j25176J83443K31727q6220l80132l49539j70823j35143j81562
42960e65766n4541K32745L82845K35960k0935j09090K5554J98360J93746m0710
42950D78168l35130m26147k18083R0429K22431J48179Q0951J48035K18868J29386
42940E37087n7574j42253o5684L2586J1364j22934k59685k96088k12473j01652
$$ y = [159153, 14947, -131927, -182297, -238022, -383851, -500338, -439146, -283774, -248197, -350415, -377533, -202008, 33179, 114137, 14023, -140983, -276110, -424779, -604836, -734781, -709515, -528000, -310971, -183111, -154278, -140142, -85774, -21935, -2634, -57521, -220348, -506648, -808635, -916619, -743882, -445659, -200531, 30105, 356257, 657050, 678365, 447659, 322483, 505926, 737653, 651433, 271301, -78238, -249061, -384204, -565766, -620307, -387562, -4717, 231243, 210308, 101218, 126772, 325132, 518878, 478168, 143038, -283109, -501192, -410763, -188332, -40153, 40798, 188833, 407701, 537087, 479513, 337260, 271576, 304162, 315526, 192592, -67093, -363181, -575654, -677306]
42930f77306r6931j96433k08754O030K80023K96893K7313j88519q3023J91646
42920f49061L06861K04312R6888J03391J15422L6610n3152m5741K9377P3671N6637
42909B75215J3446j8937j0192M6642Q5574J8263j18796j61923l6679J09158Q8150
42898B89921o4570j22761L8476K64896K76891j3691l64490m21107j04989K71145
42888D9721L52589J49368l8308n1627j5776k8992K4779K08741L11942J30125j82909
42877I09653l04990j98316j09270j64498k42183k44817k21566j71131L945K47103
42867d96070L07313J00058j04339l5817J99061K92245J59616j4846q2961q1188
42857B43072r8601j50253j83261j22982M5873J84174R5006j82521l20411j11373
$$ y = [-677306, -774237, -970670, -1179424, -1173394, -893371, -596478, -569165, -757684, -840707, -649061, -342200, -137888, -41000, 62391, 177813, 214423, 161271, 115530, 144907, 218578, 275215, 288661, 269724, 259532, 306174, 391748, 410011, 291215, 129292, 92613, 201771, 289921, 225351, 102590, 141066, 405962, 682853, 669162, 304672, -116435, -221424, 49721, 402310, 551678, 513370, 461743, 445967, 416975, 441754, 650495, 962437, 1092562, 909653, 604663, 406347, 297077, 132579, -109604, -354421, -575987, -747118, -743173, -496070, -188757, -88699, -193038, -228855, -29794, 262451, 422067, 407221, 324260, 243072, 144471, -5782, -189043, -312025, -266152, -81978, 13028, -169493, -489904, -601277]
42847f01277K03833K48275M5560m2320J22375K73699J83472k0195j12288r6541
42837B04593q5672n1793Q0252K08630J50721p1174k20262j32656J01789K59011
42827D43439K08736J8786j29093j28986m4903K1389R0199K02604K25255n414l35403
42816E66609l90004j22491N8875q9312k40884m2755K49836J57428k00904k45756
42806b99358J34633L95847K04186p7587l4922J71267J93928R9553J22097J32036
42796A041680j28290m69069m56607j27401L0448j48108k49501M5515M62409N45749
42786E46825K53427j16244l51032m21932l29393j06443J19019K54369L50970M43849
42776F43415M12481J74704j02281j89334j11617p5382j41166j79998j23163m3862
$$ y = [-601277, -397444, -149169, -103609, -145929, -23554, 250145, 433617, 413422, 301134, 204593, 118921, 67128, 147380, 356010, 506731, 435557, 215295, 82639, 184428, 443439, 652175, 670961, 541868, 412882, 367979, 389368, 479567, 682171, 907426, 902012, 566609, 176605, 54114, 112989, 23677, -217207, -259962, -10126, 147302, -53602, -299358, -164725, 231122, 435308, 357721, 322799, 494066, 687994, 787547, 909644, 1041680, 913390, 444321, -12286, -139687, -109239, -257347, -506848, -461333, 1076, 546825, 800252, 684008, 332976, -88956, -418349, -524792, -405773, -151404, 199566, 643415, 1055896, 1230600, 1128319, 938985, 827368, 751986, 610820, 430822, 307659, 263797]
42766B63797J3568Q7729J52863R7969q9928k66445l06758k17440m2587J88017
42756a19215L62662L06752Q265k96821l79357k64745j24452k2638R4446K27527
42746b07576K93934K51987J44462K9736m7745n3567j7679m2679j54923k10409
42736a4459q4923J02362J32810J8840k5154N4847O9487o7909j72917j06603j7827
42725a11446o9298j36253l6754J09411O3468j01011r5169R7864J95869J06637
42715B3318P1230K06193K62600M7381k16037k15655j7726Q0206M628p7405r3279
42704G5454j22346j59841r5777N8209J48175J18597Q7625J40328K01990J68739
42694F21153N4174l5579j2954J04147J88794J51969J10176K58264N30839O36683
$$ y = [263797, 277365, 365094, 517957, 615926, 525998, 259553, -47205, -264645, -307232, -119215, 243447, 550199, 558464, 261643, -117714, -382459, -506911, -529549, -435103, -207576, 86358, 338345, 482807, 512543, 464798, 411231, 393552, 350873, 195950, -14459, -99382, 2980, 135790, 154630, 129476, 184323, 253810, 185901, 12984, -93619, -111446, -180744, -316997, -353751, -244340, -180872, -281883, -377052, -279188, -83319, 23318, 94548, 300741, 563341, 610722, 394685, 179030, 161304, 241510, 246138, 168733, 75454, -46892, -206733, -302510, -244301, -96126, 22471, 110096, 250424, 452414, 621153, 675327, 639748, 626794, 730941, 919735, 1071704, 1181880, 1440144, 1970983, 2607666]
42684B607666N61113O96930J162474J317995M97833r16984j766727j504393p50127
42675A905780l05096j95263k7600K03838J81025j25910l97502m37601l46659k60164
42665A94848j96377j46606j05362l4308O2983J08701J06728J81519L21755K84710
42655G78591m0394l73056l98775k09428j07295j32741j04424N05M9882N2933J13751
42644c70451J57705M9884p5013K1734K22278J73447j08388j94904Q3531L50623
42634C10446K58118k7069j57421j18325j21749k12351k68965k57050k28682j61757
42624i84805o18K09758L78254M82306N16686M26821K04300m5417k19987l05243
42614F62055k91731j57746N69Q036j28694j96985j20338r3000k20748k78783o0872
$$ y = [2607666, 3168779, 3865709, 5028183, 6346178, 6844011, 5927027, 4160300, 2655907, 1905780, 1600684, 1405421, 1377821, 1581659, 1762684, 1636774, 1239272, 801671, 455012, 194848, -1529, -148135, -253497, -287805, -224822, -116121, -9393, 172126, 493881, 778591, 738197, 365141, -33634, -243062, -350357, -483098, -587522, -587017, -537135, -484202, -370451, -212746, -162862, -237875, -216141, 6137, 179584, 71196, -123708, -40177, 310446, 568564, 541495, 384074, 265749, 144000, -68351, -337316, -594366, -823048, -984805, -985423, -775665, -397411, 84895, 601581, 1028402, 1232702, 1187285, 967298, 662055, 370324, 212578, 213147, 221183, 92489, -104496, -224834, -317834, -538582, -817365, -878237]
42603h78237K42552K99511J18949j6862M941N6157P3320J22395J66360O7469j35044
42592A21511k17302j16564m4477j46065k55512j45874J23145K79286J95388K5991
42582a80473j3154R6446J80576J03293o0493j23708l5360N6004J5969r3082j17876
42571a71858k9005O9022R9990R0018R3101J18204J31597R4199P689p3682j19455
42560C09820j84480k94710l06821o6313K78616L64502J12258j20101o3126M8586
42550G8231j26133m31502l99438L5820M08578L62085P7462o8825j0743K7815r8398
42539a45048k84788l27198j51577R8327K03097J20404K6765M8851Q5479K8476
42529b97212k029J28467K57213J33701j35860k02345j7297J08787L2836l2288
$$ y = [-878237, -635685, -336174, -217225, -234087, -229146, -172989, -99669, 22726, 189086, 256555, 121511, -95791, -212355, -256832, -402897, -658409, -804283, -681138, -401852, -206464, -180473, -193627, -97181, 83395, 186688, 126195, 2487, -32873, 23131, 39100, -53982, -171858, -200863, -131841, -31851, 58167, 151268, 269472, 401069, 495268, 502957, 429275, 309820, 125340, -169370, -476191, -542504, -263888, 100614, 212872, 92771, 29645, 78231, -47902, -479404, -878842, -843022, -434444, -72359, 5103, -63722, -74465, -46650, -145048, -429836, -757034, -908611, -810284, -607187, -486783, -460018, -411167, -325688, -297212, -299241, -170774, 86439, 220140, 84280, -118065, -135362, -26575, 6261, -26027]
42519b6027K8681p90k31141l60592j15127K79601M02675K19137K3626m9127j07615
42508F3301j75986j32965Q379N1099q9227k50427k54163j16432K3035O5003J3681
42497g94702l7852J5350J58986K45894J88810R0644P9354J08439O5715r971k952
42486A07715N2388K3138p2778q0241K3116P7581L723p7777o2606l2651j04651
42475a43043k27788k45507j00004J04314K11407J53102J2650m3915N3498J79197
42465d6089J56400j0775j34232p5063R8644K00358J12279j14787k95608k63709
42455c72582m5854J52952J97143J80752K41910L05113J77053j33723l75565l54074
42445b6875j28458J09124K07392R8223j64094l57352k52690Q9997L21327J98296
$$ y = [-26027, 2654, 1864, -229277, -589869, -704996, -425395, -22720, 196417, 220043, 170916, 63301, -112685, -245650, -237271, -186172, -275399, -525826, -779989, -896421, -873386, -808383, -794702, -832554, -817204, -658218, -412324, -223514, -132870, -53516, 54923, 120638, 110667, 107715, 160103, 183241, 110463, 30222, 53338, 130919, 134642, 56865, -5741, -38392, -143043, -370831, -616338, -716342, -612028, -400621, -247519, -234869, -278784, -225286, -46089, 110311, 99536, -34696, -109759, -11115, 189243, 301522, 186735, -108873, -372582, -418436, -265484, -68341, 112411, 354321, 659434, 836487, 702764, 327199, -26875, -155333, -46209, 161183, 259406, 95312, -262040, -514730, -424733, -103406, 94890]
42435I4890j20140k72694j14459J60606K70359J34966p4589j38840l0156P7569
42425a2488N3381k6363m0701l8790j24128k08799j19295P6339J17397l1007r0811
42414d45265Q2129K33932R2464j94738k43888N5678M29720N57281L54070k8656
42404H92727l39886l97925k37873o6436k0536m9819p0044q4125q1416N563J37404
42393c12366J49164K5195j6477J21228K09746O9743q8338p06J78528J10776j63842
42382B82651k94518j71620r294Q1335J87211K67255J66025m136N5424K73533K07237
42371A041103k34388n41599l47691J6826O6438j18806j40282L5606J10270N433
42361a07090o6079j0707N1570O7109Q7395O5891o7858j76499q2070P7262J1107
$$ y = [94890, -25250, -297944, -412403, -251797, 18562, 153528, 78939, -59901, -90057, -12488, 40893, 14530, -26171, -64961, -189089, -397888, -517183, -440844, -323447, -354454, -445265, -363136, -129204, -36740, -231478, -475366, -419688, 10032, 567313, 921383, 892727, 552841, 154916, -82957, -149393, -169929, -219748, -289792, -373917, -455333, -449770, -312366, -163202, -138007, -154484, -33256, 176490, 246233, 157895, 157189, 335717, 446493, 282651, -11867, -183487, -192781, -111446, 75765, 343020, 509045, 504909, 560333, 833866, 1041103, 806715, 265116, -82575, -65749, 689, -118117, -258399, -222793, -112523, -107090, -173169, -183876, -132306, -65197, 22198, 88089, 20231, -156268, -238338, -161076, -149969]
42350a49969k15816k27053O2798K78958J49135j19661k07217j05254M5634K54081
42340b34364N20827O04076K95906j64039l00660m3347J54649n4558m14682m07463
42330d3655L2126M06096K95142j16046l22806j68824L2830K7409m7028J3005J01266
42319B09515K2939j03604j1526K29037K55213l4148l06670k77619o8234N8902
42309b6195O5239N6018M4583O153K0666J55537K92916K46571j411k99246m93231
42298F7600n02274l20387n6290J13024J30235J17880J73326K22223J74834R1453
42288B11624N4963L969j40783k81541k57949j00372J022m3458j29972j11254O0028
42277g33723L01422M36119L30766Q0280n0288K8724Q1944j01774l54914l51640
$$ y = [-149969, -365785, -592838, -530040, -251082, -101947, -221608, -428825, -534079, -488445, -234364, 286463, 890539, 1186445, 1022406, 721746, 678399, 833048, 778490, 363808, -43655, -11529, 394567, 689709, 573663, 250857, 82033, 114863, 142272, 95244, 108249, 209515, 232454, 128850, 117324, 346361, 601574, 567426, 260756, -16863, -85097, -26195, 39044, 95062, 139645, 145798, 166464, 322001, 614917, 861488, 860077, 560831, 67600, -434674, -755061, -811351, -698327, -568092, -450212, -276886, -54663, 120171, 211624, 266587, 270556, 129773, -151768, -409717, -510089, -509067, -552525, -682497, -793751, -733723, -432301, 3818, 334584, 414864, 364576, 393300, 475244, 373470, 18556, -333084]
42267c33084r1407R5715Q173k01700k86384j78665L9890K63626L82498L13832
42257A2494R3788j34307k49245k17670p3210P5034P5224q8031k00868p0288J77594
42246e99485K41700O5335j05273r4488K93M1472O6677J54587K43786K21982R2019
42235C28605n4635j47815j51842o0090N8590R5777M0274j2028k7918j00845k73724
42224c05651m04360l09790P392L47905M95997L78763J02329j31733j85926q6732
42214i1806M8956J45095J69642Q3302q7838j77308m1115K05789K78396P6566j90952
42203D18727k72517j35155P0875J82811J26178m1025j56277j20082k9693m0142
42193C700j33333j73192j43177j37048j42198n3272R8466J58358J09850R5583
$$ y = [-333084, -424491, -328776, -320603, -522303, -808687, -987352, -947462, -683836, -301338, 12494, 106282, -28025, -277270, -494940, -568150, -493116, -417892, -505923, -706791, -777079, -599485, -357785, -292450, -397723, -492211, -491918, -450446, -383769, -229182, 14604, 236586, 328605, 273970, 126155, -25687, -85777, -27187, 68590, 108864, 96836, 68918, -31927, -305651, -710011, -1019801, -1012409, -664504, -168507, 210256, 312585, 180852, -5074, -91806, -42850, 102245, 271887, 355189, 267351, 90043, 48928, 254717, 533113, 609679, 418727, 146210, 11055, 81930, 264741, 390919, 349894, 193617, 73535, 43842, 3700, -129633, -302825, -446002, -583050, -725248, -778520, -680054, -521696, -411846, -316263]
42183c16263J55304J77510J33502J08686Q1984m8676k02076j90274q3327j26374
42173c10004k45910q9910L14489M50836J02925k51096j78091O3159N7833m1232
42163a27001J03150K76512M3428l99018m12365R0248N05872M44749J68370J7093
42153G11038l8885j00983q7189J0239J8199p6696n5193J07486J37185m0212j14190
42142D70799O4086J66778p1733l72010l38888q3199q189j72102k70455j53721
42132g68634N072L9080p662k2535L1068J20815J70084J15567K9764P9010K57814
42121D9443L21311J27597j20548j60928l8743K7683L465J2797O6912P2427M0090
42110D01506M7718N9801J2494k656J06011J76816L967k51294k21015P2247J67556
$$ y = [-316263, -160959, 16551, 150053, 258739, 340723, 292047, 89971, -100303, -183630, -310004, -555914, -645824, -331335, 119501, 222426, -28670, -206761, -143602, -85769, -127001, -23851, 252661, 296089, -102929, -515294, -425046, 80826, 525575, 693945, 711038, 672153, 571170, 483981, 494220, 512419, 435723, 380530, 488016, 625201, 584989, 470799, 534885, 701663, 629930, 257920, -80968, -164167, -172356, -344458, -614913, -768634, -763562, -724482, -732144, -754679, -723611, -602796, -432712, -317145, -287381, -208371, 49443, 370754, 498351, 377803, 216875, 178132, 205815, 209280, 222077, 288989, 361416, 401506, 449224, 509025, 521519, 518863, 624874, 801690, 805657, 554363, 333348, 405595, 573151]
42099E73151j52294m96683m25512p8613P5741o1406j40717N9259L20414L34819
42089H159J12796j05310j83761j71668j32943o3500K9441R7434J34241J96026
42079g9085K89376L11874J76119m3526j64575j00973L5716N9671q1181k34780
42069A68636j99819L3160K35576K06187M7716L9331K18753K87607M6701k69306
42059H14542l06001r8301J5133p8065j42959l7906N0926m7975j88136j48672J2542
42048a54872P3401n682o2359L342J21412J76826J15237l6942j62714j30983K7142
42037c6192J11395K2521q1071l4515N8618L844j30121q8137J59369L33858K34481
42026E54050k190j22489p0680L2932J02878J35928J13776J215j56323k36810j82296
$$ y = [573151, 420857, -75826, -501338, -579951, -504210, -565616, -706333, -647074, -326660, 8159, 120955, 15645, -168116, -339784, -472727, -536227, -506786, -409352, -275111, -79085, 210291, 522165, 698284, 654758, 490183, 389210, 424926, 484597, 403416, 168636, -31183, 1977, 237553, 443740, 491456, 530787, 749540, 1037147, 1083848, 814542, 508541, 410240, 425373, 347308, 204349, 166443, 217369, 169394, -18742, -167414, -154872, -81471, -87153, -149512, -146170, -24758, 152068, 267305, 230363, 67649, -63334, -36192, 75203, 97724, 16653, -17862, 40756, 44600, -85521, -173658, -14289, 319569, 554050, 551860, 429371, 358691, 391623, 494501, 630429, 744205, 745420, 589097, 352287, 169991]
42015A69991p9588n5062j16249j49756p4405N9770J47290J45258P2891m8101j82473
42004a10434k57627k35108j71493j28144p2600L2993J17944J14034J03522J77758
41994d29155K25107R5938p8347l1729J80325K23512L8117m8284R5538J37676j31065
41983B77633l52192j41568K43011K68661l6486j49647J07861L27624J80592j33890
41973E91599k67755j93750r7654o3322n9635o7335p0203m3294l3307j25573k84525
41962g14754l61697k87530j18824R0478K93152L54533J80067o5686j10649L7138
41952g03772J07361j731r6058n1178p9l7674l0628J10290K24922J65002M7685
41941b65860N3612J53118K13732K07732J42147l4001k64458l10857o3387K23439
$$ y = [169991, 90403, 35341, -80908, -230664, -305069, -245299, -98009, 47249, 120140, 72039, -110434, -368061, -603169, -774662, -902806, -975406, -942413, -824469, -710435, -606913, -429155, -204048, -108110, -186457, -218186, -37861, 185651, 223768, 175484, 271022, 408698, 277633, -74559, -216127, 26884, 295545, 259059, 109412, 217273, 544897, 725489, 591599, 323844, 130094, 32440, -30882, -90517, -157852, -228055, -271349, -304656, -430229, -714754, -1076451, -1363981, -1482805, -1392327, -1099175, -744642, -564575, -630261, -740910, -703772, -596411, -598142, -694200, -745378, -745457, -783131, -813759, -703469, -478547, -313545, -265860, -212248, -59130, 154602, 362334, 504481, 470480, 206022, -104835, -168222, 55217]
41931E5217K31785l064j93422k04205j32027o8291j1618L2325N7100J15080K07324
41920H6204J91283k1205k56183k71914r7527L0752J8152k2981j8127p639J5759
41909c53426J15059K26840J86472j0718j61166j27675K027Q6344R6560N1934m5600
41898F6651j27962o7749J22043K23324P3740j97980l16159j73340J01006L21889
41888B5463L84763K68852L9281j53142j87283j12745q6731j43472j30549N4263
41878d1300K57047K33448p166j76001o5486J97248L38723K62706O9395j40344
41868I28270l11636l54123k15695k8679J1481o9660n7223J04671K12038J23967
41858C43411k9261p7194m5866j8585M5697J72631K21072Q0477j17985k00088k24609
$$ y = [55217, 287002, 283938, 90516, -113689, -245716, -314007, -325625, -293300, -236200, -121120, 86204, 277487, 256282, 99, -271815, -369342, -338590, -320438, -343419, -361546, -369185, -353426, -238367, -11527, 174945, 164227, 3061, -124614, -122587, -36243, 60317, 112251, 66651, -61311, -129060, -7017, 216307, 290047, 92067, -224092, -397432, -296426, 25463, 410226, 679078, 718359, 565217, 377934, 265189, 178458, 34986, -95563, -41300, 215747, 449195, 442029, 266028, 200542, 397790, 736513, 999219, 1068614, 928270, 616634, 262511, 46816, 18137, 29618, -40042, -97265, 7406, 219444, 343411, 314150, 236956, 191090, 172505, 218202, 390833, 611905, 692382, 574397, 374309, 149700]
41847A49700l21974l83560k08825J01527K17929N8773r9156m1739J23243K18334
41837a85748K52443K83431K35349L6200j92577k56951j34566K8024J13369J26746
41827C05720J22683J17970P8561k8676j62823k18419j58307q5759r4718j11683
41817b35451k5412Q4522M6053r6352j05458P5755K18935J73514R3449J45562K11284
41806E86401R9476j04007j55626l7755K9219o3036j75122j62011o8208k6931r2191
41795a69791k14580k91093k25147k6096J59316K13280K14552L04533M13402L12502
41785F90878k3501l07064k95411r4220L3971K9128K5416P4217Q1681O029p0040
41774A51084r1551r6799q8099M763J53720J76241j7253k25081j69597J28223L47913
$$ y = [149700, -172274, -555834, -764659, -663132, -445203, -386430, -485586, -527325, -404082, -185748, 66695, 350126, 585475, 621675, 429098, 172147, 37581, 65605, 178974, 305720, 428403, 546373, 624934, 596258, 433435, 215016, 56709, -29050, -123768, -235451, -260863, -176341, -130288, -226640, -332098, -256343, -37408, 136106, 229555, 375117, 586401, 685877, 581870, 426244, 388489, 417708, 354672, 179550, 17539, -50669, -77600, -169791, -384371, -675464, -900611, -926707, -767391, -554111, -339559, -35026, 378376, 690878, 667377, 360313, 64902, -29318, 4653, 33781, 59197, 133414, 215095, 221124, 151084, 59533, -37266, -125365, -120602, 33118, 209359, 192106, -32975, -202572, -74349, 273564]
41763B73564K54496m6408k73356k78434j35547n480J3295n3891q1305M7720L03952
41752A8606M95880M30912J06050k64085m13518k51015M4819J80330M5999j58817
41742B35161j58652O6651K72251K65837J26421O2604J34370J87503M7944k49499
41732I90591m42434l01719O5854K77915J27861j48579k19432j31268j61993k87576
41722b30780j89778J53771L18811P7656j96433q7603K15613K36171n0102k46441
41712H85j92860j14755j21910k7534K25926L68118K16369j9644n5604P3706J30865
41701D83562J4315j81446l08333k51537j2142K11276J82347n4002j91972q1075
41691a89007R1780J38534J41116K15250K33836K7204k92354m47415l48921j38959
$$ y = [273564, 528060, 481652, 208296, -70138, -205685, -211165, -197870, -251761, -333066, -285346, 18606, 514486, 945398, 1051448, 787363, 373845, 122830, 167649, 347979, 393978, 235161, 76509, 143160, 415411, 681248, 807669, 870273, 1004643, 1192146, 1240090, 990591, 548157, 246438, 312292, 590207, 718068, 569489, 350057, 218789, 56796, -230780, -420558, -266787, 52024, 129680, -66753, -154356, 61257, 297428, 247326, 885, -191975, -306730, -428640, -456174, -230248, 137870, 354239, 334595, 278991, 352697, 483562, 497877, 316431, 8098, -243439, -255581, -44305, 138042, 84040, -107932, -189007, -97227, 41307, 182423, 397673, 631509, 658713, 366359, -81056, -429977, -568936]
41681e68936L4694J11917P9112Q466M9657K15843K82956Q8370j82288k31477q1555
41670a93241q317q9138j07252O0290K33008K18612J07550J17802K60102L15719
41660I15135J30289j70959l05241j58537O2188P5998r9644j74432k2490J10561
41650C62868j1329k13333j44702J80830L68840J74802j97722l83987k47531P1567
41640c9697L24382L14443M8698k19344k32116l5200J06256Q7479M4947L8275p0523
41629C67600l03521l99670j68521J81407L01526J59889P710j0844L5851J00589
41619B72016K27896L59297L05667J6789k81954l37104j52465O5793J65736J50329
41609G92000Q0212k412n0702j7665O1904N3836j26660l56184l88026j46587J40825
$$ y = [-568936, -534242, -422325, -343213, -334747, -285090, -69247, 213709, 302079, 119791, -111686, -193241, -201558, -290696, -397948, -337658, -104650, 113962, 221512, 339314, 599416, 915135, 1045424, 874465, 569224, 410687, 472875, 548873, 449229, 274797, 252307, 362868, 351539, 138206, -6496, 174334, 543174, 717976, 520254, 136267, -111264, -39697, 284685, 599128, 647826, 428482, 196366, 161166, 267422, 354901, 399848, 438123, 367600, 64079, -335591, -504112, -322705, -21179, 138710, 146420, 135576, 171427, 272016, 499912, 859209, 1164876, 1181665, 899711, 562607, 410142, 475935, 641671, 792000, 872212, 869800, 819098, 801433, 863337, 917173, 790513, 434329, 46303, -100284, 40541]
41598D0541K00120M4644p7558m7244o020p7497j49393p4477N7969N1867p0639
41587a07687r4463M8638J85473J94085J78655K39143K50194N5352k26816l09214
41577D13360j32182M7023R729j46463j85831o6280M8272M6998p098j5499K9198
41566D1227R0426J45850J37504k5809l10573m82204l30278M7352L17516K83132
41556h5857O6676r4248r9733J5231J91736L43816L50603J89633J5964k2513N426
41545H76734o6088k17926k67155j68558r0546j29743j48917k5998J00839K4591
41535a12767j86223k43388l4352K13206K14909l4582k71753k51467J6154K83022
41525d07241L02099O9699j82782k52464j63680o3311j1300J9692J8340l0727k6681
$$ y = [40541, 240661, 285305, 207747, 160503, 154483, 76986, -72407, -146884, -88915, -37048, -107687, -202150, -153512, 31961, 226046, 404701, 643844, 894038, 949390, 722574, 413360, 281178, 328201, 337930, 191467, 5636, -60644, -12372, 34626, 27528, 12029, 41227, 131653, 277503, 415007, 389198, 78625, -403579, -733857, -686505, -368989, -85857, -19181, -113429, -213162, -197931, -6195, 337621, 688224, 877857, 893821, 871308, 876734, 810646, 592720, 325565, 157007, 66461, -63282, -212199, -238197, -137358, -112767, -298990, -542378, -576730, -363524, -148615, -183197, -454950, -706417, -690263, -407241, -105142, -35443, -218225, -470689, -634369, -697680, -708980, -689288, -670948, -701675, -728356]
41514g28356J42647L66358L82403J44703p6758o9948K6515l5599k25168k91425
41504c64628j42355M4833R1493K9622J2218J22175K94210L52661J46135k57983
41494C28381n38844m14222J6530L40543K79272k9901k39252j82045P300J00433
41484c31805K2700j01096j05929L3902J99167K82375K87100K53441J74021N3349
41474G67225k5799O368R6309J36348R4661m765j51936k89232k73776n9932J56878
41463D52349J65678M5193K1762P2246m3679l30283m51363k11720J24073J89984
41453C4240p90j47738r5479M8101J48653J94834K27909K69904L22420L50009K90876
41442A642939J45151k396j00202j90122k96553l59419l42233k90430k15327o4503
$$ y = [-728356, -585709, -219351, 163052, 307755, 230997, 161049, 187564, 151965, -73203, -364628, -506983, -462150, -370657, -341035, -328817, -206642, 87568, 440229, 586364, 328381, -210463, -624685, -608155, -267612, 11660, -18241, -257493, -439538, -432238, -331805, -309105, -410201, -516130, -482228, -283061, -686, 286414, 539855, 713876, 767225, 741426, 747794, 844103, 980451, 1075112, 1070347, 918411, 629179, 355403, 295471, 452349, 618027, 663220, 684982, 757228, 713549, 383266, -68097, -279817, -155744, 34240, 33450, -114288, -209767, -161666, -13013, 181821, 409730, 679634, 1002054, 1352063, 1642939, 1788090, 1785694, 1685492, 1495370, 1198817, 839398, 497165, 206735, -8592, -73095]
41432g3095J08698J25377l6208j23322L9939K51677K13362k3186j55797q9071
41422B38374o145k1186m7776l1629m8902j13346j13310j7909M4802r432j04001
41411b30460j45325j24019k5978J79804L96962M19538J89342r9375k28854j67047
41401A64588k793J68764K34482J12591r6615j76895j05316j07218k81409l83048
41391d72869j76000J78503L36440K52137J67104J84033J57130K5656m2719M5037
41381F54452J02216o4156l31261m03855k03265N6017J48934N6419r7333j94618
41371b76450j76335l9453J54421K97849K99728J38733j10414k81390k18510L8509
41361a73312K25948J40154p8938j13290Q1932K08769Q3611q0300l1195R6560N104
$$ y = [-73095, 35603, 160980, 124772, 1450, 41389, 293066, 506428, 483242, 327445, 238374, 232229, 211043, 163267, 131638, 82736, -30610, -143920, -161829, -117027, -126459, -230460, -375785, -499804, -525782, -345978, 50984, 470522, 659864, 560489, 331635, 164588, 161795, 330559, 565041, 677632, 581017, 404122, 298806, 191588, -89821, -472869, -648869, -470366, -133926, 118211, 285315, 469348, 626478, 652134, 609415, 654452, 756668, 692512, 361251, -42604, -245869, -189852, -40918, 15501, -81832, -276450, -452785, -492238, -337817, -39968, 259760, 398493, 288079, 6689, -211821, -173312, 52636, 192790, 113852, 562, 82494, 291263, 374874, 294574, 263379, 359939, 365043]
41350C65043k47424k96179k2751K79210L55228K92310K48772J75138o490j78262
41340I64595j99041j33485j14231j24874r8549p3669o6283L7634K48120L15413
41330G55630P6465k08621j86286M9008J03134r8263k32292j27432J0458J3796
41320A55597K3183J67665K78176J42781j56785l64089l57919j92620K7418J78328
41310i8265J64227O2943Q4213K62974L53418J71556j17515k32920j61379j00772
41300C88480j17626q8727M3915J64792J59707N5239n2196j09282j23008j30989
41290A90305j61721j83478j22259K1767J32405J29249J02098J80649L04673K66894
41280H60582P612k64734l18007j65808M32P3914R2992P0226n8761k52485l01001
$$ y = [365043, 117619, -178560, -201311, 77899, 433127, 725437, 974209, 1149347, 1142857, 964595, 765554, 632069, 517838, 392964, 294415, 220746, 154463, 192097, 440217, 755630, 832095, 623474, 437188, 486196, 589330, 491067, 258775, 131343, 141801, 155597, 178780, 346445, 624621, 767402, 610617, 246528, -111391, -304011, -276593, -98265, 65962, 128905, 213118, 476092, 829510, 1001066, 883551, 650631, 489252, 388480, 270854, 182127, 226042, 390834, 550541, 605780, 553584, 444302, 321294, 190305, 28584, -154894, -277153, -255386, -122981, 6268, 108366, 289015, 593688, 860582, 868194, 603460, 285453, 119645, 120077, 193991, 286983, 357209, 298448, 45963, -255038]
41269b55038r7657J45869J56473l016l8453R9862J42374m3886k40212k55415k09793
41258e98892k28868j56181J25648L45209J95808j35050j99623N1044K59692K56387
41248h4826K17721K21829R3947j99891l97871l24617j05081J14211L27834M49666
41238C12922K96436m4275j83335K8823K53484J73131o5973j68440j45752j63792
41228B93229j86460q8283O1169J15974J05093J11005N9807j08095k17306r0924
41218E5209J15186R4176j64663l55666k48846P6030L42298L08205j7152l04414
41208i9637k12136J51475L07259N8469k37690k36670r7844j18360k09816j31822
41198h26772K1990J9259l0856J30373L77312L55646R9487j3463Q6219P0221j51713
$$ y = [-255038, -352695, -206826, -50353, -53369, -91822, 8040, 150414, 106528, -133684, -389099, -598892, -827760, -983941, -858293, -513084, -317276, -452326, -651949, -600905, -341213, -84826, 132895, 354724, 448671, 248780, -149091, -473708, -578789, -464578, -136744, 312922, 609358, 565083, 381748, 410571, 664055, 837186, 771213, 602773, 457021, 293229, 106769, 18486, 79655, 195629, 300722, 411727, 471534, 363439, 146133, 55209, 170395, 264571, 99908, -255758, -504604, -428574, -86276, 221929, 204777, -99637, -311773, -160298, 146961, 205430, -32260, -268930, -366774, -485134, -694950, -826772, -804782, -785523, -816379, -686006, -308694, 46952, 146439, 132976, 219195, 289416, 137703]
41187A37703k18136P5666L95216L58177P7091p7446k1160K7502n9273j70743j66895
41176C57702n4390N9440R4581O0458J4052l2978j26472k66837l67131l67930l06080
41165i35585k03817j0005K49762M00905L32506J58230L2449m8645j17186q6844
41155b28230O6540J54604M0140j10094q3602L0736K6087n6929n4267r726m0372
41144b65113j7046K28988M83396L60660r0719m03186l25003o8067R8892J41917
41134A44719J08843K4685j4160O1048R7842o7103k53102j58604J06344J41851
41124A92363q8708j96823k4271J14046k5824k66937l67733l32440k08532M0350
41114a164509K99139L18171J25873M8443J71136J94229k477j07481O7228K29073
$$ y = [137703, -80433, -4767, 390449, 748626, 825717, 748271, 727111, 754613, 695340, 524597, 357702, 303312, 362752, 457333, 517791, 531843, 498865, 372393, 105556, -261575, -629505, -935585, -1139402, -1149407, -899645, -498740, -166234, -8004, 24445, -24200, -141386, -228230, -161690, -7086, 33054, -77040, -160642, -129906, -103819, -160748, -215015, -224741, -265113, -282159, -53171, 430225, 790885, 700166, 296980, -28023, -96090, 2802, 144719, 253562, 278247, 264087, 325135, 422977, 355874, 102772, -55832, 50512, 192363, 103655, -93168, -117439, -3393, -29217, -296154, -663887, -996327, -1204859, -1164509, -865370, -547199, -421326, -372883, -201747, -7518, -9995, -117476, -50248, 178825]
41104A78825J16762m3735L3816J70481M5021k23071k43147M9813L35256L51670
41094G71691J26911j43255k44009r1827J10626M4677k66468m09920j52902K16835
41084c7641L21953J80363K0700r9179k02447j75919M2903K55037K60983J60469
41074G27222J47526J99629K05792J87518J49900m6789l94336n60290l17499O1130
41064C59803J56117l6213k05611k13711j59425j08614o1664o8751j25822r8421
41054e62312M0416R9956J2583J4997K24701L39245R6124k54081l16843j36885
41044d42099j5533j149J5674m2516k23211k34856J23953M53524K53810k39960
41034c52363l54838l469K63935K03218J58687K99739K74244j19099m96028m56093
$$ y = [178825, 295587, 251852, 285668, 456149, 501170, 278099, 34952, 84765, 420021, 771691, 898602, 755347, 511338, 419511, 530137, 574814, 308346, -101574, -254476, -37641, 284312, 464675, 485375, 386196, 183749, 7830, 50733, 305770, 566753, 727222, 874748, 1074377, 1280169, 1467687, 1617587, 1570798, 1176462, 616172, 298673, 359803, 515920, 479707, 274096, 60385, -99040, -207654, -269318, -338069, -463891, -562312, -521896, -421940, -409357, -394360, -169659, 169586, 265710, 11629, -305214, -442099, -457632, -458781, -443107, -485623, -708834, -943690, -819737, -366213, -112403, -352363, -707201, -710670, -446735, -243517, -84830, 214909, 489153, 370054, -125974, -582067]
41024e82067j43540P8138J48345J97414K05909Q1021j12209k21248j76913J6643
41014e08507K91777M53743L25819K4019j39661p7515q56l6261o0499M198K9493
41003C05750o1507j34435o8847P2307J90599K59574K24016K2936k26797l00777
40993B82819j69399n012J13618K27701K44470J4653k96063l05445R310K21902
40983C38554R1528j02043n9061Q4324P0571l7773m7003q959q8467k39073k99987
40972b97389k64072j92733k0674K86920N18968M42717J57293l5391m7794m4068
40962E03777j01891j00202K0488J03287j8903k77697m24977l04065j7375J85260
40952d32298J74036N5197m323P277k088l0166J4533J29607K02427J90895J72170
$$ y = [-582067, -725607, -647469, -499124, -301710, -95801, -14780, -126989, -348237, -525150, -508507, -216730, 237013, 562832, 586851, 447190, 369675, 368819, 332558, 272059, 276257, 305750, 244243, 109808, 40961, 113268, 303867, 563441, 787457, 810393, 583596, 282819, 113420, 108408, 222026, 449727, 694197, 708850, 412787, 107342, 116652, 338554, 430082, 328039, 268978, 353302, 423873, 386100, 339097, 330138, 241671, 2598, -297389, -561461, -754194, -774868, -487948, 31020, 473737, 631030, 595639, 547845, 503777, 401886, 301684, 322172, 425459, 406556, 128859, -296118, -600183, -617558, -432298, -258262, -203065, -207388, -200111, -202199, -232365, -217832, -88225, 114202, 305097, 477267]
40941D77267J87157J75768R4942k4188j49829k54097k50892q0563J40100K10309
40931E25974J01111k7982o5609m3077j260N8614Q7841L1888l7409q075O5158L6677
40919G23851o3657o7606K7321M1855o5081j19379m3741K790r5757k06223j44668
40908a0295P6859K99231L82279K67056R782k07666k36850j47466j17045j62864
40898A53021j60221r2627o6013q8127o3723p737k6807q2848j8572J63324K82271
40887h059K55395J62050M1948j19995k21933j35037L8667Q0053Q448J5882P2524
40876A89943l3931k49873k50703L0452K51728J66040o5810j86795j42461L7158
40866b54252L10319M62836K36945k29178m43983k16270P6168O2023j18317j20575
$$ y = [477267, 664424, 840192, 935134, 910946, 761117, 507020, 256128, 175565, 315665, 525974, 627085, 599103, 533494, 490417, 489157, 547771, 635612, 667500, 630091, 622016, 687174, 723851, 660194, 592588, 619909, 661764, 596683, 477304, 433563, 436353, 340596, 134373, -10295, 66564, 365795, 748074, 1015130, 1024912, 817246, 580396, 432930, 315885, 153021, -7200, -99827, -165840, -253967, -317690, -325427, -352234, -435082, -453654, -290330, -8059, 247336, 409386, 451334, 331339, 109406, -25631, 13036, 93089, 101537, 117419, 189943, 156012, -93861, -344564, -314112, -62384, 103656, 37846, -148949, -291410, -254252, 56067, 518903, 755848, 526670, 82687, -133583, -57415, 4608, -113709, -234284]
40856b34284P9354K33605J98786M8685n7685l369J61014K04108J3358j54147j1379
40845D78046K53450K20270o4495j40369Q9775K04708R274j62734j10091j29200
40835F48634l87173m90363j22520L36373L19548j17602m52743m20688j76983P1919
40825g91598K38396K77896K10738J20991J2086j46460j86776J01740N06316N21104
40815H64433J03087j83954j8025J90499r952l99927m85206k28837M0886J61300
40805C4304J82322J21811Q038m0609k0233q4118k10803j57035R2077K19575J07989
40794B53318L6854J47462J91284M4173m0567M8610M6108j31522j63947L6465Q5024
40783E53262j40773j91138J36624L64224J72296m8451J335n2853m24405n41203
$$ y = [-234284, -154930, 78675, 277461, 326146, 268461, 265092, 426106, 630214, 643572, 489425, 478046, 731496, 951766, 887271, 746902, 836677, 1041385, 1050659, 887925, 777834, 648634, 261461, -228902, -351422, -15049, 304499, 186897, -265846, -686534, -863517, -791598, -553202, -275306, -64568, 56423, 68509, -77951, -264727, -162987, 343329, 864433, 967520, 783566, 765541, 956040, 946088, 546161, 60955, -167882, -126996, 34304, 216626, 338437, 346475, 305866, 285633, 201515, -9288, -166323, -74246, 145329, 253318, 290172, 437634, 628918, 673091, 632524, 681134, 727242, 595720, 431773, 468238, 553262, 412489, 221351, 357975, 722199, 894495, 846044, 847379, 794526, 370121, -171082]
40773a71082j7894M84897K47054l08607l33800Q1941K42014P4672L8415J51104
40763D88714P7652q5545l934J70688Q6131r0505k3260P8129j04086k59538q434
40752C26012K64626P7009j41565K26832P18020M48911l07683n05627n0288J88562
40742A244809l2882q6964J68336J32201k86879m26842j12251L5690k13920l22495
40732I8803o1783J05087O106O9219L47598K82149k12796m36425o7324L06392K32075
40721F69101O8935J88072L25684J81051n7461j68235k37721k68824p7962K26019
40711H48659K92894J52755J18572R3573k31127n58167l09046K54481K77475k66652
40701F73417m97141r3179K85200K42188J83399L39823L50384J23172O6018J76728
$$ y = [-171082, -188976, 295921, 542975, 234368, -99432, -17491, 224523, 299195, 337610, 488714, 566366, 480821, 476887, 647575, 733706, 643201, 619941, 698070, 593984, 334446, 326012, 590638, 667647, 526082, 752914, 1470934, 1919845, 1612162, 1106535, 1056247, 1244809, 1211927, 1124963, 1293299, 1425500, 1138621, 711779, 599528, 635218, 421298, 98803, 37020, 142107, 148213, 217432, 565030, 847179, 634383, 197958, 130634, 437026, 669101, 738036, 926108, 1251792, 1432843, 1375382, 1207147, 969426, 700602, 622640, 848659, 1141553, 1294308, 1412880, 1506453, 1275326, 717159, 408113, 662594, 940069, 673417, 176276, 83097, 368297, 610485, 793884, 1133707, 1484091, 1607263, 1673281, 1850009]
40691A850009m8112n37776n67298k8380L16912J34935l5901Q3186P7193j67926
40681A076842j79614R7203J42581o0640K2205K83080M4259n04043l97591L27758
40671H52040N19786r1053m12562L6349L51151J5199k20383R4632K74569n5113
40661A364615k29375O0115J82610k2991J23833N82832M29172k36487j72896O51162
40651B732590P58518j17221l89743M46319P81031j05428o27766J56577Q19337
40642D454214L34989n9263M99863O74354l52702r92870j67425N50561r5640o47180
40632D198901J57623Q58818J97668k82296P18232J517354O69907q0435Q47206
40623H802978J730999J051173P12426K156054K991360J573708Q77206L158045
$$ y = [1850009, 1801897, 1264121, 696823, 668443, 985355, 1120290, 1084389, 1167575, 1244768, 1076842, 897228, 994431, 1137012, 1076372, 1098577, 1381657, 1425916, 921873, 524282, 852040, 1371826, 1280773, 868211, 904560, 1255711, 1270910, 1050527, 1145159, 1419728, 1364615, 1135240, 1195355, 1377965, 1354974, 1478807, 2061639, 2490811, 2254324, 2081428, 2732590, 3491108, 3373887, 2984144, 3430463, 4211494, 4106066, 3478300, 3634877, 4454214, 4789203, 4729940, 5229803, 5904157, 5551455, 4558585, 4391160, 4941721, 4846081, 4198901, 4356524, 5215342, 5413010, 5130714, 5848946, 7366300, 8036207, 7955772, 8802978, 10533977, 11585150, 12297576, 14453630, 17444990, 19018698, 19895904, 23053949]
40615B3053949N195558M235950L784817P061304J0058887Q986793Q821075J4667181
40607H5865514K0985103K2450804K9053742N1115370P1007949N4037251m003248
40600C30512485o1133202p5628094n2642421k8280193k0877586j9463930j3076827
40593E9410232p026411p410197r014742o151023k470187k656249l950304k533033
40585A8198086o98028j595180l012826j945400k56686p52666j929923j250783
40577F756594O1971k49374j179073p82252L3967l72285j009653l32761O07481
40568C534615K00955o30966k94632M67056J86848n02854k93705K07235j75639
40559B698913p79560m44601J61459j37540p06590l22951M91422M89134n2888j08435
$$ y = [23053949, 28249507, 32485457, 36270274, 43331578, 53390465, 62377258, 71198333, 85865514, 106850617, 129301421, 158355163, 209470533, 280478482, 334515733, 330512485, 269379283, 193751189, 141108768, 112828575, 91950989, 72487059, 59410232, 52383821, 44973624, 35958882, 29807859, 27337672, 24681423, 20731119, 18198086, 17500058, 15904878, 12892052, 10946652, 10689966, 9937300, 8007377, 6756594, 6818565, 6569191, 5390118, 4607866, 4641833, 4269548, 3259895, 2927134, 3534615, 3735570, 3104604, 2809972, 3277028, 3463876, 2961022, 2667317, 2874552, 2698913, 1919353, 1474752, 1636211, 1498671, 792081, 469130, 960552, 1449686, 1396798, 1288363]
40549A288363J11974j46295m91118j95999K37507K9690l09872J0420M61331K00855
40539A196856k84778j37790K28768J7984l65229j75935J58538o0412l31954M6128
40529B92176M59934P8990m60274j56444M57903K76289l30680k48105K94036K32328
40519H96153k81661k17158L48476M01912j08617k79170K6843J02260r5653N8404
40509H51789M47591L26909k00525k87036J00524J45968k83233m53123j66893j9216
40499D62755j60178q2341K43309K41224j23772k31404L4726J19417j03218j48288
40489B52230N6847M4176j92719j35657K01281K16283j41559k39866O3785J76146
40479C00947r0102j76397J37074L04016J3981k84329k21668n4988m1033j6094
$$ y = [1288363, 1400337, 1254042, 762924, 566925, 804432, 834122, 524250, 534670, 996001, 1196856, 912078, 774288, 1003056, 1021040, 655811, 479876, 638414, 578002, 246048, 292176, 752110, 831100, 370826, 214382, 672285, 948574, 617894, 369789, 663825, 896153, 614492, 397334, 745810, 1147722, 1039105, 759935, 786778, 889038, 793385, 851789, 1299380, 1626289, 1425764, 1138728, 1239252, 1385220, 1101987, 648864, 481971, 462755, 302577, 220236, 463545, 704769, 580997, 349593, 384319, 503736, 400518, 252230, 309077, 353253, 160534, 24877, 226158, 442441, 300882, 61016, 124801, 300947, 210845, 34448, 171522, 475538, 489519, 205190, -16478, -71466, -112499, -128593]
40469a28593R8163P6433o8792j2858K12367J76493j46435k62509k5258J33104
40459E2115L6153N8567L44368M90828L01774J34887J95279J82192m1180j14666
40449A640317J18922K25434j04507n12312n47730l10708j52394j50335j92619
40440A4068k17504j37809J16188L35113K11405j29488k39085n2139M8273n4249
40430a05227l7906J75835K14322m5995j93555J2171K18835R0108j74158k53639
40420i9209j83735j07404K1305J97120K27208Q8245K6701R4191J6933k57947l56002
40409c32594p5846K53688K95898J63033P7240l390j28349j25722O5390J94091
40399C83439J09743K3746J00729J56383L7022o5370K3390J15935j0597k34308
$$ y = [-128593, -30430, 46003, -22789, -35647, 176720, 353213, 206778, -55731, -80989, 52115, 88268, 146835, 491203, 982031, 1283805, 1418692, 1613971, 1796163, 1754983, 1640317, 1759239, 1984673, 1880166, 1367854, 820124, 509416, 357022, 206687, 14068, -203436, -341245, -225057, 110056, 321461, 191973, -47112, -99251, -50978, -105227, -143133, 32702, 247024, 201029, 7474, 19645, 238480, 328588, 154430, -99209, -282944, -390348, -369043, -171923, 55285, 143530, 170231, 264422, 281355, 23408, -332594, -408440, -154752, 141146, 304179, 381419, 378029, 249680, 123958, 189348, 383439, 493182, 516928, 617657, 774040, 811062, 745692, 769082, 885017, 874420, 640112]
40389F40112l16130k47380j29106L4255K03595K28574R5783k576P999j5321r6415
40378D03390o3784N7193j4573k99578m08061j42838J57911J49052l9242j33936
40368c34466j54307j97466j43385P5848K11902N3533k04099k56156j20503J3389
40358a055710J27818K74038L42790K30395O1172l132r726o4262j15498q0996j0455
40347c03566L3290P2495Q6591J3450m3229R9080L18271K41549j81957n27376m82030
40336f73432k25710m5847N1036J43152J85693K08617L45912M77023K67158k21060
40326E12542m42356j77492Q1388q6591l73587l15993m4657P1359J13814L44137
40316c17436N65740L98328j5713j96202r2969q7209k84991l58622j17406K22442
$$ y = [640112, 323982, 76602, -52504, -18249, 185346, 413920, 509703, 507127, 515126, 499805, 403390, 339606, 396799, 382226, 82648, -325413, -468251, -310340, -161288, -200530, -334466, -488773, -686239, -829624, -753776, -541874, -488341, -692440, -948596, -1069099, -1055710, -927892, -653854, -311064, -80669, -19497, -22629, -32355, -96617, -212115, -293111, -303566, -270276, -197781, -111190, -97740, -140969, -41889, 276382, 517931, 335974, -191402, -673432, -899142, -944989, -893953, -750801, -565108, -356491, -10579, 466444, 733602, 512542, 70186, -107306, -25918, -112509, -486096, -802089, -846746, -775387, -661573, -317436, 248304, 646632, 630919, 434717, 341748, 254539, -30452, -389074, -506480, -284038]
40306b84038L92645L39533J18143j65981l14005k09453r320O6769M0881L9771
40296A4945J4993j12926j96204p3454J02456Q9012k7060J2874J81100K23293Q3748
40285C12777p5590j91187k94138k91574j05621O8303J3307r3638P8470M27603
40275a51288N10291K18519o7158o1525Q6022J38569R7667L6116r3656l04247m35052
40264b5742l32900n1647K17902L23488K28109J3704j78015k79476l36296l58559
40254g79432k48578J8287K72890L46981K63004J13079p9680k44425k24098l7695
40244e99667M4663r6854j96495k2091K23893K30884P2713K7011J09242J49808
40234e6893J45718J63473Q4047j59777k91245p4069K03252J21378j57968j31500
$$ y = [-284038, 108607, 448140, 566283, 400302, 86297, -123156, -132476, -65707, -24826, 14945, 29938, -82988, -279192, -352646, -250190, -161178, -188238, -175364, 5736, 229029, 312777, 237187, 46000, -248138, -539712, -645333, -577030, -563723, -657361, -578891, -151288, 359003, 577522, 510364, 448839, 534861, 673430, 771097, 807213, 713557, 409310, -25742, -358642, -410289, -192387, 131101, 359210, 372914, 194899, -84577, -420873, -779432, -1028010, -1009723, -736833, -389852, -126848, -13769, -93449, -337874, -561972, -599667, -555004, -651858, -848353, -870444, -646551, -415667, -342954, -315943, -206701, -56893, 88825, 252298, 336345, 176568, -114677, -188746, 14506, 135884, -22084, -153584]
40224a53584J99305L25773O3683k15008k46349j90404j63391j7418K26200K48631
40214G7438j7119j72101L8175L02637K26929j02272l25339l02085j29087R3557
40204c09267K64721K52604P7714l9249L3054J67145J98132J11706o3817l02682
40194C90061m38435k65078J07868L00093J85059N2760J05219J45315j5742j87550
40184C79570j29968K6867J2438j42501k02516j08064J7992J09472J53099P9182
40174A95571j03726j96140o8955Q9765L5170j46491j74505p186J35185J32775
40164a08537Q8698R4814J05385O6843n974r4537j68120j33531M0919J83695J05927
40153A75582p4943l5513K64404M36782J76646k66313l81736r4429J26427p1624
$$ y = [-153584, 45721, 371494, 435177, 220169, -26180, -216584, -379975, -397393, -171193, 77438, 60319, -111782, -73607, 229030, 455959, 353687, 28348, -273737, -402824, -309267, -44546, 208058, 285772, 246523, 279577, 446722, 644854, 756560, 692743, 390061, -48374, -313452, -205584, 94509, 279568, 332328, 437547, 582862, 567120, 379570, 249602, 276469, 288907, 146406, -56110, -164174, -146182, -36710, 116389, 195571, 91845, -104295, -173250, -83485, -48315, -194806, -369311, -376497, -241312, -108537, -19839, 74975, 180360, 247203, 241229, 146692, -21428, -154959, -114040, 69655, 175582, 100639, 65126, 329530, 766312, 942958, 676645, 294909, 200480, 326907, 255283]
40143B55283m19999m04115J7875L72259L20161L8859j34761j51344j50578j43699
40133d00059n1677O9044Q6525R210n8721r8842j23530m1532J96768M08349L74515
40122C70050J60082k669o8397j53411k38331k03216j10893j30931k01637j02252
40112f81605J37249K49207J79264J58936K60966K55852L4329j74027j61494k1192
40102B37485P9833J17178O6340j44651l81321l19615Q1706M14220L42989L5054
40092E29218j50478j41103p9772j2544Q5009J43858J02570L5232L805n3785j43766
40081C18244j37336k6815j2658j50222j85428K2964K00295P4210j56598j22242
40071a75586J45683L14436K85116K43903K48077J32830j51170m02250m22431k17900
$$ y = [255283, -164716, -568831, -550956, -178697, 141464, 180323, 45562, -105782, -256360, -400059, -451736, -382692, -296167, -286957, -345678, -444520, -568050, -609582, -412814, -4465, 370050, 530132, 527463, 459066, 305655, 67324, -135892, -246785, -377716, -579353, -681605, -544356, -295149, -115885, 43051, 304017, 559869, 594198, 420171, 258677, 237485, 317318, 434496, 500836, 356185, -25136, -344751, -263045, 151175, 494164, 529218, 378740, 237637, 157865, 145321, 230330, 374188, 476758, 511990, 515795, 462010, 318244, 180908, 154093, 141435, -8787, -194215, -171251, 29044, 103254, -53344, -175586, -29903, 284533, 569649, 813552, 1061629, 1194459, 1043289, 641039, 218608, 708]
40061G08N6231K02015Q6146k02057l77991k95111j34206j01627j06525L8074K53973
40050e80370L13172J97211O2489n2527j96285k68520j29327J03840J76814R2470
40040b81033P8363J69644J51377l5785j51145l1160J49542J47429o326r0972j6755
40029H3179P6857J6897j76915k85911j47252J02525J67922J1178o9767J07106
40019a14181L09127K49290K8985o4404k4418m5862j04824j1912J64084J33200
40009E19085j25238k92283k07791q1196r1199j16268k2308Q6803R5274Q9851J49518
39998D248J52688N329j39136j09952k529n435p9198m3855J00415J69621Q0108
39987A32304n0438p8077K8436K02490L15712K36348k5553k63186k83124j39318
$$ y = [708, 56939, 258954, 345100, 143043, -234948, -530059, -664265, -765892, -872417, -834343, -580370, -267198, -69987, -7498, -60025, -256310, -524830, -654157, -550317, -373503, -281033, -202670, -33026, 118351, 82566, -68579, -99739, 49803, 197232, 190906, 99934, 83179, 160036, 176933, 18, -285893, -433145, -330620, -162698, -151520, -221287, -114181, 194946, 444236, 473221, 408817, 384399, 338537, 233713, 221801, 385885, 519085, 393847, 101564, -106227, -187423, -278622, -394890, -417198, -330395, -235121, -145270, 4248, 156936, 162265, 23129, -86823, -89352, -94787, -173985, -217840, -117425, 52196, 132304, 81866, 3789, 32225, 234715, 550427, 786775, 761222, 498036, 214912, 75594]
39977G5594l4413k5338J0909J13866J27141o0792k97989l29206j16722J27041
39967d09909K06492J17843m3730k02428k67633j34055J45049K92643J07907k10301
39957c98122k48376R7314M83704N63421L61969J21126l0009r7116q3045j5328
39947G55538j429q8744j63443j34757r9075j50285j63226R526K36892K71890J47195
39936F20082J15972K14668J97538l5589k45252k14944n8496N484j2307L3402J30550
39925G51108J34591K6044n9744n9164o2992j29302j60174o1184P1245N6254j03943
39914D02739k06570j33110q592J7814J1471J00660J92156Q5443j57334k38281
39904F6396p6171N1773n1035j88521r9927J22695J96496P6221l4142m823J09494
$$ y = [75594, 41181, 15843, 26752, 140618, 267759, 206967, -91022, -420228, -536950, -409909, -203417, -85574, -129304, -331732, -599365, -733420, -588371, -295728, -187821, -398122, -646498, -549184, -65480, 497941, 859910, 981036, 951027, 853911, 770866, 755538, 754109, 665365, 501922, 367165, 268090, 117805, -45421, -35895, 200997, 472887, 620082, 736054, 950722, 1148260, 1112671, 867419, 652475, 593979, 599463, 587156, 620558, 751108, 885699, 911743, 851999, 792835, 729843, 600541, 440367, 379183, 450428, 506682, 402739, 196169, 63059, 54467, 72281, 83752, 184412, 376568, 462011, 304677, 66396, -9775, 41998, -9037, -197558, -297485, -174790, 21706, 97927, 63785, 58962, 168456]
39893A68456K10284K12360M4348k20397l31969j62220P0169Q7550m8474p7833
39883d7726K1692L6415r1799j78867j15567n124N2345Q5287J21306J22978P8993
39872G9933P317j06751k22831j80660P1905K87828K17524L150l1787Q8253M0950
39861B54831k26724l79442k15142O1077K02345K24782K04475Q6491j19236k18867
39851a25410j11628K4273O01j09980j31732m4692O4750J59647K18389J74640J4967
39840A33825j58729k34687j71221K2842K45484K82012M4249k03987j29673J74677
39830D792K94683J05592q8064r0000p6404j68299j55989R2118L00131J77874j29126
39819B67308k93761k79997k46065j76137M5499L10868L61481J46112j27030k56364
$$ y = [168456, 378740, 591100, 635448, 415051, 83082, -79138, -8969, 78581, 30107, -47726, -26034, 10381, -81418, -260285, -375852, -380976, -328631, -243344, -122038, 940, 79933, 87250, -19501, -242332, -422992, -351087, -63259, 154265, 157415, 125628, 213881, 254831, 28107, -351335, -566477, -505400, -303055, -78273, 126202, 212693, 93457, -125410, -237038, -212765, -212164, -322144, -453876, -498568, -433818, -274171, -55782, 118858, 133825, -24904, -259591, -430812, -407970, -162486, 119526, 163775, -40212, -169885, 4792, 299475, 405067, 317003, 227003, 150599, -17700, -173689, -81571, 218560, 396434, 267308, -26453, -306450, -552515, -728652, -683153, -372285, -10804, 135308, 8278, -248086]
39809b48086j97169k2213J17244Q4009o0978q1664J13164L22646L42311K20487
39799E89751R7860o655r9585j14781p3746j17490k09935q0074L17601N74109L58821
39788A235876o9161k29054r1148l456j02396k02765k00019j94623k19595j70996
39778b47337l5628O6879P9830M8072rk8171N5100K20370K31123k2081k55329j58604
39766d5785J12530J62936l0542j24967J4474J46920Q9747m7124j29870j82254
39756c3935k15046j53202j4581P7789J11059J77493K36499J44215n1307j21225
39746A57759j4302O3812o266r4081p4614n845K6120J8617m8778k02800l16506
39735d96884j99301R7778L03910L07437K69277L10364L49854L16096K45723J05574
$$ y = [-248086, -445255, -467468, -350224, -266215, -327193, -408857, -295693, 26953, 369264, 589751, 687611, 680956, 581371, 466590, 392844, 275354, 65419, -14655, 302946, 877055, 1235876, 1166715, 937661, 846513, 843057, 740661, 537896, 337877, 143254, -76341, -247337, -282965, -216086, -136256, -88184, -88193, -116364, -61264, 159106, 390229, 368148, 112819, -45785, 66745, 229681, 199139, 74172, 88646, 235566, 325313, 278189, 148319, -33935, -248981, -402183, -416764, -338975, -227916, -50423, 186076, 330291, 278984, 157759, 143457, 207269, 201003, 106922, 32308, 26463, 52583, 71200, 22422, -180378, -496884, -696185, -598407, -294497, 12940, 282217, 592581, 942435, 1258531, 1504254, 1609828]
39725A609828j86853m77237m39137p5512J64303k2472l60968m00986j16874J55624
39715a50284K03193R4549k4185o4534m253O9449Q734j78989k85373j84263J309
39704e14647J42343L07222N32749N99701L05509j72575m61035m54943l47262k68162
39694c31100j67274k3123J01961K24775M02840N05207K94994j66145m53647k90665
39684I7823O7994J70672m1318k21658j46807J3130J8781q0257q9438k1585n8096
39673b90759j92038j72071J12240M04487M03049J65700L455N5684J69677J70658
39663H30082O2227n1620q5560M246J74670K55423R6765k09246l83518k76747k4697
39652C92025J38896J15287l4115j76045j84071l9274J08653P8502j12446k50886
$$ y = [1609828, 1422975, 945738, 506601, 431089, 595392, 572920, 211952, -189034, -305908, -150284, 52909, 147458, 123273, 58739, 54486, 123935, 132669, -46320, -331693, -515956, -514647, -372304, -65082, 467667, 1067368, 1372877, 1200302, 739267, 284324, -62938, -331100, -498374, -521497, -419536, -194761, 208079, 713286, 1008280, 842135, 388488, 97823, 165817, 336489, 295171, 73513, -73294, -60164, -41383, -121640, -211078, -232663, -290759, -482797, -654868, -542628, -138141, 264908, 430608, 434063, 489747, 659424, 830082, 892309, 840689, 755129, 759375, 934045, 1189468, 1286233, 1076987, 693469, 416722, 392025, 530921, 646208, 612093, 436048, 251977, 212703, 321356, 399858, 287412, 36526]
39642C6526j88892p874J10595Q6726k3880j22856j48430r9202n008J18459K45662
39631A826K82710J48113n7372j23444m8927q2967l07962m22875j84855J56982
39621f38771J99184j8657j40154q5022o6548q3584R0921L69973L31592r5434m09615
39610e46115k50916Q7045J64141M4943P6638K89165M06542L02828J12387k8274
39600F58384r3673r7154r0274j41638j90047p3995J73302K75931J17919n1367
39590D87388j0077R7778N8056m0608k4724J1048r2101j98806r2967J03213J02816
39579D01016o3372j18920k2341N425j00566j74226j60812j79845k23090j34190
39569g70921N7280J10034l5576j36018k2291J62578K18365J54350Q9202P5179
$$ y = [36526, -152366, -160240, -49645, 37081, 13201, -109655, -258085, -357287, -362295, -243836, 1826, 284536, 432649, 375277, 251833, 202906, 119939, -188023, -610898, -795753, -638771, -439587, -458244, -598398, -683420, -749968, -833552, -742631, -372658, -41066, -136500, -546115, -797031, -709986, -545845, -500902, -424264, -135099, 271443, 574271, 686658, 658384, 564711, 467557, 377283, 235645, 45598, -28397, 144905, 420836, 538755, 487388, 477311, 575089, 633145, 592537, 567813, 578861, 486760, 287954, 194987, 298200, 401016, 337644, 218724, 196383, 201808, 101242, -72984, -233796, -413641, -636731, -770921, -713641, -603607, -639183, -775201, -797492, -634914, -416549, -262199, -172997, -97818]
39559i7818J16340J94684K14265Q6045r5365j46136q4738j03057k12862j93015
39549c21657J8306J61696N4364r7842j3578K21572K85925R2645j28681j94436
39539G8314j74319j90401j98746q7199J05774K01186J06295o1733j25762o3807
39529d10398Q032M0438J11965K44616K91111J26911j21064j87579q366J75367
39519B71033R6385k14123m30790k74884J50268M18680K49992j37569k90902j08817
39509b70727O4040k3339j74717j02289J10663J66800J6891j18497j03636j269
39499d36080J12248J97204J61746k4016j53580J0317L47336M59303J88317j80357
39489F82438l06012j73191O108Q7272P1431J2494m2517p5722j10343j59675j74045
$$ y = [-97818, 18522, 213206, 427471, 513516, 418151, 272015, 187277, 84220, -128642, -321657, -303351, -141655, -87291, -185133, -198711, 22861, 308786, 401431, 272750, 78314, -96005, -286406, -485152, -572351, -466577, -265391, -159096, -220829, -346591, -410398, -402366, -361928, -249963, -5347, 285764, 412675, 291611, 104032, 95666, 271033, 367418, 153295, -277495, -552379, -402111, 16569, 266561, 128992, -161910, -270727, -206687, -230026, -404743, -507032, -396369, -229569, -212678, -331175, -434811, -436080, -323832, -126628, 35118, 11102, -142478, -132161, 215175, 674478, 862795, 682438, 376426, 203235, 209343, 296615, 368046, 380540, 338023, 262301, 151958, -7717, -181762]
39478a81762j05463J723O1743N1946j78o2060n7806R2289K88801K72755p242k25858
39466A28888j13449J10855N0771k37408k99384M3908M36438M78287J91977j05595
39456F85288j84837o2485P9678Q6290J0912L9551J57115R8953j84697l06837k1195
39445C97736K71469Q2247l34050l22764J21220L53917J38066n3917N9625J27154
39435H40703q2863k04450L1883K65137J52456j8560R6808K45235R7696o0710J40666
39424A504001L50194Q634o04242o83917j46695K71364J74860l7004j2756K2836
39414H47275j38068k31441m5625J23823l2320k84228k28843P7583K54265J67134
39404E09555N097q1254r5797l3648J16423K39993J94457K9178o9474m9094n3762
$$ y = [-181762, -287225, -285502, -223759, -171813, -171991, -234051, -291857, -199568, 89233, 361988, 354746, 128888, 15439, 126294, 177065, -60343, -359727, -315819, 120619, 598906, 790883, 685288, 500451, 437966, 517644, 603934, 614846, 654397, 811512, 910465, 725768, 418931, 397736, 669205, 751452, 417402, 94638, 215858, 569775, 707841, 653924, 713549, 840703, 757840, 553390, 585273, 850410, 1002866, 984306, 1081114, 1326349, 1424045, 1363335, 1504001, 1854195, 1862829, 1258587, 574670, 427975, 699339, 874199, 837195, 824439, 847275, 709207, 477766, 432141, 555964, 523644, 239416, 10573, 88156, 342421, 509555, 514652, 433398, 337601, 303953, 420376, 660369, 854826, 884004, 814530, 765436, 711674]
39393G11674j93452l67486l75769j66156P9186J36076Q189p3155M0080K12197
39383A1384K39276J45673Q7646N7617o9309k30977k07225P51J02357m8600j98775
39372a10182o0559K48039L55301J44271j01106o4651K26886M43124L08946j08177
39362A281892m67418n00697k50822M7933K30707K57799J17929j45926l53717l26992
39352a09312j26194K1184M4122R0847K30596L05758J86064o994p1331j221M0794
39341F04313m7214k10057l10565k36368n646J85733J27500j28589k70189r5541
39331c86623K17254L21907J07736k19743m01888l53640j58440M8636J74925K10199
39321d39677J98401J65758R8137m152q6705p4185P2235L10451M97288M64311J97393
$$ y = [711674, 518222, 150736, -225033, -391189, -312003, -175927, -167738, -240893, -200813, 11384, 250660, 396333, 483979, 541596, 472287, 241310, 34085, 34836, 137193, 88593, -110182, -170741, 77298, 432599, 576870, 475764, 411113, 637999, 1081123, 1390069, 1281892, 814474, 313777, 62955, 110888, 341595, 599394, 717323, 571397, 217680, -109312, -235506, -214322, -170200, -79353, 151243, 457001, 643065, 636071, 564740, 563519, 604313, 557099, 347042, 36477, -199891, -205537, -19804, 107696, -20893, -291082, -386623, -169369, 152538, 260274, 40531, -361357, -714997, -873437, -824801, -649876, -439677, -241276, -75518, 22619, 18467, -68238, -142423, -70188, 240263, 737551, 1201862, 1399255]
39310A399255r3275j80736p4459L2946L0072l3779r3950j27954q2711P2902K20785
39299A069096K13946J32148J96119M11946N76675O87944R88362J422317J421026
39290G119579N92573n98327j254688j074870n86617l72481m37680m44916k55754
39281B686819k1011J19006K28753M68642Q36430J030318O72225k15918j059991
39272D745273j266468q71457m36103l17866l34074k04830Q83O1772q790n2610
39262A315730r4077k74753n10863n10884j88353J69803K48903O7602j09256j06269
39252G583K2651J21943J01240k003o7037j6450P6410N6200j07679k55412k35943
39241b98497r7759O643M0212Q0180J34980J21954N0106O3715K17302L35187K26028
$$ y = [1399255, 1305980, 1125244, 1050785, 1083731, 1113803, 1080024, 986074, 858120, 775409, 848311, 1069096, 1283042, 1415190, 1611309, 2023255, 2599930, 3287874, 4276236, 5698553, 7119579, 7712152, 7113825, 5859137, 4784267, 4197650, 3825169, 3387489, 2942573, 2686819, 2665808, 2784814, 3013567, 3482209, 4318639, 5348957, 6021182, 5805264, 4745273, 3478805, 2607348, 2171245, 1853379, 1519305, 1314475, 1315358, 1377130, 1368340, 1315730, 1221653, 946900, 436037, -74847, -263200, -93397, 155506, 223108, 113852, 7583, 30234, 152177, 253417, 251414, 184377, 167927, 244337, 300537, 192858, -62554, -298497, -396256, -389613, -349401, -269221, -134241, -12287, 37819, 101534, 318836, 654023, 880051]
39230H80051l6822j92362j24835J5991M3601l4489p2199Q27R0539N2672j34530
39219D88444l20861l27451j50719K2127L8885l7211m5319M1535J26085J84356
39209A9871K80144L65017K59066o4991l35741k82835N578J93776J22243n4115
39199E08013j46974j60576j62018r5423J06935K99234K06750k07399n96153n72693
39189h20304j54904K54408L31814J54070Q102J1860N5786M9297M5109R4758J34454
39178A64450R5459K3653n615j8494q4388j70565j65092m0011J00955J54898J29019
39167A84269R2566P9016P6155P6602Q8658J00244P0257j9456j12266j09646J8904
39156E45303J73575K09981R3335o6378j45968j40951j39647j92081k46229k19767
$$ y = [880051, 843229, 650867, 526032, 542023, 585624, 551135, 478936, 479763, 570302, 622974, 488444, 167583, -159868, -310587, -288460, -249575, -286786, -332105, -290570, -164485, 19871, 300015, 665032, 924098, 859107, 523366, 240531, 246109, 439885, 562128, 508013, 361039, 200463, 38445, -56978, 49957, 349191, 555941, 348542, -247611, -820304, -975208, -720800, -388986, -234916, -226814, -214954, -159168, -109871, -64762, 29996, 164450, 259909, 283562, 277947, 259453, 175065, 4500, -160592, -200603, -99648, 55250, 184269, 276835, 355851, 432006, 508608, 597266, 697510, 767767, 748311, 636045, 526399, 545303, 718878, 928859, 1022194, 955816, 809848, 668897, 529250, 337169, 90940, -128827]
39146a28827j10408j0538q47m5286l5645M6352P7316l3021j71410j43578M2405
39135e13487J61303R2049N951J06486K90542K64374k1571k61728j98613K7921
39125d6773Q4606r3687k32988j12709J42678K46133J09249r0915j49188k7764
39115a71358J58552K47939J32176j40659l53100l14222r5112L6306m8846j87727
39105g36051j69991j1144J15622J14875K0862r0778j14199O5142L91968N62463
39095A48769L32948j19887l61073k29331N740N3177o0725j49325j40012m9475
39085e69194J28085L24738L33608N5583k65392k70792N7377L51183K96410k0823
39075D20783k55363j94223N0576J96121R8888r1794j12929Q4379K69076K29997
$$ y = [-128827, -239235, -249773, -250620, -295906, -331551, -285199, -207883, -240904, -412314, -555892, -513487, -352184, -260135, -254184, -147698, 142844, 407218, 385647, 123919, -74694, -46773, 37833, -55854, -288842, -401551, -258873, -12740, 96509, 5594, -143594, -171358, -12806, 235133, 367309, 226650, -126450, -440672, -535784, -499478, -548324, -736051, -906042, -917186, -801564, -686689, -665827, -756605, -870804, -805662, -413694, 148769, 481717, 361830, 757, -228574, -222834, -169657, -230382, -379707, -519719, -569194, -441109, -116371, 217237, 272820, 7428, -263364, -205987, 145196, 441606, 420783, 165420, -28803, 21773, 217894, 316782, 224988, 112059, 196438, 465514, 695511]
39065F95511L2039j21344j73132k01784j92356k9884K51147M01601K44913q5907
39055H20804l02958k79868j17496M2150J43338J68260Q4743r3938k52083k50676
39045c7724p4701J33825K11201J28206l889o9494o1667n5597r8314j49523j30752
39034b08429k1255J05417J51313R6702P130o5782j39238k16677k07138j8245K78155
39023b38047M64970L95736J35300j31998k71500k53106j12723P7042K24177K53418
39013E43269J37265q9061l10859l67120j90813P1889J71774K8388j74610k07487
39003c87365m5641J43215K00426R8669r2774k75920l44976k07596J39456N31450
38993b41056O92026M71276M3146k41099k43577j60797j78572j81173J1916K67164
$$ y = [695511, 727550, 606206, 433074, 231290, 38934, 9050, 260197, 661798, 906711, 820804, 517846, 237978, 120482, 162632, 305970, 474230, 558973, 465035, 212952, -37724, -112425, 21400, 232601, 360807, 356918, 287424, 225757, 170160, 71846, -77677, -208429, -229684, -124267, 27046, 123748, 130878, 65096, -74142, -290819, -497957, -516202, -238047, 226923, 622659, 757959, 625961, 354461, 101355, -11368, 65674, 289851, 543269, 680534, 591473, 280614, -86506, -277319, -205430, -33656, -5268, -179878, -387365, -433006, -289791, -89365, 9304, -83470, -359390, -704366, -911962, -772506, -241056, 450970, 922246, 965392, 724293, 480716, 319919, 141347, -39826, -27910, 239254]
38983B39254K74970J4782k11389k24518j58630j48198j18534l698R2888J04264
38973a38809J32233K21647K31153R1666l8038n1827q4945k10858k14317M9169
38963a2926L04043K10896j00508k21198o8658O9594K8184o8662j07042j04386
38953g0663l3191J47963K83054J63061j06421k07263q9890p004m6905k1507J11401
38942A22635J26647l0404q7423P6280J74547r607k34386j85650L0416J00246k0785
38931F2516j60228k58338l29114k66494j6640J98325J53674m988J0307J50569
38921d60411J44403L089Q77J66378K17456P1513J0126J80751L01532R8999k42061
38910D92652l42063j51758N9979J27676J30871J52026J30258J44j75134k70535
$$ y = [239254, 514224, 529006, 317617, 93099, -65531, -213729, -332263, -335961, -243073, -138809, -6576, 215071, 446224, 537890, 499852, 448025, 363080, 152222, -62095, -12926, 291117, 502013, 401505, 180307, 111649, 181243, 209427, 140765, 33723, -70663, -103854, 44109, 327163, 490224, 383803, 176540, 86650, 79646, 32741, 11234, 122635, 249282, 218878, 131455, 207735, 382282, 372675, 138289, -47361, -16945, 83301, 62516, -97712, -356050, -685164, -951658, -968298, -769973, -616299, -621287, -610980, -460411, -316008, -312919, -312042, -145664, 71792, 143305, 153431, 334182, 635714, 734713, 492652, 150589, -1169, 58810, 186486, 317357, 469383, 599641, 599785, 424651, 154116]
38900A54116k27589q9907M4902J03414R3637P4247O4420L5210j436J3855O1345
38889C26214J6071j58233k82182j67201J01494K48603J74060P2300J38936L06362
38879G76424L67468K53034O4734j00908k33627l40314m04196m07545l19318r8322
38869d42570J94880L48698K20346k0510o1157J20913K12495L0292j98123j74270
38859B30994N0754K07144K01525J34086L3680j45407l15393l24812k27906k12374
38849c67709k47210r7283K46841M53448L02282Q11j24926n3352M174n8047j56585
38838i7556j71708m9099J55728K55969J03103j51678j73887P3008K23369N5851
38828B23100j51044q2381P9994j5072k32723j22909L09459N24805K39558j66225
$$ y = [154116, -73473, -163380, -118478, -15064, 78573, 152820, 217240, 252450, 251014, 264869, 326214, 342285, 184052, -98130, -265331, -163837, 84766, 258826, 331126, 470062, 776424, 1143892, 1396926, 1461660, 1360752, 1127125, 786811, 382615, -24930, -344248, -442570, -247690, 101008, 321354, 300844, 239687, 360600, 573095, 603387, 405264, 230994, 281748, 488892, 690417, 824503, 858183, 712776, 397383, 72571, -155335, -367709, -614919, -712202, -465361, -11913, 290369, 291180, 166254, 112902, 117076, 59029, -97556, -269264, -318363, -162635, 93334, 196437, 44759, -129128, -56120, 167249, 223100, 72056, -10325, 69669, 54597, -178126, -301035, 8424, 533229, 772787, 606562]
38818F06562k41298p8663m4262j72380j87582N671J93942K03650J16542Q3103
38808D85285J06366R9006M4868N984P757j710o2403j25976j22426p7784p4889
38797B84078q6500K4192K63369M04820K71494P395j19833j00656j29607k16917
38787F01835j51461R9855K53096J11258j32318j82973n5419J5522m9651j06941
38777D02803l9713J04474K09779J98158O6235q7453j17522L963J43733J98730
38767A083187K30601L28515M75504O57632R18855J127391R00923P8049q61978
38758D938679j225458r31440n46331m65345m77296k93369q5197j67200m23940
38749C23103m50289j45492J83479K75894J72332J3039j37738k11479j21627P1948
$$ y = [606562, 365264, 286601, 242339, 69959, -117623, -111952, 81990, 285640, 402182, 485285, 591651, 690657, 735525, 741509, 749266, 747556, 685153, 559177, 436751, 358967, 284078, 197578, 221770, 485139, 889959, 1161453, 1168848, 1049015, 948359, 818752, 601835, 450374, 550229, 803325, 914583, 782265, 599292, 543873, 559395, 509744, 402803, 363090, 467564, 677343, 875501, 941736, 854283, 736761, 740724, 884457, 1083187, 1313788, 1642303, 2117807, 2775439, 3694294, 4821685, 5722608, 5800657, 4938679, 3713221, 2781781, 2235450, 1770105, 1292809, 999440, 914243, 747043, 323103, -127186, -272678, -89199, 186695, 359027, 372066, 234328, 22849, -98778, -26830]
38739b6830J62839O1010p6322n8355J03911K45446K42451J10993j7892j2741Q6210
38728H20720M8566k47390n41588m45819J1487L59562K97419O2446K3429J63479
38718E52311K17579J26092M5917K1302m9018j58706j87925j43142j49862k03145
38708G1403j72368o7832m7082j18563j00970N0581J36094L6067r5373r8093m4309
38697d50445m7384l3677J00653K62001K88543J92093R0749N407r8909j63816j13130
38686C2085p311M3049M8423O8401N3611o1792j85912j82590r7321o4907n1675
38675d05939O5679J94652R6232j83061k47318J11706N39872N22499M8135l72483
38665C69974l37648N606K19762J19023q6128j32694l3406Q556q0807j49191n1840
$$ y = [-26830, 136009, 197019, 120697, 62342, 166253, 411699, 654150, 765143, 747251, 734510, 820720, 869286, 621896, 80308, -365511, -354024, 5538, 302957, 365403, 388832, 552311, 769890, 895982, 941899, 963201, 914183, 755477, 567552, 424410, 274548, 71403, -100965, -168797, -215879, -334442, -435412, -384831, -248737, -212670, -308043, -406136, -450445, -497829, -531506, -430853, -168852, 119691, 311784, 402533, 407940, 309031, 145215, 32085, 24774, 67823, 116246, 184647, 238258, 176466, -9446, -192036, -289357, -354264, -405939, -340260, -145608, -49376, -232437, -479755, -368049, 171823, 694322, 742457, 369974, 32326, 37932, 257694, 376717, 290589, 157895, 124489, 133045, 52238, -96953, -148793]
38654a48793J34886K10913J05704m6890p0737P2087K58138L23616K09195k369
38644A045750j91773l14737l69763l13069j21610P5982Q4411r8823k47189j93172
38634f43993j9211J17220K02334K87000L16485K04248J2065r2421m0018P3005
38624D16714R8735l4150k50090l50073j98916P8126K13544J42843N2087L3545
38614B02365n3374k52176l22042j05035J64209J93232O7040M0494Q9456L0626
38604E4795o5548Q534J61199J10970j03940j62030j5142L9854q7069j14078P8320
38593i4135J82260l7191l34114l38495n0882K55173L92977L23288Q7948j23828
38583B63001p6045J61962K14505n8616l07730k24800k5074o2639k26846j46882
$$ y = [-148793, -13907, 197006, 302710, 255820, 185083, 257170, 515308, 838924, 1048119, 1045750, 853977, 539240, 169477, -143592, -265202, -189220, -104809, -203632, -450821, -643993, -663204, -545984, -343650, -56650, 259835, 464083, 476148, 383727, 343709, 416714, 515449, 481299, 231209, -118864, -317780, -239654, -26110, 116733, 168820, 202365, 148991, -103185, -425227, -530262, -366053, -172821, -105781, -65287, 24169, 54795, -10753, -2219, 158980, 269950, 166010, 3980, -11162, 28692, -58377, -172455, -94135, 88125, 50934, -283180, -621675, -672557, -417384, -24407, 298881, 386829, 263001, 186956, 348918, 563423, 504807, 197077, -27723, -52797, -115436, -342282, -489164]
38573d89164J52361K52719j3385l18029l12627m5580J97693K47414J35186j5484
38563b08896q7013m1030N6756J24138J47596J28573K5822j49068k59984j96229
38553d59335k9211J03606J97388L19091M12563L36008Q5475j57582k19679r5301
38543D93023P9175J51253P0808q3362k21502l54501m83806m41156o9380M21590
38533d37858N72185K60706j12242j88590r5942r0784p9141J44340M16383L94032
38523G83089J02712j11496j09785n5801l4520K5442O4998o0286k23446j31031
38513B49876J48252J91221j10409l18866j08400K34462K64541J5783j58357j50534
38503B57569j34773j68640j23755J2621O6433n4205k25854k82733j80046J7740
$$ y = [-489164, -336803, -84084, -97469, -415498, -728125, -773705, -576012, -328598, -193412, -208896, -295909, -336939, -280183, -156045, -8449, 120124, 145946, -3122, -263106, -459335, -488546, -384940, -187552, 131539, 544102, 880110, 965585, 808003, 588324, 493023, 572198, 723451, 794259, 710897, 489395, 134894, -348912, -790068, -859448, -437858, 134327, 395033, 282791, 94201, -1741, -92525, -171666, -27326, 389057, 783089, 885801, 774305, 664520, 608719, 574199, 599641, 664639, 604353, 380907, 249876, 398128, 589349, 478940, 160074, 51674, 286136, 550677, 566460, 408103, 257569, 122796, -45844, -169599, -156978, -90545, -144750, -370604, -653337, -833383, -815643]
38493h15643J84579J88360L0370r5784k4391J30521J11696r2546j92719l780K71619
38482c07718L10870J07797m7740N664J01978M0427r7644q2523J07294K58261K38270
38471F34936J42088P1827l0443k08061l11110j80500P3237J69372J7197j86929
38461A91614k32702j24629k702N3607Q3931J62357K89229L60612K73704P9182
38451A134203m4345j9682J4973q6860k41538k34648k2830J84360J48806j49819
38441F82620m71694n02518j65520K27125K73308j5526j99983r453K76325K45194
38431C39878n6504k34927j12898J23138K62945K64721J52669n896o4454Q819j0968
38420F66523k58518m14492j00720M26385M87793m0389m83509l10485J57729L01103
$$ y = [-815643, -631064, -442704, -412334, -508118, -532509, -401988, -290292, -382838, -575557, -579337, -307718, 3152, 110949, 63209, 68873, 170851, 211278, 113634, 31111, 138405, 396666, 634936, 777024, 848851, 818408, 610347, 299237, 118737, 191974, 361346, 378543, 191614, -41088, -165717, -168419, -114812, -30881, 131476, 420705, 781317, 1055021, 1134203, 1089858, 1070176, 1085149, 998289, 756751, 522103, 499273, 683633, 832439, 682620, 210926, -291592, -457112, -229987, 43321, 27795, -172188, -181641, 94684, 339878, 283374, 48447, -64451, 58687, 321632, 586353, 739022, 733126, 668672, 677491, 666523, 408005, -6487, -107207, 319178, 806971, 766582, 283073, -27412, 130317, 431420]
38410D31420O5416j36872j20695p1171j07769j14732j3926R7908J33788J27271
38400B90638J16904P7649K338o3898r5671j15376j41227j60572j50553r7120j3699
38389c50587N3671P8014R2629J22546J16389M1282r559N3696J25401K5644j96701
38378A52425k80964j03919J65233K95930K28959O1510n2045N499J66196J73939
38368H12763q5553l39419k61443M0100J80320O7846n1682p1580j15582j58281
38358A7489k9174J51218M6682k70493l03587P5810L61496K01121p6494n4318J44767
38347B64517K06140J53686J23303J5033k07524k52942L3501K99475K02193n5005
38337G82377j07191K4366J66346L51895N26090L73971q8868k84703M6164L36916
$$ y = [431420, 496836, 359964, 239269, 168098, 60329, -54403, -68329, 29579, 163367, 290638, 407542, 485191, 487529, 423631, 327960, 212584, 71357, -89215, -239768, -336888, -350587, -296916, -218902, -126273, -3727, 112662, 153944, 144385, 198081, 323482, 349126, 152425, -128539, -232458, -67225, 228705, 457664, 519174, 467129, 472628, 638824, 812763, 727210, 387791, 126348, 166448, 346768, 414614, 362932, 291352, 175770, 17489, -11685, 139533, 186215, -84278, -387865, -312055, 49441, 250562, 174068, 119750, 264517, 470657, 624343, 747646, 762679, 555155, 302213, 335714, 635189, 837382, 782377, 675186, 699552, 865898, 1217793, 1743883, 2117854, 2028986, 1744283, 1790447, 2127363]
38327B127363J72426P7153N51080J061163R71183P48006J075739J492237J305465
38318I581815J156307J967570L029729L316822M135785P401496J0960028R268443
38310E0817995O86521q809341j2022825q749950m624789l252662l160810k198413
38302H685726j015899r22339j255421q27759j38474k77525q55538p44200n4116
38293B594455K10117n2279m2718L94099N41348R6738m05793n51341n23310n07551
38283A753765l92635k11983k11705l24579j79567K16969L88315J46895j12316
38274A073159r2431k7774j52319k40337n7334J41623M889l16307m09954k47803
38264c24588j39364j52073l2348K82562M79574L16205l9801k57126k18913l4957
$$ y = [2127363, 2299789, 2376942, 2928022, 3989185, 4960368, 5708374, 6784113, 8276350, 9581815, 10738122, 12705692, 15735421, 19052243, 23188028, 30589524, 41549552, 50817995, 51504516, 42695175, 30672350, 21922400, 17297611, 14044949, 10884139, 8685726, 7669827, 6747488, 5492067, 4664308, 4525834, 4248309, 3392771, 2648571, 2594455, 2804572, 2752293, 2709575, 3103674, 3645022, 3741760, 3335967, 2784626, 2261316, 1753765, 1361130, 1149147, 937442, 612863, 433296, 650265, 1038580, 1185475, 1073159, 980728, 952954, 800635, 560298, 502964, 644587, 649476, 333169, -76785, -324588, -463952, -616025, -648373, -365811, 113763, 429968, 390167, 133041, -85872, -120829]
38254a20829J42529J89581N0436j55642j83588M8750L12751L35174J29841o7187
38244F81816j18916r0449p4971q2454j06024j57189k07879k05629j59007j03341
38234f24043Q539K36053M60187M43656J53106j45685k20352j42923r2279m7090
38224B9169J12974L06416L13300J26144j3532K0230O6348k9207j56687j43717
38214F31438n6112q6602k22818k49757q4706Q8818Q4292m2162j04822m5522L0827
38203e7126K6311m2249r2422o5860K7673J15964J28300Q0753O2711J06554J27039
38192D17648M8714o4572r2150k2950N8330J10628J43541J16584k0108j84649k21310
38181B89706j25398m9547m8193k270J26582J71091K4925j44728j26002L8628J61382
$$ y = [-120829, 21700, 211281, 261717, 106075, -77513, -28763, 283988, 619162, 749003, 681816, 562900, 472451, 397480, 315026, 209002, 51813, -156066, -361695, -520702, -624043, -615504, -379451, 80736, 524392, 677498, 531813, 311461, 168538, 76259, 29169, 142143, 448559, 761859, 888003, 874471, 894701, 961049, 931842, 775155, 631438, 575326, 488724, 265906, 16149, -68557, 20261, 104553, 62391, -42431, -87953, -57126, -30815, -73064, -165486, -231346, -203673, -87709, 40591, 121344, 184055, 290609, 417648, 466362, 401790, 309640, 286690, 345020, 455648, 599189, 715773, 695665, 511016, 289706, 164308, 114761, 66568, 64298, 190880, 361971, 386896, 242168, 116166, 154794, 316176]
38170C16176J80264J24542m7409l27097m85332l12539K6864J71947O8881o342
38160b90045P5259J33824N4698j7830J0862k854j45189k40819j54251m7530r5803
38149g19678j59245j5503K39939L21861J90576P3238Q7699J08944K5838q9637
38139F4032j21483o1096K8843R3634J01159N4369k492l7613o3081p7868n0581
38128g2177l603j0791m9131J5169K02172L30383K75681J55788R9664J2382k08736
38117G46801l85400k74396K2905J70105P0543o6013j09081j38085j64371o4754
38107a91746J10815R4170j70322l39062j40647J96461K58665L0543j36620o8869
38097c56612K5494o0226j95771j08556K11550M57880L52037m0378l71000l62329
$$ y = [316176, 496440, 620982, 573573, 246476, -238856, -551395, -524531, -352584, -283703, -290045, -214786, -80962, -26264, -44094, -33232, -36086, -181275, -422094, -576345, -623875, -719678, -878923, -894426, -654487, -332626, -142050, -68812, 18887, 127831, 153669, 64032, -57451, -118547, -89704, 3930, 105089, 159458, 156966, 119353, 56272, -21596, -72177, -75780, -86571, -135702, -120533, 81639, 412022, 687703, 843491, 943155, 955537, 746801, 361401, 87005, 109910, 280015, 350558, 284545, 175464, 37379, -126992, -191746, -80931, 13239, -157083, -496145, -636792, -440331, -181666, -151123, -287743, -356612, -331118, -391344, -587115, -695671, -484121, -26241, 325796, 285418, -85582, -447911]
38087d47911p2310J97932K29470Q0102l7230j3450N7107J9648j37333k50906j67344
38076e42225O7815K49596K41983J05754j9091q1759j17436j39396j15965l4502
38066c85226P1092J50222J69292J41709J30356J67394J74976N4783j40960k52669
38056B80969k44348k27796k14226n9169K28987L56509J24123k43922l87205k75469
38046f61547j34544m9455N9623J72175K05782K49264M13150M99834K17568k71294
38036G00556m46811j66616J19550M9483j70499j96420p2069j3347O619R5412J24917
38025C0775k8018j23461J27876N09736N08566O0911l32997l09518o9400L2354
38015D06824j3991j986J02792J59349J15800N2977L472r7095k61899l71221k91582
$$ y = [-447911, -520221, -322289, -92819, -12717, -49947, -63397, -6290, 13358, -123975, -374881, -542225, -474410, -224814, 17169, 122923, 103832, 22073, -95363, -234759, -350724, -385226, -314134, -163912, 5380, 147089, 277445, 444839, 619815, 674598, 533638, 280969, 36621, -191175, -405401, -464570, -235583, 120926, 245049, 1127, -386078, -661547, -796091, -845546, -785923, -613748, -407966, -158702, 254448, 754282, 971850, 700556, 253745, 87129, 206679, 256162, 85663, -110757, -182826, -196173, -189554, -94142, 30775, 2757, -120704, 7172, 516908, 1025474, 1086385, 753388, 443870, 374470, 406824, 392833, 390847, 493639, 652988, 768788, 821765, 825237, 728142, 466243, 95022, -196560]
38004a96560m4754J77372J92853L3694p5499J2137J71016J67944j4987j48738
37994B74478o2402J40794K26485R8408j41299l33955l86373k82905o0859J95100
37984c32528L63287L38840J23478j35384k56277k17322j80250k52566k96663j13351
37974i58736K10597L31151J00585j79305j24730K06410L73161J34656k36446l18313
37964d60970n8745K22620K61335J02010n5699r6696l2525O6860J09059K8111j33068
37953d7708k36670j86977r744K06805L60948L23577K4767l73427n37051l22385
37943g97865K5701J72445R4913K7361Q9492J73141J77710J53294J66123J80411
37933D62726J41054O4465j3555j04011k26560l41980l49327j63296J51303L31705
$$ y = [-196560, -241314, -63942, 128911, 162605, 87106, 99243, 270259, 438203, 423216, 274478, 212076, 352870, 579355, 677763, 536464, 202509, -183864, -466769, -527628, -332528, 30759, 369599, 493077, 357693, 101416, -115906, -296156, -548722, -845385, -958736, -748139, -416988, -316403, -495708, -620438, -414028, -40867, 93789, -142657, -460970, -519715, -297095, -35760, 66250, 10551, -86145, -118670, -51810, 57249, 85360, -47708, -284378, -471355, -481099, -274294, 86654, 410231, 434998, 61571, -475480, -797865, -772164, -599719, -504806, -477445, -387953, -214812, -37102, 116192, 282315, 462726, 603780, 668245, 654690, 550679, 324119, -17861, -367188, -530484, -379181, -47476]
37923d7476J51179k34206l60195k6989L87846M14132J17490o1459K6129J11046
37913D77497K1150p8622m1025K7655K2598K5345Q4678Q8969Q177n579Q3616P4576
37901G89035j08756k18803q4007N7865q1731l58567l93565j22493J62029K46650
37891a12343J99855J66894J88697K23624J95805M7224j55922k47079j77765q5909
37881B43081n9312j5907O4481K8313j51377k21640m8712P9945j21616m21999l64572
37870i89315N6392M04524M15198K25278L0585j12285j41728m659J50105J04705
37860A38800p4510j16151J2513O3134o2377j71732j38187p4820o4183j6944R6718
37849d07739J56345J33059J48827J98551J01434j50593k84322j40614P7421J16059
$$ y = [-47476, 103703, -130503, -490698, -517687, -129841, 284291, 401781, 340322, 366451, 477497, 498647, 420025, 379000, 406655, 429253, 454598, 539276, 628245, 636422, 630843, 714459, 789035, 680279, 461476, 377469, 435334, 353603, -4964, -398529, -521022, -358993, -112343, 87512, 254406, 443103, 666727, 862532, 909756, 753834, 506755, 328990, 243081, 183769, 167862, 232343, 260656, 109279, -112361, -161073, -81128, -202744, -624743, -989315, -932923, -528399, -113201, 112077, 142662, 30377, -111351, -116010, 34095, 138800, 64290, -51861, -39348, 23786, -38591, -210323, -348510, -423330, -487513, -504457, -407739, -251394, -118335, 30492, 229043, 330477, 179884, -104438, -245052, -167631, -51572]
37839e1572O461o7973l5653P2756K04615K38827O2419k03950k81613j31848k1628
37828b09159q5964j27438p419Q9850J0913n9584O7583K16377J39625l9357l8250
37817d2823J01390J19586J1070N582J27013J54013L4372j9283P9850J28122j3943
37806F84949j67003j04654J05471K12436J21527m2753j56099k19630k52772j87888
37796f416L1713K85655L34936J10943j51388j90995n9990j3439j01983j09964
37786A29072O5553K27087J84073K8962m9424m4865n3799p4274o7121q5526j64822
37775I4916k02593j20990k7847m1765q3360k8770N7771N3921K0376Q0526J62642
37764c5173J12839j1595k4747N4632J5081k01325l96550l84253j77287R4258K88080
$$ y = [-51572, -45111, -113084, -148737, -75981, 128634, 367461, 429880, 225930, -55683, -187531, -209159, -295123, -422561, -429980, -340130, -329217, -388801, -321218, -104841, 34784, -4573, -42823, 58567, 178153, 189223, 194805, 321818, 475831, 510203, 490920, 570770, 698892, 684949, 517946, 413292, 518763, 731199, 852726, 809973, 653874, 434244, 181472, -6416, 25297, 310952, 645888, 756831, 605443, 414448, 354458, 341019, 239036, 129072, 194625, 421712, 605785, 634747, 585323, 540458, 486659, 412385, 345264, 259738, 94916, -107677, -228667, -256514, -298279, -381639, -410409, -352638, -298717, -278341, -197815, -35173, 77666, 66071, 41324, 95956, 111037, -90288, -486838, -871091, -1048378, -954120, -666040]
37753f66040K96132J51390N1461J19481K16030J63620M0957J9710L5405o9704
37743C58442j71750r949L16382L97118J14884j84974k31152j56302j40268r8723
37733A93708M5462J07955n7376k54213k24089l3934Q6820J15231J54763J39014
37723B73341o6130l40751l90294j38136J87945L50179K96025R9836r8371j34035
37713C9609J2963J29291L0149j52982j61229j8371J9724r7610j40791j1474R0608
37702b60113L8767J3371J58312K67749J05713j45556j06379K02581L47135J09067
37692G30647k08505k53702j17433j04748k09248j41762J63514L91737K80879l1558
37682D99821k37559k50420j87602r9677M9675J82766J34584p0663j74455k5198
$$ y = [-666040, -369908, -218518, -167057, -47576, 168454, 332074, 373031, 392741, 428146, 358442, 186692, 176743, 493125, 890243, 1005127, 820153, 589001, 432699, 292431, 193708, 239170, 347125, 289749, 35536, -188553, -222487, -135667, -20436, 134327, 273341, 207211, -133540, -523834, -661970, -474025, -123846, 172179, 272015, 173644, 39609, 52572, 181863, 212012, 59030, -102199, -120570, -100846, -198456, -339247, -350721, -260113, -221346, -207975, -49663, 218086, 323799, 178243, 71864, 274445, 621580, 730647, 522142, 268440, 151007, 46259, -162989, -304751, -141237, 250500, 531379, 499821, 262262, 11842, -175760, -275437, -225762, -42996, 91588, 20925, -153530, -178728]
37672a78728J84306J62417r1827k99590k61547n2914J43774K49105K68059J84175
37662C07230n728j96051k33213r3055P8641J33535P2419m175m3051p7424j40051
37651b00923j92334j54145K890J85084K22605M8342j73179j98027j6475J13720
37641c62442K2432j37761j51860p6093q2544j01101O2349K98754K66613m7859
37631c09512k27544m3884J85445J08746j17482j33884L3812Q9089l985k4699N5952
37620c87946M9813m3505j2354J44518J56653o0760k39182j81574m1449j5879l8909
37609f70574L0740J45000J77438J17921O801j42885k32186j05736J54580K08149
37599c10752o7745l13691j62680K18434L73588K02963J1650k6285p3016k33381
$$ y = [-178728, 5578, 167995, 76168, -223422, -484969, -537883, -394109, -145004, 123055, 307230, 301502, 105451, -127762, -220817, -142176, -8641, 63778, 59603, 16552, -60872, -200923, -393257, -547402, -544512, -359428, -136823, -88481, -261660, -459687, -476162, -362442, -340010, -477771, -629631, -705724, -788268, -889369, -827020, -528266, -261653, -309512, -537056, -580940, -395495, -286749, -404231, -538115, -504303, -415214, -419199, -443898, -387946, -338133, -381638, -393992, -249474, -92821, -153581, -392763, -574337, -615786, -631665, -670574, -639834, -494834, -317396, -199475, -192674, -335559, -567745, -673481, -518901, -310752, -378497, -692188, -854868, -636434, -262846, -59883, -48233, -74518, -147534, -380915]
37589c80915k98410p0570K74073L82222J90893j8021l2875J6149q7872k59956
37579b85282k06354Q7049K22885p3137m83146m58930K9147M48377M35086K11911
37569g2394J34780J59269K5748k47782l75850k24791L8328K00134K17536J77484
37559C2462J64247J70860J00395q8121k36731j46092R6860J71049j7732j89813
37549E7384j43720n6380j10812j38109L8200J78754j5076l10767k11588K59962
$$ y = [-380915, -679325, -749895, -475822, -93600, 97293, 79272, 46397, 62546, -25326, -285282, -491636, -404587, -181702, -254839, -737985, -1196915, -1167768, -719391, -284305, -72394, 62386, 221655, 247403, -379, -376229, -601020, -562692, -362558, -145022, 32462, 196709, 367569, 467964, 379843, 143112, -2980, 93880, 264929, 247197, 57384, -86336, -142716, -253528, -391637, -353437, -174683, -189759, -500526, -712114, -452152]
$$ [...]
##END NTUPLES=NMR SPECTRUM
##END=
