##TITLE=31Pdec_DE-67rmail2
 , 24 sc
 4.10.2024
##JCAMPDX= 6.0         $$ Bruker NMR JCAMP-DX V2.0
##DATA TYPE= NMR SPECTRUM
##DATA CLASS= NTUPLES
##ORIGIN= UXNMR, Bruker Analytische Messtechnik GmbH
##OWNER= root
$$ XWIN-NMR		Version 3.5
$$ Fri Oct  4 15:39:19 2024 Russian Standard Time (UT+4h)  she@DPX200
##.OBSERVE FREQUENCY= 81.013821
##.OBSERVE NUCLEUS= ^31P
##.ACQUISITION MODE= SIMULTANEOUS
##.ACQUISITION SCHEME= undefined
##.AVERAGES= 24
##.DIGITISER RES= 17
##SPECTROMETER/DATA SYSTEM= spect
##.PULSE SEQUENCE= zgpg30
##.SOLVENT NAME= CDCl3
##.SHIFT REFERENCE= (INTERNAL, CDCl3, 0, 198.062)
##AUDIT TRAIL= $$ (NUMBER, WHEN, WHO, WHERE, WHAT)
$$ ##TITLE= Audit trail, XWIN-NMR		Version 3.5
$$ ##JCAMPDX= 5.01
$$ ##ORIGIN= Bruker BioSpin GmbH
$$ ##OWNER= she
$$ F:/spectra/data/she/nmr/P31/2/pdata/1/auditp.txt
$$ ##AUDIT TRAIL=  $$ (NUMBER, WHEN, WHO, WHERE, WHAT)
(   1,<2024-10-04 15:38:20.75 +0400>,<she>,<DPX200>,
      <created by zg, POWCHK disabled, PULCHK disabled
       configuration hash MD5:
       00 E9 B6 7A A2 85 ED C7 34 08 36 98 17 FE 4E 26
       data hash MD5: 32K
       2E 4B 82 AB 8D 04 E5 E7 E0 9B 22 5E 19 C7 9E F8>)
(   2,<2024-10-04 15:38:25.87 +0400>,<she>,<DPX200>,
      <Start of raw data processing
       efp BC_mod = 2 LB = 1.5 FT_mod = 6 PKNL = 1 PHC0 = 2656.982 PHC1 = 63.8875 SI = 64K 
       data hash MD5: 64K
       5A 78 5A D7 99 43 6E 08 9C 93 1D 08 24 1C 2B 13>)
(   3,<2024-10-04 15:38:42.60 +0400>,<she>,<DPX200>,
      <pk PHC0 = 1.151285 PHC1 = 0 
       data hash MD5: 64K
       54 2A 25 18 5A 65 0C B3 23 45 45 63 A3 50 48 EB>)
$$ ##END=
$$ 
$$ hash MD5
$$ 1C 6D BD C9 D4 F7 49 96 0F 28 DD B1 C7 E5 E0 60
##$RELAX= 
##$RELAX= 
##$RELAX= 
##$RELAX= 
##$RELAX= 
##$RELAX= 
##$RELAX= 
##$RELAX= 
$$ Bruker specific parameters
$$ --------------------------
##$DU= <F:/spectra>
##$EXPNO= 2
##$NAME= <P31>
##$PROCNO= 1
##$TYPE= <nmr>
##$USER= <she>
##$AMP= (0..31)
100 100 100 100 100 100 100 100 100 100 100 100 100 100 100 100 100 100 
100 100 100 100 100 100 100 100 100 100 100 100 100 100 
##$AQSEQ= 0
##$AQ_mod= 1
##$AUNM= <au_zg>
##$AUTOPOS= <>
##$BF1= 81.014009
##$BF2= 200.13
##$BF3= 200.13
##$BF4= 200.13
##$BF5= 200.13
##$BF6= 200.13
##$BF7= 200.13
##$BF8= 200.13
##$BYTORDA= 1
##$CFDGTYP= 0
##$CFRGTYP= 5
##$CHEMSTR= <none>
##$CNST= (0..31)
1 1 145 1 1 1 1 1 1 1 1 1 1 1 1 1 1 1 1 1 1 1 1 1 1 1 1 1 1 1 1 1 
##$CPDPRG= <waltz16>
##$CPDPRG1= <>
##$CPDPRG2= <waltz16>
##$CPDPRG3= <>
##$CPDPRG4= <mlev>
##$CPDPRG5= <mlev>
##$CPDPRG6= <mlev>
##$CPDPRG7= <mlev>
##$CPDPRG8= <mlev>
##$CPDPRGB= <>
##$CPDPRGT= <>
##$D= (0..31)
0 1 0 0 0 0 0 0 0 0.06 0 0.03 2e-05 3e-06 0 0 0.0002 0 0 0 0 0 0 0 0 0 
0 0 0 0 0 0 
##$DATE= 1728041900
##$DBL= (0..7)
120 120 120 11 120 120 24 19 
##$DBP= (0..7)
150 150 150 150 150 150 150 150 
##$DBP07= 0
##$DBPNAM0= <>
##$DBPNAM1= <>
##$DBPNAM2= <>
##$DBPNAM3= <>
##$DBPNAM4= <>
##$DBPNAM5= <>
##$DBPNAM6= <>
##$DBPNAM7= <>
##$DBPOAL= (0..7)
0.5 0.5 0.5 0.5 0.5 0.5 0.5 0.5 
##$DBPOFFS= (0..7)
$$ [...]
##$SUBNAM2= <"">
##$SUBNAM3= <"">
##$SUBNAM4= <"">
##$SUBNAM5= <"">
##$SUBNAM6= <"">
##$SUBNAM7= <"">
##$SUBNAM8= <"">
##$SUBNAM9= <"">
##$SW= 400.765351723535
##$SWIBOX= (0..15)
0 1 3 0 0 0 0 0 0 0 0 0 0 0 0 0 
##$SW_h= 32467.5324675325
##$TD= 32768
##$TD0= 1
##$TE= 0
##$TE2= 300
##$TE3= 300
##$TEG= 300
##$TL= (0..7)
0 120 53 12 22 120 120 120 
##$TP= (0..7)
150 150 150 150 150 150 150 150 
##$TP07= 0
##$TPNAME0= <>
##$TPNAME1= <>
##$TPNAME2= <>
##$TPNAME3= <>
##$TPNAME4= <>
##$TPNAME5= <>
##$TPNAME6= <>
##$TPNAME7= <>
##$TPOAL= (0..7)
0.5 0.5 0.5 0.5 0.5 0.5 0.5 0.5 
##$TPOFFS= (0..7)
0 0 0 0 0 0 0 0 
##$TUNHIN= 0
##$TUNHOUT= 0
##$TUNXOUT= 0
##$USERA1= <user>
##$USERA2= <user>
##$USERA3= <user>
##$USERA4= <user>
##$USERA5= <user>
##$V9= 5
##$VALIST= <valist>
##$VCLIST= <CCCCCCCCCCCCCCC>
##$VD= 0
##$VDLIST= <DDDDDDDDDDDDDDD>
##$VPLIST= <PPPPPPPPPPPPPPP>
##$VTLIST= <TTTTTTTTTTTTTTT>
##$WBST= 1024
##$WBSW= 4
##$XGAIN= (0..3)
0 0 0 0 
##$XL= 0
##$YL= 0
##$YMAX_a= 15320
##$YMIN_a= -16210
##$ZGOPTNS= <>
##$ZL1= 120
##$ZL2= 120
##$ZL3= 120
##$ZL4= 120
##$ABSF1= 0
##$ABSF2= 0
##$ABSG= 0
##$ABSL= 0
##$ALPHA= 0
##$AQORDER= 0
##$ASSFAC= 0
##$ASSFACI= 0
##$ASSFACX= 0
##$ASSWID= 0
##$AUNMP= <proc_1d>
##$AZFE= 0.1
##$AZFW= 0.5
##$BCFW= 0
##$BC_mod= 2
##$BYTORDP= 0
##$COROFFS= 0
##$CY= -3
##$DATMOD= 1
##$DC= 0
##$DFILT= <>
##$DTYPP= 0
##$F1P= 0
##$F2P= 0
##$FCOR= 1
##$FTSIZE= 65536
##$FT_mod= 6
##$GAMMA= 0
##$GB= 0
##$INTBC= 1
##$INTSCL= 9.790993e-09
##$ISEN= 30
##$LB= 1.5
##$LEV0= 0
##$LPBIN= 0
##$MAXI= 10000
##$MC2= 0
##$MEAN= 0
##$ME_mod= 0
##$MI= 50
##$NCOEF= 0
##$NC_proc= -5
##$NLEV= 6
##$NOISF1= 182.463
##$NOISF2= 159.3651
##$NSP= 0
##$NTH_PI= 0
##$NZP= 0
##$OFFSET= 198.0616
##$PC= 4
##$PHC0= 2658.133
##$PHC1= 63.8875
##$PH_mod= 1
##$PKNL= yes
##$PPARMOD= 0
##$PSCAL= 0
##$PSIGN= 0
##$REVERSE= no
##$SF= 81.0140089999434
##$SI= 65536
##$SIGF1= 159.3651
##$SIGF2= -187.1042
##$SINO= 113.3802
##$SIOLD= 16384
##$SREGLST= <1H.CDCl3>
##$SSB= 0
##$STSI= 65536
##$STSR= 0
##$SW_p= 32467.5324675325
##$SYMM= 0
##$S_DEV= 0
##$TDeff= 32768
##$TDoff= 0
##$TI= <>
##$TILT= no
##$TM1= 0
##$TM2= 0
##$TOPLEV= 0
##$USERP1= <user>
##$USERP2= <user>
##$USERP3= <user>
##$USERP4= <user>
##$USERP5= <user>
##$WDW= 1
##$XDIM= 65536
##$YMAX_p= 483442386
##$YMIN_p= -18326042
$$ End of Bruker specific parameters
$$ ---------------------------------
##NTUPLES= NMR SPECTRUM
##VAR_NAME=  FREQUENCY,     SPECTRUM/REAL,   SPECTRUM/IMAG
##SYMBOL=    X,             R,               I
##VAR_TYPE=  INDEPENDENT,   DEPENDENT,       DEPENDENT
##VAR_FORM=  AFFN,          ASDF,            ASDF
##VAR_DIM=   65536,         65536,           65536
##UNITS=     HZ,            ARBITRARY UNITS, ARBITRARY UNITS
##FACTOR=    0.49542278885378, 1,            1
##FIRST=     16045.7642231865, 0,            0
##LAST=      -16421.768244346, 0,            0
##MIN=       -16421.768244346, -18326042,    0
##MAX=       16045.7642231865, 483442386,    0
$$ Real data points
##PAGE= N=1
##DATA TABLE= (X++(R..R)), XYDATA
$$ [...]
43352G23934J12058P5944R0087M2098j01745k05805j99222j71290j74704j50586
$$ 723934 835992 911936 1002023 1044121 942376 736571 537349 366059 191355 40769
43342D0769r6027q6170q5640L1413K18891K53798P0952j20329j39473m5694L3340
$$ 40769 -55258 -141428 -227068 -195655 23236 277034 347986 227657 88184 42490 75830
43331G5830P1327N7788m2045j48648j01731P5317J67843J22275J48338L28392
$$ 75830 147157 204945 162900 14252 -87479 -12162 155681 277956 426294 754686
43321G54686L98219J39651k31008l34345j39128O1093Q4215J3514m0411q9726
$$ 754686 1152905 1292556 1061548 727203 588075 649168 733383 746897 706486 616760
43311F16760j57677j91314j37491j8596Q5331R2174q339j07134p7646M2716Q1807
$$ 616760 459083 267769 130278 111682 197013 289187 280848 173714 96068 138784 220591
43300B20591j3922r8183o6920j3623l0486k9199P6193J61429P0484j09939j68864
$$ 220591 206669 108486 41566 27943 -2543 -31742 44451 205880 276364 166425 -2439
43289b439q4224j415L8620J12826J82289R9082j09924j95263k2004K15834K39035
$$ -2439 -86663 -88078 -49458 63368 245657 344739 234815 39552 17548 233382 472417
43278D72417K6782j99715k60407j70484m9311J9912K7616R13l1772n1544n1433
$$ 472417 499199 299484 39077 -131407 -180718 -160806 -133190 -132277 -164049 -215593 -267026
43267b67026m1788m2095m7874j7209P6953J90117K47533K39213K18192K00444
$$ -267026 -308814 -350909 -398783 -415992 -339039 -148922 98611 337824 556016 756460
43257G56460J31513k7505k33174l89968m01520k15120R7024L18141K74141N7652
$$ 756460 887973 860468 627294 237326 -164194 -379314 -282290 35851 309992 367644
43247C67644o3918M804P7480j7184j83365k12221o8564J02347J74176J32456K7706
$$ 367644 303726 308530 386010 368826 185461 -26760 -95324 7023 181199 313655 341361
43236C41361p0595j18625j52414k30523k94457k07531J6290J74430J50701O3802
$$ 341361 270766 152141 -273 -230796 -525253 -732784 -716494 -542064 -391363 -327561
43226c27561L0774k7831j76417k43834n7598K28460L10939J70414N6347P3477
$$ -327561 -296787 -324618 -501035 -744869 -802467 -574007 -263068 -92654 -36307 37170
43216C7170P2084k2624n7095O7688J87335J03311j19030k30901j12427J02604
$$ 37170 109254 86630 29535 97223 284558 387869 268839 37938 -74489 28115
43206B8115J90688P4292r8276j12237N5981J94340J23547p2486j87360j76811
$$ 28115 218803 293095 194819 82582 138563 332903 456450 383964 196604 19793
43196A9793j50323j43061q5158K0439P6909N9764L5658J0043o9578j54269j32758
$$ 19793 -130530 -273591 -358749 -338310 -261401 -201637 -165979 -155936 -225514 -379783 -512541
43185e12541m8306o0634j47008q0961J92130L91965K74032k3394j83969j20275
$$ -512541 -560847 -621481 -768489 -849450 -657320 -265355 8677 -14717 -198686 -318961
43175c18961J2409R6722J44241J64945J35739R1981J08041J79550K22328J81861
$$ -318961 -306552 -209830 -65589 99356 235095 327076 435117 614667 836995 1018856
43165A018856P0322p7056k07996k47773j61934l972J43372K30363K13344N3694
$$ 1018856 1089178 1012122 804126 556353 394419 390447 533819 764182 977526 1031220
43155A031220j87301l33398k60681k9568K00170L06923K23974l9867l09957l36440
$$ 1031220 843919 510521 249840 220272 420442 727365 951339 911472 601515 265075
43145B65075j17317K2443j39029l61728k71252O5830K22947N2801j10009J7650
$$ 265075 147758 170201 31172 -330556 -601808 -535978 -313031 -260230 -370239 -352589
43135c52589K56900K85448J17965J2706M8560O2195m7889j87553k44837k22925
$$ -352589 -95689 189759 307724 320430 368990 431185 383296 195743 -49094 -272019
43125b72019j64304p9605M815K8954k1960p6936m8415P9040K17699K20602J9478
$$ -272019 -436323 -515928 -511113 -482159 -504119 -581055 -629470 -550430 -332731 -112129 -92651
43114i2651k35781k69560j3217K45194J98162n8284j44777O4907K69030J86850
$$ -92651 -328432 -597992 -611209 -366015 -167853 -226137 -370914 -306007 -36977 149873
43104A49873m0955q3138R3865J99901N3690j67877j80169L7797K32037K05005
$$ 149873 108918 25780 119645 319546 373236 205359 25190 62987 295024 500029
43094E00029O0039M5307J84570K06498o0249l59261l04173M7408K29924M5102
$$ 500029 560068 605375 789945 996443 936194 576933 272760 320168 550092 595194
43084E95194j48634k2293J90610R8255j74675j86084P8736J84339k6307k10451
$$ 595194 446560 424267 614877 713132 538457 352373 431109 615448 589141 378690
43074C78690j56543j12442k35138k08770J93100N58694L53745k51510n86136l93557
$$ 378690 222147 109705 -125433 -334203 -141103 417591 771336 519826 -66310 -459867
43064d59867m9711R7198J14832J46606J32032L5104M437J09435J79576R0207q617
$$ -459867 -509578 -412380 -297548 -150942 -18910 16194 20631 130066 309642 399849 391232
43053C91232P3251K72648L67551K30244j12366n09119o89111m42428O8359L70547
$$ 391232 464483 737131 1104682 1334926 1222560 713441 24330 -418098 -349739 20808
43043B0808K19361r2894j38689R0817K41719J00617j72904k83612j17154J66358
$$ 20808 240169 147275 8586 99403 341122 441739 268835 -14777 -131931 34427
43033C4427K75018P4507k25806k92832j08939O592j03830j81414J5880K86113
$$ 34427 309445 383952 158146 -134686 -243625 -237033 -340863 -522277 -506397 -220284
43023b20284K83820N4922p4855k1778J9097l300O5462K05265J73508o3685k10261
$$ -220284 63536 118458 43603 21825 40922 37622 103084 308349 481857 418172 207911
43012B07911j04371J7534p6256k23922j38787J38364L27085L16068K25445J38653
$$ 207911 103540 121074 44818 -179104 -317891 -179527 147558 463626 689071 827724
43002H27724J7802j28390j93947j24477M140P0709O432j55951k68784j78020P4338
$$ 827724 845526 717136 523189 398712 402852 473561 479993 324042 55258 -122762 -48424
42991d8424K42502J66932k3873j12384q1110n3174m7551J4499J18514J67695J54387
$$ -48424 194078 361010 337137 224753 143643 90469 42918 57417 175931 343626 498013
42980D98013J38651Q9402n0921j65798o9433J57234J85025j11084m36894m60266
$$ 498013 636664 726066 675145 509347 439914 597148 782173 671089 234195 -226071
42970b26071k33268n9549o2595q2825L4380K14843K53234O1509k06988k85370
$$ -226071 -459339 -518888 -581483 -664308 -629928 -415085 -161851 -100342 -307330 -592700
42960e92700p9191J97301K56356Q7849n9280m4105O062m3349j22289j26390j07815
$$ -592700 -671891 -474590 -218234 -130385 -189665 -233770 -227708 -271057 -393346 -519736 -627551
42949f27551j30431j00961N7715K04174J69948M1992K2398J05236J47286J69734
$$ -627551 -757982 -858943 -801228 -597054 -427106 -385114 -362716 -257480 -110194 59540
42939E9540K83593L63565J54167k57442m32002j71629J84720K31379l954k24910
$$ 59540 343133 706698 860865 603423 171421 -208 184512 415891 411937 187027
42929A87027k86973k19683l7601J94850K55077O630l26859l93766j70363N9708
$$ 187027 -99946 -319629 -357230 -162380 92697 99327 -227532 -621298 -791661 -731953
42919g31953J36350J62265K07061J55233n3660k47714k21388R713K47631L14898
$$ -731953 -595603 -433338 -226277 -71044 -124704 -372418 -593806 -584093 -336462 -21564
42909b1564J63956j11353l12976k81972o7337J20449J59567J31226J48625J84222
$$ -21564 142392 31039 -281937 -563909 -631246 -510797 -351230 -220004 -71379 112843
42899A12843J46844M9198J028O1604J61210J64294K22k37162l31816j60803J26527
$$ 112843 259687 308885 309913 371517 532727 697021 697243 460081 128265 -32538 93989
42888I3989K38862Q5700j08244r4660Q1140J53154k2729l03622m35133l14511
$$ 93989 332851 418551 310307 215647 296787 449941 427212 123590 -311543 -626054
42878f26054o2558J14976J14527J0015m0716L1275J35044J36524K7309o8036o1282
$$ -626054 -688612 -573636 -459109 -449094 -489810 -458535 -323491 -186967 -159658 -227694 -288976
42867b88976j9090n3524j28604q6129J00488K19174Q5609j61352k08664n582J48820
$$ -288976 -308066 -361590 -490194 -576323 -475835 -256661 -171052 -332404 -541068 -546650 -397830
42856c97830K2170k35346l24743j98140m8973k285j2473k6429n4476p1058p290
$$ -397830 -375660 -611006 -935749 -1133889 -1182862 -1185147 -1197620 -1224049 -1278525 -1349583 -1356873
42845a356873J25330K27946K56030K59692K65909K29479J30121K8016r394K0990
$$ -1356873 -1231543 -1003597 -747567 -487875 -221966 7513 137634 165650 156256 177246
42835A77246O3321L8568q6540k16604j95112l6880K3985j39702k97388j49494
$$ 177246 240567 279135 192595 -24009 -219121 -256001 -232016 -371718 -669106 -818600
42825h18600K16795M13570K59856n4472k93676l76945k46827J22360M94487M92500
$$ -818600 -601805 -188235 71621 17149 -276527 -653472 -900299 -777939 -283452 209048
42815B09048J18836j52625j7789K16929J12275k43295m09098k64193j09170j44445
$$ 209048 327884 175259 157470 374399 486674 243379 -165719 -429912 -539082 -683527
42805f83527k19703j55162n798J01615J64094K14237K09857J34864Q4177J27227
$$ -683527 -903230 -1058392 -1064190 -962575 -798481 -584244 -374387 -239523 -155346 -28119
42795b8119J70262P1826j38539k55810j31553J41686L21398K84145J45199P0705
$$ -28119 142143 213969 75430 -180380 -311933 -170247 151151 435296 580495 651200
42785F51200M7883l8869j54256j31150K6085P6209j05338l01039k49590j2067
$$ 651200 699083 660214 505958 374808 400893 477102 371764 70725 -178865 -190932
42775a90932J62768K09939K43574K62164J32144j31254l11503k76318j28308j5063
$$ -190932 -28164 181775 425349 687513 819657 688403 376900 100582 -27726 -42789
42765d2789M1677O3240K0977q0763j47227j12718l6250m819j1590J738L8037M9022
$$ -42789 -1112 62128 83105 2342 -144885 -257603 -293853 -298672 -310262 -308524 -270487 -221465
42753b21465J9461l867L0592J03255J11711l0215k62065l96775l15599r5509R9802
$$ -221465 -202004 -205871 -175279 -72024 39687 9472 -252593 -649368 -964967 -1060476 -960674
42742i60674J86859J67091O5092l9758j8609J36009K31924J31078l075P3625K68710
$$ -960674 -773815 -606724 -541632 -581390 -599999 -463990 -232066 -100988 -104063 -30438 238272
42731B38272K32030j05991l59767k07828J34512J97074j03644l62400k31406J50041
$$ 238272 470302 364311 4544 -203284 -68772 128302 24658 -337742 -569148 -419107
42721d19107L74553K78255P4546Q906M9143M719j53588k49172j62375J2849J19931
$$ -419107 -44554 233701 308247 317153 366296 371015 217427 -31745 -194120 -181271 -61340
42710f1340J19484N1406n6955j45167r6701J04257K73566K27503K8363j06979
$$ -61340 58144 109550 52595 -92572 -189273 -85016 188550 416053 444416 337437
42700C37437r5157l5163m969K1920M9777J2551r3036j46900n8661P8677O4795
$$ 337437 242280 207117 202148 224068 273845 286396 193360 46460 -12201 66476 131271
42689A31271j67177m12218l55537O3610M99183N43708K15363q1638j06516m6835
$$ 131271 -35906 -448124 -803661 -740051 -240868 302840 518203 436565 330049 283214
42679B83214j28387k34562j39228R4559K24881J93498J05910k3217k18664l45756
$$ 283214 154827 -79735 -218963 -124404 100477 293975 399885 376668 158004 -187752
42669a87752k60391p2486K8082R7763K64183L51802R8991l19958m54343k55641
$$ -187752 -448143 -520629 -492547 -394784 -130601 221201 320192 234 -454109 -709750
42659g09750j08127j35363k0002L30744N02872K55529j4530J13263M06561L75689
$$ -709750 -817877 -953240 -973242 -642498 -139626 115903 101373 214636 621197 996886
42649I96886M9878j31295k5233Q6921R675j40363k11300j90202r2195N8063J36766
$$ 996886 1046764 915469 890236 977157 986832 846469 635169 444967 352772 410835 547601
42638E47601M1430j18778j56886q4202m7901o3079l9318j2431r2799k13680j93401
$$ 547601 589031 470253 313367 229165 181264 118185 78867 66436 -26363 -240043 -433444
42627d33444n2265j1176j33964k11117q5952J00651J15520l6233j09906P5182
$$ -433444 -485709 -496885 -630849 -841966 -927918 -827267 -711747 -747980 -857886 -782704
42617g82704L93163N07215K46418j43622k55324l9206J26051k3091k49588j76694
$$ -782704 -389541 117674 364092 220470 -34854 -74060 51991 28900 -220688 -397382
42607c97382J48427L27590J57420j66380l57651l14865r6315J64367L02146K50314
$$ -397382 -248955 78635 236055 69675 -287976 -602841 -699156 -534789 -232643 17671
42597A7671J33122J00118J13934M7555q1582j54217j56210j49682j10020n020
$$ 17671 150793 250911 364845 412400 330818 176601 20391 -129291 -239311 -244331
42587b44331L6780j15900l18882k93076k2278K41478L43979L29393K03987p3291
$$ -244331 -207551 -323451 -642333 -935409 -957687 -716209 -372230 -42837 161150 87859
42577H7859l35337k89269L8969K52000J12289j53697k36603j53051p4845k505
$$ 87859 -247478 -536747 -497778 -245778 -133489 -287186 -523789 -676840 -751685 -754190
42567g54190J31573K14609R3237j23937j59127N3053K72158K60579N0483j30494
$$ -754190 -622617 -408008 -314771 -438708 -597835 -544782 -272624 -12045 38438 -92056
42557i2056j19738K7961J25080P0076n5418j34099j73804k19444j95198j9797
$$ -92056 -211794 -183833 -58753 11323 -44095 -178194 -351998 -571442 -766640 -786437
42547g86437J67555J31909q8542j81846k265K21409K29985P5073k8902j7848J7608
$$ -786437 -618882 -486973 -575515 -757361 -759626 -538217 -308232 -233159 -262061 -279909 -262301
42536b62301J2122k8809o2383j205J96221L66159K64083n9428k41751j12295M4367
$$ -262301 -250179 -278988 -341371 -342576 -146355 219804 483887 424459 182708 70413 114780
42525A14780n3450k22810j29748J33487J77900o3897k52729j84891l7576J3372
$$ 114780 61330 -161480 -291228 -157741 20159 -43738 -296467 -481358 -518934 -505562
42515e05562P1329K48642L97118L21423P6472j42364k60876k95486j96357O1654
$$ -505562 -434233 -185591 211527 532950 609422 467058 206182 -89304 -285661 -224007
42505b24007L06641L08562Q2921j19659j32245k0094R6748J84419K01229N0651
$$ -224007 82634 391196 474117 354458 222213 202119 298867 483286 684515 735166
42495G35166k38052m19400k98247j3883J22256L4288o7505l8998K1830J4174J5199
$$ 735166 497114 77714 -220533 -234416 -112160 -77872 -145377 -184375 -162545 -148371 -133172
42484a33172P8146N7921j45661l26153k21058O2326J69629L3101l1854J62874
$$ -133172 -55026 2895 -142766 -468919 -689977 -627651 -458022 -424921 -456775 -293901
42474b93901L70037K78179l4978k35778j80652j4233R7978J27427R2299r749j35894
$$ -293901 76136 354315 319337 83559 -97093 -111326 -13348 114079 206378 196629 60735
42463F0735j74497m5257K04106M09142L97814J40641j78003k96852j35787J20574
$$ 60735 -113762 -159019 45087 454229 852043 992684 814681 517829 382042 502616
42453E02616K25787J10954r1413j87744o6009K08135L97656K95520k4399k55682
$$ 502616 728403 839357 747944 560200 494191 702326 1099982 1395502 1371103 1115421
42443A115421k21388p8028o8465j82552k03937l6232J66355J99462L5855j75402
$$ 1115421 894033 816005 747540 564988 361051 324819 491174 690636 726491 551089
42433E51089k78460k46953j62924q4552J6156J55166K52023K36379J73795J55488
$$ 551089 272629 25676 -137248 -221800 -205644 -50478 201545 437924 611719 767207
42423G67207J30374K7711j9270J65829M34499M31296J43034k6231J28793L05007
$$ 767207 897581 925292 906022 1071851 1506350 1937646 2080680 2054449 2183242 2488249
42413B488249K35231J49500L30863N77754O12205P23550J322773J959751J577997
$$ 2488249 2723480 2872980 3203843 3781597 4393802 5117352 6440125 8399876 9977873
42404I977873l3645j708225k217747j642483r81274p94074q03861o45603l86680
$$ 9977873 9944228 8236003 6018256 4375773 3394499 2600425 1796564 1150961 764281
42395G64281k28964j54588n6491N0773J08106J20144Q1640m9956k28721l15193
$$ 764281 535317 380729 324238 375011 483117 603261 684901 634945 406224 91031
42385I1031k68563j97667j54593m6784J46603K47678J26634o3097q8083J9891
$$ 91031 -177532 -375199 -529792 -576576 -429973 -182295 -55661 -118758 -206841 -186950
42375a86950L3809r9234j85608r7576N6636J40772J78323K29891K44680J66415
$$ -186950 -153141 -252375 -437983 -535559 -478923 -338151 -159828 70063 314743 481158
42365D81158O3776J7134k1052j08342j52435m3175J20040J21174p2428k71431
$$ 481158 544934 562068 541016 432674 280239 237064 357104 478278 405850 134419
42355A34419l17241k16189l7604J44851K10258Q2230j05505j20961M7814J75667
$$ 134419 -182822 -399011 -436615 -291764 -81506 724 -104781 -225742 -177928 -2261
42345b261J47023R9428J34856J26402k9109j72152j04970Q6469J50245J5700j74656
$$ -2261 144762 244190 379046 505448 476339 304187 199217 285686 435931 451631 276975
42334B76975l05372l60084l00011p5396K28991M14302L69881J73639m679m2442
$$ 276975 -28397 -388481 -688492 -763888 -534897 -120595 249286 422925 418246 375804
42324C75804M9825J24164M4096j17203j42641P569J13299M4744j2390J21939K70158
$$ 375804 425629 549793 593889 476686 334045 341614 454913 499657 487267 609206 879364
42313H79364J44620j81932l64237k79541j26762n3618O608J02877J58424J43657
$$ 879364 1023984 842052 477815 198274 71512 17894 24502 127379 285803 429460
42303D29460J02049k4555l17139n90693n09069q6874K46495K31932J13427J88384
$$ 429460 531509 506954 189815 -400878 -909947 -996821 -750326 -518394 -404967 -216583
42293b16583L36192K78440O5242l0979M3027J08227R1428P4569N5893n2059j97721
$$ -216583 119609 398049 463291 432312 475339 583566 674994 749563 805456 753397 555676
42282E55676k24716j40824j11902j65773j41674J6164J46531J34133P0374M0543
$$ 555676 330960 190136 78234 -87539 -229213 -213049 -66518 67615 137989 178532
42272A78532n1968k89670n12750m72106j52089K00819L45156K49294P0545Q752
$$ 178532 126564 -163106 -675856 -1147962 -1300051 -1099232 -754076 -504782 -434237 -425485
42262d25485J32539K82989K19225o3184k57370j15216J96300K89071O1273k00839
$$ -425485 -292946 -9957 209268 146084 -111286 -226502 -30202 258869 320142 119303
42252A19303k45465j53877j20755j38124p4022N6522J01143J6662o1997j5552
$$ 119303 -126162 -280039 -400794 -538918 -612940 -556418 -455275 -438613 -500610 -516162
42242e16162J10757J78514J13231j7166n8348N4380J69997Q8845j06913q5129
$$ -516162 -405405 -226891 -113660 -130826 -189174 -134794 35203 124048 17135 -67994
42232f7994K39374M61948K05884k83985m21815q3490K63759K50612J9862j44248
$$ -67994 171380 633328 839212 555227 133412 49922 313681 564293 584155 439907
42222D39907j96117j60738L1024K86151K66892j30239n00014m62088k05695j31067
$$ 439907 243790 83052 114076 400227 667119 536880 36866 -425222 -630917 -761984
42212g61984j89526l3591L25513M99712L33420R0094m99P277K5414O9685P9263
$$ -761984 -951510 -985101 -659588 -159876 173544 263638 263139 270416 295830 365515 444778
42201D44778o0315k36437j81481Q5907K21631P1090j04351o7284M0695j4822j75885
$$ 444778 384463 148026 -33455 52452 274083 345173 240822 173538 214233 199411 23526
42190B3526k19009r2141O6217J21794L4658j22893j72884j4431J67426Q9970j93519
$$ 23526 -195483 -287624 -221407 -99613 -64955 -187848 -360732 -375163 -207737 -117767 -311286
42179c11286l13394j04670J84941L05968L04169K65881J15798j14153j47885J17790
$$ -311286 -624680 -729350 -544409 -238441 65728 331609 447407 333254 185369 303159
42169C03159L41224J96068j34171k50873j23045k4062n1138p7681p8549j42041
$$ 303159 644383 840451 706280 455407 332362 308300 257162 179481 100932 -41109
42159d1109k11634j42111J7515Q8104O9478J01559J59089Q9175n7683l9520J98543
$$ -41109 -252743 -394854 -377339 -289235 -219757 -118198 40891 130066 72383 32863 231406
42148B31406M21545M25714K39672j2849k25331k73236j05395J02476J12813l5896
$$ 231406 652951 1078665 1318337 1305488 1080157 806921 701526 804002 916815 880919
42138H80919r3140j1939j8453j98748l07803j39191J48093K54945J31193l6034
$$ 880919 787779 775840 757387 558639 250836 111645 259738 514683 645876 609842
42128F09842j09058j09577j00667r0041m2705O5890J94552K36585J30133m7995
$$ 609842 500784 391207 290540 200499 157794 223684 418236 654821 784954 736959
42118G36959j72665k19307k24579j55973K5790K07632K12877N9576m6273l659
$$ 736959 564294 344987 120408 -35565 -9775 197857 410734 470310 424037 420378
42108D20378O6355L3856p3327j62292j81728r6292R0019K47987K25393P4493L145
$$ 420378 486733 520589 447262 284970 103242 6950 96969 344956 570349 644842 647987
42097F47987O1658Q2976n090m4656N6921J27577P294j59743j23889R8482K55608
$$ 647987 709645 792621 787531 742875 799796 927373 934667 774924 651035 749517 1005125
42086A005125J86338n6719l38474n26069m98336k43677O0923J89867P9550j59066
$$ 1005125 1191463 1134744 796270 270201 -228135 -471812 -410889 -221022 -141472 -300538
42076c00538l57176l45764l9807L88167N53783K82037j17167k19245m2185M1503
$$ -300538 -657714 -1003478 -1043285 -655118 -101335 180702 63535 -155710 -197895 -156392
42066a56392j01197j98969n8440J32316J40474L8363K71r701q5628j12142M1395
$$ -156392 -257589 -456558 -514998 -382682 -242208 -203845 -203574 -213275 -298903 -411045 -369650
42055c69650J96025Q2473j80873k08612L9660J69753j1277j71240J098K78394
$$ -369650 -173625 -91152 -272025 -480637 -440977 -271224 -282501 -453741 -452643 -174249
42045a74249K66646L5752l6900R3963J10907p9546j74884R834K40408K48234J04432
$$ -174249 92397 128149 91249 185212 296119 216573 41689 51523 291931 540165 644597
42034F44597L962o0831j68863k16287o2868J87186K94531K08258P9578N889n6399
$$ 644597 648559 587728 418865 202578 139710 326896 621427 829685 909263 915152 858753
42023H58753j54833k67380l44371l20418j41858J18554K59586J80978K6157k5094
$$ 858753 703920 436540 92169 -228249 -370107 -251553 8033 189011 215168 190074
42013A90074k548m0976j34356j64983j00520J191J10768J95034J55975k1753j49365
$$ 190074 187526 146550 12194 -152789 -253309 -252118 -141350 53684 209659 187906 38541
42002C8541n5388J45604K08638J11650L0847K1793k4392j24098j53087q2980m4088
$$ 38541 -16847 128757 337395 449045 479892 501685 477293 353195 200108 117128 73040
41991G3040j05230j77017j76647j24972m9103N8075J58260J86383J55870J21891
$$ 73040 -32190 -209207 -385854 -510826 -559929 -501854 -343594 -157211 -1341 120550
41981A20550O9524k4952p9972k3646M2032j7137j28980j29337m4355k2793n5602
$$ 120550 190074 165122 85150 61504 103536 86399 -42581 -171918 -216273 -239066 -294668
41970b94668k3339M2329K7577j926P5465J26184m9010k64278j32952K79666M68244
$$ -294668 -318007 -275678 -248101 -250027 -174562 -48378 -97388 -361666 -494618 -214952 253292
41959B53292K44985n256J2504Q3881k6788j45700p4891J1377o8952j11643R3658
$$ 253292 498277 493021 505525 589406 562618 416918 342027 353404 284452 172809 266467
41948B66467L07803K09809m2270q1630M7954L0913j13234p5904J45339J98885
$$ 266467 574270 784079 741809 660179 708133 739046 625812 549908 695247 894132
41938H94132l4189k46843k01420n2170l9538j50991k25835j85894m8444J34758
$$ 894132 859943 613100 411680 359510 319972 168981 -56854 -242748 -291192 -156434
41928a56434K79964L30577L27985L18284K41520N4620j20112j51694j15808j44878
$$ -156434 123530 454107 782092 1100376 1341896 1396516 1276404 1124710 1008902 864024
41918H64024j66947n2451P2069k5901k60942k98906p6204Q6196k5779k17763k10081
$$ 864024 697077 644626 716695 690794 429852 130946 54742 140938 115159 -102604 -312685
41907c12685j5650J51897J62012L8224j01071r1654J30589L77709L79576J50871
$$ -312685 -328335 -176438 -14426 23798 -77273 -168927 -38338 339371 718947 869818
41897H69818j7575J0061L6611j06423k68912k35112o9900M018n2244q6570k1140
$$ 869818 852243 862304 898915 792492 523580 288468 218568 222586 170342 83772 62632
41886F2632O0097O3922j1715j17754j92025j71043m5071J06108J83471J60752
$$ 62632 122729 186651 174936 57182 -134843 -305886 -350957 -244849 -61378 99374
41876I9374Q3849J5251n245P002j8842j16544j94604j27965N6352J87877J70527
$$ 99374 183223 198474 193229 200231 181389 64845 -129759 -257724 -201372 -13495 157032
41865A57032Q9211O3628R4335J01604L6798q3474j84542j64150p342J27310O1819
$$ 157032 246243 309871 404206 505810 542608 459134 274592 110442 103100 230410 292229
41854B92229j41538k25404r4033M3547m976j08338p353K68980L98367J97209j16949
$$ 292229 150691 -74713 -168746 -125199 -130175 -238513 -245866 23114 421481 618690 501741
41843E01741j92719K1446K38024K06821l109j62942k09603k52113k96623j93541
$$ 501741 309022 330468 568492 775313 772204 609262 399659 147546 -149077 -342618
41833c42618O2917K04472M4098j99389j77813P9854K19293R4133n6041j9932Q8545
$$ -342618 -279701 -75229 -31131 -230520 -408333 -328479 -109186 -15053 -71094 -91026 -2481
41822b481R3316O4687J42263K16943N5914l05344n36567m22723j34809o319j35028
$$ -2481 90835 155522 297785 514728 570642 265298 -271269 -693992 -828801 -835120 -970148
41811i70148l08378k95082j04924Q8163K00172K88600L58594K86054L4194j84121
$$ -970148 -1278526 -1573608 -1678532 -1590369 -1390197 -1101597 -743003 -456949 -422755 -606876
41801f06876j23890J72613M27906M59887L09533Q4879j32928k33842j26854J10925
$$ -606876 -730766 -558153 -130247 329640 639173 724052 591124 357282 230428 341353
41791C41353K85016L14192K69083J81867P055k01068k85009k31442k19584l22752
$$ 341353 626369 940561 1209644 1391511 1398566 1197498 912489 681047 461463 138711
41781A38711l59352j79751P1308J49744M5140n2457l3531M2386Q7949Q5295O9864
$$ 138711 -220641 -400392 -329084 -179340 -134200 -186657 -220188 -177802 -89853 -4558 65306
41770F5306J01503K05742K85707J79242j16362l69476l62841j40348Q5478J86954
$$ 65306 166809 372551 658258 837500 721138 351662 -11179 -151527 -66049 120905
41760A20905J78731J05915M000p0613p4563j8895P9064K19373L33931K78202J8946
$$ 120905 299636 405551 409551 338938 264375 245480 324544 543917 877848 1156050 1174996
41749A174996k46518k88529j24943J1511l4383j81216k44253j52755j3891K0760
$$ 1174996 928478 639949 515006 526517 492134 310918 66665 -86090 -99981 -79221
41739g9221n2715p2657N7606J91339J35448k3724k0836J46432J65987p8322k48309
$$ -79221 -131936 -204593 -146987 44352 179800 156076 135240 281672 447659 369337 121028
41728A21028m5231K86983K86053n1406k86600j81629M0169J11237N7350R438l4019
$$ 121028 75797 362780 648833 597427 310827 129198 169367 280604 337954 347392 313373
41717C13373r7004r8915j0066L2282o9600j84130j29017O6140K25834K58122J67492
$$ 313373 216369 117454 107388 139670 70070 -114060 -243077 -176937 48897 307019 474511
41706D74511n1445l35413m44946j80723K86331N32542L91660J39262P0646J10026
$$ 474511 423066 87653 -357293 -538016 -251685 280857 672517 811779 882425 992451
41696I92451K1598j64703k07473o8176J4921r2109k12592j41566O0919J94249
$$ 992451 1014049 849346 641873 573697 588618 496509 283917 142351 203270 397519
41686C97519J84703R2583j5641o6784J1945J38273Q0124j99539l68493j49736
$$ 397519 582222 674805 659164 592380 604325 742598 822722 623183 254690 104954
41676A04954K21302K85332J7556j73606q6005M9613N4037Q5466K55374L36687
$$ 104954 326256 611588 629144 455538 369533 419146 473183 558649 814023 1150710
41666A150710J25892j93176l28686k82865k01001o2706J59350K56079O7976j58197
$$ 1150710 1276602 1083426 754740 471875 270874 208168 367518 623597 691573 533376
41656E33376r8393R8125L2362k51385l02023j5123J81742N1030n8318J75076M70233
$$ 533376 434983 533108 565470 314085 12062 -3061 178681 229711 171393 346469 816702
41645H16702L83662J1499k00324j53838j34236k33490k21975l3401P5655m665
$$ 816702 1200364 1211863 1011539 857701 723465 489975 268000 234599 310254 305589
41635C05589r432K28604M19972K46312j10064k37460j26219j07043k30071j76579
$$ 305589 296157 524761 944733 1191045 1080981 843521 717302 610259 380188 203609
41625B03609J33902L05950O2169k94647l23878q0323M7150n5004j51961j00923
$$ 203609 337511 643461 705630 410983 87105 6782 53932 -1072 -153033 -253956
41615b53956o418L1065O635j16646l16806l42762K817M30969M36365M6286j57712
$$ -253956 -260374 -229309 -222674 -339320 -656126 -998888 -996071 -565102 -128737 -82451 -240163
41604b40163R7764L68493J97907k05336l52835j90013j1591P6906J75108K33124
$$ -240163 -142399 226094 424001 218665 -134170 -324183 -335774 -258868 -83760 149364
41594A49364J12215q1944j04932L8792J45101J77987K45989K74798Q2342k25125
$$ 149364 261579 179635 74703 113495 258596 436583 682572 957370 1039712 814587
41584H14587l06956q9889J19443R7000l1317p4191m1541j5735L94k04n8682j21646
$$ 814587 507631 417742 537185 634185 602868 528677 487136 471401 471795 471591 412909 291263
41572B91263q2848N208j2700r8692n0734J26877J89480P4376J9817J14620Q2627
$$ 291263 208415 213623 200923 102231 51497 178374 367854 442230 462047 576667 659294
41561F59294k41593n40174m43163r8924N4956n4238r4355J06872L29861L45967
$$ 659294 417701 -122473 -565636 -664560 -609604 -663842 -758197 -651325 -321464 24503
41551B4503K16318R1296l8886k23883l46168k31762P7904L15140K73028K8811
$$ 24503 240821 332117 293231 69348 -276820 -508582 -430678 -115538 157490 186301
41541A86301j55270j22141L3144J13943O9227K1989N7569Q2030l9105k55855l48545
$$ 186301 31031 -91110 -57966 55977 125204 147193 204762 286792 247687 -8168 -356713
41530c56713j83593J12302K80529K09310L4841m0959K2258J05910J18732Q6757
$$ -356713 -540306 -428004 -147475 61835 96676 55717 77975 183885 302617 389374
41520C89374N6573J8688k4797j5186O2170J11970N5377m0605n7370Q57K4787m1876
$$ 389374 445947 464635 439838 424652 486822 598792 654169 613564 556194 557051 581838 539962
41508E39962j47227k04060j54452q599J29372J48256Q8255R7318J73099J22139
$$ 539962 392735 188675 34223 25624 154996 303252 391507 488825 661924 784063
41498G84063j13157k94584k38121j11636j28840j54782L4756K64037J70583j55109
$$ 784063 670906 376322 138201 26565 -102275 -257057 -222301 41736 212319 57210
41488E7210k31106O1646K76608J16339j11858k6948K28988K77288J01024k4481
$$ 57210 -173896 -112250 164358 280697 168839 141891 370879 648167 749191 724710
41478G24710j4451j5033o6066p0896o1056j77055l72428m01445j52935J96981
$$ 724710 710259 695226 629160 558264 497208 320153 -52275 -453720 -606655 -409674
41468d09674M02346L63261J23513j72066k98619j14061K27453L64687J21953k77135
$$ -409674 -7328 355933 479446 307380 8761 -105300 122153 486840 608793 331658
41458C31658m64278l18843k1681K17349L49648L92546K95886M3749j79317j32032
$$ 331658 -132620 -451463 -473144 -255795 93853 486399 782285 826034 646717 514685
41448E14685J25765K23135m3152m04557m90639l31197k11942j63098L2255L45335
$$ 514685 640450 863585 820433 415876 -74763 -405960 -617902 -781000 -748745 -403410
41438d03410M32647J65902j35270j70229l8122M4497R9694K11268K60348J33841
$$ -403410 29237 195139 59869 -110360 -148482 -103985 -4291 206977 467325 601166
41428F01166p043L5311J52545J15666m5207j39714j54201j75908j15386J33004
$$ 601166 594123 629434 781979 897645 852438 712724 558523 382615 267229 400233
41418D00233L47383K02799j80533l33539j34734J5555j43774l17552j58755J53444
$$ 400233 747616 950415 769882 436343 301609 317164 173390 -144162 -302917 -149473
41408a49473K02578o904q2298J25616L02420J62129j35548k35426p6692P7883
$$ -149473 53105 46201 -36097 89519 391939 554068 418520 183094 106402 184285
41398A84285L9143q3984r3321K0386J12130J09112P2236N2870J3983p6206j66869
$$ 184285 223428 139444 46123 66509 178639 287751 359987 412857 426840 350634 183765
41387A83765j89642j39231n3143L1537P0291J9220j10933k44965k97693k06784
$$ 183765 -5877 -145108 -198251 -166714 -96423 -77203 -188136 -433101 -730794 -937578
41377i37578M3072L37697M32048J99526j25261j57247J38011L69561K45849m7151
$$ -937578 -894506 -556809 -124761 74765 -50496 -207743 -69732 299829 545678 498527
41367D98527j54591l6450Q6690J21200J53234J76773N5963k04647l81116l09346
$$ 498527 343936 307486 394176 515376 668610 845383 901346 696699 315583 6237
41357F237r4260M1238J3099q4788j23527o3330K6335M3356k7261p8671j953J78460
$$ 6237 -88023 -46785 -33686 -118474 -242001 -305331 -278996 -235640 -262901 -341572 -343525 -165065
41345a65065L27862L34012J81449n9552k59665k87048j15372J26252K54878J86696
$$ -165065 162797 496809 678258 618706 359041 71993 -43379 82873 337751 524447
41335E24447j0688j75086j55716N9916K88777K92592K8375k85056l84484k09474
$$ 524447 513759 338673 182957 242873 531650 824242 852617 567561 183077 -26397
41325b6397P0520K19092J30294o6333j16984O2199K55222K27290N4849j4727L5267
$$ -26397 44123 263215 393509 327176 210192 272391 527613 754903 809752 795025 830292
41314H30292n226j78496k74299j97907j13121j11198n2947J01576J26266p9938
$$ 830292 825066 646570 372271 174364 61243 -49955 -102902 -1326 124940 45002
41304D5002k22518j6937L57604N02979L25268L4900k09496l64747l51076j40893
$$ 45002 -177516 -194453 163151 666130 991398 1026298 816802 452055 100979 -39914
41294c9914Q9608J58074J29064J35918R5501j14414l29702k84500m0302R3954
$$ -39914 49694 207768 336832 472750 568251 453837 124135 -160365 -200667 -106713
41284a06713J7112r9174j49015j71243j21117R3265L27755K89085k1891k40156
$$ -106713 -89601 -188775 -337790 -509033 -630150 -536885 -209130 79955 58064 -182092
41274a82092j08047K10467L78023K65382J4073j40799p2101J12133J67832L2749
$$ -182092 -290139 -79672 298351 563733 577806 437007 364906 477039 644871 677620
41264F77620o7221K7134J18323m2503l15927l53560j19055J00788J49084J33476
$$ 677620 610399 637533 755856 713353 397426 43866 -75189 25599 174683 308159
41254C08159J39657J33694J35193J81502J50302o4511k51512j22449J81277K35637
$$ 308159 447816 581510 716703 898205 1048507 983996 732484 610035 791312 1026949
41244A026949n537j43283O335J47736M6821j08851j12165j03001k49864l79995
$$ 1026949 1021412 878129 884464 1032200 1079021 970170 858005 755004 505140 125145
41234A25145k39724Q6935K99280K78915J47801M1190L165K5386N7538L4669m6133
$$ 125145 -114579 -27644 271636 550551 698352 739542 742707 768093 825631 860300 814167
41223H14167j33147j85273j41724P7260L77057M35041R7326l01066l34544q5883
$$ 814167 681020 495747 354023 431283 808340 1243381 1340707 1039641 705097 619214
41213F19214L3265n5284p8419J9092K7803j3729J46005L63412J76299l52452n48067
$$ 619214 652479 597195 518776 537868 565671 551942 697947 1061359 1237658 885206 337139
41202C37139j57224K06826M3250k62836j64683J27677R2573j83820k26692j4406
$$ 337139 179915 386741 429991 167155 2472 130149 222722 38902 -187790 -202196
41192b02196P8202r646j2330P7369J8536j32936o1179K18010L25096J30447o8652
$$ -202196 -123994 -133640 -145970 -68601 -50065 -183001 -244180 -26170 298926 429373 360721
41181C60721o2980K789j8260m2749p568k5524j43790k05203q5748J24777K73288
$$ 360721 297741 300530 282270 239521 231953 206429 62639 -142564 -228312 -103535 169753
41170A69753L09999K49468J22853Q079l0193m3759j17892k05633j86226o6918
$$ 169753 479752 729220 852073 860152 829959 786200 668308 462675 276449 209531
41160B09531J4180k8008j51739k65081k82084j62124K0678J26916J35775J57532
$$ 209531 223711 195703 43964 -221117 -503201 -665325 -644647 -517731 -381956 -224424
41150b24424K06498J49193k8971j32361p0593k5978j28347k11870j15986J7162
$$ -224424 -17926 131267 102296 -30065 -100658 -126636 -254983 -466853 -582839 -565677
41140e65677N147m4408M7715J91294K05140J47676J63612J81208P5450m2411j9169
$$ -565677 -560530 -604938 -557223 -365929 -160789 -13113 150499 331707 407157 364746 345577
41129C45577L0075o6602j94355j59181n0633l5253O675K26740L95342K21936p4573
$$ 345577 375652 309050 114695 -44486 -95119 -130372 -123697 103043 498385 720321 645748
41118F45748m5812K37693K81452j4866k08389n0181J65525J30280o4217k05938
$$ 645748 599936 837629 1119081 1104215 895826 845645 1011170 1141450 1077233 871295
41108H71295k60775k35963r5978N2909J8086j39134j41567M9436J57842M2327
$$ 871295 610520 374557 278579 331488 349574 210440 68873 118309 276151 318478
41098C18478j33804k50600l65519m14744j97467K04732M03443K71726J37666K08659
$$ 318478 184674 -65926 -431445 -846189 -1043656 -838924 -435481 -163755 -26089 182570
41088A82570K09460j25941n52942o40680l51941O132K21985K96253K66017J60417
$$ 182570 392030 266089 -286853 -927533 -1279474 -1273342 -1051357 -755104 -489087 -328670
41078c28670M7229l6549j14106j51758o5973Q5772J19363J0261n0025K8924R7050
$$ -328670 -281441 -317990 -432096 -583854 -649827 -564055 -444692 -434431 -484456 -455532 -358482
41067c58482M4763k0607l522J2591l6671n7350Q630O8106Q0425J47831K76025
$$ -358482 -313719 -334326 -337848 -325257 -361928 -419278 -410648 -342542 -262117 -114286 161739
41056A61739K86463J10462o7525j05501r5588j07615j2941K32058L78531K09011
$$ 161739 448202 558664 491139 385638 290050 182435 169494 401552 780083 989094
41046I89094j20105k93275k38882j11651k1224J9335Q37m2079n281J26660K15528
$$ 989094 868989 575714 336832 225181 203957 223292 224129 182050 176769 303429 518957
41035E18957J80355J27557J55948J97015J69289J13805N2163r0902k76575k75862
$$ 518957 699312 826869 982817 1179832 1349121 1462926 1515089 1424187 1147612 871750
41025H71750K49K71226K06125j41903m07558l40150k2418K57847K60346M542k23282
$$ 871750 871999 1143225 1349350 1207447 799889 459739 437321 695168 955514 960056 736774
41014G36774j90450l5043o4698k56968k61965M1053L29517L14934J12215l8034
$$ 736774 546324 511281 446583 189615 -72350 -31297 298220 613154 725369 687335
41004F87335r9344r1309O6020L07148L19495j7843l48343l00541j5552J03488
$$ 687335 587991 496682 562702 869850 1189345 1171502 823159 522618 507066 610554
40994F10554k6443j67707j90157j68723j50363j11600p6478n2240M9783K34597
$$ 610554 584111 416404 226247 57524 -92839 -204439 -280917 -333157 -283374 -48777
40984d8777L18445K06839Q3201Q8948N1342j72872l31825j47309J52593J33795
$$ -48777 269668 476507 559708 648656 699998 527126 195301 47992 200585 334380
40974C34380j28306j41246K02409M24466J86414k25490l58324k01617p7627j44796
$$ 334380 206074 64828 267237 691703 878117 652627 294303 92686 15059 -129737
40964a29737k75766l17682k43939p5977J63517L75911L83446J12402k30532k90541
$$ -129737 -405503 -723185 -967124 -1043101 -879584 -503673 -120227 -7825 -238357 -528898
40954e28898K8286L75782L42774r577k28917q4913J68679K28226J46482J24894
$$ -528898 -500612 -124830 217944 208367 -20550 -105463 63216 291442 437924 562818
40944E62818J46135N9882j19774k35449k16408j21160l4418k4869q4651n6708
$$ 562818 708953 768835 649061 413612 197204 76044 41626 16757 -67894 -124602
40934a24602J78496M04034K65391j34697k46587J05129L58398L7413m77977n13240
$$ -124602 53894 457928 723319 588622 342035 447164 805562 842975 364998 -148242
40924a48242j06425J50012P7998O3232K75743L94049K26415M3326P6231J38504
$$ -148242 -254667 -104655 -26657 36575 312318 706367 932782 976108 1052339 1190843
40914A190843j737k24096k84543j73170k1201J25592K39518K11865J8323j62598
$$ 1190843 1189106 965010 680467 507297 486096 611688 851206 1063071 1081394 918796
40904I18796j62647l5581P3636J40363J97738J73609l7046l63200n53748m25554
$$ 918796 756149 720568 794204 934567 1132305 1305914 1268868 905668 351920 -73634
40894g3634p9989J68284J13867j02558j63749P495J45153L1542j74454j69961
$$ -73634 -153623 14661 128528 25970 -137779 -130284 14869 46411 -128043 -298004
40884b98004M8669J90300P8328j39119k04421l9613K05268L16221K24282P5359
$$ -298004 -249335 -59035 19293 -119826 -324247 -363860 -158592 157629 381911 457270
40874D57270M3448Q4029N775k01582l09611j86912K3964J62497K46455K85555
$$ 457270 500718 584747 590522 388940 79329 -107583 -83619 78878 325333 610888
40864F10888J65349r8667k49752j53068k4482o3924j22687j0401J29749P5841
$$ 610888 776237 677570 427818 274750 250268 186344 63657 53256 183005 258846
40854B58846p9250j29674j23194j65497r9240K00016M23493K06154k47452m09675
$$ 258846 179596 49922 -73272 -238769 -338009 -137993 285500 491654 244202 -165473
40844a65473j98116K992J6155L6321J31097J05673n9372j11560K5032J23694P7664
$$ -165473 -363589 -360597 -344442 -308121 -177024 -71351 -130723 -242283 -217251 -93557 -15893
40833a5893N2569J17721J10340k1050r9087n4440m1088j14973j26735k5592N2974
$$ -15893 36676 154397 264737 243687 144600 90160 49072 -65901 -192636 -218228 -165254
40822a65254P8608J74193L06912K81390J12651L8152P6306k7630k91201l46882
$$ -165254 -86646 87547 394459 675849 788500 826652 902958 875328 584127 237245
40812B37245q458L78843M02332J12720j44355j98084j35913q9751j16363j76883
$$ 237245 228787 607630 1009962 1122682 978327 780243 644330 554579 438216 261333
40802B61333j51153R252J44966P8633j04667j94082j94546k36349k26174L2220
$$ 261333 110180 119432 264398 343031 238364 44282 -150264 -386613 -612787 -580567
40792e80567M02254N14677L18639J18837M3323p3604k29308j72236R1678J96005
$$ -580567 -178313 336364 655003 773840 817163 743559 514251 342015 433693 629698
40782F29698o887k11607j89588j10307j29176r8139O8304J53651L1772p5245J6768
$$ 629698 622811 411204 221616 111309 -17867 -116006 -47702 105949 137721 62476 79244
40771G9244J68475K43517L35192M30770K67290j82768m78460k98264Q6308K54630
$$ 79244 247719 491236 826428 1257198 1524488 1341720 863260 564996 651304 905934
40761I05934K24440K57433L81248M47669M11102K55682q8984n00353o40795m45279
$$ 905934 1130374 1387807 1769055 2216724 2627826 2883508 2794524 2294171 1653376 1208097
40751A208097k81351l40530k83004J35757N02324L09027k33192m79870k44379
$$ 1208097 926746 586216 303212 438969 941293 1250320 1017128 537258 292879
40742B92879R7553K39572J99734M8228j68440k81508j59703L3199O1848N758R4425
$$ 292879 390432 630004 829738 877966 709526 428018 268315 301514 363362 369120 463545
40731D63545K67051K58389N4152r2763p3952l9963j07511k12395k54959k00380
$$ 463545 730596 988985 1043137 950374 876422 836459 728948 516553 261594 61214
40721F1214p0495K5139m1825j89938j52924J07043K55459P8599j47413p9778J50575
$$ 61214 -9281 15858 -25967 -215905 -368829 -261786 -6327 72272 -75141 -154919 -4344
40710d344J86427K8770l2191O5148J19953Q7222J33839K74790K96206R1465j80657
$$ -4344 182083 210853 178662 243810 363763 450985 584824 859614 1155820 1247285 1066628
40699A066628l14593k55951r0344K2054m0203j87257j74136M3571J89489P2025
$$ 1066628 752035 496084 405740 427794 387591 200334 26198 69769 259258 331283
40689C31283j06534q4605K4642o1256l04940l91661j87036J30242L49375M04434
$$ 331283 224749 140144 164786 103530 -201410 -593071 -780107 -649865 -300490 103944
40679A03944L10910J32204j2746n2270l4326k1230j3752k8922r2393j15887K165
$$ 103944 414854 547058 534312 482042 447716 426486 412734 383812 291419 175532 177697
40668A77697J32823O7708o2758P7809L98304L71897j37860n56880m17913r597
$$ 177697 310520 378228 315470 393279 791583 1163480 1025620 468740 50827 41230
40658D1230J73457J56706J98414K08370J32k11841j27615Q4291P9095n6368j5019
$$ 41230 214687 371393 569807 778177 778309 566468 438853 523144 602239 545871 530852
40647E30852J39042J38283P0067J94046L56695J83518k21683l48483n5557K33656
$$ 530852 669894 808177 878244 1072290 1428985 1612503 1390820 1042337 986780 1220436
40637A220436J58400j72618m40803m46901j83360J42325K18799K382j74915j00773
$$ 1220436 1378836 1206218 765415 318514 135154 277479 496278 498660 323745 222972
40627B22972j8825j63725k96155j26647J17399N7202j75935j90083j2768M4597
$$ 222972 204147 40422 -255733 -382380 -264981 -207779 -383714 -573797 -586565 -541968
40617e41968L880J19220L21241L41671K49211K86716L24657Q0666k50939k26550
$$ -541968 -538088 -418868 -97627 244044 493255 779971 1104628 1185294 934355 707805
40607G07805Q0921J82969j6377j48779q3744o5920j50186j19719P029j8615j39309
$$ 707805 788726 971695 955318 806539 722795 656875 506689 386970 393999 375384 236075
40596B36075m7458J94901J84134j21413k97900j31983J29267K63584K99714K22334
$$ 236075 188617 383518 567652 446239 148339 16356 145623 409207 708921 931255
40586I31255m0966l04386k80902o3657R268q2876r6927l1925m9358k5016K28497
$$ 931255 890289 585903 305001 241344 250612 167736 70809 38884 -10474 -35490 193007
40575A93007M39041K25674j69312k01408O0356J02677p3614j5618K29053J40601
$$ 193007 632048 857722 688410 487002 547358 650035 576421 560803 789856 930457
40565I30457k65504l90658j11922L5384j24183j41095J12601J78187n3707q6302
$$ 930457 664953 274295 162373 197757 73574 -67521 45080 223267 169560 83258
40555H3258J95768K31546j46494k96628J06955M42717J95892j91211j49041P9535
$$ 83258 279026 510572 364078 67450 174405 617122 813014 621803 472762 552297
40545E52297k239k64702k91612j11936r625r703k0546r1329j65875j9079K73078
$$ 552297 550058 285356 -6256 -118192 -127817 -137520 -158066 -249395 -415270 -434349 -161271
40534a61271L10106O0330k0952J90326K48087K688p8100J67275J87623k59190
$$ -161271 148835 209165 188213 378539 626626 629314 551214 718489 906112 646922
40524F46922n12629p9457M60020L52557j60924l50951j48915j8574p9446q3540
$$ 646922 134293 54836 514856 867413 706489 355538 206623 188049 108603 25063
40514B5063J5084O9449Q1347Q4826k0899j75013q6615K20188K86681k0463k02241
$$ 25063 40147 109596 190943 275769 254870 79857 -6758 213430 500111 479648 277407
40503B77407L8253K81483J59274j4293R5542J88422p1764l78029l12311m6407
$$ 277407 315660 597143 756417 742124 837666 1026088 954324 576295 263984 217577
40493B17577N7595N1190Q5935K7805j20238Q50L99112M61512n3074m53493j87594
$$ 217577 275172 326362 412297 440102 319864 320714 719826 1181338 1128264 674771 487177
40482D87177K37138J31619k55841l01374p4688r422m1301R6964K04732L0065j15412
$$ 487177 724315 855934 600093 298719 224031 214609 173308 270272 475004 505069 389657
40471C89657Q3665K72657P0097j61427M083J70413j86516o55663m92202J28761
$$ 389657 473322 745979 816076 654649 658732 829145 642629 -13034 -505236 -376475
40461c76475M22486K32796M4195L6885K933k8232J17497K53039J10818j28738
$$ -376475 46011 278807 323002 359887 362820 334588 452085 705124 815942 687204
40451F87204j87112j90995k57486r5356L51627M85055N742l80083l5657N13027
$$ 687204 500092 309097 51611 -43745 307882 792937 798679 418596 382939 895966
40441H95966M79566J15444P6191J64138j48881n32709l39002J67258L11316K58272
$$ 895966 1375532 1490976 1567167 1731305 1582424 1049715 710713 877971 1189287 1447559
40431A447559N27946P43541K06030o54393p79513j86126J65078j053r9384J8489
$$ 1447559 1975505 2719046 2925076 2270683 1491170 1305044 1470122 1469069 1369685 1388174
40421A388174p8011l14986j68171K14336J48254l34501n13003k30133j1663Q511
$$ 1388174 1310163 995177 827006 1041342 1189596 855095 342092 111959 100296 108807
40411A08807J81540M31199L32069J8787k4488P0658j44999m13185j76953K46018
$$ 108807 290347 721546 1053615 1072402 1047914 1118572 973573 560388 383435 629453
40401F29453J19171l27471k55318K47998L37149l6093j10151K21216K90316j9252
$$ 629453 748624 421153 165835 413833 750982 714889 604738 825954 1116270 1097018
40391A097018j33376M3901O8917r033K08324M37248J04264m23863l36151J34761
$$ 1097018 963642 1007543 1076460 1067427 1275751 1712999 1817263 1393400 1057249 1192010
40381A192010J37462j52540J43226Q46651R11898K57631j96398k18288l79916
$$ 1192010 1329472 1176932 1320158 2166809 3078707 3336338 3139940 2921652 2541736
40372B541736o20598l59862Q8415q3864n27452k48347M38828L63765l01276l34813
$$ 2541736 1921138 1561276 1649691 1565827 1038375 790028 1228856 1592621 1291345 956532
40362I56532K04155J24153m92481l50085N16082O43673j74587m98855J26336N13503
$$ 956532 1160687 1284840 792359 442274 958356 1602029 1427442 928587 1054923 1568426
40352A568426K02656J26515M73076K69903m26030l38734N30714O74391j47209
$$ 1568426 1771082 1897597 2370673 2640576 2214546 1875812 2406526 3080917 2933708
40343B933708m32080K19339M15600k53339m50610K07018M13788j37101j23577
$$ 2933708 2501628 2720967 3136567 2883228 2432618 2639636 3053424 2916323 2792746
40334B792746O18698N87748l51081m66975N13941Q09094J33208L65373J663413
$$ 2792746 3411444 3999192 3648111 3181136 3695077 4504171 4637379 5002752 6666165
40325F666165J647268k34942j355194m60091L01775l84117p20350L13533Q27655
$$ 6666165 8313433 8078491 6723297 6263206 6564981 6180864 5460514 5774047 6601702
40316F601702j04269m71624O02633R74103j42291l21096J245132J819068M84067
$$ 6601702 6497433 6025809 6628442 7602545 7460254 7139158 8384290 10203358 10687425
40307A0687425K67899K185431K826931J011115O39409L251071M489084K335276
$$ 10687425 10955324 13140755 15967686 16978801 17618210 20869281 25358365 27693641
40299B7693641J555945M797098P183239N873754O274152J1382160J4649330J2583659
$$ 27693641 29249586 34046684 41229923 47103677 53377829 64759989 79409319 91992978
40291I1992978J3638005K2945068L0691113L1845170M3508796P7061373J01710110
$$ 91992978 105630983 128576051 159267164 191112334 234621130 311682503 413392613
40284D13392613P0049773j4915976r0017440j03428925p0345760l9923639l1099629
$$ 413392613 483442386 468526410 378508970 275080045 204734285 164810646 133711017
40277A33711017k7128943j6967341r818260j1352628j2705835q066496l921467
$$ 133711017 106582074 89614733 79796473 68443845 55738010 47671514 43750047
40270D3750047n040738o196902l438086j259252l013881m509970k444238m00171
$$ 43750047 38709309 32512407 29074321 27815069 24801188 20291218 17846980 17446809
40262A7446809j459346k543478q77910P07796m86622j984713j159761m123p74828
$$ 17446809 15987463 13443985 12566075 13273871 12787249 10802536 9642775 9638652 8863824
40253H863824j634816n58052O67602L8080q93507k89460M45181l27629j191625
$$ 8863824 7229008 6670956 7338558 7376638 6483131 6193671 6638852 6311223 5119598
40244E119598n21307L63767j47701q99305l67841M29918R5043m68705m5732M55372
$$ 5119598 4598291 4962058 4814357 3915052 3547211 3977129 4072172 3603467 3557735 4013107
40234D013107o1825o35573j87999L29314j36657o64971k56262J75927k91519o60822
$$ 4013107 3951282 3315709 3127710 3457024 3320367 2655396 2399134 2575061 2283542 1622720
40224A622720J1719O29579O7352o71527l34886K99689N7562l98329j4617N30636
$$ 1622720 1634439 2264018 2331370 1659843 1324957 1624646 1682208 1283879 1269262 1799898
40214A799898J94546l71225j13246M03513J83822k65587n7007K63769j34002n98439
$$ 1799898 1994444 1623219 1509973 1913486 2097308 1831721 1774714 2038483 1904481 1306042
40204A306042k10280L71546J03501m76509k86330L02641K94850l7724J47134N42586
$$ 1306042 1095762 1467308 1570809 1094300 807970 1110611 1405461 1367737 1514871 2057457
40194B057457L86034M6898K47713N03713Q659o88014n60353M5015Q7523l02906
$$ 2057457 2443491 2490389 2738102 3241815 3250474 2562460 2002107 2047122 2134645 1831739
40184A831739k79271K0719j28983m79188k56295K79028K83034p8708q681L44151
$$ 1831739 1552468 1573187 1444204 965016 708721 987749 1270783 1192075 1183394 1527545
40174A527545J92876l31533m12532p0462k9953k93301k25211J23646J09229k32271
$$ 1527545 1720421 1388888 976356 905894 875941 582640 357429 481075 590304 358033
40164C58033k63565K8171Q0548j03689k2913K51447J97120q9504l5289L19612
$$ 358033 94468 122639 203187 99498 76585 328032 525152 435648 400359 719971
40154G19971M18173K30062J76162J83325j41826n57628m65389j6998R8772j30156
$$ 719971 1138144 1368206 1544368 1727693 1585867 1028239 562850 545852 644624 514468
40144E14468q3365L05310M52027K22206J33267L80992N47438L72999O0025k25308
$$ 514468 431103 736413 1188440 1410646 1543913 1924905 2472343 2845342 2905367 2680059
40134B680059m71376n00558j94017Q8063l7776l01352k20127O1420R3661l7991
$$ 2680059 2208683 1708125 1514108 1602171 1564395 1263043 1042916 1104336 1197997 1160006
40124A160006J7639R9210j28018l76999j77736J98497J85573k1561J39942M44234
$$ 1160006 1177645 1276855 1148837 771838 594102 792599 978172 956611 1096553 1540787
40114A540787K09562m10793o00469k43574l734q4122j9944K68872L15202Q3309
$$ 1540787 1750349 1339556 739087 495513 491779 407657 387713 656585 971787 1055096
40104A055096N9164K49394J18213l41233m96624k07180n1836k27625k38776O3170
$$ 1055096 1114260 1363654 1481867 1140634 644010 436830 384994 157369 -81407 -18237
40094a8237J52956j24393j82370K19918M66847J56313j88822m0530K68162J99746
$$ -18237 134719 10326 -172044 47874 514721 671034 482212 441682 709844 909590
40084I09590j04152j99456q9186l9027n1534n632K0487m2629m5885O4803O1952
$$ 909590 805438 605982 516796 477769 426235 420603 441090 398461 352576 417379 479331
40073D79331j52461k92431j22367J70580K92166K39438J64836J11581P0232O1578
$$ 479331 326870 34439 -87928 82652 374818 614256 779092 890673 960905 1022483
40063A022483L7745p4807j87790j60460q1287j34801k34731j52984L7192N5443
$$ 1022483 1060228 985421 797631 637171 555884 421083 186352 33368 70560 126003
40053A26003q8554j23864q462O0369Q4524K25255L52327J61632k35906l70180
$$ 126003 37449 -86415 -94877 -34508 50016 275271 627598 789230 553324 183144
40043A83144j14590J63304K06824J36823O7192m9368j32791j6904J67313J18483
$$ 183144 68554 231858 438682 575505 642697 593329 460538 443634 610947 729430
40033G29430j03241j54852j2835L3226k1842J01988L42255K89988r0475l46657
$$ 729430 626189 471337 458502 491728 469886 571874 914129 1204117 1113642 766985
40023G66985k73064j67640k03925j44481J13860K64449J04194j44664k28807j61593
$$ 766985 493921 326281 122356 -22125 91735 356184 460378 315714 86907 -74686
40013g4686k67K37438L52709J35907j80571j48267J74544K87535Q2035k0949J37704
$$ -74686 -74953 162485 515194 651101 470530 322263 496807 784342 866377 845428 983132
40002I83132J98333j1445j75339j10296n1239q5710M5367L19207K68560k22494
$$ 983132 1181465 1170020 994681 884385 833146 747436 792803 1112010 1380570 1158076
39992A158076n92773m44784j16611k3400j0725J86759L71795K70262O7785Q1202
$$ 1158076 565303 120519 3908 -19492 -30217 156542 528337 798599 866384 947586
39982I47586K27431K34399R1857n0790j57693k05447j06053N6185M9115p9138
$$ 947586 1175017 1409416 1501273 1450483 1292790 1087343 981290 1037475 1086590 1007452
39972A007452p957K55755K75774r6435m21470l62752j64633j35711j66734j02183
$$ 1007452 999495 1255250 1531024 1434589 1013119 650367 485734 350023 183289 81106
39962H1106q9392j86269j04511K60955N03924L15054j2151q7019j3073o0946j55099
$$ 81106 -8286 -194555 -299066 -38111 465813 780867 768716 681697 668624 607678 452579
39951D52579j16113n1597r4201q8612Q3136K07327J21157K7760R1153J09832n7047
$$ 452579 336466 284869 190668 102056 185192 392519 513676 541436 632589 742421 685374
39940F85374j56747j2941R5045p4310k66328j81035K2082Q6066J11001K21059
$$ 685374 528627 515686 610731 536421 270093 89058 111140 197206 308207 529266
39930E29266K03074o6363k49736p6112J68922J52037N7609J39796J61722j41319
$$ 529266 732340 665977 416241 340129 509051 661088 718697 858493 1020215 878896
39920H78896m54027l55059l6363O8940K8042J36307K37916J1197l33381l38373
$$ 878896 424869 69810 33447 102387 130429 266736 504652 515849 182468 -155905
39910a55905p7366K0515o6242l1669Q7396R925j44620j098L45447M11866J18858
$$ -155905 -233271 -212756 -278998 -310667 -223271 -213346 -357966 -359064 -13617 398249 517107
39899E17107j16848q8715k1945o7325j07401r6649j17713j00270P1845K25711
$$ 517107 400259 311544 289599 222274 114873 18224 -99489 -199759 -127914 97797
39889I7797J22889p4044m0856J13957K6839k42968k87751n6231J00762Q5625J66918
$$ 97797 220686 146642 105786 219743 246582 3614 -284137 -340368 -239606 -153981 12937
39878A2937L84621M09688J17596j84171k30926j03722J8356M9719p0485k89709
$$ 12937 397558 807246 924842 740671 509745 406023 424379 474098 403613 113904
39868A13904l41232j00730R0445r7424l60306j80831K78232L79013N3400j01432
$$ 113904 -227328 -328058 -237613 -335037 -695343 -876174 -597942 -218929 -165529 -266961
39858b66961J51510L21572O7241k49758k15864L788O0422q852K1270J42343K12066
$$ -266961 -115451 206121 273362 23604 -192260 -188472 -128050 -136902 -115632 26711 238777
39847B38777K13680J75935O8755n9005q0514l1951q1472j98652j76820l5908l2552
$$ 238777 452457 628392 697147 638142 557628 525677 444205 245553 68733 32825 273
39836B73j94278k39114o6129P3335L0062p726J03678K07551J48132J1677q2245
$$ 273 -194005 -433119 -499248 -425913 -395851 -403577 -299899 -92348 55784 67461 -14784
39825a4784j36931j22591K6887J83436J23654p7725j11538N5225J28727P275q4796
$$ -14784 -151715 -274306 -247419 -63983 59671 -18054 -129592 -74367 54360 61635 -23161
39814b3161o2473j08039k18918j27072J65432K78011Q7286l8060J13385K31714
$$ -23161 -85634 -193673 -412591 -539663 -374231 -96220 -8934 -46994 66391 298105
39804B98105Q0864n8066P2509K01271K7378j84843l4628L01763L32385K5336j99806
$$ 298105 378969 320903 393412 594683 622061 437218 402590 704353 1036738 1062074 862268
39793H62268j48997m3223o0286j03830o8206j0943M501J4155N0750P8868M7628
$$ 862268 713271 670048 609762 505932 437726 426783 431284 445439 496189 575057 622685
39782F22685p0512k47521l56619k68909m9954P8654L3837l4271k08P3775J04075
$$ 622685 552173 304652 -51967 -320876 -370830 -292176 -258339 -292610 -292818 -219043 -114968
39771a14968J15678J27698J05492Q5520J34146J50018k7131k75155k78369k8590
$$ -114968 710 128408 233900 319420 453566 603584 576453 301298 22929 -5661
39761e661J16567j2502j59964j14798l0356o5537q2693M4007J63804J55691J64053
$$ -5661 110906 98404 -61560 -176358 -206714 -272251 -354944 -310937 -147133 8558 172611
39750A72611K58132K07133r3678l20233k02524J2800k0731j69791j03633R9309
$$ 172611 430743 637876 544198 223965 21441 34241 13510 -156281 -259914 -160605
39740a60605J21787R256Q8378L62481M69998K46769q2575k95826l86166l52622
$$ -160605 -38818 -29562 58816 421297 891295 1138064 1055489 759663 373497 20875
39730B0875j32418J75059L07536J65795o4273j73173j34309k4103Q7637J35589
$$ 20875 -111543 63516 371052 536847 472574 299401 165092 140989 228626 364215
39720C64215Q9183N508m6032q4590j52166k11095k05175j40383j5858K00150M18607
$$ 364215 453398 458906 412874 328284 176118 -34977 -240152 -380535 -396393 -196243 222364
39709B22364M17925J40007j58561k30867j63133j74483k45542j91191j383J39017
$$ 222364 640289 780296 621735 390868 227735 53252 -192290 -383481 -384864 -245847
39699b45847J24991K6423n5851p5423l1612J0355k5643o9354M5946K80310L49174
$$ -245847 -120856 -94433 -150284 -225707 -257319 -246964 -272607 -341961 -296015 -15705 333469
39688C33469J39732p5605n0264O0304N050j13727l9370J65557K20754J03026M9606
$$ 333469 473201 397596 347332 407636 412686 298959 259589 425146 645900 748926 798532
39677G98532J25711J30416n3768k96729m21475l49584q0752K51671L70322J47887
$$ 798532 924243 1054659 1000891 704162 282687 -66897 -147649 104022 474344 622231
39667F22231j51875j86510j5286K6206j30397k11951p5880R1709J23713J08480
$$ 622231 470356 283846 268560 294766 164369 -47582 -123462 -31753 91960 200440
39657B00440J59927K07009J54036N7857J1834p89k4912k4657L7923R6420M4183
$$ 200440 360367 567376 721412 779269 791103 790314 765402 740745 778668 875088 919271
39646I19271j24873k86206k97167j48439P867L5376p959J3924N2723n6531k45023
$$ 919271 794398 508192 211025 62586 70453 105829 97870 111794 164517 107986 -137037
39635a37037k17947O9073K54448J07293p8191O9735M03629M76622J98607j03784
$$ -137037 -354984 -285911 -31463 75830 -2361 67374 471003 947625 1146232 1042448
39625A042448j90082j16120J300J01541R5367m4016j40539k8478J59052J74369
$$ 1042448 852366 736246 737546 839087 934454 890438 749899 721421 880473 1054842
39615A054842K8128j02972k08457l49629l71741j15556J81202J40189j48962k43113
$$ 1054842 1082970 979998 771541 421912 50171 -65385 115817 256006 107044 -136069
39605a36069n5075N5253n4683r2440P6544J45276p0108k41583m3625K91167K95528
$$ -136069 -191144 -135891 -190574 -283014 -206470 -61194 -131302 -372885 -416510 -125343 170185
39594A70185p5814m30452m37537j06593L07425M98309L33808K1093q7091O8910
$$ 170185 94371 -336081 -773618 -880211 -572786 -74477 259331 280424 193333 262243
39584B62243J97882J02865o9749j31099j18394j07970l9390P7955M8628j84712
$$ 262243 460125 562990 493241 362142 243748 135778 96388 174343 222971 38259
39574C8259l39656j79419J01411J56545q891j07414k8561O4708N1509O041K8188
$$ 38259 -301397 -480816 -379405 -222860 -231751 -339165 -367726 -303018 -251509 -245468 -217280
39563b17280J08033J75112J68031P3175l4113n4837k7147r3733k36493k26852
$$ -217280 -109247 65865 233896 307071 272958 218121 190974 97241 -139252 -366104
39553c66104K5882K67198K30254J2493j03455o4773k6177j4635R0086K64117L06098
$$ -366104 -340222 -73024 157230 169723 66268 1495 -24682 -39317 50769 314886 620984
39542F20984J36217r0464k18372k47968k08853p1665J20823J97406O3286j35882
$$ 620984 757201 666737 448365 200397 -8456 -80121 40702 238108 301394 165512
39532A65512j77113l5783J05741J01338k010o2926k5130N3564J16131J73405K31870
$$ 165512 -11601 -47384 58357 159695 157685 94759 69629 123193 239324 412729 644599
39521F44599K19640O2181j80366l29662k70456p2978Q4466Q4346m1053j50290
$$ 644599 864239 926420 746054 416392 145936 72958 157424 241770 200717 50427
39511E0427j20465K8502J45591J27667O1144J06166K46676K66648L3008k78343
$$ 50427 -70038 -41536 104055 231722 292866 399032 645708 912356 945364 667021
39501F67021l46081r2025J92112J81304p1718k01913l9946J29702j5494l16759
$$ 667021 320940 228915 421027 602331 530613 328700 288754 418456 402962 86203
39491H6203l29117J0366K78869K16231Q9750J94463L45457K08719j27280l10346
$$ 86203 -242914 -232548 46321 262552 352302 546765 892222 1100941 973661 663315
39481F63315k79329k46566k44701j26368M2943M4036l9517J12949M57226N07080
$$ 663315 383986 137420 -107281 -233649 -190706 -146670 -186187 -73238 383988 891068
39471H91068L8097n23516o49356l40726J4651J57309J01193j9687l4048J66911
$$ 891068 929165 405649 -243707 -584433 -569782 -412473 -311280 -330967 -365015 -198104
39461a98104M40676M71944J81789j29743j89945r3461p1700j31551j29532m5168
$$ -198104 242572 714516 896305 766562 576617 483156 411456 279905 150373 105205
39451A05205K5742M4874M2442M8438J10317K51177L41977J98009j14960k88740
$$ 105205 130947 175821 218263 266701 377018 628195 970172 1168181 1053221 764481
39441G64481j94813n8639p2826r7042N3509K52512K44061K1675j93928k35982
$$ 764481 569668 511029 438203 341161 394670 647182 891243 912918 718990 483008
39431D83008r2347J29645K14119O553l07290l43601p8244O5243j11085k16813
$$ 483008 390661 520306 734425 740978 433688 90087 11843 77086 -33999 -250812
39421b50812P1932L90993K33921j74443j84696K24010L82265j1889m24109l18602
$$ -250812 -178880 212113 446034 271591 86895 310905 693170 681281 257172 -61430
39411f1430P9079K28303R1086N4003K43981L76497K57618O1629J0852M2902l3777
$$ -61430 17649 245952 337038 391041 635022 1011519 1269137 1330766 1341618 1384520 1350743
39400A350743j99330k40608q8443M7527l5430k36499k81686r4275J25498J88192
$$ 1350743 1151413 910805 822362 869889 834459 597960 316274 221999 347497 535689
39390E35689J25621P9060J13072J86074J96740M4584k35507m20297l46677j74042
$$ 535689 661310 740370 853442 1039516 1236256 1280840 1045333 625036 278359 104317
39380A04317j63322k32899p4244K61621L23087l2260l25124j47755K19921K79103
$$ 104317 -59005 -291904 -366148 -104527 218560 186300 -138824 -286579 -66658 212445
39370B12445P1411o603Q3788L2944j95117k80932j08277O3840O5586L7908P6655
$$ 212445 283856 277253 361041 393985 198868 -82064 -190341 -126501 -60915 -23007 53648
39359E3648L4680j59917l10368k63074j49923j27552j00557P7980K95744L07768
$$ 53648 88328 -71589 -381957 -645031 -794954 -922506 -1023063 -945083 -649339 -341571
39349c41571J01828o9221k6956J10568J10161n5827j82752j36543m7598q1924
$$ -341571 -239743 -308964 -335920 -225352 -115191 -171018 -353770 -490313 -537911 -619835
39339f19835j35071J5257L00731M12234K89259K03728K41840J10387l03095n90106
$$ -619835 -754906 -739649 -438918 -26684 262575 466303 708143 818530 515435 -74671
39329g4671m11313o9679l0955j67913l9830K76519K74614j08587l39751j08327
$$ -74671 -485984 -555663 -586618 -754531 -794361 -517842 -243228 -351815 -691566 -799893
39319g99893K52229L33016J72175J0956p1354o9977N8176K24473K18489M6362
$$ -799893 -547664 -214648 -42473 -31517 -102871 -172848 -114672 109801 328290 374652
39309C74652k4756J08140K15346J25199k5599p8876q6481j01428m2024P3146N5162
$$ 374652 349896 458036 673382 798581 772982 694106 607625 506197 464173 537319 592481
39298E92481j24113k31218j64675j27377k23689k31492j0224K03042J85945J06409
$$ 592481 468368 237150 72475 -54902 -278591 -510083 -520307 -317265 -131320 -24911
39288b4911J92442L11018K26606M3189J8721J19252J21766K2661j0039J1471o6529
$$ -24911 167531 478549 705155 748344 767065 886317 1008083 1030744 1020705 1032176 965647
39277I65647k12347k37596j22814l8661n9153q8806n5311K3795J25822K00163
$$ 965647 753300 515704 392890 354229 295076 206270 150959 174754 300576 500739
39267E00739J36640o9064k22208j86375j02181j36756j72495j8835K05264K26220
$$ 500739 637379 568315 346107 159732 57551 -79205 -251700 -270535 -65271 160949
39257A60949O2775k6146Q598l0351j72267j99705n6650J5531j12999k20604q8250
$$ 160949 223724 197578 206176 175825 3558 -196147 -252797 -237266 -350265 -570869 -659119
39246f59119J49232K19279J08493K7945Q3411J77810K03307J68651J23214O3867
$$ -659119 -509887 -290608 -182115 -154170 -70759 107051 310358 479009 602223 666090
39236F66090l5634j44962j82287j25827q2794j58120k54304j48887J55431L31235
$$ 666090 630456 485494 303207 177380 94586 -63534 -317838 -466725 -311294 19941
39226A9941J45088j68773j98151O8906K52895J62796L5348R0487J64530J6501
$$ 19941 165029 -3744 -201895 -132989 119906 282702 318050 408537 573067 589568
39216E89568k23278k14362P3974L02326K39205M2590l3497m078m7882j62904j58564
$$ 589568 366290 151928 225902 528228 767433 810023 776526 772448 724566 561662 403098
39205D03098J4796J51588J00249N247O6174J79380P2162k24132l21460j5229L58116
$$ 403098 417894 569482 669731 674978 741152 920532 992694 768562 447102 431873 789989
39194G89989L26573q6578l98436l01924k127J51393J30495J44671K35982K16498
$$ 789989 1116562 1029984 631548 329624 327497 478890 609385 754056 990038 1206536
39184A206536J8391j35177n0238J06488J6775l04906m89571l21434j9222J17530
$$ 1206536 1224927 1089750 1039512 1146000 1162775 857869 368298 46864 27642 145172
39174A45172J08197J26628J43805L9090o2439O8581L16580L00177k9506k44483
$$ 145172 253369 379997 523802 562892 500453 569034 885614 1185791 1156285 911802
39164I11802n8076K42512K24403q1957k86638j96650J0277J00302M4829k4513
$$ 911802 853726 1096238 1320641 1238684 952046 755396 765673 865975 910804 886291
39154H86291R744J06942O5933k23939n18585m32645l7K66380O2261k53399j84621
$$ 886291 896035 1002977 1068910 844971 326386 -106259 -106296 160084 222345 -31054 -215675
39143b15675J68860K98855O5778j50732p1054J20362J33293j9650j23076n9832
$$ -215675 -46815 252040 317818 167086 96032 216394 349687 330037 206961 147129
39133A47129J16763K70949K63610O1717j84606k81209k14811j23378o9056l004
$$ 147129 263892 534841 798451 860168 675562 394353 179542 56164 -12892 -15896
39123a5896N6100K816j56609k53516j64194N2776K57437L52762L00344J38675
$$ -15896 40204 43020 -113589 -367105 -531299 -478523 -221086 131676 432020 570695
39113E70695o369n1157q2702k19990l75117l37325j00795R5254J07651P8858J88511
$$ 570695 564326 513169 430467 210477 -164640 -501965 -602760 -507506 -399855 -320997 -132486
39102a32486L70179M06576K23892k1032j20876k4358J30490J73933Q8771l690
$$ -132486 237693 644269 868161 847129 726253 701895 832385 1006318 1095089 1091399
39092A091399l8305p5527j35161j21528k2840n032j30991j72306M4508K70212
$$ 1091399 1053094 977567 842406 720878 698038 693006 562015 389709 434217 704429
39082G04429J48834k05266l43587j68119m3355j56252k16145J3676K85257K58047
$$ 704429 853263 647997 304410 136291 92936 -63316 -279461 -265785 19472 277519
39072B77519K4513p6108L7028J74829K19615J85588N6207j51518k48732r2615
$$ 277519 302032 225924 262952 437781 657396 842984 899191 747673 498941 406326
39062D06326J11013K7018k86221l84512n4563L53727L82762N6953k10137k00526
$$ 406326 517339 544357 258136 -126376 -180939 172788 555550 612503 402366 201840
39052B01840j22927k18743l67851k74824N6652K87878K23366Q4521J51686L30695
$$ 201840 78913 -139830 -507681 -782505 -725853 -437975 -214609 -130088 21598 352293
39042C52293L25467J17395m2112p9622j85356l86766m01209r8740K02603J74904
$$ 352293 677760 795155 753043 673421 488065 101299 -299910 -398650 -196047 -21143
39032b1143k4820j9628J88725K48694K9903j93278j77966l2355J1323q3443j91338
$$ -21143 -45963 -65591 123134 371828 401731 208453 30487 -1868 9455 -73988 -265326
39021b65326k07647p9064J97452M80461N22511K53266p2160j64621o8292o0373
$$ -265326 -472973 -552037 -354585 125876 648387 901653 829493 664872 596580 536207
39011E36207k23605l31658k02460L7286J60218J52537J47074J50316N8754q4781
$$ 536207 312602 -19056 -221516 -184230 -24012 128525 275599 425915 484669 399888
39001C99888r4372M9232J19468j3254j61772j07719O2628J10136J296j06366j33437
$$ 399888 305516 354748 474216 460962 299190 191471 254099 364235 365531 259165 125728
38990A25728r1111Q3186M08220O22938M10805r8774l92258k42303R460J654j39262
$$ 125728 34617 117803 526023 1148961 1559766 1460992 1068734 826431 835891 837545 698283
38979F98283r4051J16304K21760J61939J15288J46273J34749M4438o18P5958K23097
$$ 698283 604232 720536 942296 1104235 1219523 1365796 1500545 1544983 1544365 1620323 1843420
38968A843420L85692N28060N85362N99832Q14109J320011J661105J195262l9353
$$ 1843420 2229112 2757172 3342534 3942366 4756475 6076486 7737591 8932853 8893500
38959H893500j195241j543581j206804p50967m20443j49332k3877j95163m31851
$$ 8893500 7698259 6154678 4947874 4196907 3776464 3627132 3603255 3408092 2976241
38950B976241k91801K24243O70359Q77317J136015J459877J258192K05680j011618
$$ 2976241 2684440 2908683 3579042 4456359 5592374 7052251 8310443 8516123 7504505
38941G504505j433120j056896o94129p23134p13182l56498k9898j11435l45767
$$ 7504505 6071385 5014489 4320360 3597226 2884044 2527546 2497648 2386213 2040446
38932B040446l34670j91980k09847k46871j9767K51844J13656l23742m71553j64479
$$ 2040446 1705776 1513796 1303949 1057078 1037311 1289155 1402811 1079069 607516 443037
38922D43037J08374j651k11469j37027J34465L00477L22521L19586K34613m6979
$$ 443037 551411 549760 338291 201264 335729 636206 958727 1278313 1512926 1465947
38912A465947l81903m75362k58071M8679K05130J44136m6058j92130j42388P9399
$$ 1465947 1084044 608682 350611 399290 604420 748556 702498 510368 367980 447379
38902D47379K64896K39467L7247j78871k80518k24838o7890K5141p7632k63967
$$ 447379 712275 951742 988989 810118 529600 304762 236872 262013 184381 -79586
38892g9586k62095r335K29306K11179K1620r6467o7872J5004J00465K10551L15784
$$ -79586 -341681 -351016 -121710 89469 111089 14622 -53250 -38246 62219 272770 588554
38881E88554L20104J77769l0448j35667k1957K05290K56661M426k79657k46176
$$ 588554 908658 1086427 1055979 920312 898355 1103645 1360306 1364732 1085075 838899
38871H38899K5459J30635n4460k18650j43172j1765l0785r3046m9250Q53m8456
$$ 838899 864358 994993 940533 721883 578711 566946 536161 443115 393865 394718 346262
38860C46262o0166P0267J62991P8176J7859J59497K58248K8031l08529l21267
$$ 346262 286096 356363 519354 597530 615389 774886 1033134 1061165 752636 431369
38850D31369o2630M2437r8544j70072n6734l758j11807j68640r8485j05843k12636
$$ 431369 368739 411176 312632 142560 85826 82068 -29739 -198379 -296864 -402707 -615343
38839f15343j18331K49074M76195K60022j07420j92784m7447O881l2997P2941
$$ -615343 -733674 -484600 -8405 251617 144197 -48587 -96034 -89153 -122150 -49209
38829d9209K79348K71461J3938j36561K0909K14784J20476j55137k50565p0074
$$ -49209 230139 501600 515538 378977 399886 614670 735146 580009 329444 259370
38819B59370J26795J22088l775o6240m5449l9737o4820n3156r380j7132q9765
$$ 259370 386165 508253 504478 438238 392789 353052 288232 235076 225696 208564 118799
38808A18799j42393j26135p1895M029R8829J22777k0408k17449k19306j0061J23068
$$ 118799 -23594 -149729 -221624 -217595 -118766 4011 -16397 -233846 -453152 -463213 -340145
38797c40145J0689j46772j24811k7078m1124o4076R9052L17120K84704K2725j40101
$$ -340145 -329456 -476228 -601039 -628117 -669241 -733317 -634265 -317145 -32441 -9716 -149817
38786a49817p5229J2660o920o470P7678P1135j21416k84897j82682R6049K64806
$$ -149817 -225046 -212386 -219306 -225776 -148098 -76963 -198379 -483276 -665958 -569909 -305103
38775c05103K05265M7024n4168q8558j41866k26324k04171M6277L80105M66172
$$ -305103 -99838 -52814 -106982 -195540 -337406 -563730 -767901 -721624 -341519 124653
38765A24653K24341j0183M7029K00982J06679j48195j83285M2486J81266Q1046
$$ 124653 348994 338811 385840 586822 693501 545306 362021 404507 585773 666819
38755F66819k6299N330J7419o9614p6367N1237Q1185o3696j01687J04121K30295
$$ 666819 640520 645850 663269 593655 517288 568525 649710 586014 484327 588448 818743
38744H18743K3894k04839m5119L23626L73458J3988l14189k82433k1384J72708
$$ 818743 842637 637798 592679 916305 1289763 1303751 989562 707129 685745 858453
38734H58453J53676o2123l20428l63867r3728K17258K23933o229q7258J06526
$$ 858453 1012129 950006 629578 265711 171983 389241 613174 606945 519687 626213
38724F26213K65752J25289j67397l11035k61989j98427j98031j49226K7374K13094
$$ 626213 891965 1017254 849857 538822 276833 78406 -119625 -268851 -241477 -28383
38714b8383K26459Q6669K9944J84550L24045J35434k86342m77413k31141R1700
$$ -28383 198076 284745 314689 499239 823284 958718 672376 194963 -36178 55522
38704E5522P6095j72430k52189p7651Q3017Q7892P1304J16665J18052L0933k2274
$$ 55522 131617 -40813 -293002 -370653 -287636 -199744 -128440 -11775 106277 137210 114936
38693A14936K2496Q0384J17490J98372K63325J22608k05481l95905k21693J35979
$$ 114936 137432 217816 335306 533678 797003 919611 714130 318225 96532 232511
38683B32511L45323L16955J72818l251j73904k35739j24912L4443Q5703Q1250
$$ 232511 577834 894789 1067607 1064356 890452 654713 529801 564244 649947 731197
38673G31197J64165K59859J31426k34185n27703m93871k24710K9537J75899K54720
$$ 731197 895362 1155221 1286647 1052462 524759 30888 -193822 -164285 11614 266334
38663B66334K37323O4733j51512j84705K430J75519J34563l1521j06789n7159
$$ 266334 503657 568390 416878 232173 234603 410122 544685 513164 406375 349216
38653C49216k9937j01348j84738j89818j31571n1302M6291J28374J18770K0469
$$ 349216 319279 217931 33193 -156625 -288196 -339498 -293207 -164833 -46063 -25594
38643b5594l5573M6865J77419J85069M9225o6770k7481R3412R3919r6939k87777
$$ -25594 -61167 -14302 163117 348186 397411 330641 303160 396572 490491 393552 105775
38632A05775k18135J09312L82068L35100P1697r5458o1955j3146r3173j98567
$$ 105775 -112360 -3048 379020 714120 785817 690359 628404 615258 522085 323518
38622C23518j82647r0877n2686n1865L1682J89581K40411N2802k54642l87657
$$ 323518 140871 49994 -2692 -54557 -22875 166706 407117 459919 205277 -182380
38612a82380j71559K26341M29024K64531k2768r3381K9752L1986j78852l04487
$$ -182380 -353939 -127598 301426 565957 543189 449808 479560 511546 332694 28207
38602B8207j15864J68831J88068l5790j40931M1869K55370J84323j20381l25512
$$ 28207 -87657 81174 269242 233452 92521 134390 389760 574083 453702 128190
38592A28190k54083q1443m4017q7598J2463K16899J88967j69089m24212j58174
$$ 128190 -125893 -207336 -251353 -338951 -326488 -109589 79378 -89711 -513923 -672097
38582f72097L84812N93705L39952O7324K8493l5069k88451m12210j49958J85566
$$ -672097 -287285 306420 646372 713696 742189 707120 418669 6459 -143499 42067
38572D2067J78969l7138n6869J11958J24438q0671k22640j85840j35411j30251
$$ 42067 221036 183898 127029 238987 363425 282754 60114 -125726 -261137 -391388
38562c91388l9457J19251J45862K6937j8482O2532N8289j07866k13527j08059
$$ -391388 -430845 -311594 -165732 -138795 -157277 -94745 -36456 -144322 -357849 -465908
38552d65908N4249J04509J07499J52361J50168L4765m9485L0952J56866J36939
$$ -465908 -411659 -307150 -199651 -47290 102878 137643 88158 119110 275976 412915
38542D12915J242p1242j7308Q5353J73545K23459J85134L7624j26815j89005j46198
$$ 412915 414157 342915 325607 410960 584505 807964 993098 1030722 903907 714902 568704
38531E68704q2579l3275L6814J41817K37446K72743K37228J56901N7959o5703
$$ 568704 486125 452850 489664 631481 868927 1141670 1378898 1535799 1593758 1528055
38521A528055k25741l58890l28941q4119K19807L41897J95024r8070l52191m45763
$$ 1528055 1302314 943424 614483 530364 750171 1092068 1287092 1189022 836831 391068
38511C91068l46172j20710Q5543J65735J35143N6105m7858j30090q3210J02245
$$ 391068 44896 -75814 9729 175464 310607 366712 318854 188764 105554 207799
38501B07799K34238J40652p1300j51220m7379P5130J19475J52039K07548J96177
$$ 207799 442037 582689 511389 360169 312790 387920 507395 659434 866982 1063159
38491A063159N7754j24042k02815r3403J54524L31987K14759j44064l81082k48410
$$ 1063159 1120913 996871 794056 700653 855177 1187164 1401923 1257859 876777 628367
38481F28367N1359J62472P4992N1801J52218J56035m3377k67548l14454j61196
$$ 628367 679726 842198 917190 968991 1121209 1277244 1233867 966319 651865 490669
38471D90669J05017L48649M06803K67011J68266L03461N40191P08550R65061J436523
$$ 490669 595686 944335 1351138 1618149 1786415 2089876 2630067 3338617 4303678 5740201
38461E740201J670021J046416k39256j226008j363973j073794r32595r04499p24045
$$ 5740201 7410222 8456638 8217382 6991374 5627401 4553607 3621012 2716513 1992468
38452A992468m97218m40066m10799j95741K1077n2610k68983k38308N9808K78866
$$ 1992468 1495250 1055184 644385 448644 469721 417111 148128 -90180 -30372 248494
38442B48494K39259R8898L7849P3585J54928K02580J12071r5273k27599j99238
$$ 248494 487753 586651 624500 698085 853013 1055593 1167664 1072391 844792 645554
38432F45554j91476l39401m50778k87828M1295K40364K28230J25329j3303j77007
$$ 645554 454078 114677 -336101 -623929 -582634 -342270 -114040 11289 -2014 -179021
38422a79021k41124j06970R3898J67700J22866O9224J2818l7121M7170K72220
$$ -179021 -420145 -527115 -433217 -265517 -142651 -73427 -60609 -97730 -50560 221660
38412B21660L72441J74769q7734j14632K3695R0649Q5314R3241n862k70269l85379
$$ 221660 594101 768870 681136 566504 590199 680848 766162 859403 853541 583272 197893
38401A97893r5911K69571K32034o9218j28302N2108O053l15893m20686j23488
$$ 197893 101982 371553 603587 534369 406067 458175 464228 148335 -272351 -395839
38391c95839J46781Q6258m8202N529P4379l7187j73194j70914j52635j83323o0055
$$ -395839 -249058 -162800 -211002 -205473 -131094 -168281 -341475 -512389 -665024 -848347 -908402
38380i08402K47069L62920P7329k26988j11128K67100M35470K82323N8798p5497
$$ -908402 -661333 -298413 -221084 -448072 -559200 -292100 143370 425693 484491 408994
38370D08994j31145r0131K7805N9431m4591n3306J56502K93321R4679j72074r9826
$$ 408994 277849 187718 215523 274954 230363 177057 333559 626880 721559 549485 449659
38359D49659J66333J43701j87310l45790j22677J37697J36354K3250J8425M0145
$$ 449659 615992 759693 572383 226593 103916 241613 377967 401217 419642 459787
38349D59787m4728j20197l7385R9677J10545K6325j5513j4043l4949k6415Q3072
$$ 459787 415059 294862 257477 357154 467699 494024 478511 464468 429519 403104 486176
38338D86176J95941J62520L2159n464R2779J69070J02503m5440j46231j47779
$$ 486176 682117 844637 876796 871332 964111 1133181 1235684 1190244 1044013 896234
38328H96234p6614P175L3952j5436o2761k8536K5817l7217k06233k93673j92112
$$ 896234 819620 826795 860747 845311 782550 754014 779831 742614 536381 242708 50596
38317E0596k5725M8071N7130R4140R8128l6185j96013j48469Q6868K18243J10130
$$ 50596 24871 72942 130072 224212 322340 286155 90142 -58327 28541 246784 356914
38306C56914j7766M5238J76146J61606O1569O2719J15733L2596j29171j19784
$$ 356914 339148 384386 560532 722138 783707 846426 962159 994755 865584 745800
38296G45800O0001J13204o8621k03912q0190P3065n8390l36307l25755N8415L82274
$$ 745800 805801 919005 850384 646472 566282 639347 580957 244650 -81105 -22690 359584
38285C59584K64167j15118k54150K0400L48039L05182p0880l51008k49656N8997
$$ 359584 623751 508633 254483 274883 622922 928104 857224 506216 256560 315557
38275C15557J95393K3972k39526l01498q3021K24813L38794J61134q5125q5230
$$ 315557 510950 534922 295396 -6102 -89123 135690 474484 635618 550493 465263
38265D65263J57065K81230N2502k77008k90818J6982K44167J31230j44192k69523
$$ 465263 622328 903558 956060 679052 388234 405216 649383 780613 636421 366898
38255C66898j79567m4914k4432j19226j93650j07966J06337K33447J31491o0488
$$ 366898 187331 142417 117985 -1241 -194891 -302857 -196520 36927 168418 107930
38245A07930j16818m9672l8614r5326n3889J08330K08958J64808J01742R2668
$$ 107930 -8888 -58560 -97174 -192500 -246389 -138059 70899 235707 337449 430117
38235D30117M1189p8271j18664k8971J3577j01338k05571j18490O2272J34568
$$ 430117 471306 393035 274371 245400 258977 157639 -47932 -166422 -104150 30418
38225C0418J04302J18936J98947K29138J48545j769j54540k26562j45399K5435
$$ 30418 134720 253656 452603 681741 830286 828517 673977 447415 302016 327451
38215C27451R7079K010r5492n6490J2568m4215j58391j60918p5585o7948j55550
$$ 327451 424530 426540 331048 274558 287126 242911 84520 -76398 -151983 -219931 -375481
38204c75481j82347p2434P3818J48806J49748J02182P104r5292j10102J0262J93931
$$ -375481 -557828 -630262 -556444 -407638 -257890 -155708 -148604 -243896 -353998 -343736 -149805
38193a49805L08872K82993J68820Q5527P3163L8747q2244j63512l9854J85363
$$ -149805 159067 442060 610880 696407 769570 808317 726073 562561 522707 708070
38183G08070J90484j25105m41012m01471o6905J86034J34763q1005j91832j06128
$$ 708070 898554 773449 332437 -69034 -135939 50095 184858 103853 -87979 -194107
38173a94107L2984L7224r5761j56158K4671L27616M60562L07421L2785j56297
$$ -194107 -161123 -123899 -219660 -375818 -351147 -23531 437031 744452 777237 620940
38163F20940j98974j29278j8059J0087j07743k11933q4208J96929L10971J59080
$$ 620940 421966 292688 274629 284716 176973 -34960 -119168 77761 388732 547812
38153E47812j0073l0930n8501k09570k84859r9036J70620K43456J39808N7491
$$ 547812 537739 506809 448308 238738 -46121 -145157 25463 268919 408727 466218
38143D66218L2078j015K3664J71147K78637J53927r9563k28999k05248j80808
$$ 466218 498296 497281 520945 692092 970729 1124656 1025093 796094 590846 410038
38133D10038j72917p5412P7029J29442N3423n4049j52571k19290j32414J45346
$$ 410038 237121 161709 238738 368180 421603 367554 214983 -4307 -136721 8625
38123H625L62931K51854o2058k07007p7001R2911J23653O8101P085m2370j8078
$$ 8625 371556 623410 561352 354345 277344 370255 493908 562009 569094 526724 508646
38112E08646J16340K02565O2756j77654k34490j08960n7518j17456l8351K37231
$$ 508646 624986 827551 890307 712653 478163 369203 311685 194229 155878 393109
38102C93109L97236K20174r9509k65027k49427j67425k3883J78473K66178Q5679
$$ 393109 790345 1010519 911010 645983 396556 229131 205248 383721 649899 735578
38092G35578k18862l27296j20042K01096L54017K52588N3206l0796L3171O3989
$$ 735578 516716 189420 69378 270474 624491 877079 930285 899489 932660 996649
38082I96649q7352l18075m00089k74709q6756M0249J06858J27874Q4437P653k7737
$$ 996649 909297 591222 191133 -83576 -170332 -130083 -23225 104649 189086 196739 169002
38071A69002j6823j8235l2345r62P7413J45647J84909K01800J54569K0140j05602
$$ 169002 152179 133944 101599 100637 178050 323697 508606 710406 864975 885115 779513
38060G79513j16499o8247r2620j74492j75503o1118N4807Q9452P3883N4459L0858
$$ 779513 663014 594767 502147 327655 152152 91034 145841 235293 309176 363635 394493
38049C94493n501n5210j09812j12958J567J73668K35068J39915L5208J6445o398
$$ 394493 388992 333782 223970 111012 112579 286247 521315 661230 696438 712883 706485
38038G06485q9316j13990j6866O1485K7778O672P5869Q7134l7701j11468k0707
$$ 706485 617169 503179 486313 547798 575576 582248 658117 745251 707550 596082 575375
38027E75375M5885k2336M472K46597L70304J07288k30485k24881j5754J3526j02056
$$ 575375 621260 598924 603396 849993 1220297 1327585 1097100 872219 856465 869991 767935
38016G67935j06237o9866j57106j53840J38527L56656J19160k10378r0468J94276
$$ 767935 661698 591832 434726 280886 419413 776069 895229 684851 594383 788659
38006G88659J2813m01577k79943K82606M02085r3562l97854j27777J43656M0044
$$ 788659 801472 399895 119952 402558 804643 711081 313227 185450 329106 369150
37996C69150k9775J81448K55850L287r6673J86024L67814J64547m206J35267K29587
$$ 369150 339375 520823 776673 779960 683287 869311 1237125 1401672 1397466 1532733 1762320
37985A762320R0346P8837L00580L44705J90356L52639P77742P51025K83138K74181
$$ 1762320 1852666 1931503 2232083 2576788 2767144 3119783 3897525 4648550 4931688 5205869
37975E205869Q59662J088134P77913R71942J850267K178382J776347K240737L916559
$$ 5205869 6065531 7153665 7931578 8903520 10753787 12932169 14708516 16949253 20865812
37966B0865812M893703M983577P395481J2917228J5344080Q056844n817253j5402477
$$ 20865812 25759515 30743092 38138573 51055801 66399881 74456725 68639472 53236995
37958E3236995j4869224r170533n612449m923904l760833j674536r39946j710019
$$ 53236995 38367771 29197238 23584789 18660885 14900052 13225516 12285570 10575551
37950A0575551j850226q69700l66080p32494n55186M91172Q66022j52527j229435
$$ 10575551 8725325 7855625 7489545 6757051 6201865 6693037 7559059 7406532 6177097
37941F177097j155090m87202k40678l78724m02473l35918l87492m29079l61611
$$ 6177097 5022007 4534805 4294127 3915403 3512930 3177012 2789520 2360441 1998830
37932A998830l66285m43638l06651L7661K05955R6918K3130Q0242K2303j42910
$$ 1998830 1632545 1188907 882256 919917 1125872 1222790 1245920 1326162 1348465 1205555
37922A205555j00994J16417R6585k02792l33135j46866m6374k30135l25858n0682
$$ 1205555 1104561 1220978 1317563 1114771 781636 634770 588396 358261 32403 -18279
37912a8279L17019M13549K69914P0228j37816k76631j97286J544Q395j87866k31202
$$ -18279 298740 712289 982203 1052431 914615 637984 440698 442242 450637 262771 31569
37901C1569M121J88943R7796m4592k609Q8858L8423o2479p8050r6508j98894k24130
$$ 31569 35690 224633 322429 277837 275228 364086 402509 340030 261980 165472 -33422 -257552
37889b57552k2255K59198L61278K35840L3665q4314l1967J46515K49595J13135
$$ -257552 -279807 -20609 340669 576509 610174 525860 493893 640408 890003 1003138
37879A003138j53721l07474l01656k48718j35221J08257L20955K73911Q4637O0481
$$ 1003138 849417 541943 240287 -8431 -143652 -35395 285560 559471 644108 704589
37869G04589J49530J8285l03702l94346j61040k8123j97863k87759k0089K51811
$$ 704589 854119 872404 568702 174356 13316 -14807 -212670 -500429 -520518 -268707
37859b68707J32247j32553n8222K88148M14502J57786j46729j85668N531K06544
$$ -268707 -136460 -269013 -327235 -39087 375415 533201 386472 200804 206335 412879
37849D12879K30725J9963k72290l66331j87754J2981K4393l2805L3850J59625
$$ 412879 643604 663567 391277 24946 -162808 -149827 -125434 -158239 -124389 35236
37839C5236K05235K48051L82093M19660J56893j93905k30968L1840J72584j4438
$$ 35236 240471 488522 870615 1290275 1447168 1253263 1022295 1054135 1226719 1212281
37829A212281k68045l08119k01020j35568j02622P092J52372J84125P1669n7626
$$ 1212281 944236 636117 435097 299529 196907 203999 356371 540496 612165 554539
37819E54539r7060r2750j65155l16219l67902j67445J61470L08064J63733l1635
$$ 554539 457479 364729 199574 -116645 -484547 -651992 -490522 -182458 -18725 -50360
37809e0360l5756O8387O5152j8205J6734J56894J56768n6749k17726q9301J85764
$$ -50360 -86116 -17729 47423 29218 45952 202846 359614 302865 85139 -4162 181602
37798A81602K75019R7247j07221j30650n6160q7344k24493k56074p8929J19784
$$ 181602 456621 553868 446647 315997 259837 172493 -52000 -308074 -387003 -267219
37788b67219J07570o0413j17072L6244K10879K25388J34397P6796O0926K9694
$$ -267219 -159649 -220062 -337134 -300890 -90011 135377 269774 346570 407496 437190
37778D37190J0173M9762R3279O4719P65k4332l1037o0204n1006M8361J19884J2977
$$ 437190 447363 497125 590404 655123 655888 631556 600519 540315 489309 537670 657554 670531
37766F70531j93863k63656j32360K1215O4373P7738J59050K26835J42303p0889
$$ 670531 476668 213012 80652 101867 166240 243978 403028 629863 772166 701277
37756G01277k41519k35706n7718J75343K95755J91839n7883k03640p8904J79186
$$ 701277 459758 224052 166334 341677 637432 829271 771388 567748 488844 668030
37746F68030K64915P3986j62706j74782N79Q1670o9325k60473k34312o175J82786
$$ 668030 932945 1006931 844225 669443 670022 751692 682367 421894 187582 181407 364193
37735C64193J90981J04219M2157k212o9605j17126r9404p8074j33494k16725k00831
$$ 364193 555174 659393 701550 699338 629733 512607 413203 335129 201635 -15090 -215921
37724b15921o1336Q4449J11489l997j85758k99099k24310K0937K45802K63874
$$ -215921 -277257 -192808 -81319 -85316 -271074 -570173 -794483 -773546 -527744 -263870
37714b63870J07874j5369J6890J23653J67173J10366j0827j61234k76372k51237
$$ -263870 -155996 -171365 -154475 -30822 136351 246717 235890 74656 -201716 -452953
37704d52953o8670J15640J35220L3783n46Q2370J25242K3617r0030l1979J64140
$$ -452953 -521623 -405983 -270763 -236980 -237526 -155156 -29914 -6297 -96327 -128306 35834
37693C5834K96601K50660P4910j37248k87284k44309J5898K46878J43134k18720
$$ 35834 332435 583095 658005 520757 233473 -10836 5062 251940 395074 176354
37683A76354l88620j21423K78648L82003K01643P6225J25796J45095J2236j05931
$$ 176354 -212266 -333689 -55041 326962 528605 604830 730626 875721 887957 782026
37673G82026l4925J44479K22827J16298q1066k09842j81337p2198n4046j49373
$$ 782026 747101 891580 1114407 1230705 1149639 939797 758460 686262 632216 482843
37663D82843j59665J5892J33717o1834l70338l58477k8474J49349m2329k40090
$$ 482843 323178 339070 472787 410953 40615 -317862 -346336 -196987 -239316 -479406
37653d79406r7675J77087J94541q455j04118k2890J4287q4185j75386j63552r6329
$$ -479406 -577081 -399994 -205453 -213908 -318026 -340916 -326629 -410814 -586200 -749752 -846081
37642h46081K657J42392K28815J67405P5448J35755K60274J88186o2591j56077
$$ -846081 -843424 -701032 -472217 -304812 -229364 -93609 166665 354851 292260 136183
37632A36183N5115K78117K02656o4084k05488j69886j76181l08309l60446j46350
$$ 136183 191298 469415 672071 607987 402499 232613 56432 -251877 -612323 -758673
37622g58673K09116M08661L41749J78756J01054O5040o5071k34048k29989j7345
$$ -758673 -549557 -140896 200853 379609 480663 545703 480632 246584 16595 -750
37612g50J64621J39961N1597J07723K25267J71111k4747q8928M8046J15233o9144
$$ -750 163871 303832 355429 463152 688419 859530 834783 745855 793901 909134 839990
37601H39990k68234j31612K90912N55575L43228j72111n21676m39675j05162J01108
$$ 839990 571756 440144 731056 1286631 1629859 1457748 936072 496397 391235 492343
37591D92343J9384j70301k23857j03587P4800K24514K88001J73720j08152l06370
$$ 492343 511727 341426 117569 13982 88782 313296 601297 775017 666865 360495
37581C60495j61429K08323L86387J91825r0386j31995k499O489j54595k54386
$$ 360495 199066 407389 793776 985601 895215 763220 760721 767210 612615 358229
37571C58229j58846j2098J982r8448j72042j57719j04025n9474k2884J6127M9543
$$ 358229 199383 187285 189267 90819 -81223 -238942 -342967 -402441 -425325 -409198 -359655
37560c59655O2633L8636l4979j25396j37822r194J68299K01531L8222j16095l6345
$$ -359655 -297022 -258386 -293365 -418761 -556583 -565777 -397478 -195947 -157725 -273820 -310165
37549c10165J98192K69045M0492k38784k55096k4160J80080K03381J32232O5659
$$ -310165 -111973 157072 197564 -41220 -296316 -320476 -140396 62985 195217 260876
37539B60876k5302j50072j83270k4876K12501L01123J53948j02988k87631l05743
$$ 260876 235574 85502 -97768 -122644 89857 390980 544928 441940 154309 -151434
37529a51434j55097J02770L30945L62894J54249j28604k53645j68291k9963K1030
$$ -151434 -306531 -203761 127184 490078 644327 515723 262078 93787 63824 84854
37519H4854K1420O2286J12276Q0391j2572o6858p2090r2537j06126l2490P3122
$$ 84854 106274 168560 280836 361227 348655 281797 209707 117170 11044 -21446 51676
37508E1676M9424j01538j71929n6279Q7423R3013K4783L2667J29282K40928L23681
$$ 51676 101100 -438 -172367 -228646 -141223 -48210 -23427 9240 138522 379450 703131
37497G03131L07152J08493j57140j98151L6405J95526K0741k42262k37988p3259
$$ 703131 1010283 1118776 961636 763485 799890 995416 1016157 773895 535907 462648
37487D62648r0235k42724j84192Q9863J98533J4853j40263o3960K5735n6372j17148
$$ 462648 372413 129689 -54503 35360 233893 248746 108483 44523 70258 13886 -103262
37476a03262N0957K88031L19432J44148o0428k01271k39807j28085L2893M352
$$ -103262 -52305 235726 555158 699306 638878 437607 197800 69715 102608 106960
37466A06960k29943l59081j96170L4182Q3155O4810J77407L11504K63458J05794
$$ 106960 -122983 -482064 -678234 -644052 -560897 -496087 -318680 -7176 256282 362076
37456C62076P084q9452k44577k21842J46773M89431L08549k33144m82544k36496
$$ 362076 369160 279708 35131 -186711 -39938 449493 758042 524898 42354 -194142
37446a94142M2033K1077n1689R6966K68488J73722o1067j25158r390O9280N4198
$$ -194142 -152109 -131032 -182721 -85755 182733 356455 295388 170230 160840 230120 284318
37435B84318N9324J07156J15805P6801M0514j1823j09437j71720j05102L5057
$$ 284318 343642 450798 566603 643404 683918 672095 562658 390938 285836 320893
37425C20893J15106J04343P3127O7173Q2256J03559Q7683k3864k00925l13913
$$ 320893 435999 540342 613469 680642 762898 866457 954140 930276 729351 415438
37415D15438k86644j69734k5938J26592K21666J77567Q6671J52752L30929K84619
$$ 415438 128794 -40940 -66878 59714 281380 458947 545618 698370 1029299 1313918
37405A313918j15351n02171m83894j85404m092o062M8757J86820J63863o0449
$$ 1313918 1198567 696396 212502 27098 23006 16944 65701 252521 416384 355935
37395C55935k02552j06170M1980P4900R4707J98053K57787J78252R6225J04172
$$ 355935 153383 47213 89193 164093 258800 456853 714640 892892 989117 1093289
37385A093289K9254k45561m66222l33559J3533J78292P1128m8600m4586n0410
$$ 1093289 1122543 876982 410760 77201 90734 269026 340154 291554 246968 196558
37375A96558j12509m7079K12383M15215L30412P9118o3089m9418n0155j44817
$$ 196558 84049 36970 249353 664568 994980 1074098 1011009 961591 911436 766619
37365G66619k16586j45289K1706J18728M2548j13656j27294Q2725K84946J81119
$$ 766619 550033 404744 426450 545178 587726 474070 346776 429501 714447 895566
37355H95566j72064l85524k54972l9040o8025k73289l38989j85685j9789M5625
$$ 895566 723502 337978 83006 43966 -24059 -297348 -636337 -822022 -841811 -796186
37345g96186J21711K56965K89910J13568j01622j03215J24388L55152L74256J57853
$$ -796186 -674475 -417510 -127600 -14032 -115654 -218869 -94481 260671 634927 792780
37335G92780j37078k97295k29187o8175n0967k26247l65279k32924J11132L68232
$$ 792780 655702 358407 129220 61045 10078 -216169 -581448 -814372 -703240 -335008
37325c35008L32527R5313p7081j8753J89607L24444K55186O1563r1107j42634
$$ -335008 -2481 92832 15751 -3002 186605 511049 766235 827798 736691 594057
37315E94057j40800r6813M0271K40159L34445J82331j52260m42386m96169l06617
$$ 594057 453257 356444 396715 636874 971319 1153650 1001390 559004 62835 -243782
37305b43782n4486L6656p6988j73322p11L67726N39590K56765k44451m56150j62833
$$ -243782 -298268 -261612 -338600 -511922 -512633 -144907 394683 651448 406997 -49153 -211986
37294b11986L20728M93064J84762k92377m88289k81138J9725M7659j93452l54211
$$ -211986 108742 601806 786568 494191 5902 -275236 -255511 -207852 -401304 -755515
37284g55515j76724K08308M64148M24090K00890p724j08211j16125p2873r856
$$ -755515 -932239 -723931 -259783 164307 365197 357473 249262 133137 60264 50408
37274E0408L4063J3339p0267j25591m6391J36808K40956J35965q3878k20106k12826
$$ 50408 84471 97810 27543 -98048 -144439 -7631 233325 369290 285412 65306 -147520
37263a47520j51437q5720K2199J57148K16155J52228L0690q4701j80792k17684
$$ -147520 -298957 -384677 -362478 -205330 10825 163053 193743 109042 -71750 -289434
37253b89434j48320m0187j7784m7550L9969K51810L52208J90603o2568j45367
$$ -289434 -437754 -477941 -495725 -543275 -503306 -251496 100712 291315 228747 83380
37243H3380l4804Q6545Q4673k4407j33365j13707P0514K56431K23428m575j69111
$$ 83380 48576 135121 219794 195387 62022 -51685 18829 275260 498688 494113 325002
37232C25002j47943r5253j20245r1904P3083J92280J10688k0082l714P1524K9618
$$ 325002 177059 81806 -38439 -130343 -57260 135020 245708 225626 221912 293436 323054
$$ [...]
##END NTUPLES=NMR SPECTRUM
##END=
