##TITLE=31Pdec_DE-67rmail
 , 24 sc
 4.10.2024
##JCAMPDX= 6.0         $$ Bruker NMR JCAMP-DX V2.0
##DATA TYPE= NMR SPECTRUM
##DATA CLASS= NTUPLES
##ORIGIN= UXNMR, Bruker Analytische Messtechnik GmbH
##OWNER= root
$$ XWIN-NMR		Version 3.5
$$ Fri Oct  4 13:53:53 2024 Russian Standard Time (UT+4h)  she@DPX200
##.OBSERVE FREQUENCY= 81.013821
##.OBSERVE NUCLEUS= ^31P
##.ACQUISITION MODE= SIMULTANEOUS
##.ACQUISITION SCHEME= undefined
##.AVERAGES= 24
##.DIGITISER RES= 17
##SPECTROMETER/DATA SYSTEM= spect
##.PULSE SEQUENCE= zgpg30
##.SOLVENT NAME= CDCl3
##.SHIFT REFERENCE= (INTERNAL, CDCl3, 0, 198.062)
##AUDIT TRAIL= $$ (NUMBER, WHEN, WHO, WHERE, WHAT)
$$ ##TITLE= Audit trail, XWIN-NMR		Version 3.5
$$ ##JCAMPDX= 5.01
$$ ##ORIGIN= Bruker BioSpin GmbH
$$ ##OWNER= she
$$ F:/spectra/data/she/nmr/P31/2/pdata/1/auditp.txt
$$ ##AUDIT TRAIL=  $$ (NUMBER, WHEN, WHO, WHERE, WHAT)
(   1,<2024-10-04 13:52:32.31 +0400>,<she>,<DPX200>,
      <created by zg, POWCHK disabled, PULCHK disabled
       configuration hash MD5:
       00 E9 B6 7A A2 85 ED C7 34 08 36 98 17 FE 4E 26
       data hash MD5: 32K
       69 E0 3B 69 AD 7B 6F 33 FB B7 90 1F AF 69 C9 2D>)
(   2,<2024-10-04 13:52:46.29 +0400>,<she>,<DPX200>,
      <Start of raw data processing
       efp BC_mod = 2 LB = 1.5 FT_mod = 6 PKNL = 1 PHC0 = 2710.706 PHC1 = 78.4875 SI = 64K 
       data hash MD5: 64K
       3F BE F4 3D 87 F0 90 C8 88 BB A4 1A 49 D8 BB 2B>)
(   3,<2024-10-04 13:53:08.60 +0400>,<she>,<DPX200>,
      <pk PHC0 = -53.724 PHC1 = -14.6 
       data hash MD5: 64K
       23 29 F9 9F 6F DF 16 7F DC F2 7B 57 1F 0B 76 34>)
(   4,<2024-10-04 13:53:13.31 +0400>,<she>,<DPX200>,
      <abs ABSG = 5 
       data hash MD5: 64K
       83 80 E1 97 BC 43 32 63 F6 DE BE C7 5F AA 83 A1>)
$$ ##END=
$$ 
$$ hash MD5
$$ 0A 17 DB C5 C5 17 F7 B7 BC B2 59 F6 A4 DF 23 D7
##$RELAX= 
##$RELAX= 
##$RELAX= 
##$RELAX= 
##$RELAX= 
##$RELAX= 
##$RELAX= 
##$RELAX= 
$$ Bruker specific parameters
$$ --------------------------
##$DU= <F:/spectra>
##$EXPNO= 2
##$NAME= <P31>
##$PROCNO= 1
##$TYPE= <nmr>
##$USER= <she>
##$AMP= (0..31)
100 100 100 100 100 100 100 100 100 100 100 100 100 100 100 100 100 100 
100 100 100 100 100 100 100 100 100 100 100 100 100 100 
##$AQSEQ= 0
##$AQ_mod= 1
##$AUNM= <au_zg>
##$AUTOPOS= <>
##$BF1= 81.014009
##$BF2= 200.13
##$BF3= 200.13
##$BF4= 200.13
##$BF5= 200.13
##$BF6= 200.13
##$BF7= 200.13
##$BF8= 200.13
##$BYTORDA= 1
##$CFDGTYP= 0
##$CFRGTYP= 5
##$CHEMSTR= <none>
##$CNST= (0..31)
1 1 145 1 1 1 1 1 1 1 1 1 1 1 1 1 1 1 1 1 1 1 1 1 1 1 1 1 1 1 1 1 
##$CPDPRG= <waltz16>
##$CPDPRG1= <>
##$CPDPRG2= <waltz16>
##$CPDPRG3= <>
##$CPDPRG4= <mlev>
##$CPDPRG5= <mlev>
##$CPDPRG6= <mlev>
##$CPDPRG7= <mlev>
##$CPDPRG8= <mlev>
##$CPDPRGB= <>
##$CPDPRGT= <>
##$D= (0..31)
0 1 0 0 0 0 0 0 0 0.06 0 0.03 2e-05 3e-06 0 0 0.0002 0 0 0 0 0 0 0 0 0 
0 0 0 0 0 0 
##$DATE= 1728035551
##$DBL= (0..7)
120 120 120 11 120 120 24 19 
##$DBP= (0..7)
150 150 150 150 150 150 150 150 
##$DBP07= 0
##$DBPNAM0= <>
##$DBPNAM1= <>
##$DBPNAM2= <>
$$ [...]
##$SUBNAM3= <"">
##$SUBNAM4= <"">
##$SUBNAM5= <"">
##$SUBNAM6= <"">
##$SUBNAM7= <"">
##$SUBNAM8= <"">
##$SUBNAM9= <"">
##$SW= 400.765351723535
##$SWIBOX= (0..15)
0 1 3 0 0 0 0 0 0 0 0 0 0 0 0 0 
##$SW_h= 32467.5324675325
##$TD= 32768
##$TD0= 1
##$TE= 0
##$TE2= 300
##$TE3= 300
##$TEG= 300
##$TL= (0..7)
0 120 53 12 22 120 120 120 
##$TP= (0..7)
150 150 150 150 150 150 150 150 
##$TP07= 0
##$TPNAME0= <>
##$TPNAME1= <>
##$TPNAME2= <>
##$TPNAME3= <>
##$TPNAME4= <>
##$TPNAME5= <>
##$TPNAME6= <>
##$TPNAME7= <>
##$TPOAL= (0..7)
0.5 0.5 0.5 0.5 0.5 0.5 0.5 0.5 
##$TPOFFS= (0..7)
0 0 0 0 0 0 0 0 
##$TUNHIN= 0
##$TUNHOUT= 0
##$TUNXOUT= 0
##$USERA1= <user>
##$USERA2= <user>
##$USERA3= <user>
##$USERA4= <user>
##$USERA5= <user>
##$V9= 5
##$VALIST= <valist>
##$VCLIST= <CCCCCCCCCCCCCCC>
##$VD= 0
##$VDLIST= <DDDDDDDDDDDDDDD>
##$VPLIST= <PPPPPPPPPPPPPPP>
##$VTLIST= <TTTTTTTTTTTTTTT>
##$WBST= 1024
##$WBSW= 4
##$XGAIN= (0..3)
0 0 0 0 
##$XL= 0
##$YL= 0
##$YMAX_a= 14426
##$YMIN_a= -12892
##$ZGOPTNS= <>
##$ZL1= 120
##$ZL2= 120
##$ZL3= 120
##$ZL4= 120
##$ABSF1= 198.0616
##$ABSF2= -202.7028
##$ABSG= 5
##$ABSL= 3
##$ALPHA= 0
##$AQORDER= 0
##$ASSFAC= 0
##$ASSFACI= 0
##$ASSFACX= 0
##$ASSWID= 0
##$AUNMP= <proc_1d>
##$AZFE= 0.1
##$AZFW= 0.5
##$BCFW= 0
##$BC_mod= 2
##$BYTORDP= 0
##$COROFFS= 0
##$CY= -3
##$DATMOD= 1
##$DC= 0
##$DFILT= <>
##$DTYPP= 0
##$F1P= 0
##$F2P= 0
##$FCOR= 1
##$FTSIZE= 65536
##$FT_mod= 6
##$GAMMA= 0
##$GB= 0
##$INTBC= 1
##$INTSCL= 9.790993e-09
##$ISEN= 30
##$LB= 1.5
##$LEV0= 0
##$LPBIN= 0
##$MAXI= 10000
##$MC2= 0
##$MEAN= 0
##$ME_mod= 0
##$MI= 50
##$NCOEF= 0
##$NC_proc= -5
##$NLEV= 6
##$NOISF1= 182.463
##$NOISF2= 159.3651
##$NSP= 0
##$NTH_PI= 0
##$NZP= 0
##$OFFSET= 198.0616
##$PC= 4
##$PHC0= 2656.982
##$PHC1= 63.8875
##$PH_mod= 1
##$PKNL= yes
##$PPARMOD= 0
##$PSCAL= 0
##$PSIGN= 0
##$REVERSE= no
##$SF= 81.0140089999434
##$SI= 65536
##$SIGF1= 159.3651
##$SIGF2= -187.1042
##$SINO= 113.3802
##$SIOLD= 16384
##$SREGLST= <1H.CDCl3>
##$SSB= 0
##$STSI= 65536
##$STSR= 0
##$SW_p= 32467.5324675325
##$SYMM= 0
##$S_DEV= 0
##$TDeff= 32768
##$TDoff= 0
##$TI= <>
##$TILT= no
##$TM1= 0
##$TM2= 0
##$TOPLEV= 0
##$USERP1= <user>
##$USERP2= <user>
##$USERP3= <user>
##$USERP4= <user>
##$USERP5= <user>
##$WDW= 1
##$XDIM= 65536
##$YMAX_p= 501574237
##$YMIN_p= -10635330
$$ End of Bruker specific parameters
$$ ---------------------------------
##NTUPLES= NMR SPECTRUM
##VAR_NAME=  FREQUENCY,     SPECTRUM/REAL,   SPECTRUM/IMAG
##SYMBOL=    X,             R,               I
##VAR_TYPE=  INDEPENDENT,   DEPENDENT,       DEPENDENT
##VAR_FORM=  AFFN,          ASDF,            ASDF
##VAR_DIM=   65536,         65536,           65536
##UNITS=     HZ,            ARBITRARY UNITS, ARBITRARY UNITS
##FACTOR=    0.49542278885378, 1,            1
##FIRST=     16045.7642231865, 0,            0
##LAST=      -16421.768244346, 0,            0
##MIN=       -16421.768244346, -10635330,    0
##MAX=       16045.7642231865, 501574237,    0
$$ Real data points
##PAGE= N=1
##DATA TABLE= (X++(R..R)), XYDATA
$$ [...]
$$ plain form
43345 -293376 -313484 -199102 -264505 -546581 -783703 -770641 -533860 -207981 81333 216756
43335 216756 124537 -136655 -395586 -518250 -506308 -438066 -362729 -290464 -246031 -249185 -226884
43324 -226884 -41459 308706 583826 531776 209876 -58898 -62708 109507 275666 375359
43314 375359 401299 303057 95563 -87676 -205052 -431315 -881389 -1318698 -1364018 -954650
43304 -954650 -401063 -14289 135043 109837 -20487 -148479 -142208 18539 200625 253472
43294 253472 137969 -56336 -148609 22905 409095 712577 677336 383135 116034 -2827
43284 -2827 -80789 -178870 -195789 -68572 98491 171326 106379 -103381 -430768 -701834 -659675
43273 -659675 -249414 284695 667042 824472 783073 511715 23347 -490097 -803250 -887948
$$ packed form
43345b93376k0108J14382o5403k82076k37122J3062K36781L25879K89314J35423
43335B16756r2219k61192k58931j22664J1942O8242P5337P2265M4433l154K2301
43324b26884J85425L50165K75120n2050l21900k68774l810J72215J66159R9693
43314C75359K5940r8242k07494j83239j17376k26263m50074m37309m5320M09368
43304i54650N53587L86774J49332k5206j30324j27992O271J60747J82086N2847
43294B53472j15503j94305r2273J71514L86190L03482l5241k94201k67101j18861
43284b827p7962r8081j6919J27217J67063P2835o4947k09760l27387k71066M2159
43273f59675M10261N34109L82347J57430m1399k71358m88368n13444l13153q4698
$$ plain form
43263 -887948 -863245 -765773 -516861 -108266 309775 560272 593876 501888 424180 442258 523438
43252 523438 574911 570194 586015 682168 789643 771696 573977 275313 12863 -115792 -116448
43241 -116448 -104449 -209331 -427422 -600125 -580106 -383346 -132193 103144 329391 524609
43231 524609 609383 554129 447745 406488 440777 457073 385870 268377 202012 227504 300759
43220 300759 368409 433243 527302 641998 706324 628893 362740 -41547 -433155 -646632
43210 -646632 -627340 -465548 -295213 -182122 -122791 -111188 -166483 -310318 -537500 -786897
43200 -786897 -931544 -846160 -524974 -111282 210516 332578 250747 50159 -124024 -172978
43190 -172978 -160772 -238723 -414243 -505928 -398514 -223887 -180220 -273844 -370917 -413726 -424172
$$ packed form
43263h87948K4703R7472K48912M08595M18041K50497L3604r1988p7708J8078Q1180
43252E23438N1473m717J5821R6153J07475j7947j97719k98664k62450j28655o56
43241a16448J1999j04882k18091j72703K0019J96760K51153K35337K26247J95218
43231E24609Q4774n5254j06384m1257L4289J6296p1203j17493o6365K5492P3255
43220C00759O7650O4834R4059J14696O4326p7431k66153m04287l91608k13477
43210f46632J9292J61792J70335J13091N9331J1603n5295j43835k27182k49397
43200g86897j44647Q5384L21186M13692L21798J22062q1831k00588j74183m8954
43190a72978J2206p7951j75520r1685J07414J74627M3667r3624r7073m2809j0446
$$ plain form
43179 -424172 -351508 -98224 300976 665570 844479 807871 599546 326561 167750 240449
43169 240449 445411 559205 480330 285677 83871 -54006 -62971 43449 85098 -115635
43159 -115635 -459459 -634094 -476248 -115384 242419 482538 521810 316440 14454 -102879
43149 -102879 57200 297661 435858 520043 632265 681343 571371 422971 422862 541439
43139 541439 580091 440908 194658 -66614 -290573 -406888 -352296 -165297 29733 130498
43129 130498 101202 -42221 -220303 -305269 -220951 -9091 229913 405765 429731 245307
43119 245307 -60494 -264844 -220431 -10972 163602 199695 140303 85315 106370 186846 207321
43108 207321 62688 -182351 -345691 -350604 -280396 -202151 -98200 -12331 -73219 -278428 -424472
$$ packed form
43179d24172P2664K53284L99200L64594J78909l6608k08325k72985j58811P2699
43169B40449K04962J13794p8875j94653k01806j37877q965J06420M1649k00733
43159a15635l43824j74635J57846L60864L57803K40119L9272k05370l01986j17333
43149a02879J60079K40461J38197Q4185J12222M9078j09972j48400j09J18577
43139E41439L8652j39183k46250k61272k23959j16315N4592J86999J95030J00765
43129A30498k9296j43423j78082q4966Q4318K11860K39004J75852K3966j84424
43119B45307l05801k04350M4413K09459J74574L6093n9392n4988K1055Q0476K0475
43108B07321j44633k45039j63340m913P0208P8245J03951Q5869o0888k05209j46044
$$ plain form
43097 -424472 -361885 -170645 9658 145548 198295 60195 -229880 -401340 -286141 -76301
43087 -76301 -39773 -140457 -177029 -146687 -182834 -227676 -74961 275303 561582 576978 355442
43076 355442 65669 -108098 -40254 184601 261262 15042 -313522 -366890 -165745 -31169
43066 -31169 -88567 -175818 -211881 -288788 -355716 -181935 243395 592887 631106 485504 339166
43055 339166 137797 -193025 -484582 -534582 -427084 -411068 -554563 -708161 -739245 -642731
43045 -642731 -473482 -297810 -175553 -108585 -48410 16143 61655 125340 261422 386511
43035 386511 341816 151152 28963 75862 172580 242358 371507 557408 606338 459040
43025 459040 359659 470107 556783 352697 30993 -37385 121531 119207 -180468 -449900
$$ packed form
43097d24472O2587J91240J80303J35890N2747j38100k90075j71460J15199K09840
43087g6301L6528j00684l6572L0342l6147m4842J52715L50264K86279J5396k21536
43076C55442k89773j73767O7844K24855P6661k46220l28564n3368K01145J34576
43066c1169n7398q7251l6063p6907o6928J73781M25330L49492L8219j45602j46338
43055C39166k01369l30822k91557n0000J07498J6016j43495j53598l1084R6514
43045f42731J69249J75672J22257O6968O0175O4553M5512O3685J36082J25089
43035C86511m4695j90664j22189M6899R6718O9778J29149J85901M8930j47298
43025D59040r9381J10448Q6676k04086l21704o8378J58916k324k99675k69432
$$ plain form
43015 -449900 -391949 -151442 -80338 -282214 -544199 -617637 -445434 -156331 89781 248279
43005 248279 384106 526071 598721 539499 388811 193244 -66289 -347432 -480150 -380210
42995 -380210 -209162 -137720 -61888 221412 645166 938286 1009189 986358 900817 643924
42985 643924 284034 105622 217717 398667 458576 477518 518980 405504 46213 -252922
42975 -252922 -149036 201019 316888 61576 -209098 -189691 10321 153451 235216 360833
42965 360833 458989 360507 87764 -131970 -128487 71699 346223 581818 677924 579618 353920
42954 353920 151249 55030 26665 1328 -46003 -133018 -252699 -293714 -116917 211913 407976
42943 407976 317281 158139 232866 488110 591745 414432 173546 61155 3479 -90005
$$ packed form
43015d49900N7951K40507P1104k01876k61985p3438J72203K89103K46112J58498
43005B48279J35827J41965P2650n9222j50688j95567k59533k81143j32718R9940
42995c80210J71048P1442P5832K83300M23754K93120P0903k2831q5541k56893
42985F43924l59890j78412J12095J80950N9909J8942M1462j13476l59291k99135
42975b52922J03886L50055J15869k55312k70674J9407K00012J43130Q1765J25617
42965C60833R8156r8482k72743k19734L483K00186K74524K35595R6106r8306k25698
42954C53920k02671r6219k8365k5337m7331q7015j19681m1015J76797L28830J96063
42943D07976r0695j59142P4727K55244J03635j77313k40886j12391n7676r3484
$$ plain form
42933 -90005 -99718 68851 216934 87000 -238064 -436832 -404165 -341075 -387135 -426966 -333578
42922 -333578 -173212 -46858 92005 319062 571714 744194 849243 940951 956786 797484
42912 797484 528494 346696 338774 397281 398096 351739 343172 419884 592747 859154 1141813
42901 1141813 1263830 1096285 734495 441207 381726 469699 502370 387949 191659 15592
42891 15592 -84612 -90849 -23996 39250 30603 -14858 -2885 71783 116417 101751 111012 163608
42879 163608 117859 -127826 -427587 -532971 -400095 -203202 -66987 46622 164582 187365
42869 187365 40628 -159825 -194688 43143 462029 848783 1000461 853180 544531 306773
42859 306773 244147 242440 131460 -104015 -317024 -366548 -245992 -64529 57910 84668
$$ packed form
42933i0005r713J68569J48083j29934l25064j98768L2667O3090m6060l9831R3388
42922c33578J60366J26354J38863K27057K52652J72480J05049R1708J5835j59302
42912G97484k68990j81798p922N8507Q15m6357q567P6712J72863K66407K82659
42901A141813J22017j67545l61790k93288n9481Q7973L2671j14421j96290j76067
42891A5592j00204o237O6853O3246q647m5461J1973P4668M4634j4666R261N2596
42879A63608m5749k45685k99761j05384J32876J96893J36215J13609J17960K2783
42869A87365j46737k00453l4863K37831M18886L86754J51678j47281l08649k37758
42859C06773o2626j707j10980k35475k13009m9524J20556J81463J22439K6758
$$ plain form
42849 84668 81999 148342 314287 507751 599655 471585 85146 -444179 -852923 -903843 -607860
42838 -607860 -231505 -40038 -53663 -84184 15101 181574 233847 104906 -58127 -63255 82682
42827 82682 181496 111983 -16223 -51976 -42440 -147463 -373739 -558067 -604476 -571117 -493980
42816 -493980 -289529 90614 531865 866983 1022756 995371 786602 451136 122691 -99937
42806 -99937 -243003 -378637 -519754 -636453 -693041 -627458 -403965 -142905 -63268 -200842
42796 -200842 -313635 -187291 92047 308876 423074 509511 512119 319943 51997 -2832
42786 -2832 228279 502610 611030 611440 619053 576665 399292 196206 145904 214658 188051
42775 188051 -13710 -201484 -151731 110335 328244 287722 22980 -251836 -365830 -297151
$$ packed form
42849H4668k669O6343J65945J93464R1904j28070l86439n29325m08744n0920K95983
42838f07860L76355J91467j3625l0521R9285J66473N2273j28941j63033n128J45937
42827H2682R8814o9513j28206l5753R536j05023k26276j84328m6409L3359P7137
42816d93980K04451L80143M41251L35118J55773k7385k08769l35466l28445k22628
42806i9937j43066j35634j41117j16699n6588O5583K23493K61060P9637j37574
42796b00842j12793J26344K79338K16829J14198Q6437K608j92176k67946n4829
42786b832K31111K74331J08420M10P613m2388j77373k03086n0302O8754k6607
42775A88051k01761j87774M9753K62066K17909m0522k64742k74816j13994O8679
$$ plain form
42765 -297151 -99597 147546 281376 113914 -295908 -543818 -284948 285630 591009 343883
42755 343883 -165002 -502462 -551240 -404292 -87816 339282 590877 387861 -152662 -622339
42745 -622339 -799421 -790345 -723829 -588482 -421908 -380464 -490343 -543524 -387758 -145427
42735 -145427 1940 75534 166909 199971 63138 -106576 -34180 289235 535542 438137
42725 438137 98100 -181137 -227628 -80943 143290 341537 428769 380630 281344 259743
42715 259743 355551 483933 546387 550777 597934 753754 959089 1083755 1051282 876885 602647
42704 602647 266125 -58433 -280400 -403794 -528369 -663692 -639490 -329413 105088 354923
42694 354923 316653 141173 -42834 -236985 -379903 -305011 -23659 167712 57095 -171343
$$ packed form
42765b97151J97554K47143J33830j67462m09822k47910K58870N70578L05379k47126
42755C43883n08885l37460m8778J46948L16476M27098K51595k03016n40523m69677
42745f22339j77082R076O6516J35347J66574M1444j09879n3181J55766K42331
42735a45427J47367P3594R1375L3062j36833j69714P2396L23415K46307r7405
42725D38137l40037k79237m6491J46685K24233J98247Q7232m8139r9286k1601
42715B59743R5808J28382O2454M390M7157J55820K05335J24666l2473j74397k74238
42704F02647l36522l24558k21967j23394j24575j35323K4202L10077M34501K49835
42694C54923l8270j75480j84007j94151j42918P4892K81352J91371j10617k28438
$$ plain form
42684 -171343 -216893 -117683 -150281 -344809 -417636 -223365 19873 71765 -5747 -24721 23926
42673 23926 38710 39741 110446 180855 89319 -150061 -330250 -320530 -190139 -32569 167142
42662 167142 415721 607127 653152 627113 648371 670735 520261 152382 -239247 -423341
42652 -423341 -380579 -295527 -324201 -425175 -431668 -252380 34974 276206 370252 278023 -34751
42641 -34751 -553636 -1092542 -1328518 -1078401 -522700 -51975 124275 125005 133288 115782 -80396
42630 -80396 -432480 -716939 -799205 -804185 -925301 -1164996 -1353075 -1346621 -1116144 -703834 -225974
42619 -225974 117628 185014 65098 -5694 74445 183972 196422 152466 147533 175123 181772
42608 181772 173316 156820 81690 -23374 40133 395390 808363 883955 564017 205897 92851
$$ packed form
42684a71343m5550R9210l2598j94528p2827J94271K43238N1892p7512j8974M8647
42673B3926J4784J031P0705P0409r1536k39380j80189R720J30391J57570J99711
42662A67142K48579J91406M6025k6039K1258K2364j50474l67879l91629j84094
42652d23341M2762Q5052k8674j00974o493J79288K87354K41232R4046r2229l12774
42641c4751n18885n38906k35976K50117N55701M70725J76250P30Q283j7506j96178
42630h0396l52084k84459q2266m980j21116k39695j88079O454K30477M12310M77860
42619b25974L43602O7386j19916p0792Q0139J09527J2450m3956m933K7590O649
42608A81772q456j6496p5130j05064O3507L55257M12973P5592l19938l58120j13046
$$ plain form
42597 92851 83817 -108803 -467785 -695128 -602518 -299374 -26682 53709 -69612 -265683
42587 -265683 -350372 -268334 -158709 -151198 -171646 -92407 881 -92652 -337449 -447516 -288349
42576 -288349 -74842 -50496 -154659 -170981 -71508 -23499 -114604 -233489 -209579 30916 414823
42565 414823 742883 820256 667832 547997 671343 925155 1001338 752096 320670 -24442
42555 -24442 -80928 182399 564761 729202 515378 134041 -75975 -30657 102277 206098
42545 206098 305555 399728 440128 473809 578275 649073 507179 244687 172474 342938 430151
42534 430151 229116 -26394 -54763 40908 10458 -94217 -44571 119027 114214 -143939 -431890
42523 -431890 -559914 -565130 -518656 -367919 -62027 308404 569727 593985 378309 79174
$$ packed form
42597I2851r034j92620l58982k27343R2610L03144K72692Q0391j23321j96071
42587b65683q4689Q2038J09625P511k0448P9239R3288r3533k44797j10067J59167
42576b88349K13507K4346j04163j6322R9473M8009r1105j18885K3910K40495L83907
42565D14823L28060P7373j52424j19835J23346K53812P6183k49242m31426l45112
42555b4442n6486K63327L82362J64441k13824l81337k10016M5318J32934J03821
42545B06098R9457R4173M0400L3681J04466P0798j41894k62492p2213J70464Q7213
42534D30151k01035k55510k8369R5671l0450j04675M9646J63598m813k58153k87951
42523d31890j28024n216M6474J50737L05892L70431K61323K4258k15676k99135
$$ plain form
42513 79174 -79251 -35838 30898 -33545 -128375 -97387 -44669 -207941 -569834 -850086 -882600
42502 -882600 -769964 -660921 -607310 -649300 -788416 -839844 -576827 -99884 189224 89178
42492 89178 -152246 -204337 -43659 155574 297955 355961 268453 52819 -110514 -91750
42482 -91750 -11508 -65528 -244406 -388712 -443163 -492258 -588740 -685468 -715046 -643253 -478494
42471 -478494 -295197 -194424 -192868 -224306 -271514 -363302 -404127 -205624 192126 424268 226178
42460 226178 -166520 -258529 114839 617327 808129 562124 109774 -214392 -252524 -124186
42450 -124186 -46494 -57783 -18299 103108 129191 -31573 -172390 -55877 223282 345469
42440 345469 174208 -126526 -351231 -462430 -538159 -634127 -724850 -740920 -685110 -696681 -880530
$$ packed form
42513G9174j58425M3413O6736o4443r4830L0988N2718j63272l61893k80252l2514
42502h82600J12636J09043N3611m1990j39116n1428K63017M76943K89108j00046
42492H9178k41424n2091J60678J99233J42381N8006q7508k15634j63333J8764
42482i1750Q0242n4020j78878j44306n4451m9095r6482r6728k9578P1793J64759
42471d78494J83297J00773J556l1438m7208r1788m0825J98503L97750K32142j98090
42460B26178l92698r2009L73368N02488J90802k46005m52350l24166l8132J28338
42450a24186P7692j1289L9484J21407K6083j60764j40817J16513K79159J22187
42440C45469j71261l00734k24705j11199p5729r5968r0723j6070N5810j1571j83849
$$ plain form
42429 -880530 -1061314 -895685 -306630 384431 855041 1094289 1197828 1123589 874607 684995
42419 684995 740789 897191 956362 1052080 1444724 2077855 2661840 3083951 3450454 3902983
42409 3902983 4725307 6353922 8715991 10689290 10912049 9270836 7047954 5442214
42401 5442214 4478929 3586122 2640385 1974563 1730342 1714484 1743227 1750183 1653393 1417298
42391 1417298 1174931 1059639 995654 838360 616622 464625 426370 483628 646316 852106
42381 852106 907554 698243 349345 46439 -165417 -276973 -186019 147565 549951 793671
42371 793671 796939 574507 187455 -139249 -100848 291493 629890 634862 511751 530924 533390
42360 533390 226305 -234399 -396531 -168158 82931 75478 -93009 -210547 -182116 27641
$$ packed form
42429h80530j80784J65629N89055O91061M70610K39248J03539p4239k48982j89612
42419F84995N5794J56402N9171R5718L92644O33131N83985M22111L66503M52529
42409C902983Q22324J628615K362069J973299K22759j641213k222882j605740
42401E442214r63285q92807r45737o65822k44221j5858K8743O956r6790k36095
42391A417298k42367j15292o3985j57294k21738j51997l8255N7258J62688K05790
42381H52106N5448k09311l48898l02906k11856j11556R0954L33584M02386K43720
42371G93671L268k22432l87052l26704L8401L92341L38397M972j23111J9173K466
42360E33390l07085m60704j62132K28373K51089p453j68487j17538K8431K09757
$$ plain form
42350 27641 374520 613709 489109 110853 -110005 32657 330380 500396 490380 381831
42340 381831 235661 132901 163788 275695 297873 186150 78583 60740 59130 17537 -20421
42329 -20421 -72466 -253705 -546855 -717378 -583833 -243072 67709 207016 153382 -54652
42319 -54652 -292544 -379724 -248791 -18760 159711 251842 291614 287709 235505 158013 108336
42308 108336 173063 417902 729927 807399 498240 88490 9451 270099 451719 298619
42298 298619 17271 -109672 -109589 -141299 -172222 -62532 172165 374995 430399 310529 64635
42287 64635 -127609 -45007 303500 640057 763618 760644 751195 655246 415586 240680 347577
42276 347577 600121 687964 579901 523216 645839 830409 959870 1018700 937986 605563
$$ packed form
42350B7641L46879K39189j24600l78256k20858J42662K97723J70016j0016j08549
42340C81831j46170j02760L0887J11907K2178j11723j07567j7843j610m1593l7958
42329b0421n2045j81239k93150j70523J33545L40761L10781J39307n3634k08034
42319e4652k37892q7180J30933K30031J78471R2131L9772l905n2204p7492m9677
42308A08336O4727K44839L12025P7472l09159m09750p9039K60648J81620j53100
42298B98619k81348j26943Q3l1710l0923J09690K34697K02830N5404j19870k45894
42287F4635j92244Q2602L48507L36557J23561k974r449r5949k39660j74906J06897
42276C47577K52544Q7843j08063n6685J22623J84570J29461N8830q0714l32423
$$ plain form
42266 605563 100867 -294762 -413388 -368725 -340466 -338528 -263885 -89447 104306 211964
42256 211964 180024 50165 -67635 -108239 -104755 -83209 3523 139922 172971 50434 19031
42245 19031 324099 761434 836131 408184 -118601 -346390 -321674 -265204 -172338 27922
42235 27922 132168 -138445 -644965 -882296 -600693 -127628 41750 -205127 -579032 -782399
42225 -782399 -775627 -711548 -724666 -782787 -707427 -381910 37333 210022 -12881 -389274 -569496
42214 -569496 -504404 -418417 -423858 -378055 -173748 40684 77430 1342 22613 178324 309553
42203 309553 315940 238864 98501 -139291 -381601 -397788 -107697 264586 450462 437654
42193 437654 389555 375168 338175 268817 235232 246317 214844 77763 -133086 -347009 -509304
$$ packed form
42266F05563n04696l95629j18626M4663K8259J938P4643J74438J93753J07658
42256B11964l1940j29859j17800m0604L484K1546Q6732J36399L3049j22537l1403
42245A9031L05068M37335P4697m27947n26785k27789K4716N6470R2866K00260
42235B7922J04246k70613n06520k37331K81603M73065J69378k46877l73905k03367
42225g82399O772O4079j3118n8121P5360L25517M19243J72689k22903l76393j80222
42214e69496O5092Q5987n441M5803K04307K14432L6746p6088K1271J55711J31229
42203C09553O387p7076j40363k37792k42310j6187K90091L72283J85876j2808
42193D37654m8099j4387l6993o9358l3585J1085l1473j37081k10849k13923j62295
$$ plain form
42182 -509304 -581708 -555590 -472170 -391155 -349404 -365468 -427408 -439209 -263608 99899 442671
42171 442671 542282 386523 135750 -62763 -134310 -44340 153357 291332 254104 137844
42161 137844 119832 212685 283776 264102 168885 -46285 -438229 -871822 -1069914 -932806
42151 -932806 -649549 -433343 -295696 -146123 24645 137741 103699 -121634 -443998 -601409
42141 -601409 -404774 -26297 156090 41707 -99201 -77642 -39278 -113556 -112859 148064 463524
42130 463524 498555 295702 177638 225072 206785 17832 -165901 -232671 -312744 -494233
42120 -494233 -638020 -626363 -558813 -529827 -424874 -146602 128129 161891 22627 -13092
42110 -13092 122735 215724 132816 32075 110060 298279 351906 174085 -72301 -172976
$$ packed form
42182e09304p2404K6118Q3420Q1015M1751j6064o1940j1801J75601L63507L42772
42171D42671R9611j55759k50773j98513p1547Q9970J97697J37975l7228j16260
42161A37844j8012R2853P1091j9674r5217k15170l91944m33593j98092J37108
42151i32806K83257K16206J37647J49573J70768J13096l4042k25333l22364j57411
42141f01409J96635L78477J82387j14383j40908K1559L8364p4278O97K60923L15460
42130D63524L5031k02853j18064M7434j8287j88953j83733o6770q0073j81489
42120d94233j43787J1657O7550K8986J04953K78272K74731L3762j39264l5719
42110a3092J35827R2989q2908j00741P7985J88219N3627j77821k46386j00675
$$ plain form
42100 -172976 -96699 9263 9656 -89974 -209465 -332179 -515011 -768999 -998739 -1089615 -1011199
42089 -1011199 -811756 -562723 -340769 -203972 -129563 -23838 139946 235100 114596 -188836
42079 -188836 -474136 -573189 -467718 -227943 56168 271543 331635 285694 277113 320769 229602
42068 229602 -114110 -496151 -557092 -236365 145851 296551 265786 252537 264566 168042
42058 168042 -16664 -113645 -95881 -161256 -420339 -702211 -801557 -756479 -711379 -641358 -443299
42047 -443299 -232386 -281996 -630922 -969901 -1003435 -755689 -434171 -162963 22681 66812
42037 66812 -44224 -180083 -182409 -53875 75672 124707 94143 -17806 -204946 -389554
42027 -389554 -494094 -552875 -632525 -673041 -556563 -334416 -232077 -383418 -671578 -871907
$$ packed form
42100a72976P6277J05962L93r9630j19491j22714j82832k53988k29740r0876P8416
42089a011199J99443K49033K21954J36797P4409J05725J63784R5154j20504l03432
42079a88836k85300r9053J05471K39775K84111K15375O0092m5941q581M3656r1167
42068B29602l43712l82041o0941L20727L82216J50700l0765j3249J2029r6524
42058A68042j84706r6981J7764o5375k59083k81872r9346M5078M5100P0021J98059
42047d43299K10913m9610l48926l38979l3534K47746L21518K71208J85644M4131
42037F6812j11036j35859k326J28534J29547M9035l0564j11949j87140j84608
42027c89554j04540n8781p9650m0516J16478K22147J02339j51341k88160k00329
$$ plain form
42017 -871907 -859108 -652745 -363937 -129274 -5810 86831 228454 317579 176923 -145982
42007 -145982 -366393 -323153 -176477 -128534 -108311 89255 450294 723297 728405 526152
41997 526152 270677 30493 -195450 -364796 -369938 -149386 182739 373077 277582 53859
41987 53859 -9364 147073 311274 337869 325412 369691 355683 165528 -78700 -188316 -197612
41976 -197612 -268364 -413749 -540894 -668569 -849520 -950523 -789267 -457081 -223977 -135566
41966 -135566 -4999 179372 177534 -77509 -304336 -289907 -208026 -310002 -506364 -488466
41956 -488466 -146195 313161 569843 407026 -131923 -675724 -770767 -340556 230916 576988
41946 576988 715576 808202 812809 633877 418330 383114 458311 410248 250597 212362 342686
$$ packed form
42017h71907J2799K06363K88808K34663J23464R2641J41623Q9125j40656l22905
42007a45982k20411M3240J46676M7943K0223J97566L61039K73003N108k02253
41997E26152k55475k40184k25943j69346n142K20552L32125J90338r5495k23723
41987E3859o3223J56437J64201K6595j2457M4279j4008j90155k44228j09616r296
41976a97612p0752j45385j27145j27675j80951j01003J61256L32186K33104Q8411
41966a35566J30567J84371j838k55043k26827J4429Q1881j01976j96362J7898
41956d88466L42271M59356K56682j62817n38949n43801r5043M30211N71472L46072
41946E76988J38588R2626M607j78932k15547l5216P5197m8063j59651l8235J30324
$$ plain form
41935 342686 424807 331105 178897 85848 25079 -7544 78306 275990 427173 461572 500810
41924 500810 609009 620353 365446 -58532 -390541 -494772 -431541 -319561 -246193 -263036
41914 -263036 -363586 -482063 -572606 -655756 -742831 -769909 -672915 -495869 -361156 -333208 -342299
41903 -342299 -252086 -9344 273347 422014 405447 366866 403527 409641 246437 -12562 -162398
41892 -162398 -154810 -136815 -204231 -286724 -308111 -301233 -304814 -279383 -195986 -110355 -93557 -161232
41880 -161232 -283943 -380858 -323968 -81494 157255 164284 -19691 -146040 -129969 -123050 -167901
41869 -167901 -72748 215548 383015 144049 -315393 -566825 -503809 -397121 -430276 -462537
41859 -462537 -301272 15146 306011 473371 532103 498061 352800 121508 -63626 -32642
$$ packed form
41935C42686Q2121r3702j52208r3049o0769l2623Q5850J97684J51183L4399L9238
41924E00810J08199J1344k54907m23978l32009j04231O3231J11980P3368j6843
41914b63036j00550j18477r0543q3150q7075k7078R6994J77046J34713K7948r091
41903c42299R0213K42742K82691J48667j6567l8581L6661O114j63204k58999j49836
41892a62398P588J7995o7416q2493k1387O878l581K5431Q3397Q5631J6798o7675
41880a61232j22711r6915N6890K42474K38749P029j83975j26349J6071O919m4851
41869a67901R5153K88296J67467k38966m59442k51432O3016J06688l3155l2261
41859d62537J61265L16418K90865J67360N8732l4042j45261k31292j85134L0984
$$ plain form
41849 -32642 237610 526019 550972 279574 -42896 -204618 -238643 -258980 -248452 -155002 -74612
41838 -74612 -146091 -317907 -399687 -336042 -282629 -400438 -675358 -929774 -937016 -589112 -66127
41827 -66127 232873 84285 -274222 -409830 -212785 28153 52523 -79385 -172264 -184680
41817 -184680 -217018 -322150 -444927 -513581 -523774 -533436 -577836 -588366 -460316 -247503 -181071
41806 -181071 -368187 -564087 -434369 -10780 316853 277526 -646 -223543 -264087 -199618
41796 -199618 -169601 -260765 -410404 -402027 -114648 213398 191688 -187376 -467668 -316938
41786 -316938 41084 180904 58243 -28054 64046 149444 30807 -252842 -526954 -663868
41776 -663868 -635594 -511256 -411372 -360564 -214247 142229 562058 769513 712915 605225
$$ packed form
41849c2642K70252K88409K4953k71398l22470j61722l4025k0337J0528R3450Q0390
41838g4612p1479j71816q1780O3645N3413j17809k74920k54416p242L47904N22985
41827f6127K99000j48588l58507j35608J97045K40938K4370j31908r2879j2416
41817a84680l2338j05132j22777o8654j0193r662m4400j0530J28050K12813O6432
41806a81071j87116j95900J29718M23589L27633l9327k78172k22897m0544O4469
41796a99618L0017r1164j49639Q377K87379L28046k1710l79064k80292J50730
41786c16938L58022J39820j22661q6297R2100Q5398j18637k83649k74112j36914
41776f63868K8274J24338R9884N0808J46317L56476M19829K07455n6598j07690
$$ plain form
41766 605225 584180 512133 198964 -306013 -745390 -905882 -775368 -513540 -324685 -315373
41756 -315373 -434560 -563915 -641114 -646623 -531882 -281281 -15193 115689 138237 202930
41746 202930 309292 274611 42417 -169325 -155558 -12711 6556 -179239 -436454 -606334
41736 -606334 -600559 -394770 -78625 153504 208128 227966 376833 560984 543316 292418
41726 292418 31869 -44514 61195 245926 383288 324925 31134 -290248 -379351 -269618
41716 -269618 -217632 -282099 -255331 -75124 19758 -100067 -199759 -68683 108192 60947 -109229
41705 -109229 -136327 -89872 -261432 -604012 -697176 -340832 153277 383269 307094 143958
41695 143958 47889 30957 64916 127991 219539 359610 486341 402912 9730 -441735 -566472
$$ packed form
41766F05225k1045p2047l13169n04977m39377j60492J30514K61828J88855R312
41756c15373j19187j29355p7199n509J14741K50601K66088J30882K2548O4693
41746B02930J06362l4681k32194k11742J3767J42847J9267j85795k57215j69880
41736f06334N775K05789L16145K32129N4624J9838J48867J84151j7668k50898
41726B92418k60549p6383J05709J84731J37362n8363k93791l21382q9103J09733
41716b69618N1986o4467K6768J80207R4882j19825r9692J31076J76875m7245j70176
41705a09229k7098M6455j71560l42580r3164L56344M94109K29992p6175j63136
41695A43958r6069j6932L3959O3075R1548J40071J26731q3429l93182m51465j24737
$$ plain form
41684 -566472 -332814 -84794 -50809 -110971 -112399 -93785 -67540 95723 364989 425392 103510
41673 103510 -333643 -559838 -626202 -730218 -789955 -605487 -264799 -6964 187756 473245
41663 473245 702422 563341 141446 -96505 44002 244418 197514 -2085 -145636 -234502
41653 -234502 -303049 -215678 107312 477580 680389 745247 775396 709585 494075 316027
41643 316027 383797 581373 613911 437179 287384 314205 433397 553483 708542 895575
41633 895575 970059 812390 491212 181932 -1402 -40518 41625 196251 342463 403598
41623 403598 360646 264442 191998 174362 168610 136645 145768 309860 593441 764451 632660
41612 632660 288633 13040 -31892 62547 116676 77081 36135 84902 192370 247043 215304
$$ packed form
41684e66472K33658K48020L3985o0162j428J8614K6245J63263K69266O0403l21882
41673A03510m37153k26195o6364j04016n9737J84468L40688K57835J94720K85489
41663D73245K29177j39081m21895k37951J40507K00416m6904j99599j43551q8866
41653b34502o8547Q7371L22990L70268K02809O4858L0149o5811k15510j78048
41643C16027O7770J97576L2538j76732j49795K6821J19192J20086J55059J87033
41633H95575P4484j57669l21178l09280j83334l9116Q2143J54626J46212O1135
41623D03598m2952r6204p2444j7636n752l1965R123J64092K83581J71010j31791
41612F32660l44027k75593m4932R4439N4129l9595m0946M8767J07468N4673l1739
$$ plain form
41601 215304 214226 363898 581802 620161 347351 -74665 -331207 -219702 229707 791552
41591 791552 1161727 1157044 889773 666383 644096 681910 599625 440846 340896 266507 94562
41580 94562 -122003 -201980 -144714 -159606 -329988 -455045 -340770 -97643 -14290 -225697
41570 -225697 -619562 -997527 -1214321 -1205181 -993676 -680270 -368689 -112910 45546 59152
41560 59152 -40195 -99470 13362 247110 428049 461568 388989 266005 99872 -71424
41550 -71424 -148130 -82188 46894 136721 194347 293618 429001 488655 384161 165521 -6977
41539 -6977 2199 179607 362986 401163 329912 328472 463333 560993 427765 123481 -122511
41528 -122511 -228972 -320658 -453772 -476279 -255022 106480 395513 522773 511913 371154
$$ packed form
41601B15304j078J49672K17904L8359k72810m22016k56542J11505M49409N61845
41591G91552L70175m683k67271k23390k2287L7814q2285j58779r9950p4389j71945
41580I4562k16565p9977N7266j4892j70382j25057J14275K43127Q3353k11407
41570b25697l93865l77965k16794R140K11505L13406L11581K55779J58456J3606
41560E9152r9347n9275J12832K33748J80939L3519p2579j22984j66133j71296
41550g1424p6706O5942J29082Q9827N7626R9271J35383N9654j04494k18640j72498
41539f977R176J77408J83379L8177p1251j440J34861R7660j33228l04284k45992
41528a22511j06461r1686j33114k2507K21257L61502K89033J27260j0860j40759
$$ plain form
41518 371154 125853 -100169 -191825 -181301 -144262 -28141 246307 565041 701286 606840
41508 606840 434285 269530 50374 -217365 -384009 -381126 -330336 -322996 -266225 -68484 185481
41497 185481 383992 560276 755883 853780 739040 514646 349535 205165 -43829 -277873
41487 -277873 -222307 92090 258315 33027 -286710 -245596 160916 512525 529251 333929
41477 333929 125078 -124763 -478859 -751995 -679560 -310527 12047 83789 42936 85786
41467 85786 185709 213795 166822 117349 66690 18666 94031 378073 719858 874064 805456
41456 805456 682630 618208 600158 631127 720904 763540 642014 443224 339830 271279 11916
41445 11916 -419847 -710579 -678775 -468773 -231393 78210 437431 599455 421295 109980
$$ packed form
41518C71154k45301k26022r1656J0524L7039J16121K74448L18734J36245r4446
41508F06840j72555j64755k19156k67739j66644K883N0790P340N6771J97741K53965
41497A85481J98511J76284J95607R7897j14740k24394j65111j44370k48994k34044
41487b77873N5566L14397J66225k25288l19737M1114M06512L51609J6726j95322
41477C33929k08851k49841l54096k73136P2435L69033L22574P1742m0853M2850
41467H5786R9923K8086m6973m9473n0659m8024P5365K84042L41785J54206o8608
41456H05456j22826o4422j8050L0969Q9777M2636j21526j98790j03394o8551k59363
41445A1916m31763k90732L1804K10002K37380L09603L59221J62024j78160l11315
$$ plain form
41435 109980 -76074 -154565 -235383 -240590 -71117 134780 182388 109793 47036 -49581 -253621
41424 -253621 -427082 -432923 -444835 -695370 -1009093 -957242 -455095 133027 487838 616588
41414 616588 627195 545948 428043 371273 337767 191222 -32826 -114518 48015 331171
41404 331171 596922 788832 817840 613166 313322 148014 104741 -21971 -247125 -384043
41394 -384043 -438625 -625951 -897952 -876963 -458724 -83226 -124875 -362584 -388192 -224855
41384 -224855 -131506 -45595 284769 728079 835047 507816 164802 124402 202825 107149
41374 107149 -93215 -157812 -132642 -303576 -741922 -1156644 -1250555 -1046066 -769389 -542286
41364 -542286 -329042 -130451 -51869 -123772 -186860 -68124 198486 437889 564498 618605
$$ packed form
41435A09980j86054p8491q0818n207J69473K05897M7608p2595o2757r6617k04040
41424b53621j73461n841j1912k50535l13723N1851N02147N88122L54811J28750
41414F16588J0607q1247j17905n6770l3506j46545k24048q1692J62533K83156
41404C31171K65751J91910K9008k04674k99844j65308m3273j26712k25154j36918
41394c84043n4582j87326k72001K0989M18239L75498m1649k37709k5608J63337
41384b24855R3349Q5911L30364M43310J06968l27231l43014m0400P8423r5676
41374A07149k00364o4597K5170j70934m38346m14722r3911K04489K76677K27103
41364e42286K13244J98591P8582p1903o3088J18736K66610K39403J26609N4107
$$ plain form
41354 618605 610337 485487 263148 70110 -2404 25188 108000 234237 378383 501615
41344 501615 607281 688767 639007 361896 -25296 -274518 -322741 -355428 -515462 -722976
41334 -722976 -828926 -760872 -468542 53210 599575 847672 750965 633616 742156 915596
41324 915596 883666 681820 534182 496430 482090 520723 709999 975684 1133488 1149626
41314 1149626 1113498 1005481 745247 446257 352334 487250 602917 526607 342303 167203
41304 167203 -26417 -257221 -400329 -363845 -271382 -310296 -471050 -578769 -548685 -483036
41294 -483036 -505430 -591177 -600033 -434007 -128865 190250 405221 454980 341371 137966
41284 137966 -25867 -54202 33091 150183 261748 382101 479408 488813 432815 417819 481743
$$ packed form
41354F18605q268j24850k22339j93038p2514K7592Q2812J26237J44146J23232
41344E01615J05666Q1486m9760k77111l87192k49222m8223l2687j60034k07514
41334g22976j05950O8054K92330N21752N46365K48097r6707j17349J08540J73440
41324I15596l1930k01846j47638l7752j4340L8633J89276K65685J57804J6138
41314A149626l6128j08017k60234k98990r3923J34916J15667p6310j84304j75100
41304A67203j93620k30804j43108L6484R2463l8914j60754j07719L0084O5649
41294d83036k2394q5747q856J66026L05142L19115K14971M9759j13609k03405
41284A37966j63833k8335Q7293J17092J11565J20353R7307R405n5998j4996O3924
$$ plain form
41273 481743 548176 551623 489206 339039 94241 -87075 21833 370332 594097 478475
41263 478475 257050 247800 384235 385343 257255 282790 524199 661717 428434 -19910
41253 -19910 -296421 -206966 118289 424168 574706 631606 720128 820608 766582 507798
41243 507798 261104 258928 433201 528723 471407 405606 376897 225724 -121922 -459086 -529915
41232 -529915 -341818 -125382 -54805 -112420 -191282 -236725 -271514 -323434 -366752 -364341 -354748
41221 -354748 -423674 -554734 -587810 -394959 -38183 311484 541390 616926 532496 353898
41211 353898 233323 262808 370753 461842 569302 743256 887529 871325 729699 586228
41201 586228 445672 240896 19499 -111285 -169666 -223620 -187558 63971 406588 553754
$$ packed form
41273D81743O6433L447o2417j50167k44798j81316J08908L48499K23765j15622
41263D78475k21425r250J36435J108j28088K5535K41409J37518k33283m48344
41253a9910k76511Q9455L25255L05879J50538N6900Q8522J00480n4026k58784
41243E07798k46694k176J74273R5522n7316o5801k8709j51173l47646l37164p0829
41232e29915J88097K16436P0577n7615p8862m5443l4789n1920m3318K411R593
41221c54748o8926j31060l3076J92851L56776L49667K29906P5536q4430j78598
41211C53898j20575K9485J07945R1089J07460J73954J44273j6204j41626j43471
41201E86228j40556k04776k21397j30784n8381n3954L6062K51529L42617J47166
$$ plain form
41191 553754 452473 332993 316971 242008 -20301 -308375 -385288 -248739 -90372 -56895
41181 -56895 -142993 -218243 -106866 235053 582084 628974 363652 86303 6996 20522 -34566
41170 -34566 -110104 -95822 -57580 -134700 -303244 -418667 -432006 -413827 -405281 -374000 -294084
41159 -294084 -169947 -131 206187 395159 502979 501010 382980 161177 -96720 -290748
41149 -290748 -380910 -396064 -335321 -150201 132807 354726 358027 153602 -64104 -49335 307425
41138 307425 854337 1278621 1413135 1386793 1374190 1304033 1004687 558750 253209 181914
41128 181914 162273 83018 55950 134543 164110 65062 14576 148170 289047 204235 -26089
41117 -26089 -135087 -58728 35023 41242 16626 3065 -44149 -127203 -162783 -116396 -75420 -139703
$$ packed form
41191E53754j01281j19480j6022p4963k62309k88074p6913J36549J58367L3477
41181e6895q6098p5250J11377L41919L47031M6890k65322k77349p9307J3526n5088
41170c4566p5538J4282L8242p7120j68544j15423j3339J8179Q546L1281P9916
41159b94084J24137J69816K06318J88972J07820j969j18030k21803k57897j94028
41149b90748r0162j5154O0743J85120K83008K21919L301k04425k17706J4769L56760
41138C07425N46912M24284J34514k6342j2603p0157k99346m45937l05541p1295
41128A81914j9641p9255k7068P8593K9567r9048n0486J33594J40877q4812k30324
41117b6089j08998P6359R3751O219k4616j3561m7214q3054l5580M6387M0976o4283
$$ plain form
41105 -139703 -294619 -422751 -419203 -287248 -120454 14348 139525 272058 332239 247211
41095 247211 91853 -8213 -65223 -149219 -167592 34507 344622 428185 187367 -82011
41085 -82011 -115707 -18161 -13416 -88262 -90828 -6084 80574 155303 217750 186969 55534 -5173
41073 -5173 96110 143244 -114401 -564859 -860724 -873181 -768365 -678873 -567230 -422420
41063 -422420 -333135 -295096 -154716 146770 417131 424523 200351 31710 150830 480656
41053 480656 728327 734081 652574 708183 853678 850167 656075 496210 496210 506870 408859 333867
41041 333867 396947 442014 299310 116168 155685 385125 537528 508492 434467 422649 448728
41030 448728 510151 662824 891505 1108061 1274222 1390210 1396079 1225275 928382 636955
$$ packed form
41105a39703j54916j28132L548J31955J66794J34802J25177J32533O0181q5028
41095B47211j55358j00066n7010q3996j8373K02099L10115Q3563k40818k69378
41085h2011l3696R7546M745p4846k566Q4744Q6658P4729O2447l0781j31435o0707
41073e173J01283M7134k57645m50458k95865j2457J04816Q9492J11643J44810
41063d22420Q9285L8039J40380L01486K70361P392k24172j68641J19120L29826
41053D80656K47671N754q1507N5609J45495l511j94092j59865%J0660r8011p4992
41041C33867O3080M5067j42704j83142L9517K29440J52403k9036p4025j1818K6079
41030D48728O1423J52673K28681K16556J66161J15988N869j70804k96893k91427
$$ plain form
41020 636955 457011 463956 665197 868714 787350 443483 259174 516221 939750 1105945
41010 1105945 1052903 1111148 1283619 1241560 888917 489844 209959 -48595 -277657 -237085
41000 -237085 147643 596733 853417 969081 1059656 1061311 926061 826217 937057 1156685
40990 1156685 1220064 999322 589124 204278 60021 218740 491130 614547 549902 446604
40980 446604 334927 101948 -197907 -303029 -129830 62312 37691 -109857 -163208 -72513
40970 -72513 115029 385296 625356 580488 184275 -229855 -290586 -41590 193867 280382
40960 280382 341046 434158 445435 325903 204407 185024 189474 91357 -80501 -149840 18767
40949 18767 365077 667240 753537 684316 671032 803553 940740 911806 737689 582982
$$ packed form
41020F36955j79944O945K01241K03517q1364l43867j84309K57047M23529J66195
41010A105945n3042N8245J72471m2059l52643l99073k79885k58554k29062M0572
41000b37085L84728M49090K56684J15664R0575J655j35250r9844J10840K19628
40990A156685O3379k20742m10198l84846j44257J58719K72390J23417o4645j03298
40980D46604j11677k32979k99855j05122J73199J92142k4621j47548n3351R0695
40970g2513J87542K70267K40060m4868l96213m14130o0731K48996K35457Q6515
40960B80382O0664R3112J1277j19532j21496j9383M450r8117j71858o9339J68607
40949A8767L46310L02163Q6297o9221j3284J32521J37187k8934j74117j54707
$$ plain form
40939 582982 558455 650656 795310 934314 1018610 1021358 957372 874042 834161 895186 1052207
40928 1052207 1191014 1150979 866741 439492 77658 -33740 124198 340664 329360 27826
40918 27826 -321469 -465422 -420053 -351186 -299639 -198234 -67903 9100 54939 136539 203990
40907 203990 208442 308749 679830 1139171 1270660 959337 523822 271527 209169 250941
40897 250941 387132 517403 423232 92454 -171517 -141214 53846 200398 320669 515951
40887 515951 692839 671307 437550 126806 -113527 -138190 111872 404564 340511 -126544
40877 -126544 -531943 -487601 -186248 -45427 -85461 -22954 175738 241018 58209 -179983
40867 -179983 -297120 -312042 -271939 -182572 -141650 -279920 -509009 -564346 -371367 -151444
$$ packed form
40939E82982k4527R2201J44654J39004Q4296K748o3986q3330l9881O1025J57021
40928A052207J38807m0035k84238m27249l61834j11398J57938K16466j1304l01534
40918B7826l49295j43953M5369O8867N1547J01405J30331P7003M5839Q1600O7451
40907B03990M452J00307L71081M59341J31489l11323m35515k52295o2358M1772
40897B50941J36191J30271r4171l30778k63971L0303J95060J46552J20271J95282
40887E15951J76888k1532k33757l10744k40333k4663K50062K92692o4053m67055
40877a26544m05399M4342L01353J40821m0034O2507J98692O5280j82809k38192
40867a79983j17137j4922M0103Q9367M0922j38270k29089n5337J92979K19923
$$ plain form
40857 -151444 -83031 -73946 11805 97174 35853 -105290 -91832 170931 497262 606415 403606
40846 403606 76929 -77429 39168 192966 56105 -386151 -744612 -631791 -122530 305822
40836 305822 307251 9069 -254949 -399379 -571992 -767301 -761974 -504939 -271550 -250433
40826 -250433 -241911 -22771 226029 200084 5702 -1027 173008 155295 -161075 -419529 -338392
40815 -338392 -63001 152287 256587 250026 72446 -172543 -207040 14929 194307 155206
40805 155206 92530 155975 157804 -40410 -214777 -179465 -163252 -407693 -686928 -655647 -437923
40794 -437923 -412027 -575178 -585101 -343391 -107051 -58922 -144256 -300284 -497474 -586598 -443479
40783 -443479 -236063 -221492 -314991 -198684 163806 467022 523730 455819 403108 354713 305481
$$ packed form
40857a51444O8413R085Q5751Q5369o1321j41143J3458K62763L26331J09153k02809
40846D03606l26677j54358J16597J53798j36861m42256l58461J12821N09261M28352
40836C05822J429k98182k64018j44430j72613j95309N327K57035K33389K1117
40826b50433Q522K19140K48800k5945j94382o729J74035j7713l16370k58454Q1137
40815c38392K75391K15288J04300o561j77580k44989l4497K21969J79378l9101
40805A55206o2676O3445J829j98214j74367L5312J6213k44441k79235L1281K17724
40794d37923K5896j63151r923K41710K36340M8129q5334j56028j97190q9124J43119
40783d43479K07416J4571r3499J16307L62490L03216N6708o7911n2711m8395m9232
$$ plain form
40772 305481 288030 216236 -20418 -280166 -277772 -7073 242936 352836 545565 978965
40762 978965 1442656 1644918 1632753 1750357 2228799 2890579 3257021 2999435 2324700 1785469
40752 1785469 1624187 1513817 1116637 624455 416672 411844 214021 -202804 -450274 -378370
40742 -378370 -299119 -445341 -614123 -519304 -179777 200667 467732 500971 231969 -183264
40732 -183264 -441779 -453159 -396553 -351069 -158462 223270 521509 494473 253870 59742
40722 59742 -22732 -89417 -176884 -241331 -247776 -165083 18917 198674 201593 20104 -139333
40711 -139333 -121596 -14724 2067 -104847 -211803 -190190 -31520 137126 190359 199521 373938
40700 373938 704110 840120 535671 55130 -138190 25470 253141 398934 567032 755968
$$ packed form
40772C05481j7451p1794k36654k59748K394K70699K50009J09900J92729M33400
40762I78965M63691K02262j2165J17604M78442O61780L66442k57586o74735n39231
40752A785469j61282j10370l97180m92182k07783m828j97823m16825k47470P1904
40742c78370P9251j46222j68782R4819L39527L80444K67065L3239k69002m15233
40732a83264k58515j1380N6606M5484J92607L81732K98239k7036k40603j94128
40722E9742q2474o6685q7467o4447o445Q2693J84000J79757K919j81489j59437
40711a39333J7737J06872J6791j06914j06956K1613J58670J68646N3233R162J74417
40700C73938L30172J36010l04449m80541j93320J63660K27671J45793J68098J88936
$$ plain form
40690 755968 799596 685497 571678 461279 217794 -80357 -192110 -157345 -266978 -516048
40680 -516048 -534740 -199861 132936 202229 219559 431203 694485 778691 745784 725706 615349
40669 615349 327327 87370 148676 391976 510345 445806 375293 386620 410122 385356 316630
40658 316630 247510 283494 496873 729132 692283 364879 55067 -36716 -49176 -126201 -159849
40647 -159849 -57432 34753 13131 53365 301765 561627 557930 325567 90892 -49433
40637 -49433 -106123 -49350 87388 141853 71973 66606 209052 283330 155831 69399 242384
40626 242384 430128 263684 -165173 -453061 -480633 -452578 -428646 -245582 74964 234802
40616 234802 97499 -62308 98547 559212 964673 1016582 779411 622527 842831 1326766
$$ packed form
40690G55968M3628j14099j13819j10399k43485k98151j11753L4765j09633k49070
40680e16048j8692L34879L32797O9293J7330K11644K63282Q4206l2907k0078j10357
40669F15349k88022k39957O1306K43300J18369o4539p0513J1327K3502k4766o8726
40658C16630o9120L5984K13379K32259l6849l27404l09812r1783j2460p7025l3648
40647a59849J02417R2185k1622M0234K48400K59862l697k32363k34675j40325
40637d9433n6690N6773J36738N4465o9880n367J42446P4278j27499q6432J72985
40626B42384J87744j66444m28857k87888k7572K8055K3932J83064L20546J59838
40616B34802j37303j59807J60855M60665M05461N1909k37171j56884K20304M83935
$$ plain form
40606 1326766 1647568 1515267 1040975 553872 292959 283909 340926 169927 -325734 -819313
40596 -819313 -874948 -507492 -144686 -8924 90513 258800 251767 -59068 -353707 -311417
40586 -311417 -85882 -16764 -128290 -227334 -264486 -280824 -196912 41524 278003 367306 408403
40575 408403 534499 688210 821278 1045342 1328963 1348516 960847 535799 453461 532575
40565 532575 359761 -37001 -273171 -203756 -19286 139602 279426 346863 260564 85905
40555 85905 -75424 -241288 -363058 -197838 337045 891696 1082294 959344 778321 564524
40545 564524 268429 87925 205856 419276 453134 428821 581482 740876 594886 280419
40535 280419 181960 291672 315944 295294 528067 922107 1012558 669901 267316 79592
$$ packed form
40606A326766L20802j32301m74292m87103k60913r050N7017j70999m95661m93579
40596h19313n5635L67456L62806J35762R9437J68287p033l10835k94639M2290
40586c11417K25535O9118j11526r9044l7152j6338Q3912K38436K36479Q9303M1097
40575D08403J26096J53711J33068K24064K83621J9553l87669m25048q2338P9114
40565E32575j72814l96762k36170O9415J84470J58888J39824O7437q6299j74659
40555H5905j61329j65864j21770J65220N34883N54651J90598j22950j81023k13797
40545E64524k96095j80504J17931K13420L3858k4313J52661J59394j45990l14467
40535B80419r8459J09712K4272k0650K32773L94040R0451l42657m02585j87724
$$ plain form
40525 79592 1080 -62736 7162 235039 440305 545835 648789 717450 575718 269512
40515 269512 107815 235744 448763 514830 443569 380738 426750 565258 627538 423465
40505 423465 70275 5752 438923 995697 1190787 1027347 819383 687115 612809 730912
40495 730912 1105063 1429448 1410896 1246395 1267978 1349144 1162464 782654 488373 214022
40485 214022 -195703 -432095 -121748 395996 432959 1667 -232796 1905 329058 494535
40475 494535 627585 678409 362871 -186768 -411110 -134749 223091 358419 376095 290559
40465 290559 -73926 -527553 -534114 5293 588219 888528 1073869 1200606 992280 480012
40455 480012 212313 498678 979526 1225285 1252949 1202908 1023045 747836 632799 765566
$$ packed form
40525G9592p8512o3816O9898K27877K05266J05530J02954O8661j41732l06206
40515B69512j61697J27929K13019O6067p1261o2831M6012J38508O2280k04073
40505D23465l53190o4523M33171N56774J95090j63440k07964j32268p4306J18103
40495G30912L74151L24385j8552j64501K1583Q1166j86680l79810k94281k74351
40485B14022m09725k36392L10347N17744L6963m31292k34463K34701L27153J65477
40475D94535J33050N0824l15538n49639k24342K76361L57840J35328J7676q5536
40465B90559l64485m53627o561N39407N82926L00309J85341J26737k08326n12268
40455D80012k67699K86365M80848K45759K7664n0041j79863k75209j15037J32767
$$ plain form
40445 765566 939419 1060186 1251296 1459705 1436873 1207068 1072206 1090374 1054866 1009062
40435 1009062 1218445 1622592 1926356 2230448 2885161 3691893 3990960 3629872 3116055
40426 3116055 2728142 2240490 1627734 1242812 1150414 1050554 960071 1157502 1397085 1108248
40416 1108248 480176 344106 818110 1134639 1023504 1100654 1551650 1652853 1103061 647608
40406 647608 762369 845393 416285 41249 279661 705279 803883 915119 1410002 1791113
40396 1791113 1533537 1085506 1134297 1512241 1657344 1566972 1535982 1526031 1484231 1695516
40386 1695516 2192390 2454029 2273020 2202102 2559678 2803786 2547124 2352075 2780079 3443022
40376 3443022 3734046 3724287 3630307 3216543 2462138 1993898 2118977 2252873 1989771 1818863
$$ packed form
40445G65566J73853J20767J91110K08409k2832k29805j34862J8168l5508m5804
40435A009062K09383M04147L03764L04092O54713Q06732K99067l61088n13817
40426C116055l87913m87652o12756l84922r2398r9860r0483J97431K39583k88837
40416A108248o28072j36070M74004L16529j11135P7150M50996J01203n49792m55453
40406F47608J14761Q3024m29108l75036K38412M25618R8604J11236M94883L81111
40396A791113k57576m48031M8791L77944J45103r0372l0990r951m1800K11285
40386A695516M96874K61639j81009p0918L57576K44108k56662j95049M28004O62943
40376C443022K91024r759r3980m13764p54405m68240J25079J33896k63102j70908
$$ plain form
40366 1818863 2076776 2209628 1860697 1637134 1954551 2202228 1932526 1736184 2000631
40357 2000631 2018898 1378554 977687 1491526 2085672 1919237 1660546 2118741 2613336 2235189
40347 2235189 1590816 1709841 2255131 2371959 2293157 2562300 2712462 2266891 1965701 2445748
40337 2445748 2883736 2554643 2420712 3409338 4494557 4430350 3998952 4451845 5148345
40328 5148345 5040354 5089004 6645892 8652194 9080576 8091512 7202287 6497382 5345238
40319 5345238 4653547 5520381 6771076 6740448 6299721 7132219 8405646 8432904 8163760
40310 8163760 9437804 11249978 11621673 11666782 13619243 16401414 17708943 18830241 22351778
40301 22351778 26811888 29272381 31443836 36966937 44472938 50535747 57546630 70182484
$$ packed form
40366A818863K57913J32852l48931k23563L17417K47677k69702j96342K64447
40357B000631J8267o40344m00867N13839N94146j66435k58691M58195M94595l78147
40347B235189o44373J19025N45290J16828p8802K69143J50162m45571l01190M80047
40337B445748M37988l29093j33931R88626J085219o4207m31398M52893O96500
40328E148345j07991M8650J556888K006302M28382r89064q89225p04905j152144
40319E345238o91691Q66834J250695l0628m40727Q32498J273427K7258k69144
40310H163760J274044J812174L71695M5109J952461K782171J307529J121298L521537
40301B2351778M460110K460493K171455N523101P506001O062809P010883J2635854
$$ plain form
40293 70182484 85965496 99486903 114368592 138721257 170314742 203134299 249473862
40286 249473862 331069884 435191445 501574237 477828005 379161845 271431716 200588290
40279 200588290 161032999 129720761 102300159 85463209 75977589 65001862 52829795
40272 52829795 45312949 41672259 36781545 30965936 28071980 27146127 24217557 19796642
40264 19796642 17426125 16834044 14940594 11969904 10698460 10969463 10278913 8708236
40256 8708236 8383064 8956597 8193164 6324441 5609063 6126731 5906784 4765207 4367214
40247 4367214 4843040 4736823 4023719 4017623 4546596 4193071 3102193 2751781 3171434 3056748
40237 3056748 2393108 2370529 2906056 2761924 1966492 1728332 2097665 2009941 1486004 1532280
$$ packed form
40293G0182484J5783012J3521407J4881689K4352665L1593485L2819557M6339563
40286B49473862Q1596022J04121561O6382792k3746232r8666160j07730129p0843426
40279B00588290l9555291l1312238k7420602j6836950r485620j0975727j2172067
40272E2829795p516846l640690m890714n815609k893956r25853k928570m420915
40264A9796642k370517n92081j893450k970690j271444K71003o90550j570677
40256H708236l25172N73533p63433j868723p15378N17668k19947j141577l97993
40247D367214M75826j06217p13104o096N28973l53525j090878l50412M19653j14686
40237C056748o63640k2579N35527j44132p95432k38160L69333q7724n23937M6276
$$ plain form
40227 1532280 1999888 1762015 921207 687350 1134101 1170356 676941 604517 985248 898263
40217 898263 428741 642354 1528917 1927246 1614166 1562942 1978451 1962825 1357276 1091055
40207 1091055 1406298 1459051 998720 808192 1157252 1372629 1238985 1328267 1679344 1636071
40197 1636071 1247220 1354067 2035236 2420704 2288448 2366136 2785298 2748146 2077826 1624619
40187 1624619 1725386 1677742 1177149 890321 1118766 1216120 846298 573682 694849 678915
40177 678915 277912 56772 325920 620795 672590 821249 1076777 891947 282455 48642
40167 48642 447523 755881 581986 464991 700940 747904 361262 187422 596732 979256
40157 979256 845524 628284 743441 822083 544125 316748 450567 532737 281824 178305
$$ packed form
40227A532280M67608k37873q40808k33857M46751L6255m93415p2424L80731q6985
40217H98263m69522K13613Q86563L98329l13080n1224M15509j5626o05549k66221
40207A091055L15243N2753m60331j90528L49060K15377j33644Q9282L51077m3273
40197A636071l88851J06847O81169L85468j32256P7688M19162l7152o70320m53207
40187A624619J00767m7644n00593k86828K28445R7354l69822k72616J21167j5934
40177F78915m01003k21140K69148K94875N1795J48659K55528j84830o09492k33813
40167D8642L98881L08358j73895j16995K35949M6964l86642j73840M09310L82524
40157I79256j33732k17240J15157P8642k77958k27377J33819Q2170k50913j03519
$$ plain form
40147 178305 577010 1011265 1053489 1077875 1482903 1914114 1968591 1978101 2382864 2932295
40137 2932295 3150040 3028587 2718508 2145520 1457595 1185489 1413514 1464942 958473 468703
40127 468703 549671 831420 752201 499927 509331 644173 604919 583545 798338 911908 622228
40116 622228 322491 458061 712220 564227 215506 210638 504456 635050 526053 440615
40106 440615 394572 232345 54285 24799 -1148 -180205 -302116 -169784 -30152 -166719
40096 -166719 -408783 -494747 -538252 -667320 -621425 -227152 130935 62689 -178045 -134662
40086 -134662 133217 312021 432926 638663 719734 480422 236499 351600 588543 520273
40076 520273 287484 326705 598030 699162 546903 376342 250959 100263 44905 185438
$$ packed form
40147A78305L98705M34255M2224K4386M05028M31211N4477R510M04763N49431
40137B932295K17745j21453l10079n72988o87925k72106K28025N1428n06469m89770
40127D68703Q0968K81749p9219k52274R404J34842l9254k1374K14793J13570k89680
40116F22228k99737J35570K54159j47993l48721m868K93818J30594j08997q5438
40106D40615m6043j62227j78060k9486k5947j79057j21911J32332J39632j36567
40096a66719k42064q5964m3505j29068M5895L94273L58087o8246k40734M3383
40086a34662K67879J78804J20905K05737Q1071k39312k43923J15101K36943o8270
40076E20273k32789L9221K71325J01132j52259j70561j25383j50696n5358J40533
$$ plain form
40066 185438 285016 133213 -39141 14230 33376 -306686 -749260 -835410 -644660 -557530
40056 -557530 -553525 -373724 -130067 -95001 -99209 190740 576996 594437 323769 253015 432502
40045 432502 458476 242297 115188 172857 166039 70111 143796 370139 430084 302899 327801
40034 327801 576494 702730 537593 344467 346801 435213 468666 478734 465863 337200 128884
40023 128884 -11010 -87722 -216377 -337642 -288441 -119738 -34668 -62825 -88547 -107564 -159325
40012 -159325 -146493 -37079 -55877 -322504 -532243 -403569 -174232 -172229 -191512 106929
40002 106929 441591 279398 -205396 -318380 57393 333555 227598 119369 257002 359981
39992 359981 250060 198603 365800 507220 523945 707588 1110646 1245805 811334 227713
$$ packed form
40066A85438R9578j51803j72354N3371J9146l40062m42574q6150J90750Q7130
40056e57530M005J79801K43657L5066m208K89949L86256J7441k70668p0754J79487
40045D32502K5974k16179j27109N7669o818r5928P3685K26343N9945j27185K4902
40034C27801K48693J26236j65137j93126K334Q8412L3453J0068j2871j28663k08316
40023A28884j39894p6712j28655j21265M9201J68703Q5070k8157k5722j9017n1761
40012a59325J2832J09414j8798k66627k09739J28674K29337K003j9283K98441
40002A06929L34662j62193m84794j12984L75773K76162j05957j08229J37633J02979
39992C59981j09921n1457J67197J41420J6725J83643M03058J35159m34471n83621
$$ plain form
39982 227713 29937 135227 137037 -25315 -131883 -156149 -249235 -402364 -467159 -414141 -321397
39971 -321397 -203181 -41349 108039 176538 156590 48054 -134975 -285684 -316304 -338895
39961 -338895 -491790 -602491 -344417 229964 653445 633746 357895 105720 -102502 -315557
39951 -315557 -415994 -283168 12016 321388 557311 647266 559077 423896 415628 487279
39941 487279 471601 423541 538393 725106 648032 269913 -33934 -30945 66189 12615 -96844
39930 -96844 -66047 77713 189118 207553 118274 -66638 -198201 -104589 120543 205707 105164
39919 105164 5349 -73747 -283243 -510077 -410254 -10565 205976 30489 -117779 152310
39909 152310 614373 820723 726223 565986 417241 242824 125505 116974 50903 -191036
$$ packed form
39982B27713j97776J05290J810j62352j06568k4266r3086j53129o4795N3018R2744
39971c21397J18216J61832J49388O8499j9948j08536j83029j50709l0620k2591
39961c38895j52895j10701K58074N74381M23481j9699k75851k52175k08222k13055
39951c15557j00437J32826K95184L09372K35923Q9955q8189j35181q268P1651
39941D87279j5678m8060J14852J86713p7074l78119l03847K989R7134n3574j09459
39930i6844L0797J43760J11405J8435q9279j84912j31563R3612K25132Q5164j00543
39919A05164r9815p9096k09496k26834R9823L99689K16541j75487j48268K70089
39909A52310M62063K06350r4500j60237j48745j74417j17319q531o6071k41939
$$ plain form
39899 -191036 -407090 -341125 -51671 219051 366094 404370 339093 268503 401611 755542
39889 755542 1045884 1078799 1015331 1041912 1051197 897553 698419 598274 483381 234217
39879 234217 33911 108965 356844 530615 602323 650221 594321 370418 176165 195699
39869 195699 239160 9694 -406105 -673152 -724035 -773366 -879856 -851874 -588179 -218964
39859 -218964 98919 291997 307613 176030 100860 261032 544344 666539 515230 220108
39849 220108 -29121 -75187 158112 507324 600788 276880 -163243 -349917 -327559 -369451
39839 -369451 -486837 -481089 -372727 -380087 -495297 -466163 -245102 -109248 -235024 -439556
39829 -439556 -468787 -322315 -172262 -123808 -156713 -191571 -157429 -77283 -83074 -252380 -477145
$$ packed form
39899a91036k16054O5965K89454K70722J47043L8276o5277p0590J33108L53931
39889G55542K90342L2915o3468K6581R285j53644j99134j00145j14893k49164
39879B34217k00306P5054K47879J73771P1708M7898n5900k23903j94253J9534
39869A95699M3461k29466m15799k67047n0883m9331j06490K7982K63695L69215
39859b18964L17883J93078J5616j31583p5170J60172K83312J22195j51309k95122
39849B20108k49229m6066K33299L49212R3464l23908m40123j86674K2358m1892
39839c69451j17386N748J08362p360j15210K9134K21061J35854j25776k04532
39829d39556k9231J46472J50053M8454l2905l4858L4142Q0146n791j69306k24765
$$ plain form
39818 -477145 -616835 -707822 -849907 -949124 -787431 -339851 168472 525149 679161 638616
39808 638616 422168 150568 7475 29420 46495 -106893 -398232 -651228 -740994 -715795
39798 -715795 -748439 -953140 -1242943 -1414432 -1367519 -1162098 -888295 -629588 -533113 -689888
39788 -689888 -905991 -849582 -515043 -267053 -296250 -341000 -148409 111491 180669 169596
39778 169596 312889 495615 436571 198935 99674 188761 221806 118269 60041 125976 188393
39767 188393 207079 292216 426013 438465 328002 311136 465365 583454 477940 212934
39757 212934 -40827 -188627 -210307 -172147 -255403 -560940 -882081 -909798 -674148 -521021
39747 -521021 -618421 -762314 -742234 -629381 -591015 -649836 -747568 -851927 -888940 -742122 -426213
$$ packed form
39818d77145j39690r0987j42085r9217J61693M47580N08323L56677J54012m0545
39808F38616k16448k71600j43093K1945J7075j53388k91339k52996q9766K5199
39798g15795l2644k04701k89803j71489M6913K05421K73803K58707R6475j56775
39788f89888k16103N6409L34539K47990k9197m4750J92591K59900O9178j1073
39778A69596J43293J82726n9044k37636r9261Q9087L3045j03537n8228O5935O2417
39767A88393J8686Q5137J33797J2452j10463j6866J54229J18089j05514k65006
39757B12934k53761j47800k1680L8160q3256l05537l21141k7717K35650J53127
39747e21021r7400j43893K0080J12853L8366n8821r7732j04359l7013J46818L15909
$$ plain form
39736 -426213 -126973 -1022 -58380 -249965 -497458 -631438 -511971 -243195 -60773 14822
39726 14822 175790 449885 607364 529841 392217 345096 278076 68582 -170169 -292994
39716 -292994 -377082 -545492 -682002 -561042 -191188 168989 305849 221239 55732 -24182
39706 -24182 102732 425056 776736 974187 970103 838025 650101 426325 181076 -27131
39696 -27131 -108814 -32491 87124 63328 -131357 -286954 -219434 -38980 -7672 -183955 -381672
39685 -381672 -454557 -437760 -409652 -394074 -413736 -471867 -468069 -295971 -25696 181798 323868
39674 323868 511805 693054 679393 488576 376829 434407 423999 181632 -62256 18988
39664 18988 384179 670000 612182 255982 -174839 -462087 -496065 -334485 -152187 -58297
$$ packed form
39736d26213K99240J25951n7358j91585k47493j33980J19467K68776J82422P5595
39726A4822J60968K74095J57479p7523j37624m7121o7020k09494k38751j22825
39716b92994q4088j68410j36510J20960L69854L60177J36860q4610j65507p9914
39706b4182J26914L22324L51680J97451m084j32078j87924k23776k45249k08207
39696b7131q1683P6323J19615k3796j94685j55597O7520J80454L1308j76283j97717
39685c81672p2885J6797K8108J5578j9662n8131L798J72098K70275K07494J42070
39674C23868J87937J81249j3661j90817j11747N7578j0408k42367k43888Q1244
39664A8988L65191K85821n7818l56200m30821k87248l3978J61580J82298R3890
$$ plain form
39654 -58297 11390 176357 439206 683997 808521 822196 829591 906613 975100 875344 626195
39643 626195 488499 621817 798166 681082 310182 38512 21967 75558 60587 89440
39633 89440 243347 384200 404866 424344 565585 740618 813661 791374 703154 487064 167139
39622 167139 -31338 64569 334723 538961 604340 594232 533948 436117 376226 366645 253536
39611 253536 -89475 -536966 -833773 -890546 -838865 -844573 -962251 -1119151 -1167748 -1007845
39601 -1007845 -691331 -331900 69424 554099 977680 1093419 924977 800798 898628 1002004
39591 1002004 869156 610659 498266 589157 743960 849851 831789 614214 275138 68812
39581 68812 88239 90537 -108829 -273359 -82893 329969 539726 439994 333158 423682 567193
$$ packed form
39654e8297O9687J64967K62849K44791J24524J3675P395P7022O8487r9756k49149
39643F26195j37696J33318J76349j17084l70900k71670j6545N3591j4971K8853
39633H9440J53907J40853K0666J9478J41241J75033P3043k2287q8220k16090l19925
39622A67139j98477R5907K70154K04238O5379j0108o0284r7831n9891r581j13109
39611B53536l43011m47491k96807n6773N1681n708j17678j56900m8597J59903
39601a007845L16514L59431M01324M84675M23581J15739j68442j24179R7830J03376
39591A002004j32848k58497j12393R0891J54803J05891j8062k17575l39076k06326
39581F8812J9427K298j99366j64530J90466M12862K09757r9732j06836R0524J43511
$$ plain form
39570 567193 573315 455270 287551 69243 -154261 -234239 -117356 25290 -23046 -286315
39560 -286315 -589064 -731297 -655504 -493535 -432840 -492096 -494643 -326508 -101608 53038
39550 53038 236470 582672 915093 861977 340193 -295990 -646373 -630569 -415495 -166766
39540 -166766 18852 67329 -41862 -225061 -351415 -360457 -320647 -379820 -621201 -933244
39530 -933244 -1075903 -935670 -658663 -460702 -375584 -288725 -149603 -16482 72068 125484
39520 125484 102749 -77477 -388783 -656036 -720135 -604159 -481969 -490897 -586508 -604366 -488351
39509 -488351 -400664 -507106 -697650 -692661 -444787 -233680 -274128 -422682 -413501 -221726 -21614
39498 -21614 85368 114757 74094 -10236 -4544 207738 538075 770706 796415 655149 411720
$$ packed form
39570E67193O122j18045j67719k18308k23504p9978J16883J42646m8336k63269
39560b86315l02749j42233P5793J61969O0695n9256k547J68135K24900J54646
39550E3038J83432L46202L32421n3116n21784o36183l50383J5804K15074K48729
39540a66766J85618M8477j09191j83199j26354r042L9810n9173k41381l12043
39530i33244j42659J40233K77007J97961Q5118Q6859J39122J33121Q8550N3416
39520A25484k2735j80226l11306k67253o4099J15976J22190q928r5611j7858J16015
39509d88351Q7687j06442j90544M989K47874K11107m0448j48554R181J91775K00112
39498b1614J06982K9389m0663q4330N692K12282L30337K32631K5709j41266k43429
$$ plain form
39487 411720 128865 -81815 -118034 15422 233957 438429 511016 380193 174270 149337
39477 149337 343054 476998 361686 203750 288419 533561 640395 561176 503800 536446
39467 536446 511377 390375 349521 487232 657490 691823 635332 674443 902991 1192896
39457 1192896 1282248 1055573 746680 696128 851491 768700 268674 -211025 -208443 96397
39447 96397 205235 78886 98923 348436 463681 256929 14538 35689 256634 483088
39437 483088 664681 786714 781907 698194 703076 809089 844271 773857 761412 819324 725633
39426 725633 432363 233205 329133 515796 526458 434927 475787 667151 847942 925600
39416 925600 875492 653563 326405 152288 309024 625071 769026 647877 469430 457765
$$ packed form
39487D11720k82855k10680l6219J33456K18535K04472P2587j30823k05923k4933
39477A49337J93717J33944j15312j57936Q4669K45142J06834p9219n7376L2646
39467E36446k5069j21002m0854J37711J70258L4333n6491L9111K28548K89905
39457A192896Q9352k26675l08893n0552J55363q2791n00026m79699K582L04840
39447I6397J08838j26349K0037K49513J15245k06752k42391K1151K20945K26454
39437D83088J81593J22033m807q3713M882J06013L5182p0414j2445N7912r3691
39426G25633k93270j99158R5928J86663J0662r1531M0860J91364J80791P7658
39416I25600n0108k21929l27158j74117J56736L16047J43955j21149j78447j1665
$$ plain form
39406 457765 619236 759355 685563 444044 328630 528487 819821 821706 523836 270455
39396 270455 211060 130462 -73583 -138381 112409 402615 386774 149685 19288 80311
39386 80311 182603 276383 419920 545039 508475 344016 239518 289709 430806 554765
39376 554765 555151 371576 127351 77100 262964 400838 295028 159089 275029 535973
39366 535973 648730 633619 743451 958870 961713 640213 271311 111507 99331 88426
39356 88426 132514 361586 704057 885659 688058 176559 -305160 -408995 -123360 203514
39346 203514 243518 8149 -277067 -461527 -493051 -324900 -25646 141761 8303 -217071
39336 -217071 -215506 -34111 12703 -123619 -153756 33836 150835 -25961 -258384 -160360
$$ packed form
39406D57765J61471J40119p3792k41519j15414J99857K91334J885k97870k53381
39396B70455n9395q0598k04045o4798K50790K90206j5841k37089j30397O1023
39386H0311J02292R3780J43537J25119l6564j64459j04498N0191J41097J23959
39376E54765L86j83575k44225n0251J85864J37874j05810j35939J15940K60944
39366E35973J12757j5111J09832K15419K843l21500l68902j59804j2176j0905
39356H8426M4088K29072L42471J81602j97601n11499m81719j03835K85635L26874
39346B03514M0004k35369k85216j84460l1524J68151K99254J67407j33458k25374
39336b17071J565J81395M6814j36322l0137J87592J16999j76796k32423R8024
$$ plain form
39326 -160360 263997 634483 666843 432203 168657 -2508 -129558 -285598 -445857 -528704
39316 -528704 -523167 -490497 -416123 -183573 205994 510299 509306 309998 192543 214810 211779
39305 211779 166922 284155 601343 809792 643929 261072 29046 67229 209436 326849
39295 326849 438049 508950 397823 101485 -128095 -81223 86669 15115 -390281 -829867
39285 -829867 -1006357 -965469 -905618 -814922 -546714 -190429 -66148 -286381 -584749 -702337
39275 -702337 -708764 -775464 -860721 -858981 -879099 -1072502 -1285032 -1197015 -790401 -383684 -177217
39264 -177217 -42129 170108 373223 430914 386884 353817 321830 231757 132342 116988 172845
39253 172845 220605 252870 310121 349091 264965 70101 -46037 92130 418185 650590
$$ packed form
39326a60360M24357L70486L2360k34640k63546j71165j27050j56040j60259q2847
39316e28704N537L2670P4374K32550L89567L04305r93j99308j17455K2267l031
39305B11779m4857J17233L17188K08449j65863l82857k32026L8183J42207J17413
39295C26849J11200P0901j11127k96338k29580M6872J67892p1554m05396m39586
39285h29867j76490M0888N9851R0696K68208L56285J24281k20233k98368j17588
39275g02337o427o6700q5257J740k0118j93403k12530Q8017M06614M06717K06467
39264a77217J35088K12237K03115N7691m4030l3067l1987r0073r9415j5354N5857
39253A72845M7760L2265N7251L8970q4126j94864j16138J38167L26055K32405
$$ plain form
39243 650590 579428 297516 96017 138695 305940 375677 281778 148341 126888 244409
39233 244409 365827 292171 -21563 -332323 -322803 142 274513 237264 27673 -114006
39223 -114006 -256013 -617830 -1111068 -1354544 -1168407 -789568 -522124 -389503 -235011 8121
39213 8121 273649 470438 516545 347691 2963 -339133 -502402 -489994 -471065 -580489
39203 -580489 -751527 -776295 -560038 -287062 -250300 -507017 -811956 -933057 -902914 -870000
39193 -870000 -838273 -711164 -514997 -407680 -474453 -630033 -721568 -664747 -509585 -408812
39183 -408812 -454516 -534728 -482838 -379698 -484588 -789560 -921824 -665904 -304769 -183535
39173 -183535 -194490 -36710 225793 278545 104350 -8790 47366 122012 193886 415131
$$ packed form
39243F50590p1162k81912k01499M2678J67245O9737r3899j33437k1453J17521
39233B44409J21418p3656l13734l10760R520L22945K74371l7249k09591j41679
39223a14006j42007l61817m93238k43476J86137L78839K67444J32621J54492K43132
39213H121K65528J96789M6107j68854l44728l42096j63269J2408J8929j09424
39203e80489j71038k4768K16257K72976L6762k56717l04939j21101L0143L2914
39193h70000L1727J27109J96167J07317o6773j55580r1535N6821J55162J00773
39183d08812m5704q0212N1890J03140j04890l04972j32264K55920L61135J21234
39173a83535j0955J57780K62503N2752j74195j13140N6156P4646P1874K21245
$$ plain form
39163 415131 717397 771444 447221 -3220 -293886 -334255 -92962 393712 817175 804986
39153 804986 458450 299590 538125 782247 662278 344078 172438 168950 184310 235436
39143 235436 359202 380594 159205 -121999 -208546 -142753 -119071 -166305 -249992 -485163 -919190
39132 -919190 -1265949 -1210194 -879849 -684391 -750024 -834071 -759172 -609597 -478127 -306834
39122 -306834 -53127 193553 330625 338315 234877 67047 -46793 13524 239964 508260
39112 508260 694068 720296 564985 311238 119250 64371 72150 69494 91483 177034 292089
39101 292089 422560 584754 674587 511758 147590 -83342 35125 345796 601368 770767
39091 770767 900854 936060 893069 956408 1147259 1156499 798557 370213 217886 206337 23580
$$ packed form
39163D15131L02266N4047l24223m50441k90666m0369K41293M86674M23463j2189
39153H04986l46536j58860K38535K44122j19969l18200j71640l488J5360N1126
39143B35436J23766K1392k21389k81204q6547O5793K3682m7234q3687k35171m34027
39132i19190l46759N5755L30345J95458o5633q4047P4899J49575J31470J71293
39122c06834K53707K46680J37072P690j03438j67830j13840O0317K26440K68296
39112E08260J85808K6228j55311k53747j91988n4879P779k656K1989Q5551J15055
39101B92089J30471J62194Q9833j62829l64168k30932J18467L10671K55572J69399
39091G70767J30087L5206m2991O3339J90851R240l57942m28344j52327j1549j82757
$$ plain form
39080 23580 -222246 -198318 29083 109973 75077 312201 837256 1141445 921317 493566
39070 493566 283061 298271 336704 357795 393024 358764 213925 105443 142647 189103 58660
39059 58660 -217732 -460682 -551179 -473843 -293938 -167556 -213949 -307656 -173395 239358
39049 239358 657702 829905 775553 621422 405819 154699 -46505 -180278 -328162 -474508
39039 -474508 -455907 -212498 79390 230563 241434 204974 180992 238828 431298 646582
39029 646582 689515 585546 568122 672316 620788 272592 -87187 -125199 97669 297635
39019 297635 388092 472326 567079 597420 576492 564293 515854 355214 125751 -87750 -284074
39008 -284074 -445216 -454496 -299638 -208276 -351971 -539228 -460785 -154331 48332 67
$$ packed form
39080B3580k45826K3928K27401Q0890l4896K37124N25055L04189k20128m27751
39070D93566k10505J5210L8433K1091L5229l4260j44839j08482L7204M6456j30443
39059E8660k76392k42950r0497P7336J79905J26382m6393r3707J34261M12753
39049B39358M18344J72203n4352j54131k15603k51120k01204j33773j47884j46346
39039d74508J8601K43409K91888J51173J0871l6460k3982N7836J92470K15284
39029F46582M2933j03969j7424J04194n1528l48196l59779l8012K22868J99966
39019B97635R0457Q4234R4753L0341k0928j2199m8439j60640k29463k13501j96324
39008b84074j61142r280J54858R1362j43695j87257P8443L06454K02663m8265
$$ plain form
38998 67 -104185 -66152 52194 62469 -119922 -434218 -745564 -922371 -917423 -774259 -522995
38987 -522995 -153525 250345 493971 516606 517043 677350 897546 991755 1005980 1102976 1248269
38976 1248269 1289877 1281074 1428187 1728019 1929430 1880038 1690405 1555944 1628385 2029855
38966 2029855 2761678 3657487 4678859 6107835 8010474 9589955 9696166 8178620 6203503
38957 6203503 4928391 4348970 3839104 3311039 3187462 3508721 3809432 3873820 3988943
38948 3988943 4368557 4911160 5680051 6993997 8669840 9690914 9191456 7531472 5885966
38939 5885966 4900938 4259243 3527031 2845433 2564238 2617244 2619766 2391388 2068250 1777378
38929 1777378 1472676 1111050 795018 665773 739337 887077 941084 829794 650483 576217
$$ packed form
38998F7j04252L8033J18346J0275j82391l14296l11346j76807M948J43164K51264
38987e22995L69470M03870K43626K2635M37J60307K20196R4209J4225R6996J45293
38976A248269M1608q803J47113K99832K01411m9392j89633j34461P2441M01470
38966B029855P31823Q95809J021372J428976J902639J579481J06211j517546j975117
38957F203503j275112n79421n09866n28065j23577L21259L00711O4388J15123
38948C988943L79614N42603P68891J313946J675843J021074m99458j659984j645506
38939E885966r85028o41695p32212o81598k81195N3006K522k28378l23138k90872
38929A777378l04702l61626l16032j29245P3564J47740N4007j11290j79311p4266
$$ plain form
38919 576217 643843 683736 527549 232216 1917 -77131 -109997 -203895 -319428 -351710 -285904
38908 -285904 -217188 -236484 -321937 -355083 -270205 -174489 -234873 -422770 -501411 -356518 -195417
38897 -195417 -244522 -365626 -229919 157881 400368 243865 -88588 -242356 -189044 -142455
38887 -142455 -177287 -168106 -41412 120674 214678 192963 21770 -277292 -530778 -508492 -174865
38876 -174865 240803 468835 441343 301943 239239 326315 473172 523332 426085 297993
38866 297993 279652 369948 459164 479550 435163 318843 120543 -78166 -143562 -68829 -7544
38855 -7544 -59235 -114022 -15589 179483 243493 88943 -90492 -63122 143342 292995 244868
38844 244868 76838 -91892 -254217 -426822 -540681 -540024 -504440 -536447 -584526 -521195 -352688
$$ packed form
38919E76217O7626L9893j56187k95333k30299p9048l2866r3898j15533l2282O5806
38908b85904O8716j9296q5453l3146Q4878R5716o0384j87897p8641J44893J61101
38897a95417m9105j21104J35707L87800K42487j56503l32453j53768N3312M6589
38887a42455l4832R181J26694J62086R4004k1715j71193k99062k53486K2286L33627
38876a74865M15668K28032k7492j39400o2704Q7076J46857N0160r7247j28092
38866B97993j8341R0296Q9216K0386m4387j16320j98300j98709o5396P4733O1285
38855g544n1691n4787R8433J95072O4010j54550j79435K7370K06464J49653m8127
38844B44868j68030j68730j62325j72605j13859O57L5584l2007m8079O3331J68507
$$ plain form
38833 -352688 -188669 -34489 186709 392516 347120 -2617 -384220 -510036 -378604 -158395
38823 -158395 52409 189658 112782 -235083 -634239 -781951 -657738 -502978 -450789 -385000
38813 -385000 -206825 -49288 -119428 -431810 -786030 -949043 -812279 -436400 -2128 315593
38803 315593 468626 534362 609058 726488 848514 882849 737384 423912 93066 -100496
38793 -100496 -160798 -221948 -372048 -566413 -701288 -709432 -591177 -408638 -240656 -100104
38783 -100104 73715 292922 450582 456401 385096 367116 364211 207863 -116931 -378506 -374350
38772 -374350 -201172 -140552 -310804 -528607 -532484 -284279 -1367 101371 48726 46146 221576
38761 221576 503499 748464 887903 915892 838349 709040 633507 648977 659360 568708 422171
$$ packed form
38833c52688J64019J54180K21198K05807m5396l49737l81603j25816J31432K20209
38823a58395K10804J37249p6876l47865l99156j47712J24213J54760N2189O5789
38813c85000J78175J57537p0140l12382l54220j63013J36764L75879M34272L17721
38803C15593J53033O5736P4696J17430J22026L4335j45465l13472l30846j93562
38793a00496o0302o1150j50100j94365j34875q144J18255J82539J67982J40552
38783a00104J73819K19207J57660N819p1305j7980k905j56348l24794k61575M156
38772c74350J73178O0620j70252k17803l877K48205K82912J02738n2645k580J75430
38761B21576K81923K44965J39439K7989p7543j29309p5533J5470J0383r0652j46537
$$ plain form
38750 422171 339524 370295 486023 637717 736664 667218 425508 169549 36583 10355
38740 10355 66202 284960 641257 836403 613562 160798 -79646 36396 280729 500252
38730 500252 784499 1121139 1246624 1025268 702409 563784 550308 429777 185485 5791
38720 5791 -5703 92926 221900 332735 385067 398696 454459 548496 565573 495432 500289 615923
38708 615923 585351 219102 -253527 -479901 -495492 -603628 -828057 -879758 -686462 -548445
38698 -548445 -634736 -685025 -431740 -34857 167665 138487 95596 132632 163040 156537 159923
38687 159923 120795 -53543 -267270 -313208 -202058 -167951 -284265 -325371 -138616 69614
38677 69614 12615 -264997 -466645 -442062 -292674 -123540 93137 382989 669998 863859
$$ packed form
38750D22171q2647L0771J15728J51694R8947o9446k41710k55959j32966k6228
38740A0355N5847K18758L56297J95146k22841m52764k40444J16042K44333K19523
38730E00252K84247L36640J25485k21356l22859j38625j3476j20531k44292j79694
38720E791j1494R8629J28974J10835N2332J3629N5763R4037J7077p0141M857J15634
38708F15923l0572l66249m72629k26374j5591j08136k24429n1701J93296J38017
38698e48445q6291n0289K53285L96883K02522k9178m2891L7036L0408o503L386
38687A59923l9128j74338k13727m5938J11150L4107j16314m1106J86755K08230
38677F9614n6999k77612k01648K4583J49388J69134K16677K89852K87009J93861
$$ plain form
38667 863859 928503 837455 586079 285298 121179 163456 302011 401870 417294 333605 139879
38656 139879 -83922 -200207 -219053 -324665 -585180 -784361 -702826 -447642 -306055 -346153
38646 -346153 -377226 -283739 -181686 -202402 -297933 -335607 -263660 -115447 57195 191101 215091
38635 215091 97775 -125987 -366584 -493864 -412110 -207055 -142646 -373796 -709643 -818085
38625 -818085 -633535 -384591 -232261 -93211 135616 381532 519805 543304 522909 517226
38615 517226 570542 666010 651861 390131 21772 -127956 15444 168788 127398 37151
38605 37151 49221 -7927 -308341 -600333 -485777 -29546 299484 287368 203687 311540
38595 311540 503163 568334 528454 497410 424659 206645 -69640 -199353 -121110 32170
$$ packed form
38667H63859O4644r1048k51376l00781j64119M2277J38555R9859J5424q3689j93726
38656A39879k23801j16285j8846j05612k60515j99181Q1535K55184J41587m0098
38646c46153l1073R3487J02053k0716r5531l7674P1947J48213J72642J33906K3990
38635B15091j17316k23762k40597j27280Q1754K05055O4409k31150l35847j08442
38625h18085J84550K48944J52330J39050K28827K45916J38273K3499k0395n683
38615E17226N3316R5468j4149k61730l68359j49728J43400J53344m1390r0247
38605C7151J2070n7148l00414k91992J14556M56231L29030j2116q3681J07853
38595C11540J91623O5171l9880l1044p2751k18014k76285j29713P8243J53280
$$ plain form
38585 32170 92787 -25093 -287111 -518013 -506120 -233529 81957 268902 405854 609498
38575 609498 759041 655699 386614 269343 413551 574681 518977 325562 206126 199175
38565 199175 204458 198154 229640 264363 206602 70386 -20433 -21525 -33753 -137499 -252926
38554 -252926 -224793 -9970 250530 342749 189332 -31947 -47260 175696 342272 205625
38544 205625 -61447 -73720 206168 358112 38803 -579594 -1042421 -1124678 -944561 -687532
38534 -687532 -425385 -179952 12955 148857 282031 480457 767284 1067934 1210872 1083258
38524 1083258 824070 731892 909130 1140923 1216090 1184123 1145558 996834 639787 296279
38514 296279 295911 600213 836326 795428 611323 432549 223026 -39741 -250101 -365601
$$ packed form
38585C2170O0617j17880k62018k30902J1893K72591L15486J86945J36952K03644
38575F09498J49543j03342k69085j17271J44208J61130n5704j93415j19436o951
38565A99175N283o304L1486L4723n7761j36216r0819j092j2228j03746j15427
38554b52926K8133K14823K60500R2219j53417k21279j5313K22956J66576j36647
38544B05625k67072j2273K79888J51944l19309o18397m62827q2257J80117K57029
38534f87532K62147K45433J92907J35902J33174J98426K86827L00650J42938j27614
38524A083258k59188r2178J77238K31793P5167l1967l8565j48724l57047l43508
38514B96279l68L04302K36113m0898j84105j78774k09523k62767k10360j15500
$$ plain form
38504 -365601 -467344 -522267 -337348 105977 509325 629793 592956 634947 708920 586448
38494 586448 244297 -85028 -218193 -199877 -179007 -220943 -241680 -83321 290257 650696
38484 650696 681186 357222 13639 -55028 88050 218759 304235 477407 763658 1031532
38474 1031532 1187456 1268230 1342017 1423995 1504068 1613319 1857954 2351163 3046266 3719769
38464 3719769 4282251 5002869 6104526 7140928 7210818 5997841 4248856 2955268 2373745
38455 2373745 2157621 2091011 2183905 2240916 1927120 1298711 805990 674233 657536 501841
38445 501841 289116 176836 111631 -12780 -147709 -203699 -181955 -66802 213242 582375
38435 582375 765619 598568 252705 28166 48199 245613 483123 568336 322640 -194898
$$ packed form
38504c65601j01743n4923J84919M43325M03348J20468l6837M1991P3973j22472
38494E86448l42151l29325j33165J8316K0870m1936k0737J58359L73578L60439
38484F50696L0490l23964l43583o8667J43078J30709Q5476J73172K86251K67874
38474A031532J55924Q0774P3787Q1978Q0073J09251K44635M93209O95103O73503
38464C719769N62482P20618J101657J036402O9890j212977j748985j293588n81523
38455B373745k16124o6610R2894N7011l13796o28409m92721j31757j6697j55695
38445E01841k12725j12280o5205j24411j34929n5990K1744J15153K80044L69133
38435E82375J83244j67051l45863k24539K0033J97414K37510Q5213k45696n17538
$$ plain form
38425 -194898 -643965 -732317 -506725 -214876 -7024 89039 36537 -158828 -333966 -317258
38415 -317258 -188198 -202039 -421004 -588806 -458233 -121217 106494 64627 -114224 -222789
38405 -222789 -190868 -45819 180662 384942 358378 25818 -335883 -359385 -83470 74470
38395 74470 -76991 -218528 -24216 325512 433679 300144 286105 543249 829472 899185
38385 899185 768894 555556 333312 214263 307644 506496 544048 358199 191683 236541
38375 236541 383629 432739 361332 264986 196995 184701 258426 356662 336820 169883 -12366
38364 -12366 -134166 -272112 -448446 -515465 -375054 -147129 24530 176457 363738 431996
38354 431996 174187 -326802 -701029 -666592 -308705 25939 62712 -164330 -381984 -388834
$$ packed form
38425a94898m49067q8352K25592K91849K07852R6063n2502j95365j75138J6708
38415c17258J29060j3841k18965j67802J30573L37016K27711m1867j78851j08565
38405b22789L1921J45049K26481K04280k6564l32560l61701k3502K75915J57940
38395G4470j51461j41537J94312L49728J08167j33535j4039K57144K86223O9713
38385H99185j30291k13338k22244j19049R3381J98852L7552j85849j66516M4858
38375B36541J47088M9110p1407r6346o7991j2294P3725R8236j9842j66937j82249
38364a2366j21800j37946j76334o7019J40411K27925J71659J51927J87281O8258
38354D31996k57809n00989l74227L4437L57887L34644L6773k27042k17654o850
$$ plain form
38344 -388834 -259580 -182755 -171775 -86696 97806 249393 323395 442758 659120 812051
38334 812051 721710 391366 -37012 -386959 -479458 -251756 95359 257215 191106 122931
38324 122931 148387 100403 -84148 -170173 9634 259142 326879 283272 322126 377161 242085
38313 242085 -50925 -272390 -340240 -346062 -288930 -63339 283128 522850 521749 366838 200773
38302 200773 81265 17029 4004 1289 -37034 -108357 -196777 -302911 -371559 -288826 -51175
38291 -51175 169485 245252 259684 327200 387386 354436 333801 464268 641111 641814 473084
38280 473084 348775 345972 327367 223663 166715 279465 502808 690260 747154 645083
38270 645083 421142 191554 65410 36567 47076 121592 310521 522473 566969 396223
$$ packed form
38344c88834J29254P6825J0980Q5079J84502J51587P4002J19363K16362J52931
38334H12051r0341l30344m28378l49947r2499K27702L47115J61856o6109o8175
38324A22931K5456m7984j84551q6025J79807K49508O7737m3607L8854N5035j35076
38313B42085k93010k21465o7850n822N7132K25591L46467K39722j101j54911j66065
38302B00773j19508o4236j3025k715l8323p1323q8420j06134o8648Q2733K37651
38291e1175K20660P5767J4432O7516O0186l2950k0635J30467J76843P03j68730
38280D73084j24309k803j8605j03704n6948J12750K23343J87452N6894j02071
38270F45083k23941k29588j26144k8843J0509P4516J88929K11952M4496j70746
$$ plain form
38260 396223 200634 231483 578168 1096051 1494124 1545032 1288997 987331 823910 747804
38250 747804 674470 679189 832734 982914 918141 676817 480011 397599 296805 115960
38240 115960 -20194 2023 137680 284323 405866 507317 579157 616726 650944 729888
38230 729888 856955 922690 755881 360624 44559 89998 307708 228175 -187327 -403594
38220 -403594 -84791 370515 409392 117236 -14229 116707 171518 20567 -70095 73552
38210 73552 295389 427237 476200 433032 243125 38621 67149 305450 442054 311465
38200 311465 62075 -138905 -252600 -197805 101701 435224 449363 176401 42835 231194
38190 231194 434975 416793 387146 570004 780543 768610 663219 699067 743454 498185
$$ packed form
38260C96223j95589L0849L46685N17883L98073N0908k56035l01666j63421p6106
38250G47804p3334M719J53545J50180o4773k41324j96806q2412j00794j80845
38240A15960j36154K2217J35657J46643J21543J01451P1840L7569L4218P8944
38230G29888J27067O5735j66809l95257l16065M5439K17710p9533m15502k16267
38220d03594L18803M55306L8877k92156j31465J30936N4811j50951r0662J43647
38210G3552K21837J31848M8963m3168j89907k04504K8528K38301J36604j30589
38200C11465k49390k00980j13695N4795K99506L33523J4139k72962j33566J88359
38190B31194K03781j8182k9647J82858K10539j1933j05391L5848M4387k45269
$$ plain form
38180 498185 27246 -297412 -305440 -149701 38382 282773 519534 517055 172680 -278630
38170 -278630 -487193 -357460 -109413 6124 -19387 -5877 128022 245226 202646 56807
38160 56807 -52986 -111449 -172270 -211708 -208450 -236763 -271010 -67411 459751 906591 823409
38149 823409 386382 164315 264907 252945 -34373 -192472 28532 276362 199547 13729
38139 13729 68106 244309 226539 65605 28082 104045 84791 -29054 -72138 -35136 -12324
38128 -12324 38438 184600 317993 351514 433673 654891 743489 431669 -40539 -203103
38118 -203103 -32656 71407 -64889 -195461 -132285 -16468 -4358 -2323 135161 350230
38108 350230 452984 340834 103126 -20029 171990 592738 896154 868391 676358 592996
$$ packed form
38180D98185m70939l24658q028J55739J88083K44391K36761k479l44375m51310
38170b78630k08563J29733K48047J15537k5511J3510J33899J17204m2580j45839
38160E6807j09793n8463o0821l9438L258k8313l4247K03599N27162M46840q3182
38149H23409m37027k22067J00592j1962k87318j58099K21004K47830p6815j85818
38139A3729N4377J76203j7770j60934l7523P5963j9254j13845m3084L7002K2812
38128a2324N0762J46162J33393L3521Q2159K21218Q8598l11820m72208j62564
38118b03103J70447J04063j36296j30572O3176J15817J2110K035J37484K15069
38108C50230J02754j12150k37708j23155J92019M20748L03416k7763j92033q3362
$$ plain form
38098 592996 634006 651324 620274 599313 547503 436579 418053 608384 816823 771998 537088
38087 537088 413238 487783 560957 493349 363732 280766 249009 218350 117563 -98696 -308260
38076 -308260 -265986 51032 330423 357564 334535 504413 708922 673180 507020 498665 581115
38065 581115 480048 291601 403969 843979 1178512 1136083 914814 787858 777080 819703
38055 819703 926710 1060389 1111611 1066556 985784 845700 647711 594455 828524 1082084
38045 1082084 975036 599164 371768 344611 153582 -304954 -665580 -695427 -628453 -708005
38035 -708005 -816088 -777154 -666729 -594005 -491735 -330701 -262462 -360633 -473937 -490593
38025 -490593 -497671 -549166 -536725 -408670 -251559 -52534 326972 822352 1107284 1011154
$$ packed form
38098E92996M1010J7318l1050k0961n1810j10924j8526J90331K08439m4825k34910
38087E37088j23850P4545P3174o7608j29617q2966l1757l0659j00787k16259k09564
38076c08260M2274L17018K79391K7141k3029J69878K04509l5742j66160q355Q2450
38065E81115j01067j88447J12368M40010L34533m2429k21269j26956j0778M2623
38055H19703J07007J33679N1222m5055q0772j40084j97989n3256K34069K53560
38045A082084j07048l75872k27396k7157j91029m58536l60626k9847O6974p9552
38035g08005j08083L8934J10425P2724J02270J61034O8239r8171j13304j6656
38025d90593p078n1495J2441J28055J57111J99025L79506M95380K84932r6130
$$ plain form
38015 1011154 741397 566528 517892 503169 471760 378372 205361 72188 113877 272415
38005 272415 443225 718027 1145679 1391820 1103227 538160 319020 575491 857004 883618
37995 883618 813274 751867 620273 573226 913911 1492448 1821984 1879176 2115453 2597099
37985 2597099 2893430 2934021 3146646 3572985 3730610 3573554 3657856 4108236 4444062 4715947
37975 4715947 5650314 7268168 8639923 9533702 10910646 13146515 15359554 17346624
37967 17346624 20345438 24757421 29412307 34921404 44941810 60402488 74102211 75878869
37959 75878869 63808676 46556516 33600091 26630775 22038319 17889814 15005477 13420923
37951 13420923 11728821 9591779 8100813 7573160 7131388 6559775 6668872 7535556 8015077
$$ packed form
38015A011154k69757j74869m8636j4723l1409r3388j73011j33173M1689J58538
38005B72415J70810K74802M27652K46141k88593n65067k19140K56471K81513K6614
37995H83618p0344o1407j31594m7047L40685N78537L29536N7192K36277M81646
37985B597099K96331M0591K12625M26339J57625j57056Q4302M50380L35826K71885
37975D715947R34367J617854J371755Q93779J376944K235869K213039J987070
37967A7346624K998814M411983M654886N509097J0020406J5460678J3699723J776658
37959G5878869j2070193j7252160j2956425o969316m592456m148505k884337j584554
37951A3420923j692102k137042j490966n27653m41772n71613J09097Q66684M79521
$$ plain form
37942 8015077 7418034 6344397 5460412 4639229 3749865 3213721 3212187 3179652 2639176 1910261
37932 1910261 1523624 1465282 1407671 1236039 980420 606489 196400 28802 217508 519672
37922 519672 671099 655848 531559 283762 -15125 -172015 -124600 -12560 56529 89385
37912 89385 58867 -55835 -101519 58584 203494 -22455 -515243 -742892 -474375 -96355
37902 -96355 -48432 -283118 -472193 -450392 -245677 81420 403931 512916 337932 71814
37892 71814 -55728 -23788 40397 39775 -46197 -171665 -229387 -155130 -30757 47085 159904
37881 159904 438612 782323 947902 906793 840159 767202 491442 -8818 -448800 -624757
37871 -624757 -650619 -659324 -555517 -281152 -83362 -235967 -618146 -813621 -579910 -60541
$$ packed form
37942H015077n97043j073637q83985q21183q89364n36144j534l2535n40476p28915
37932A910261l86637n8342n7611j71632k55619l73931m10089j67598J88706L02164
37922E19672J51427j5251j24289k47797k98887j56890M7415J12040O9089L2856
37912H9385l0518j14702m5684J60103J44910k25949m92788k27649K68517L78020
37902i6355M7923k34686j89075K1801K04715L27097L22511J08985j74984k66118
37892G1814j27542L1940O4185o22q5972j25468n7722P4257J24373P7842J12819
37881A59904K78708L43711J65579m1109o6634p2957k75760n00260m39982j75957
37871f24757k5862q705J03807K74365J97790j52605l82179j95475K33711N19369
$$ plain form
37861 -60541 410781 591711 480673 289108 214633 204574 56035 -224314 -353348 -163916
37851 -163916 126971 202376 53624 -68459 -5225 172910 303325 254961 -20584 -423281
37841 -423281 -735694 -828468 -786406 -756233 -764946 -784227 -853593 -994068 -1094200 -1044815 -920389
37830 -920389 -863178 -839224 -684497 -371599 -55946 157587 338281 577900 839126 1011945
37820 1011945 1037881 933245 752835 568140 435451 356498 294914 234405 195595 206577
37810 206577 281306 400849 491069 470901 371363 345883 485635 679715 759647 737398 766161
37799 766161 879487 932562 848644 762762 803657 849115 665180 247872 -145040 -323854
37789 -323854 -370365 -441691 -515797 -466435 -294766 -112660 64459 312531 568989 617557
$$ packed form
37861f0541M71322J80930j11038j91565p4475j0059j48539k80349j29034J89432
37851a63916K90887P5405j48752j22083O3234J78135J30415m8364k75545m02697
37841d23281l12413r2774M2062L0173q713j9281o9366j40475j00132M9385J24426
37830i20389N7211K3954J54727L12898L15653K13533J80694K39619K61226J72819
37820A011945K5936j04636j80410j84695j32689p8953o1584o0509l8810J0982
37810B06577P4729J19543R0220k0168r9538k5480J39752J94080P9932k2249K8763
37799G66161J13326N3075q3918q5882M0895M5458j83935m17308l92912j78814
37789c23854m6511p1326p4106M9362J71669J82106J77119K48072K56458M8568
$$ plain form
37779 617557 399650 161573 142318 257012 275041 198051 221301 363103 394418 184192
37769 184192 -107740 -273225 -306254 -294861 -220746 -23045 228657 372075 328677 153056
37759 153056 -42331 -132392 -22344 242112 449212 416159 195168 -1587 -59869 -48196
37749 -48196 -51163 -30882 90698 272871 355968 232795 -14216 -187819 -194022 -136581 -152520
37738 -152520 -208144 -155867 19409 129310 1564 -308840 -572543 -593534 -347397 10269
37728 10269 252433 284048 258812 395786 667677 814620 713579 557986 556371 613876 486164
37717 486164 139932 -230381 -476938 -594603 -578544 -391917 -102567 114472 166960 130340
37707 130340 116443 158540 241467 340495 409506 421564 427523 482862 528586 458996 297133
$$ packed form
37779F17557k17907k38077j9255J14694J8029p6990K3250J41802L1315k10226
37769A84192k91932j65485l3029J1393P4115J97701K51702J43418m3398j75621
37759A53056j95387r0061J10048K64456K07100l3053k20991j96755n8282J1673
37749d8196k967K0281J21580J82173Q3097j23173k47011j73603o203N7441j5939
37738a52520n5624N2277J75276J09901j27746l10404k63703k0991K46137L57666
37728A0269K42164L1615k5236J36974K71891J46943j01041j55593j615N7505j27712
37717D86164l46232l70313k46557j17665J6059J86627K89350K17039N2488l6620
37707A30340j3897M2097Q2927R9028O9011J2058N959N5339M5724o9590j61863
$$ plain form
37696 297133 166832 87378 -50977 -280843 -485400 -578880 -599223 -556751 -363853 -24084
37686 -24084 265874 349446 327830 392435 536447 599838 535141 454035 437353 459391 496473
37675 496473 563821 630010 623544 551975 509650 541645 586914 568974 460918 266104 33974
37664 33974 -111659 -82997 19425 -5809 -188989 -338122 -312940 -214000 -215185 -334618 -485678
37653 -485678 -646056 -824323 -921037 -792353 -461635 -141898 -10067 -34251 -50854 43112
37643 43112 197533 278195 222410 133084 181750 398288 619075 683640 599597 445856 224146
37632 224146 -54022 -216552 -67687 322851 646906 710840 605380 484179 353660 180627
37622 180627 50229 62875 155457 163570 28230 -153969 -259015 -253811 -229149 -347398 -673364
$$ packed form
37696B97133j30301p9454j38355k29866k04557r3480k0343M2472J92898L39769
37686b4084K89958Q3572k1616O4605J44012O3391o4697q1106j6682K2038L7082
37675D96473O7348O6189o466p1569m2325L1995M5269j7940j08056j94814k32130
37664C3974j45633K8662J02422k5234j83180j49133K5182R8940j185j19433j51060
37653d85678j60378j78267r6714J28684L30718L19737J31831k4184j6603R3966
37643D3112J54421Q0662n5785q9326M8666K16538K20787O4565q4043j53741k21710
37632B24146k78168j62530J48865L90538L24055O3934j05460j21201j30519j73033
37622A80627j30398J2646R2582Q113j35340j82199j05046N204K4662j18249l25966
$$ plain form
37611 -673364 -1017591 -1071423 -775240 -420312 -283564 -314648 -330249 -341631 -448937 -540407
37601 -540407 -410557 -143153 -53525 -207016 -307335 -172245 -24613 -127317 -372656 -471144
37591 -471144 -378881 -285479 -277665 -254842 -135160 53091 253774 388074 335566 109367 3013
37580 3013 312456 882158 1171163 875198 294804 -48452 -15547 91634 -15784 -286154
37570 -286154 -459651 -392084 -177095 7881 106054 194715 312830 356308 211809 -56665
37560 -56665 -262801 -331407 -362837 -444849 -521050 -504408 -415157 -318629 -206019 -42685 109470
37549 109470 128642 -4761 -161273 -204886 -152262 -173728 -425646 -854213 -1178337 -1135002
37539 -1135002 -756281 -327571 -51421 138461 371706 583723 604317 430347 246848 187370
$$ packed form
37611f73364l44227n3832K96183L54928J36748l1084j5601j1382j07306r1470
37601e40407J29850K67404Q9628j53491j00319J35090J47632j02704k45339r8488
37591d71144R2263R3402P814K2823J19682J88251K00683J34300n2508k26199j06354
37580C013L09443N69702K89005k95965n80394l43256L2905J07181j07418k70370
37570b86154j73497O7567K14989J84976R8173Q8661J18115M3478j44499k68474
37560e6665k06136o8606l1430q2012p6201J6642Q9251R6528J12610J63334J52155
37549A09470J9172j33403j56512m3613N2624k1466k51918m28567l24124M3335
37539a135002L78721M28710K76150J89882K33245K12017K0594j73970j83499n9478
$$ plain form
37529 187370 211599 228139 208642 152984 57792 -39204 -78382 -72475 -84343 -88192 18749 210067
37517 210067 274601 77800 -224365 -364890 -289283 -161358 -100970 -88660 -127873 -306339
37507 -306339 -602679 -774545 -597330 -171729 152604 182747 91317 145437 316843 305038
37497 305038 -47443 -509743 -726443 -630828 -454844 -372190 -314844 -189379 -102756 -234820
37487 -234820 -567963 -882705 -1001809 -937170 -807506 -705134 -649712 -596491 -474543 -269456
37477 -269456 -74107 -12643 -110417 -267587 -346602 -262581 -30491 228822 369255 361138 316483
37466 316483 331581 374981 399163 467355 641758 816236 825623 697051 622223 668092 679647
37455 679647 515129 238114 20532 -28355 107659 368808 610644 690667 622544 548346
$$ packed form
37529A87370K4229J6540j9497n5658r5192r6996l9178N907j1868l849J06941J91318
37517B10067O4534j96801l02165j40525P5607J27925O0388J2310l9213j78466
37507c06339k96340j71866J77215M25601L24333L0143r1430N4120J71406j1805
37497C05038l52481m62300k16700R5615J75984Q2654N7346J25465Q6623j32064
37487b34820l33143l14742j19104O4639J29664J02372N5422N3221J21948K05087
37477b69456J95349O1464r7774j57170p9015Q4021K32090K59313J40433q117m4655
37466C16483J5098M3400K4182O8192J74403J74478R387j28572p4828M5869J1555
37455F79647j64518k77015k17582m8887J36014K61149K41836Q0023o8123p4198
$$ plain form
37445 548346 522079 438328 217027 -72180 -322885 -489859 -511487 -294289 113465 456845
37435 456845 502996 259810 -89865 -354747 -394260 -193418 29407 -18084 -313300 -493507
37425 -493507 -363657 -182615 -222992 -310943 -146426 122309 85317 -250690 -444188 -325148
37415 -325148 -261706 -547644 -909236 -897041 -515335 -172588 -141508 -310758 -406781 -283723
37405 -283723 -28659 115968 -9247 -260413 -315436 -80516 175903 183155 -15006 -241241
37395 -241241 -488350 -808696 -1029461 -880247 -410371 -17259 33288 -73298 8440 295450
37385 295450 447333 210732 -246732 -513811 -378105 2890 352891 568389 692634 715439
37375 715439 558688 245929 -56079 -202840 -193368 -115507 -60306 -93492 -206200 -276754 -179608
$$ packed form
37445E48346k6267q3751k21301k89207k50705j66974k1628K17198M07754L43380
37435D56845M6151k43186l49675k64882l9513K00842K22825m7491k95216j80207
37425d93507J29850J81042m0377q7951J64517K68735l6992l36007j93498J19040
37415c25148O3442k85938l61592J2195L81706L42747L1080j69250r6023J23058
37405b83723K55064J44627j25215k51166n5023K34920K56419P252j98161k26235
37395b41241k47109l20346k20765J49214M69876L93112N0547j06586Q1738K87010
37385B95450J51883k36601m57464k67079J35706L80995L50001K15498J24245K2805
37375G15439j56751l12759l02008j46761R472P7861N5201l3186j12708p0554R7146
$$ plain form
37364 -179608 52776 264946 360366 335405 167695 -153826 -483289 -600603 -491411 -365446
37354 -365446 -344829 -331792 -254676 -214831 -257948 -214990 45037 367680 507369 439268 300426
37343 300426 146880 -36400 -181760 -190079 -79470 57780 161947 146551 -123314 -609088
37333 -609088 -986646 -980762 -722683 -556180 -571459 -568460 -420617 -220114 -76430 750 15120
37322 15120 -26018 -50483 -29853 -95562 -335999 -548899 -467297 -196261 -117373 -340844 -569314
37311 -569314 -577250 -513146 -590989 -752487 -810118 -719748 -547283 -336016 -154279 -118473 -228722
37300 -228722 -315453 -258638 -117605 42014 263838 530242 676321 621045 494912 381732
37290 381732 146365 -273086 -615879 -629215 -493902 -583466 -871448 -936485 -581456 -105087
$$ packed form
37364a79608K32384K12170R5420k4961j67710l21521l29463j17314J09192J25965
37354c65446K0617J3037P7116L9845m3117M2958K60027L22643J39689o8101j38842
37343C00426j53546j83280j45360q319J10609J37250J04167j5396k69865m85774
37333f09088l77558N884K58079J66503j5279K999J47843K00503J43684P7180J4370
37322A5120m1138k4465K0630o5709k40437k12900Q1602K71036P8888k23471k28470
37311e69314p936O4104p7843j61498n7631R0370J72465K11267J81737L5806j10249
37300b28722q6731N6815J41033J59619K21824K66404J46079n5276j26133j13180
37290C81732k35367m19451l42793j3336J35313q9564k87982o5037L55029M76369
$$ plain form
37280 -105087 162056 296517 544953 848933 889229 568634 209404 180810 463483 711681
37270 711681 702225 578574 602518 779233 853341 640321 234893 -118107 -252673 -169127
37260 -169127 -8304 31482 -137537 -371751 -449385 -358945 -284103 -272542 -139780 170173
37250 170173 342615 49299 -556402 -946296 -801727 -301186 163062 362535 305836 127722
$$ packed form
37280a05087K67143J34461K48436L03980M0296l20595l59230k8594K82673K48198
37270G11681r456j23651K3944J76715P4108k13020m05428l53000j34566Q3546
37260a69127J60823L9786j69019k34214p7634R0440P4842J1561J32762L09953
37250A70173J72442k93316o05701l89894J44569N00541M64248J99473n6699j78114
$$ [...]
##END NTUPLES=NMR SPECTRUM
##END=
