##TITLE=31Pdec_DE-67rm
 , 24 sc
 3.10.2024
##JCAMPDX= 6.0         $$ Bruker NMR JCAMP-DX V2.0
##DATA TYPE= NMR SPECTRUM
##DATA CLASS= NTUPLES
##ORIGIN= UXNMR, Bruker Analytische Messtechnik GmbH
##OWNER= root
$$ XWIN-NMR		Version 3.5
$$ Thu Oct  3 16:37:33 2024 Russian Standard Time (UT+4h)  she@DPX200
##.OBSERVE FREQUENCY= 81.013821
##.OBSERVE NUCLEUS= ^31P
##.ACQUISITION MODE= SIMULTANEOUS
##.ACQUISITION SCHEME= undefined
##.AVERAGES= 24
##.DIGITISER RES= 17
##SPECTROMETER/DATA SYSTEM= spect
##.PULSE SEQUENCE= zgpg30
##.SOLVENT NAME= CDCl3
##.SHIFT REFERENCE= (INTERNAL, CDCl3, 0, 198.062)
##AUDIT TRAIL= $$ (NUMBER, WHEN, WHO, WHERE, WHAT)
$$ ##TITLE= Audit trail, XWIN-NMR		Version 3.5
$$ ##JCAMPDX= 5.01
$$ ##ORIGIN= Bruker BioSpin GmbH
$$ ##OWNER= she
$$ F:/spectra/data/she/nmr/P31/2/pdata/1/auditp.txt
$$ ##AUDIT TRAIL=  $$ (NUMBER, WHEN, WHO, WHERE, WHAT)
(   1,<2024-10-03 16:36:29.71 +0400>,<she>,<DPX200>,
      <created by zg, POWCHK disabled, PULCHK disabled
       configuration hash MD5:
       00 E9 B6 7A A2 85 ED C7 34 08 36 98 17 FE 4E 26
       data hash MD5: 32K
       CD BF 1D BF E2 40 30 5C 1B C1 0E 81 E3 42 ED BC>)
(   2,<2024-10-03 16:36:35.45 +0400>,<she>,<DPX200>,
      <Start of raw data processing
       efp BC_mod = 2 LB = 1.5 FT_mod = 6 PKNL = 1 PHC0 = 2698.737 PHC1 = 107.8875 SI = 64K 
       data hash MD5: 64K
       C1 11 A4 D5 44 BB 0B 60 0C 11 38 1E F8 E2 6E CB>)
(   3,<2024-10-03 16:36:59.07 +0400>,<she>,<DPX200>,
      <pk PHC0 = 11.96889 PHC1 = -29.4 
       data hash MD5: 64K
       F9 9A 90 22 42 08 2D C6 BE 3F E5 F4 1B 61 82 C2>)
$$ ##END=
$$ 
$$ hash MD5
$$ 43 79 BA C9 82 A5 F3 00 2A DE 5D E3 40 C5 D7 5D
##$RELAX= 
##$RELAX= 
##$RELAX= 
##$RELAX= 
##$RELAX= 
##$RELAX= 
##$RELAX= 
##$RELAX= 
$$ Bruker specific parameters
$$ --------------------------
##$DU= <F:/spectra>
##$EXPNO= 2
##$NAME= <P31>
##$PROCNO= 1
##$TYPE= <nmr>
##$USER= <she>
##$AMP= (0..31)
100 100 100 100 100 100 100 100 100 100 100 100 100 100 100 100 100 100 
100 100 100 100 100 100 100 100 100 100 100 100 100 100 
##$AQSEQ= 0
##$AQ_mod= 1
##$AUNM= <au_zg>
##$AUTOPOS= <>
##$BF1= 81.014009
##$BF2= 200.13
##$BF3= 200.13
##$BF4= 200.13
##$BF5= 200.13
##$BF6= 200.13
##$BF7= 200.13
##$BF8= 200.13
##$BYTORDA= 1
##$CFDGTYP= 0
##$CFRGTYP= 5
##$CHEMSTR= <none>
##$CNST= (0..31)
1 1 145 1 1 1 1 1 1 1 1 1 1 1 1 1 1 1 1 1 1 1 1 1 1 1 1 1 1 1 1 1 
##$CPDPRG= <waltz16>
##$CPDPRG1= <>
##$CPDPRG2= <waltz16>
##$CPDPRG3= <>
##$CPDPRG4= <mlev>
##$CPDPRG5= <mlev>
##$CPDPRG6= <mlev>
##$CPDPRG7= <mlev>
##$CPDPRG8= <mlev>
##$CPDPRGB= <>
##$CPDPRGT= <>
##$D= (0..31)
0 1 0 0 0 0 0 0 0 0.06 0 0.03 2e-05 3e-06 0 0 0.0002 0 0 0 0 0 0 0 0 0 
0 0 0 0 0 0 
##$DATE= 1727958989
##$DBL= (0..7)
120 120 120 11 120 120 24 19 
##$DBP= (0..7)
150 150 150 150 150 150 150 150 
##$DBP07= 0
##$DBPNAM0= <>
##$DBPNAM1= <>
##$DBPNAM2= <>
##$DBPNAM3= <>
##$DBPNAM4= <>
##$DBPNAM5= <>
##$DBPNAM6= <>
##$DBPNAM7= <>
##$DBPOAL= (0..7)
0.5 0.5 0.5 0.5 0.5 0.5 0.5 0.5 
##$DBPOFFS= (0..7)
$$ [...]
##$SUBNAM2= <"">
##$SUBNAM3= <"">
##$SUBNAM4= <"">
##$SUBNAM5= <"">
##$SUBNAM6= <"">
##$SUBNAM7= <"">
##$SUBNAM8= <"">
##$SUBNAM9= <"">
##$SW= 400.765351723535
##$SWIBOX= (0..15)
0 1 3 0 0 0 0 0 0 0 0 0 0 0 0 0 
##$SW_h= 32467.5324675325
##$TD= 32768
##$TD0= 1
##$TE= 0
##$TE2= 300
##$TE3= 300
##$TEG= 300
##$TL= (0..7)
0 120 53 12 22 120 120 120 
##$TP= (0..7)
150 150 150 150 150 150 150 150 
##$TP07= 0
##$TPNAME0= <>
##$TPNAME1= <>
##$TPNAME2= <>
##$TPNAME3= <>
##$TPNAME4= <>
##$TPNAME5= <>
##$TPNAME6= <>
##$TPNAME7= <>
##$TPOAL= (0..7)
0.5 0.5 0.5 0.5 0.5 0.5 0.5 0.5 
##$TPOFFS= (0..7)
0 0 0 0 0 0 0 0 
##$TUNHIN= 0
##$TUNHOUT= 0
##$TUNXOUT= 0
##$USERA1= <user>
##$USERA2= <user>
##$USERA3= <user>
##$USERA4= <user>
##$USERA5= <user>
##$V9= 5
##$VALIST= <valist>
##$VCLIST= <CCCCCCCCCCCCCCC>
##$VD= 0
##$VDLIST= <DDDDDDDDDDDDDDD>
##$VPLIST= <PPPPPPPPPPPPPPP>
##$VTLIST= <TTTTTTTTTTTTTTT>
##$WBST= 1024
##$WBSW= 4
##$XGAIN= (0..3)
0 0 0 0 
##$XL= 0
##$YL= 0
##$YMAX_a= 89079
##$YMIN_a= -59490
##$ZGOPTNS= <>
##$ZL1= 120
##$ZL2= 120
##$ZL3= 120
##$ZL4= 120
##$ABSF1= 0
##$ABSF2= 0
##$ABSG= 0
##$ABSL= 0
##$ALPHA= 0
##$AQORDER= 0
##$ASSFAC= 0
##$ASSFACI= 0
##$ASSFACX= 0
##$ASSWID= 0
##$AUNMP= <proc_1d>
##$AZFE= 0.1
##$AZFW= 0.5
##$BCFW= 0
##$BC_mod= 2
##$BYTORDP= 0
##$COROFFS= 0
##$CY= -3
##$DATMOD= 1
##$DC= 0
##$DFILT= <>
##$DTYPP= 0
##$F1P= 0
##$F2P= 0
##$FCOR= 1
##$FTSIZE= 65536
##$FT_mod= 6
##$GAMMA= 0
##$GB= 0
##$INTBC= 1
##$INTSCL= 9.790993e-09
##$ISEN= 30
##$LB= 1.5
##$LEV0= 0
##$LPBIN= 0
##$MAXI= 10000
##$MC2= 0
##$MEAN= 0
##$ME_mod= 0
##$MI= 50
##$NCOEF= 0
##$NC_proc= -3
##$NLEV= 6
##$NOISF1= 182.463
##$NOISF2= 159.3651
##$NSP= 0
##$NTH_PI= 0
##$NZP= 0
##$OFFSET= 198.0616
##$PC= 4
##$PHC0= 2710.706
##$PHC1= 78.4875
##$PH_mod= 1
##$PKNL= yes
##$PPARMOD= 0
##$PSCAL= 0
##$PSIGN= 0
##$REVERSE= no
##$SF= 81.0140089999434
##$SI= 65536
##$SIGF1= 159.3651
##$SIGF2= -187.1042
##$SINO= 113.3802
##$SIOLD= 16384
##$SREGLST= <1H.CDCl3>
##$SSB= 0
##$STSI= 65536
##$STSR= 0
##$SW_p= 32467.5324675325
##$SYMM= 0
##$S_DEV= 0
##$TDeff= 32768
##$TDoff= 0
##$TI= <>
##$TILT= no
##$TM1= 0
##$TM2= 0
##$TOPLEV= 0
##$USERP1= <user>
##$USERP2= <user>
##$USERP3= <user>
##$USERP4= <user>
##$USERP5= <user>
##$WDW= 1
##$XDIM= 65536
##$YMAX_p= 456256344
##$YMIN_p= -1626591
$$ End of Bruker specific parameters
$$ ---------------------------------
##NTUPLES= NMR SPECTRUM
##VAR_NAME=  FREQUENCY,     SPECTRUM/REAL,   SPECTRUM/IMAG
##SYMBOL=    X,             R,               I
##VAR_TYPE=  INDEPENDENT,   DEPENDENT,       DEPENDENT
##VAR_FORM=  AFFN,          ASDF,            ASDF
##VAR_DIM=   65536,         65536,           65536
##UNITS=     HZ,            ARBITRARY UNITS, ARBITRARY UNITS
##FACTOR=    0.49542278885378, 1,            1
##FIRST=     16045.7642231865, 0,            0
##LAST=      -16421.768244346, 0,            0
##MIN=       -16421.768244346, -1626591,     0
##MAX=       16045.7642231865, 456256344,    0
$$ Real data points
##PAGE= N=1
##DATA TABLE= (X++(R..R)), XYDATA
$$ [...]
45542 29322 9874 -26682 -72251 -89363 -69446 -55583 -75017 -96808 -93430 -94468 -128489 -152922
45530 -152922 -104416 1220 76791 65727 -6470 -75998 -97667 -65226 -13876 -2715 -63721
45519 -63721 -165911 -249689 -288473 -294681 -280274 -245410 -200756 -166774 -145859 -119056 -75072 -25799
45507 -25799 7088 6387 -35422 -108036 -181971 -228425 -238227 -216112 -171564 -127227 -115635 -144867
45495 -144867 -182874 -199871 -210357 -244478 -293392 -320275 -317535 -311318 -307134 -273050 -190718 -89200
45483 -89200 -10916 27507 23729 -29203 -121602 -208529 -245432 -233946 -207430 -182334 -154256 -133683
45471 -133683 -144351 -177363 -185511 -146173 -100749 -101236 -138057 -156354 -131840 -90885 -58533 -29854
45459 -29854 -1693 9108 -1490 -10652 -12279 -39672 -111053 -182201 -195063 -153809 -109966 -87037
45447 -87037 -66999 -45081 -48043 -89686 -145475 -179642 -170069 -110751 -26079 22937 -6314 -74447
45435 -74447 -101568 -79519 -85288 -162553 -250145 -267604 -222418 -181466 -171118 -163068 -142422 -133653
45423 -133653 -155459 -190610 -212560 -219343 -231498 -264585 -303230 -301804 -226969 -107067 -18462 -8397
45411 -8397 -49590 -83804 -86338 -68425 -41607 -10933 8329 -4744 -55563 -127955 -190813 -207115
45399 -207115 -158133 -70831 -1253 19851 4529 -30281 -80556 -126563 -136958 -127056 -161095 -255587
45387 -255587 -329063 -303699 -217769 -170795 -184743 -195157 -168890 -150254 -177456 -221907 -238067
45376 -238067 -223225 -199144 -172719 -142640 -118667 -113309 -132633 -181414 -250028 -291481 -248538 -121352
45364 -121352 19424 102196 113076 76645 12418 -68049 -146352 -203962 -230929 -217273 -157283
45353 -157283 -75215 -21826 -24976 -60860 -89248 -96277 -86114 -57438 -17410 731 -29077 -80402
45341 -80402 -95895 -58683 -16351 -25363 -90892 -170405 -220229 -227214 -207134 -186558 -182059 -187009
45329 -187009 -180791 -156582 -133441 -131326 -141113 -135795 -110550 -92385 -103152 -131025 -151307 -159794
45317 -159794 -167956 -177303 -180020 -177495 -175540 -165113 -131265 -81794 -45878 -41821 -62457 -89153 -100721
45304 -100721 -75104 -9736 60468 91186 73658 28594 -33002 -106397 -161453 -165528 -139813 -140007
45292 -140007 -172964 -188718 -167994 -153594 -170107 -178946 -150971 -119028 -109330 -83075 -9415 56965
45280 56965 44490 -28898 -91838 -128309 -172138 -219849 -235160 -229131 -251467 -300930 -322650 -302264
45268 -302264 -287855 -302911 -307206 -267203 -204800 -150995 -105052 -67003 -63070 -107088 -169558 -209390
45256 -209390 -213060 -192236 -168814 -165441 -182300 -186683 -157441 -126988 -135684 -159774 -142354 -87021
45244 -87021 -53859 -62204 -69253 -54427 -49699 -66636 -70187 -56886 -85000 -181201 -280112 -308032
45232 -308032 -275026 -233280 -193163 -139078 -90649 -84458 -112537 -130527 -117917 -92775 -77516 -80622
45220 -80622 -99622 -116183 -102391 -55001 -9380 -969 -28329 -68073 -106549 -142704 -177627 -210914
45208 -210914 -232162 -221185 -183247 -170283 -221293 -290537 -293766 -224927 -159219 -134224 -108115 -58191
45196 -58191 -35176 -75024 -131695 -151792 -152039 -167215 -181457 -171078 -161593 -181835 -210458 -223923
45184 -223923 -243948 -279088 -279320 -217632 -157666 -162609 -194043 -187225 -168583 -194860 -224556 -171293
45172 -171293 -58609 3065 -13476 -26536 4485 24224 -1448 -28659 -33492 -61945 -134453
45161 -134453 -195198 -211732 -238144 -314165 -378197 -356768 -281435 -237399 -238357 -230997 -195722 -164527
45149 -164527 -148310 -117198 -61684 -20589 -33187 -97792 -186902 -273715 -333904 -347492 -316266
45138 -316266 -267493 -227066 -192722 -142654 -71137 -7110 12371 -14884 -54671 -82270 -110676
45127 -110676 -159833 -217744 -255128 -264247 -257138 -237077 -201749 -167636 -159152 -173200 -181180 -166372
45115 -166372 -135714 -97676 -55343 -21162 -12829 -32177 -66992 -108524 -145404 -149722 -99872 -16414
45103 -16414 50200 67669 40407 -8277 -49453 -58537 -40133 -29012 -39811 -39588 -6769 12958
45091 12958 -33773 -112648 -134645 -81008 -25243 -21070 -38500 -35784 -30369 -57333 -102929 -123649
45079 -123649 -105777 -73205 -53918 -59340 -78356 -79330 -41695 4257 -2507 -79964 -174288 -217164
45067 -217164 -190367 -128332 -82390 -85912 -126887 -153094 -132344 -101444 -118313 -174721 -206947 -189238
45055 -189238 -155535 -121838 -56007 50614 144382 176694 158153 114013 41457 -48487 -101192
45044 -101192 -85049 -49756 -65500 -131981 -193375 -215495 -202287 -162787 -111593 -82806 -95797
45033 -95797 -120992 -121640 -112672 -132135 -168061 -166883 -115607 -68260 -76983 -129080 -167552 -155320 -108803
45020 -108803 -77549 -93279 -134297 -146052 -101534 -29934 19538 25800 1451 -27998 -38487 -21412
45008 -21412 3409 6807 -9536 -15805 -4675 -6554 -38627 -73410 -81617 -73472 -67622 -48989 4445
44995 4445 71450 100986 68526 -5617 -83852 -137002 -157120 -165830 -195993 -246720 -273786 -244210
44983 -244210 -181694 -136133 -125745 -132638 -139903 -147311 -157318 -163890 -152766 -109798 -41750 13900
44971 13900 24433 5639 -2371 -2019 -36044 -110302 -169821 -173155 -144003 -124244 -121351 -128820 -150228
44958 -150228 -170655 -152565 -97218 -62745 -81101 -106244 -90981 -64517 -76442 -108422 -106991 -70440
44946 -70440 -37691 -17700 5486 19042 -3120 -45707 -70818 -78559 -97086 -127954 -151318 -167143
44934 -167143 -183216 -186662 -177053 -194691 -256337 -299416 -263531 -194454 -180851 -212343 -199310 -124846
44922 -124846 -70645 -78248 -86347 -39749 26223 53712 43904 25191 -1251 -36632 -51348 -23814
44910 -23814 16551 21999 -15486 -59307 -64774 -13272 69369 128806 137414 120817 103702 60710
44898 60710 -30836 -124289 -160727 -166148 -205001 -253895 -226953 -131484 -84292 -140951 -215618 -220127
44886 -220127 -184490 -174407 -176324 -144691 -97006 -77841 -73829 -41167 14983 53645 60857 43245
44874 43245 -7542 -86634 -144093 -139347 -100927 -80132 -76111 -60884 -44489 -52211 -64826 -48321
44862 -48321 -22642 -33067 -66752 -65850 -18236 30369 55386 80963 120132 146133 140599 122092
44850 122092 107280 82968 36073 -19065 -58582 -69850 -47044 5719 57944 68387 32722
44839 32722 -3997 3885 53302 98376 95182 39163 -31373 -70909 -76410 -94572 -164265 -259863
44827 -259863 -313415 -290970 -224614 -164913 -122802 -73843 -12410 18079 -33451 -151510 -242464
44816 -242464 -222503 -110906 -7919 18129 -12638 -51102 -88918 -142119 -200343 -232561 -230917
44805 -230917 -217898 -213959 -218636 -220990 -215141 -206147 -202291 -196609 -166725 -111333 -70272 -72662 -79679
44792 -79679 -32573 45695 63233 -13170 -113715 -176605 -229178 -310221 -380047 -376799 -314826 -256937
44780 -256937 -223480 -195391 -175913 -178766 -177864 -138669 -84542 -67069 -85029 -97887 -105414 -142855
44768 -142855 -202743 -232925 -216842 -192771 -187677 -189604 -188954 -190426 -182759 -154743 -140569 -186425 -271027
44755 -271027 -325600 -333387 -333765 -323084 -244515 -106535 -20565 -63882 -171343 -222143 -183203 -112163
44743 -112163 -65492 -62913 -106182 -171559 -203909 -169324 -100696 -54899 -45245 -51059 -67191 -99300
44731 -99300 -127473 -119883 -79294 -46346 -60524 -131578 -229486 -288397 -254070 -152697 -77799 -79369
44719 -79369 -106556 -98166 -80886 -116086 -188020 -224985 -215458 -219551 -260994 -288560 -267292 -235467
44707 -235467 -233031 -233052 -192853 -129158 -88776 -74289 -55620 -41442 -81110 -188163 -306865 -372709
44695 -372709 -374754 -338426 -274882 -181064 -79780 -21689 -32147 -76845 -101144 -94287 -92130 -118493
44683 -118493 -151508 -160709 -154423 -165104 -197141 -216825 -197567 -153317 -117321 -103528 -103116 -109954
44671 -109954 -131090 -167622 -197334 -191537 -153591 -128971 -159961 -230364 -275229 -255819 -205477 -180952
44659 -180952 -184903 -169586 -113181 -54132 -38829 -70028 -126826 -201030 -279223 -316061 -275581 -192812
44647 -192812 -145414 -156753 -171681 -142381 -91143 -59460 -38487 3287 50486 53883 6844 -39733
44635 -39733 -44996 -22493 -8197 -16310 -37617 -56308 -60541 -57102 -73997 -120797 -152396 -114393
44623 -114393 -28084 18508 -19342 -89342 -123018 -123454 -135968 -171332 -204111 -220590 -222856 -203240
44611 -203240 -156866 -107317 -83676 -83817 -90341 -103086 -121828 -121569 -89286 -63606 -86467 -131348
44599 -131348 -136971 -103951 -95860 -141083 -194426 -209789 -196538 -185519 -187992 -207943 -248075 -280487
44587 -280487 -255742 -168491 -77369 -37150 -49885 -102602 -199557 -316653 -372764 -309135 -177225
44576 -177225 -91482 -100247 -148893 -168139 -152718 -141762 -156764 -178584 -169373 -106583 -8153 69142
44564 69142 70132 -6921 -100850 -137766 -95634 -21197 16895 -8994 -70621 -124493 -150805 -150574
44552 -150574 -130371 -107446 -106296 -124212 -122984 -88569 -73218 -126589 -202232 -201191 -111841 -33450
44540 -33450 -37890 -78829 -79352 -45853 -35674 -59357 -84279 -107021 -151327 -204555 -221611 -195661
44528 -195661 -169767 -167821 -160884 -119072 -61430 -35445 -67921 -144605 -220406 -250022 -230783 -212566
44516 -212566 -239822 -289160 -297493 -250112 -200289 -193192 -211569 -215831 -200741 -184065 -168494 -149833
44504 -149833 -144005 -167844 -199834 -195507 -145147 -87237 -57553 -50701 -43081 -29313 -17377 -7007
44492 -7007 2585 -4606 -43039 -93235 -114943 -95354 -59513 -30179 -6926 7283 -5291 -42276
44480 -42276 -68821 -68235 -73090 -110012 -144826 -131456 -91137 -82909 -107849 -109818 -72654 -45956 -58955
44467 -58955 -79731 -89552 -127350 -211347 -275827 -250731 -165997 -111236 -115658 -132209 -128102 -127141 -157520
44454 -157520 -207642 -244380 -242063 -192277 -116034 -61100 -53341 -58696 -32235 4722 -13142 -95058
44442 -95058 -170504 -179487 -136718 -85107 -35277 14124 38538 19178 -10023 3384 56206 92908
44430 92908 82966 51643 23233 -21505 -99852 -170998 -173643 -113761 -68307 -89090 -143466 -175095
44418 -175095 -185628 -212185 -247269 -239138 -173798 -103525 -76308 -80544 -82934 -80262 -80428 -66369 -22214
44405 -22214 24735 32295 5181 -11992 -2055 3508 -20908 -53565 -58525 -39985 -39539 -82649 -145977
44392 -145977 -186281 -192761 -193562 -206118 -202324 -145347 -49177 28987 54714 45189 30141 16211
44380 16211 -2033 -27356 -67572 -128815 -191396 -223461 -226899 -233120 -245386 -232398 -194424 -179948
44368 -179948 -207183 -225841 -199486 -171565 -193061 -230887 -217150 -158908 -126983 -150682 -190065
44357 -190065 -207128 -205797 -202156 -204386 -219843 -241111 -237621 -203275 -188735 -231545 -279508 -253866
44345 -253866 -172381 -129467 -157653 -194199 -196694 -204533 -253678 -305557 -305049 -253315 -183397 -113320
44333 -113320 -61670 -61086 -110280 -148572 -122318 -52216 -311 6012 -13431 -31452 -35426 -27422
44321 -27422 -27426 -61125 -126312 -187880 -218041 -220643 -207345 -178892 -142965 -119300 -108316 -81752 -24083
44308 -24083 38784 67557 46412 -15593 -93188 -146726 -145876 -104145 -64258 -43737 -26350 -11148
44296 -11148 -28046 -88853 -157664 -186332 -153926 -70266 22868 58103 3521 -76868 -82482 -8078
44284 -8078 47320 20951 -37768 -64524 -75850 -112583 -153127 -151930 -119340 -97901 -95394 -101771
44272 -101771 -136310 -213199 -289984 -314743 -299422 -284729 -262160 -203738 -145293 -154790 -221845 -261250
44260 -261250 -235942 -198403 -188219 -163484 -77025 32968 80408 34387 -53447 -110258 -103726
44249 -103726 -54243 -9633 -5419 -36849 -70139 -83382 -89643 -116515 -168620 -215046 -217063 -172389
44237 -172389 -125922 -122467 -153658 -174867 -172550 -179886 -216658 -253568 -259100 -245791 -239059 -230820 -201097
44224 -201097 -163155 -149424 -166282 -192732 -208554 -197585 -144544 -60017 10049 29992 11658
44213 11658 -18196 -59113 -114163 -159045 -175537 -186176 -210021 -214052 -162496 -87304 -46680 -33573
44201 -33573 4080 61000 67945 -3821 -98276 -151733 -156695 -131197 -81768 -25455 -2640 -34052
44189 -34052 -92580 -139217 -162464 -169753 -168798 -170190 -181242 -187452 -166961 -128708 -105685 -106805 -111671
44176 -111671 -118119 -151050 -208706 -244333 -229592 -203184 -223651 -293632 -359625 -374829 -338364 -279565
44164 -279565 -226081 -191820 -183506 -203953 -239975 -256518 -227206 -173521 -143910 -144889 -131694 -86142
44152 -86142 -54027 -67302 -81312 -48753 -10227 -31702 -82530 -68945 19775 92919 92509 53685
44140 53685 14072 -42050 -114476 -151945 -136887 -127850 -160178 -175536 -118417 -41685 -35732 -94475
44128 -94475 -135188 -128768 -128761 -172022 -219565 -212600 -143955 -59245 -11721 -19621 -51894 -62647 -50824
44115 -50824 -64311 -127182 -192760 -199063 -145116 -78193 -29640 -2396 -889 -27022 -55648 -56140
44103 -56140 -35330 -24144 -26289 -16273 11741 26815 -533 -65332 -135418 -174594 -163758 -118893
44091 -118893 -83607 -86650 -113820 -135695 -146637 -155118 -154167 -132323 -102726 -90595 -99385 -117633
44079 -117633 -148608 -198542 -242053 -239334 -191845 -144846 -125524 -112383 -80890 -47948 -45398 -67959
44067 -67959 -75780 -45314 2608 28435 14272 -27387 -75563 -117646 -143230 -137422 -97317 -50416
44055 -50416 -36736 -68172 -120577 -168076 -203912 -219955 -193315 -118422 -38020 -13073 -59758 -133421
44043 -133421 -176488 -169320 -133859 -103003 -94403 -104402 -114522 -103754 -67714 -35183 -54069 -139298
44031 -139298 -237828 -275800 -249052 -231547 -272384 -323288 -309457 -241078 -197329 -214911 -255442
44020 -255442 -283103 -309940 -348025 -373503 -363918 -327667 -275189 -203825 -131949 -102666 -126612 -160582
44008 -160582 -167308 -156676 -146503 -130781 -115737 -136041 -194834 -232862 -202833 -136703 -95092 -87421
43996 -87421 -89304 -102372 -142791 -197616 -242574 -277668 -300341 -279020 -210150 -166933 -219447 -324634
43984 -324634 -367870 -307544 -211479 -152200 -134361 -133702 -141988 -151127 -142433 -114407 -85773 -59412
43972 -59412 -19825 25036 39285 10148 -30742 -50797 -52040 -52544 -60567 -78728 -109503 -144146
43960 -144146 -162711 -153062 -121082 -84971 -66993 -76712 -91755 -79920 -57739 -90432 -198623 -301468
43948 -301468 -305137 -224114 -157008 -156293 -182304 -182030 -154297 -129915 -135370 -182675 -254593 -299476 -280858
43935 -280858 -228964 -203770 -217704 -240171 -262486 -298951 -331462 -317563 -256652 -190920 -140418
43924 -140418 -95440 -69421 -91264 -142102 -168743 -164924 -167728 -170332 -123449 -38347 3213 -27054
43912 -27054 -56971 -29705 18654 44420 73012 127394 157046 114572 44082 16717 23814 5396
43900 5396 -54298 -125528 -188893 -229243 -213669 -142341 -84324 -94529 -130074 -119337 -77914 -76118
43888 -76118 -119413 -146809 -132219 -104112 -74004 -28685 9092 -4847 -55990 -85996 -96879 -156074
43876 -156074 -274552 -361766 -343562 -260617 -203874 -202856 -223950 -238379 -243089 -239069 -229576 -224188
43864 -224188 -216442 -176648 -95033 -15371 3126 -51123 -137901 -214131 -265458 -294324 -299602 -278511
43852 -278511 -242698 -220327 -230673 -257985 -267625 -252842 -241902 -246913 -237750 -194004 -149279 -138960
43840 -138960 -130095 -64870 34107 70622 2749 -94870 -126202 -86077 -43279 -46419 -86225 -133180
43828 -133180 -176263 -223852 -281789 -331827 -336796 -283154 -211614 -177588 -184807 -193670 -193242 -215146
43816 -215146 -263314 -284120 -238011 -158015 -100921 -76694 -63749 -58165 -62625 -57164 -31593 -23256
43804 -23256 -69446 -141273 -180906 -187475 -200703 -210559 -165056 -79819 -53588 -132245 -227834 -232347
43792 -232347 -159873 -107005 -108550 -111536 -79475 -42811 -34433 -42825 -54203 -84358 -133870 -158143
43780 -158143 -126720 -80868 -83691 -129839 -152891 -119579 -73283 -74681 -132283 -206301 -256900 -270158
43768 -270158 -249983 -203213 -134694 -54060 13645 34308 -4072 -69627 -112055 -111768 -91586 -80562
43756 -80562 -82225 -81534 -67213 -39693 -7799 16096 25460 27945 37361 55894 71206 70342 49399
43743 49399 13528 -22938 -42140 -41291 -40058 -55581 -77773 -86379 -83052 -83706 -87306 -80923 -72284 -85591
43729 -85591 -121589 -149837 -144553 -104229 -40652 18219 21847 -56821 -162852 -201154 -155491 -112671
43717 -112671 -141668 -205378 -233969 -230546 -241168 -258599 -231648 -158330 -99742 -94335 -112932 -111014
43705 -111014 -82180 -47378 -27853 -40578 -88701 -145063 -171511 -161865 -141458 -123315 -96596 -63343
43693 -63343 -50996 -73699 -109902 -134735 -150413 -168528 -185404 -194940 -207710 -234811 -263015 -267135
43681 -267135 -244693 -221938 -221903 -235565 -231436 -193655 -145310 -127020 -152910 -196942 -223635 -219535
43669 -219535 -191910 -155048 -127059 -121680 -130766 -132725 -128674 -144032 -177555 -183288 -136341 -85898
43657 -85898 -95148 -146571 -160851 -106151 -35818 -9580 -24432 -39995 -34482 -16519 -9617 -38479
43645 -38479 -104816 -168157 -179959 -145576 -120513 -134356 -153157 -133389 -78826 -22157 18534 38758
43633 38758 30497 -3333 -36110 -48284 -58251 -97238 -163358 -222695 -247120 -231691 -185718 -129966
43621 -129966 -96687 -107720 -147780 -173245 -152982 -96977 -46253 -36431 -66442 -102340 -116926 -119365
43609 -119365 -132881 -153755 -160312 -160190 -190501 -256608 -306192 -291125 -228736 -169916 -127314 -75305
43597 -75305 -13547 12797 -30710 -118470 -188770 -203940 -175869 -142802 -132893 -145967 -161089 -160964
43585 -160964 -152435 -161494 -202649 -252109 -259297 -195645 -91732 -13556 3850 -12605 -17561 -5956
43573 -5956 -9417 -44257 -89610 -119497 -133597 -146130 -158211 -151412 -104431 -16553 78655 130120
43561 130120 114707 61346 13742 -23363 -77232 -152051 -213481 -234988 -229490 -221051 -210723 -189160
43549 -189160 -162922 -145903 -135960 -120463 -100999 -97347 -125395 -177066 -223252 -238993 -229293 -223107
43537 -223107 -234485 -243117 -229232 -210409 -214090 -226527 -211192 -176941 -179233 -237576 -295455 -290189
43525 -290189 -230175 -173693 -158712 -184625 -237811 -295917 -320905 -288686 -226375 -190318 -203011
43514 -203011 -232644 -236281 -203327 -153001 -106872 -73267 -50937 -39638 -43229 -59329 -71245 -63905
43502 -63905 -49545 -61009 -110208 -165223 -180177 -143376 -91193 -77513 -124429 -192465 -208611 -144520
43490 -144520 -59365 -35340 -73444 -92083 -37483 46420 80055 43630 -20094 -70216 -98567
43479 -98567 -111828 -116076 -114073 -98183 -57408 -8913 -2598 -66428 -160407 -214206 -203281 -162077
43467 -162077 -129673 -111680 -95572 -76727 -60355 -51176 -46132 -32368 1748 46137 70127 56342
43455 56342 23744 3572 2287 3547 -2220 -7973 -4816 9848 38070 82823 142214 208607 275325
43442 275325 345732 437176 564316 703060 781731 737368 584711 406395 272659 194090
43432 194090 148742 116265 76150 12127 -61575 -108237 -118318 -120845 -133767 -141709 -139344 -151629
43420 -151629 -183251 -190653 -140133 -59549 86 18821 -6241 -81099 -175210 -208598 -142703 -54469
43408 -54469 -52887 -137762 -205621 -188504 -124665 -88523 -106167 -152212 -187224 -183582 -141986 -89875
43396 -89875 -48863 -15329 9651 124 -50944 -96939 -92015 -56709 -41318 -48489 -48961 -53195 -100232
43383 -100232 -182103 -242950 -253953 -234449 -204024 -171916 -166577 -209155 -258518 -251826 -203588 -192530
43371 -192530 -240743 -280942 -261612 -210276 -167572 -132211 -103936 -109470 -144307 -153805 -118131 -96011
43359 -96011 -134023 -188564 -194509 -162918 -149117 -161831 -166689 -153714 -143212 -142038 -142571 -147822 -154553
43346 -154553 -133265 -71488 -16736 -25152 -79185 -106037 -74056 -25706 -12226 -33307 -49716 -31303
43334 -31303 11926 32453 -14107 -116494 -208806 -239892 -224580 -208173 -203263 -189181 -155760 -116732
43322 -116732 -89367 -84540 -106571 -143330 -169309 -174038 -169372 -156600 -117065 -55778 -16934 -22807
43310 -22807 -32395 -3711 33676 20487 -39360 -84189 -82329 -58937 -38868 -19714 -8668 -30777
43298 -30777 -78494 -95458 -40694 52912 105926 67738 -41195 -147084 -180560 -135671 -76344
43287 -76344 -71658 -126714 -188877 -209179 -176527 -107734 -37058 -5499 -22009 -39221 -7560 48546
43275 48546 55080 -5623 -67090 -77982 -75684 -119274 -188935 -208929 -156533 -93853 -84419 -119098
43263 -119098 -142010 -122950 -82715 -58687 -62492 -70218 -49126 2120 40349 17638 -60672 -133188
43251 -133188 -151197 -136853 -150357 -205562 -248744 -229007 -159788 -89988 -38989 7224 48597
43240 48597 58923 26024 -25696 -62799 -72244 -58023 -31425 -12386 -18007 -39054 -46756 -30447
43228 -30447 -7179 12327 38500 70057 77650 45528 5404 -2055 15669 15811 -17127 -52255
43216 -52255 -58009 -43232 -42748 -72097 -104789 -97841 -43089 14858 27041 -1428 -29448 -52890
43204 -52890 -114094 -220872 -303922 -297002 -227836 -178890 -176262 -173468 -141198 -112191 -117254 -126579
43192 -126579 -92720 -25309 16968 1958 -40931 -65703 -64124 -60405 -67419 -71816 -63067 -54712 -62381
43179 -62381 -74370 -63910 -26052 15439 35301 23719 -19695 -86201 -150346 -183047 -176917 -143942
43167 -143942 -93187 -34331 2864 -11691 -62887 -96353 -78440 -21668 51473 128944 183388
43156 183388 174539 105277 37432 20472 34209 29912 -3450 -45053 -83609 -117202 -136127 -140468
43144 -140468 -154269 -190997 -225881 -232344 -223411 -227081 -244567 -263201 -283787 -302135 -292623 -248109
43132 -248109 -208133 -207297 -224786 -228506 -236019 -276499 -320545 -312866 -258396 -211007 -187304 -159289
43120 -159289 -128837 -136239 -181978 -206934 -176176 -130127 -124883 -162923 -207708 -231134 -222307 -179118
43108 -179118 -114977 -54302 -6966 34841 69079 78627 62656 49655 66661 108840 143474 133285
43096 133285 61739 -48475 -148582 -208325 -233928 -231913 -188263 -110457 -51635 -46454 -53539 -17582
43084 -17582 35658 31685 -38456 -104558 -116238 -90680 -58464 -26431 -4428 -8288 -22709 -16181
43072 -16181 -1557 -21806 -65683 -66415 -6877 41094 16065 -53277 -105605 -130142 -147236 -149898
43060 -149898 -116870 -60340 -17325 -2899 2136 23465 62817 86288 51003 -35518 -102835 -103904
43048 -103904 -89382 -135165 -216928 -240586 -192355 -158251 -176002 -175105 -110763 -55295 -82494 -142781
43036 -142781 -141196 -81523 -43543 -55895 -76434 -75079 -60075 -36411 -3642 15480 -721 -32495
43024 -32495 -49954 -64666 -100918 -139152 -143373 -125378 -124818 -141350 -143892 -133363 -135070 -135572 -89955
43011 -89955 2496 84096 111210 97429 74643 50297 16972 -23557 -57387 -65680 -39206 -412
42999 -412 5229 -37158 -85261 -93905 -75418 -73277 -96845 -122109 -140940 -165732 -192722 -200758 -184022
42986 -184022 -155020 -122881 -97454 -100693 -140063 -183956 -198042 -191616 -191933 -190496 -159413 -109635
42974 -109635 -85593 -103859 -137118 -156881 -155501 -130354 -83976 -38392 -15983 -9344 1315 12999
42962 12999 15483 24557 55123 73179 26513 -76185 -164069 -189109 -173725 -167614 -192028 -232788
42950 -232788 -257856 -236898 -168378 -87486 -27833 13381 50661 74854 76767 78933 96130 88367
42938 88367 14115 -83374 -112265 -56897 1265 2568 -13510 22053 111041 197744 247320 283580
42926 283580 356136 476612 581278 575238 438928 267000 162310 118351 62526 -11603 -38644
42915 -38644 -5112 12235 -41209 -122721 -166107 -166604 -151489 -123840 -83487 -57990 -63196 -66109
42903 -66109 -29868 31264 75600 83428 54228 -7572 -68796 -69194 7334 93421 115356 82520
42891 82520 54749 50451 44061 33242 40346 48595 4150 -98631 -187333 -197467 -151846 -122368
42879 -122368 -139188 -172551 -189005 -187473 -178842 -162270 -135697 -110636 -100757 -106040 -119187 -135589
42867 -135589 -145086 -131457 -101709 -98090 -147039 -207946 -217235 -180822 -168319 -204030 -224929 -177813
42855 -177813 -99493 -52676 -33585 -6182 10900 -32817 -126546 -198929 -209925 -183595 -152032
42844 -152032 -123692 -108001 -116173 -132076 -129032 -116053 -122599 -144461 -155753 -164721 -196944 -228635
42832 -228635 -204551 -126759 -60131 -41836 -48747 -59989 -81923 -100821 -84606 -49435 -53099 -103624
42820 -103624 -147738 -167872 -206782 -268981 -289660 -245893 -209693 -232350 -257792 -218541 -143103
42809 -143103 -91919 -53863 7076 56332 33879 -38527 -82363 -75100 -64030 -84664 -131556 -193051
42797 -193051 -252924 -274484 -240654 -191832 -173026 -171370 -159653 -162213 -206129 -241378 -194533 -83598
42785 -83598 3489 32070 38504 34634 -11309 -89827 -137251 -132432 -128111 -156935 -178359 -154965
42773 -154965 -117736 -114138 -144262 -188593 -249139 -316525 -339090 -281288 -190249 -151416 -184245 -225120
42761 -225120 -217202 -180737 -176316 -219360 -259721 -249774 -206609 -179975 -171964 -132777 -44674 38952
42749 38952 67226 59679 57030 43774 -19525 -110633 -160868 -151991 -135749 -150816 -175685 -175802 -148888
42736 -148888 -109769 -72649 -60099 -88456 -132216 -141930 -108437 -71489 -57100 -49504 -36499 -36623
42724 -36623 -62267 -96123 -122840 -144787 -148785 -101701 -6142 78571 101727 75169 34428 -18492
42712 -18492 -96848 -180480 -224977 -207643 -139993 -53338 5152 -10976 -99271 -193756 -233008 -230027
42700 -230027 -240750 -275741 -285129 -233061 -149680 -95242 -96043 -129966 -161247 -176888 -192679 -227134
42688 -227134 -268870 -277641 -227365 -141108 -69957 -42612 -51239 -80367 -123997 -168647 -185467 -159081
42676 -159081 -111772 -80080 -74925 -83307 -101480 -138905 -186895 -213889 -207816 -199265 -221319 -266300
42664 -266300 -306609 -336845 -359719 -347763 -270183 -159840 -101577 -132237 -190035 -189137 -117765 -40096
42652 -40096 -24329 -88335 -192881 -267863 -265545 -205996 -153815 -144945 -165000 -200117 -256952 -312606
42640 -312606 -303568 -208195 -95540 -43747 -46907 -51121 -43298 -45364 -54812 -58998 -83483 -153037 -219913
42627 -219913 -207670 -123716 -55304 -50120 -72387 -84502 -95005 -105056 -83628 -32668 -11726 -51817
42615 -51817 -97474 -84991 -37238 -27117 -74303 -130895 -154530 -146724 -121951 -83761 -45126 -42685
42603 -42685 -105113 -209358 -284430 -272870 -189390 -104605 -65365 -51235 -22994 13408 23254 4919
42591 4919 -5477 12136 37607 40064 4693 -63115 -130714 -146412 -92410 -22257 -5373 -39905
42579 -39905 -64670 -54446 -51955 -95306 -159957 -192080 -168751 -112527 -70514 -81173 -136597 -182241
42567 -182241 -179613 -152539 -137721 -119343 -68836 -21916 -38182 -95940 -114944 -86562 -86214 -136290
42555 -136290 -156283 -94005 -17252 -13214 -67770 -109328 -111621 -85978 -27150 56739 101359 52945
42543 52945 -43207 -88275 -48646 27592 92387 133243 139660 99721 35525 -8922 -24791 -45860
42531 -45860 -92730 -141831 -158881 -142247 -126320 -148051 -203133 -234566 -188617 -88707 -20225 -28385
42519 -28385 -72074 -100772 -126901 -179415 -229031 -218931 -148091 -69581 -17132 19477 54459 85968
42507 85968 112632 132338 126949 80598 9991 -50900 -89454 -112315 -116797 -94925 -58935 -34976
42495 -34976 -35072 -54004 -83281 -110553 -121237 -119600 -128377 -147591 -139749 -83149 -14573 13423 -3833
42482 -3833 -34892 -66074 -106253 -152652 -187931 -204277 -205197 -194019 -178055 -164173 -135218 -64400
42470 -64400 24712 56377 -1283 -79961 -98859 -71465 -69331 -113238 -166945 -215461 -274025 -324546
42458 -324546 -316671 -246321 -177086 -165139 -201712 -239276 -240643 -200073 -149731 -141927 -188722 -227359
42446 -227359 -189525 -98776 -48452 -81164 -142599 -165927 -152144 -144913 -164776 -194771 -207314 -184885
42434 -184885 -129296 -63251 -13164 12724 21419 18048 4322 -16656 -46710 -87525 -118087 -105892
42422 -105892 -59539 -32529 -44569 -43053 11690 68634 58682 7909 -3250 27452 24194 -35492
42410 -35492 -84056 -79428 -68352 -93432 -112386 -67459 17113 67760 60326 31907 12143 -8077
42398 -8077 -43324 -87266 -124870 -146645 -144088 -107563 -40932 25442 49531 16588 -42065 -84978
42386 -84978 -110177 -143624 -182655 -192971 -169845 -150369 -142442 -100088 -8989 62965 57163 11566
42374 11566 -11708 -30883 -86989 -127363 -60896 84443 173103 138475 44585 -40134 -120211
42363 -120211 -195212 -216809 -180960 -171115 -240543 -321452 -318307 -234424 -142497 -80966 -44999 -37087
42351 -37087 -58455 -78299 -70834 -61299 -85774 -129998 -158358 -180756 -235908 -318970 -374800 -362518
42339 -362518 -292191 -200964 -121742 -71289 -44886 -24354 -3701 3547 -8787 -24979 -32630 -41791
42327 -41791 -63972 -91130 -108992 -113940 -108514 -99904 -106422 -140660 -184736 -210545 -220353 -229216 -214708
42314 -214708 -140833 -37307 9720 -32281 -102027 -141911 -172944 -232654 -298195 -326601 -327528 -338405
42302 -338405 -357808 -355952 -327659 -288977 -244121 -199033 -183965 -215953 -255736 -245756 -180786 -107255
42290 -107255 -66386 -67731 -99948 -135461 -141740 -117706 -100890 -113156 -124951 -102397 -60360 -33159
42278 -33159 -21120 -7172 -1291 -23122 -58494 -77074 -79229 -84644 -88784 -72931 -46305 -35842
42266 -35842 -40618 -35549 -15459 1266 9141 20038 32104 26288 -4805 -50948 -106161 -171555
42254 -171555 -236175 -275672 -270761 -216000 -121682 -23043 28025 5936 -58507 -107655 -110964 -80870
42242 -80870 -50230 -45663 -65364 -71925 -29671 37585 54324 -20137 -138811 -223887 -250605 -248107
42230 -248107 -242335 -232468 -210452 -175159 -134337 -107392 -109461 -119543 -90803 -13659 56854 61614
42218 61614 4324 -63807 -103150 -105680 -78443 -35049 7396 38952 53866 36596 -22852 -98810
42206 -98810 -150104 -171696 -185358 -183536 -142930 -97403 -120141 -210561 -279342 -282241 -284887 -342393
42194 -342393 -399668 -384931 -328539 -302441 -302253 -282726 -259649 -274952 -296678 -258734 -180237 -144076
42182 -144076 -165434 -177724 -149165 -122561 -131034 -155340 -174671 -186879 -173545 -119012 -67410 -81632
42170 -81632 -137803 -143844 -79379 -31847 -63313 -121737 -128979 -89991 -61011 -57061 -45180 -3737
42158 -3737 52453 93335 99432 80641 74353 102341 133065 120745 76014 51289 56390 44417
42146 44417 -7147 -58988 -77222 -85461 -116252 -154169 -167363 -163358 -169627 -177509 -150272 -86420
42134 -86420 -38562 -52978 -107895 -133816 -96435 -38812 -25599 -63832 -110182 -142798 -174374 -190537
42122 -190537 -140663 -22794 78118 85261 23481 -28747 -43383 -48777 -66368 -96964 -144861
42111 -144861 -204643 -245740 -251431 -242678 -225612 -163787 -54256 24494 10096 -49181 -74621 -78318
42099 -78318 -111930 -146853 -122242 -79214 -117733 -228275 -293524 -265030 -214864 -193945 -164898
42088 -164898 -112072 -97122 -146470 -184374 -144493 -67259 -23090 -10208 7231 21037 6130
42077 6130 -18588 -16754 7653 24877 27134 27436 31862 35878 30578 7635 -17991 -2263 68985
42064 68985 131126 109356 25183 -32568 -33341 -22262 -16036 24685 102427 153723 144780 118313
42052 118313 112607 106362 77022 45906 32060 21921 10574 12282 11557 -28079 -88220 -102369
42040 -102369 -61040 -35634 -72220 -133768 -170718 -174842 -142541 -64247 26162 70201 72448 86885
42028 86885 103724 50221 -73516 -167968 -177427 -151711 -127438 -65307 39879 102171 68315
42017 68315 520 -29611 -32198 -21066 48311 182555 287661 289008 236070 214395 232021 257652
42005 257652 283268 283137 206672 83255 33733 99137 159216 105118 -9387 -77667 -94934
41994 -94934 -103031 -81457 -2765 89021 154308 225946 313810 345356 297061 272214 341837 426863
41982 426863 454146 502959 663423 874093 1043980 1213528 1449302 1713362 1990058 2385716
41972 2385716 2935110 3516762 4192483 5365056 7174220 8870377 9308756 8161771 6260340
41963 6260340 4634414 3588301 2859344 2260946 1819834 1510240 1223381 957511 799066
41954 799066 735594 661902 552682 483873 489468 512762 502757 473078 456952 458825 456585 425483
41942 425483 365030 308333 287749 299730 330010 390479 493648 623687 773308 955393 1129852
41931 1129852 1205827 1196870 1271852 1541680 1908670 2261381 2678092 3263312 3971977 4867094
41921 4867094 6322228 8467310 10476438 11004075 9581557 7183804 5159318 3958297
41913 3958297 3190848 2520792 1987657 1629073 1314847 1002509 804348 736389 662576 533597
41903 533597 452191 456641 443339 353511 259077 215174 183720 146222 149505 197582 225521 216598
41891 216598 228103 272307 287275 256335 248275 306864 396739 484815 586798 716846 878429
41880 878429 1107142 1416114 1685932 1725998 1489170 1137532 859162 699858 603424 525009
41870 525009 450106 367768 281540 214137 175152 155268 155539 177502 187490 147740 83558 60029
41858 60029 90496 129302 154649 189064 230862 238459 202769 171682 178871 201020 205073 188714
41846 188714 157185 107420 52727 21624 17130 12326 -6316 -24825 -31289 -25190 -2954 29439
41834 29439 40725 11167 -30848 -51865 -68724 -107648 -137208 -112685 -65095 -62734 -94089 -80482
41822 -80482 -11365 27138 -14877 -74474 -73891 -28134 -7540 -40470 -95112 -125717 -108526 -58658
41810 -58658 -24997 -37635 -58104 -23763 59174 121855 136152 146027 177804 188565 140749 69220
41798 69220 27083 10172 -13668 -33561 -9166 57791 111896 106833 52168 -6060 -34117 -34268
41786 -34268 -26198 -13303 19532 70895 108193 107947 90699 87453 89066 64753 18332 -14514 -20444
41773 -20444 -22078 -38254 -62678 -78584 -67008 -14325 54240 68724 -10696 -128181 -194212 -198880
41761 -198880 -201403 -218411 -203583 -149236 -122513 -161062 -202823 -175048 -102938 -67428 -85567 -98481
41749 -98481 -71870 -49387 -86476 -167256 -219062 -201518 -151794 -127337 -125691 -98106 -40330 -18184
41737 -18184 -74210 -153775 -174348 -139499 -123418 -155462 -187020 -179206 -158724 -160680 -167342 -142416
41725 -142416 -94503 -65804 -70221 -77141 -59138 -31343 -28691 -54255 -74032 -71792 -81553 -132765
41713 -132765 -182960 -159835 -70598 -5246 -11779 -35498 -18796 7742 -8395 -44684 -46913 -24880
41701 -24880 -25252 -42143 -37755 -27591 -56801 -104394 -102233 -51373 -31372 -78501 -134683 -142283 -119624
41688 -119624 -110830 -117972 -117049 -99925 -73479 -48184 -42791 -71048 -116050 -144674 -145795 -128114 -96291
41675 -96291 -65392 -74811 -136836 -193191 -182360 -131479 -115541 -142832 -156513 -138523 -126917 -129161
41663 -129161 -105854 -55072 -30308 -51687 -73781 -66152 -55524 -62435 -64769 -54001 -63904 -110682
41651 -110682 -159206 -177167 -173972 -166888 -160084 -170354 -214482 -256452 -230546 -135609 -44944 -6977
41639 -6977 -1566 -8071 -38770 -79459 -76371 -20506 24057 13834 -17009 -28036 -32078 -42226 -26213
41626 -26213 37275 112157 159328 186145 203456 189688 142670 117712 168128 283152 412691
41615 412691 512371 547183 506068 433706 390211 363927 291544 175699 94101 67670 20921
41604 20921 -81080 -157269 -135585 -62006 -12234 21237 73519 115915 109438 87792 99686 121018
41592 121018 105609 70900 52104 24421 -43254 -107754 -116351 -107499 -150685 -221999 -240049 -201389
41580 -201389 -178344 -190746 -176186 -95742 10230 85521 116273 116571 105483 103351 112763 106364
41568 106364 62273 -4582 -70068 -125581 -146695 -88914 35885 128069 108201 19801 -34777
41557 -34777 -24152 5779 16180 1330 -34891 -65657 -39464 46896 112881 93762 29840 -9860
41545 -9860 -34901 -78911 -95859 -22158 92494 132537 79885 21143 1199 -18560 -52877 -55982
41533 -55982 -15059 16741 9837 -2383 -973 -19349 -71122 -108585 -89012 -30704 21480 39200
41521 39200 5893 -76588 -159275 -174649 -113148 -31309 23286 51037 62138 51201 20390 -15830
41509 -15830 -54665 -92949 -94852 -22023 101657 203327 242191 233855 197964 133353 48800 -29282
41497 -29282 -87415 -127525 -142497 -125878 -96677 -77209 -61686 -45300 -58398 -121405 -191612 -212564
41485 -212564 -193294 -179093 -170969 -143381 -116259 -128886 -156738 -135532 -61468 8793 50527 86519
41473 86519 119229 128286 128837 148592 153224 86364 -15982 -48520 13809 83320 93335 70643
41461 70643 51827 23614 -16261 -25862 7692 34071 22378 14856 57816 133265 191701 203120
41449 203120 154505 52737 -50278 -91882 -73965 -49172 -30297 14229 71498 80546 36287
41438 36287 5427 10070 -10921 -84677 -142299 -128928 -91187 -89883 -98266 -59477 10337 47506
41426 47506 32110 -2908 -22125 -3718 60085 140054 180848 165156 132354 114483 100263 80321
41414 80321 70469 65642 31176 -31289 -69766 -62905 -51753 -60099 -51371 -2002 50533 74264 89972
41401 89972 109543 98861 53244 39249 100257 180784 204683 172101 122205 62792 4487 4923
41389 4923 96997 212361 252025 205454 136711 84317 40963 7829 3555 28693 66981 109579
41377 109579 148070 169187 181235 206406 222331 168647 51151 -24806 14773 101313 111904
41366 111904 28480 -59951 -82650 -45742 14327 71308 108031 119763 114926 91189 34443 -41331
41354 -41331 -93677 -112611 -131205 -149919 -115124 -13735 77664 91942 58661 36870 25858
41343 25858 7558 10563 51079 68702 12702 -53220 -29133 68633 126940 88436 -2419 -90015
41331 -90015 -156529 -185653 -160938 -109594 -84664 -97800 -118700 -132714 -147267 -153461 -135390 -106962
41319 -106962 -90291 -73181 -36585 -3039 -5728 -31623 -47808 -58424 -80508 -94094 -78728 -67919
41307 -67919 -96208 -120885 -76826 10464 51949 27447 7013 36614 80822 93038 76382 57974
41295 57974 55051 76522 112575 122736 81144 27630 22007 55493 65129 31265 -1683 -4398
41283 -4398 -646 -13590 -27160 -19108 5610 26545 24674 -11778 -69599 -106649 -96938 -67492 -58469
41270 -58469 -65741 -61608 -51494 -63633 -96478 -120745 -123362 -112166 -91656 -68191 -60043 -71586
41258 -71586 -83767 -96546 -138627 -202012 -222754 -174898 -122944 -119399 -114691 -48541 30451 35030
41246 35030 -18325 -44451 -33367 -48477 -103002 -149506 -179762 -223001 -249881 -193613 -75458
41235 -75458 676 -4690 -27852 -26383 -34544 -66334 -69804 -23135 15152 1838 -23218 -13936 7001
41222 7001 367 -20900 -23972 -11700 -6241 -14552 -37152 -73211 -98300 -78810 -24368 15535 17633
41209 17633 4069 -9306 -33130 -64586 -77658 -64889 -46956 -36931 -33679 -41593 -53083 -32231
41197 -32231 28370 62167 12357 -64930 -68246 -2968 32093 492 -36954 -45323 -58015 -75628
41185 -75628 -38796 55597 113889 75607 501 -25938 -844 29265 42697 39141 22336 22027
41173 22027 72763 141515 143014 58884 -24680 -29497 29541 98916 153793 177133 142080 56264
41161 56264 -31924 -98864 -161343 -213115 -217056 -176956 -140240 -113506 -60714 -777 -5184 -68369
41149 -68369 -86907 -12963 73875 99701 98687 120820 136623 107071 60503 25663 -28920 -113925
41137 -113925 -159938 -120487 -59086 -50569 -66982 -47919 -16602 -31998 -80389 -107159 -112254 -128435
41125 -128435 -145258 -136602 -127106 -153135 -189551 -184847 -136010 -67142 22271 120274 160687 97290
41113 97290 -14340 -82968 -99854 -122026 -168667 -206548 -217564 -214783 -204677 -184423 -160155 -129881
41101 -129881 -77180 -15977 963 -41772 -84812 -76441 -42642 -29879 -34072 -38133 -61200 -109090
41089 -109090 -129669 -84551 -21550 -13665 -64341 -125873 -170883 -200162 -224810 -275586 -371423 -451602
41077 -451602 -424033 -318316 -283222 -370272 -437105 -355861 -202823 -125728 -127777 -121971 -112467 -162768
41065 -162768 -239221 -246402 -191916 -171482 -204293 -214903 -170773 -117445 -83427 -60462 -66871 -121417
41053 -121417 -166647 -126930 -32471 17159 -3715 -43481 -86997 -155324 -212069 -196261 -141678
41042 -141678 -141193 -195922 -220112 -190498 -163914 -148968 -97033 -29681 -32363 -96308 -107817 -34777
41030 -34777 12204 -41295 -121074 -138263 -121814 -137238 -165463 -147071 -82206 -15388 29127 43760
41018 43760 18138 -32630 -64988 -65179 -66636 -89254 -112337 -122420 -131056 -134512 -118464 -109180 -147648
41005 -147648 -205677 -209761 -160688 -139388 -171947 -183087 -119007 -27147 28747 49217 49912 15300
40993 15300 -43714 -60608 -2415 72520 101138 103437 130558 179550 216264 236586 248356 229541
40981 229541 159057 65328 977 -14641 -1559 11879 8801 -6122 -10615 -3710 -29269 -116343
40969 -116343 -210397 -227792 -173119 -128276 -123510 -106379 -56830 -39467 -96650 -166909 -166529 -97900
40957 -97900 -26381 7022 6334 -9172 -17674 -5119 13226 7099 -24402 -54666 -72456 -80237 -61784
40944 -61784 -11553 15263 -39851 -131184 -145382 -59377 25785 32509 837 1209 35563 68646
40932 68646 86726 81775 39508 -19684 -47963 -48719 -83739 -173000 -256986 -291269 -306419 -335709
40920 -335709 -353997 -332250 -289927 -252692 -216948 -189167 -195941 -222605 -210330 -148784 -102701 -112173
40908 -112173 -137614 -137193 -123602 -108910 -72358 -21155 -2750 -19421 -16697 7398 -17815 -99985
40896 -99985 -138532 -80601 -12706 -16956 -44386 -28991 -24430 -105726 -215343 -238115 -175675 -122931
40884 -122931 -112204 -99723 -75906 -71599 -71271 -28740 37231 60231 35794 25059 50338 71051
40872 71051 67167 68164 87464 94252 65788 18022 -25986 -60681 -88672 -113322 -131404 -116168
40860 -116168 -38682 70701 127874 98601 47317 38109 43349 11017 -32798 -29047 4286 -7397
40848 -7397 -81627 -159344 -189614 -172337 -128123 -82593 -68119 -88309 -95854 -56966 -19344 -59553
40836 -59553 -173888 -273770 -285019 -212165 -114694 -54558 -54233 -78404 -73308 -38058 -19972 -25531
40824 -25531 1336 76409 119882 63664 -43652 -108183 -119496 -134172 -169303 -190788 -185012 -171204
40812 -171204 -155160 -126539 -86774 -35737 41239 128544 161654 108826 35127 24990 72682
40801 72682 109145 105855 87948 68936 36704 -7229 -42951 -54515 -27133 48769 143359 200231
40789 200231 212966 235475 285491 308855 285001 287114 369950 470213 494996 446323 384118
40778 384118 332663 303395 339786 445890 530906 518813 456141 420562 390267 309926 221339
40767 221339 206645 248825 266318 243972 216443 170879 89541 40573 89960 163246 139980
40756 139980 54335 46069 129607 178085 142409 118105 160820 190921 138970 56806 19498 21250
40744 21250 28450 47724 86355 117507 128872 145944 181345 221257 272972 356448 440875 463013
40732 463013 414534 338440 243585 109593 -24060 -70705 -13328 74279 132381 162297 171308
40721 171308 161222 172435 244526 328759 334044 262219 200317 179234 146937 85578 41441 27086
40709 27086 8297 2903 73685 202201 290338 312973 344851 404586 404862 307462 200503 158601
40697 158601 142165 102281 74122 90085 100565 62853 24453 41632 89999 123085 144679
40686 144679 160366 137146 79019 64461 134838 216204 226124 191873 185900 205026 196111 154653
40674 154653 117689 91316 55369 16943 1935 11766 30631 54260 79528 92019 90544 96223
40662 96223 118853 145728 173165 209377 241979 251531 259085 301499 355736 354033 283624 204801
40650 204801 161292 142553 141952 173619 216704 220529 183439 155355 153298 152664 166711 243239 369873
40637 369873 475871 542077 611222 673530 650427 522594 373781 275657 223496 207399 240872
40626 240872 293437 307280 309378 387814 523945 578454 492044 370101 310258 275714 208691
40615 208691 142875 121304 115721 107744 142137 222050 261029 219382 179989 208619 250556 249170
40603 249170 250212 295765 332221 325932 353118 459953 545156 509917 425758 419483 479121 512533
40591 512533 521302 570128 641556 666818 665100 718625 828452 907765 904601 839711 742255 628166
40579 628166 521762 436783 365547 326425 360005 434826 444763 362100 296974 329499 386932
40568 386932 378882 345349 356286 365970 302051 218503 219576 290134 330730 309994 264070 200442
40556 200442 120896 83991 124209 161779 111368 26437 15496 69566 97948 85014 83884 98637
40544 98637 98241 106286 154303 186929 134687 39881 -8187 -15796 -39347 -49246 24213 149700
40532 149700 236700 284809 357310 439770 464069 447059 465934 513116 509349 447233 394161 367054
40520 367054 328371 289730 293886 308052 258938 162089 98987 82361 61482 39626 62465 105866
40508 105866 97019 35407 -17631 -47061 -72297 -63608 8610 78734 67482 19027 24477 56293
40496 56293 28053 -26971 -4845 75241 104110 87999 134174 236998 270297 207199 158893
40485 158893 165847 136556 39262 -25315 -5961 8776 -42800 -84303 -38760 44951 82053 68068
40473 68068 40714 15106 7179 37120 71960 47424 -28405 -78145 -72851 -52895 -28997 27802
40461 27802 89663 82422 9214 -47844 -62008 -83661 -119170 -113381 -71392 -71382 -127994 -161847 -134795
40448 -134795 -102272 -101641 -96099 -58041 -10547 32404 75275 90576 57854 39235 103243 192805
40436 192805 196148 127578 95958 114324 100621 55903 67787 132670 152692 125295 155305 252326
40424 252326 298095 252914 215698 234543 235348 189901 178134 223054 233931 177037 139014 160230
40412 160230 170119 146275 164721 227801 221722 121806 60841 105981 144248 88403 26049 54578
40400 54578 126760 174017 233966 337906 408294 385392 334954 325525 316300 261216 204287 181615
40388 181615 149075 90328 71976 113538 133710 99700 88779 127985 127616 56442 20081 72558
40376 72558 118417 106078 143156 293512 426792 413359 321411 276720 263725 210497 143672
40365 143672 115134 90464 43340 44414 127368 185203 130148 42227 33287 79211 109223 139920
40353 139920 193988 207370 147112 105212 150887 207988 198948 183371 229769 280317 270665 252649
40341 252649 272148 264964 203639 196912 300922 385654 343459 276000 309457 381698 394601 420375
40329 420375 547833 660628 594370 412940 314223 344140 401379 443116 489644 498205 425377
40318 425377 359634 420726 578606 717529 815169 925753 1062264 1217597 1420653 1682531
40308 1682531 2006091 2502719 3274299 4058502 4275028 3669326 2691682 1974438 1635904
40299 1635904 1386597 1106321 931278 886655 823780 700837 610008 543893 415607 280633
40289 280633 266935 320236 286981 206843 243430 363089 374885 269330 224397 279262 291577
40278 291577 228692 216325 271975 263073 166644 113028 134367 118965 53688 65172 172751
40267 172751 235222 196498 168348 222420 301174 365736 433478 455038 363072 250638 280516
40256 280516 409331 432658 316219 239846 286839 335386 301535 254368 238486 203537 159002
40245 159002 188028 267168 277531 219700 206242 231178 180379 82623 96478 220955 280777
40234 280777 236929 241853 334817 361897 273673 225794 287012 312365 218220 132343 148532 166662
40222 166662 103261 43210 57552 74822 49900 60946 127287 131813 39122 -5302 88561 205213
40210 205213 223427 188090 174311 153792 102728 78050 89012 51745 -45348 -92067 -42421
40199 -42421 17127 43570 100273 189004 213894 172819 185115 270119 306523 268799 279271 359189
40187 359189 365024 253928 173947 196930 198833 106814 29974 36843 35983 -11029 8624 128352
40175 128352 204538 168249 146332 214859 264354 228749 209643 250015 231478 129402 116104
40164 116104 259104 365208 287741 150521 102127 86291 30046 25092 135663 242933 259888
40153 259888 289070 395446 441810 327460 174815 104160 43015 -65922 -99528 12547
40143 12547 116614 93233 63638 140436 202042 130617 53327 118869 236960 264123 253612
40132 253612 300983 332842 266797 195649 204865 197119 98787 37750 110966 186629 148219 114955
40120 114955 197769 263605 183895 96980 169945 307293 347842 343520 388557 384133 240670
40109 240670 110582 148927 238970 220475 184438 266917 362057 331608 294353 405229 544298
40098 544298 534095 474597 546406 665911 658346 596923 643359 719032 661369 545519 527134
40087 527134 529776 416798 307425 381246 525662 521942 430641 445962 516532 465707 349258
40076 349258 337844 376314 312591 232577 310647 456328 466419 400013 444224 538568 499242
40065 499242 389666 397370 465982 419078 323274 354713 435880 386929 302398 381619 518982
40054 518982 474150 324313 327485 453493 475225 412645 455335 553099 520734 445353 549555
40043 549555 752904 809617 768657 844467 954438 864696 679365 686794 825109 807912 675778
40032 675778 698915 836102 836185 777600 935646 1201522 1228812 1087651 1163258 1462785 1648840
40021 1648840 1709314 1945056 2335929 2591595 2793790 3295512 4047877 4789437 5802334
40012 5802334 7517959 9314412 9770600 8438315 6444354 4976004 4061357 3261107 2630597
40003 2630597 2356335 2173020 1819391 1538456 1568717 1643252 1490682 1328130 1384442 1442075
39993 1442075 1312244 1247899 1423204 1526426 1338460 1184310 1328928 1468705 1329801 1218021
39983 1218021 1427223 1646294 1537150 1375530 1510837 1706173 1648871 1605858 1902625 2250815
39973 2250815 2297653 2351541 2815772 3390903 3653499 3965185 4917716 6262568 7290922
39964 7290922 7915256 8471493 8868263 8962646 9377184 10779345 12704861 14379530 16330265
39955 16330265 19630302 23941726 28473380 34873218 46099493 60755680 71067884 69546087
39947 69546087 57029162 41749658 30743092 24519911 20096856 16119550 13251000 11538392
39939 11538392 9943303 8109295 6753785 6184191 5755714 5037437 4414377 4176514 3932577
39930 3932577 3377612 2877095 2777855 2770029 2474897 2130825 2118827 2254915 2158651 1958285
39920 1958285 2007953 2199984 2189161 2063572 2158678 2401696 2487608 2538189 2896274 3368876
39910 3368876 3386934 2894588 2396579 2121881 1831173 1484736 1380121 1517404 1515096 1297246
39900 1297246 1208435 1313536 1257565 976795 860739 1017426 1065312 869043 789596 964422
39890 964422 1036998 868029 815060 1014373 1088687 883191 784244 969681 1057969 863818
39880 863818 776687 997300 1131529 965773 906212 1189926 1401303 1266010 1187049 1464760
39870 1464760 1717875 1643209 1633673 2050758 2570643 2833690 3045669 3351274 3344295 2833099
39860 2833099 2371865 2381765 2460517 2206709 1966778 2075984 2142801 1832520 1586351 1786309
39850 1786309 1979934 1732919 1465309 1614754 1776043 1535585 1333304 1586522 1803167
39841 1803167 1524259 1283821 1616329 1987694 1790760 1517128 1796652 2163007 1984910
39832 1984910 1734418 2049525 2418879 2145583 1748576 2001707 2444292 2306265 2040954
39823 2040954 2406572 2896792 2689533 2289367 2561045 3012079 2776701 2399280 2800037
39814 2800037 3394199 3187874 2799033 3316414 4109515 3987390 3568333 4129765 5068343
39805 5068343 5037131 4647352 5326494 6442915 6477560 6116524 7050662 8622512 9034163
39796 9034163 8977744 10418864 12672531 13672265 14266126 16878558 20750556 23373823 25870371
39787 25870371 31475516 39323376 45925039 52365642 62964191 76980671 89918048 103345086
39779 103345086 123718308 150948103 181231622 223908448 296639764 390647526 456256344
39772 456256344 445133553 363473827 265500482 195828384 155872521 126633398 101398696
39765 101398696 84550341 74374625 63744287 51998541 43835274 39285653 34095510
39758 34095510 27908193 24058230 22575456 20251966 16777671 14806654 14499289 13342775
39750 13342775 11056708 9861089 10015619 9453525 7840641 7014581 7282957 6943442 5684521
39741 5684521 5090262 5482970 5377952 4417012 3957202 4356150 4357894 3605493 3261264 3666752
39731 3666752 3719990 3066814 2733277 3077511 3153003 2619395 2366885 2719239 2825490 2369443
39721 2369443 2173436 2559037 2727518 2331440 2131169 2509041 2775455 2552150 2482974 2942629
39711 2942629 3316434 3225382 3285974 3957019 4707126 5056267 5482159 6525886 7828593
39702 7828593 8868445 9990374 11853366 14329211 16914169 20166440 25735198 34165788
39694 34165788 42783582 46721249 43065489 33966083 24759388 18888064 15637366 12912172
39686 12912172 10434796 9069886 8545179 7769042 6727655 6260227 6258812 5752778 4660840
39677 4660840 3892670 3689550 3336366 2629842 2218206 2275483 2168421 1709677 1492261 1678424
39667 1678424 1652426 1212009 959000 1139625 1195665 862527 657503 850630 955128 691484
39657 691484 509976 693544 835862 670411 565840 743889 825712 606148 487389 697043
39647 697043 841806 676599 564373 734261 829719 646804 591175 928639 1281536 1352619
39637 1352619 1476997 1954694 2456891 2587231 2461574 2285581 1934308 1390521 1028510
39628 1028510 1018567 989974 694249 448642 517407 622981 496875 360007 425481 466872
39618 466872 308855 212356 348905 427390 263852 174212 364717 489236 280320 72453
39608 72453 198528 390137 301040 134491 212219 375479 353889 304648 448940 571008
39598 571008 411664 191187 223271 358524 312355 202902 265436 360770 260894 116701
39588 116701 167321 279641 227708 130634 176893 224049 104988 10523 130796 246114 121361
39577 121361 -28235 71334 230903 152235 -16770 18079 142460 88699 -32347 31170
39567 31170 156957 81530 -84738 -73393 36215 16927 -24674 137046 362541 374670 271982
39556 271982 322724 440893 366534 187061 175009 268344 211497 64529 75742 184740 145867
39545 145867 21046 59096 197499 172128 24490 19151 143348 160378 79860 107107 199030
39534 199030 138228 -12830 4607 158351 176930 47400 13659 110271 140197 93363 148689
39523 148689 269937 231075 48757 -24239 55777 84600 17602 14823 70403 -150 -173439
39512 -173439 -206621 -55926 54955 26355 -1850 37076 41606 -2922 11175 63602 16994
39501 16994 -106275 -142755 -78412 -40180 -27607 54079 136872 75871 -51915 -49462 51529
39490 51529 66209 14119 53462 125942 45938 -105011 -71239 113111 156096 2051 -107001
39479 -107001 -76182 -61864 -102192 -45598 100574 139201 62170 82505 225686 268111 157251
39468 157251 114474 226329 300483 234480 176289 205443 191108 82324 18134 38962 703
39457 703 -121795 -158281 -70169 -41532 -141105 -203483 -150378 -119790 -168311 -154855 -33980 39730
39445 39730 13101 36616 153202 193726 105306 75373 193469 288502 243487 182094 200401
39434 200401 198924 125573 103914 172441 172216 41354 -50881 -8221 29076 -31014 -66054 -12069
39422 -12069 -16999 -149194 -230571 -146552 -56745 -103135 -164508 -104793 -22545 -39968 -66859 9981
39410 9981 104397 106366 93366 166672 248216 227840 153629 109220 63712 -3893 -2685 96615
39398 96615 158326 97766 27406 49717 85865 49277 3895 9469 -3659 -67777 -78090 3171
39386 3171 40747 -37401 -102025 -60985 -21922 -68202 -94988 -33156 -12454 -118482 -202059 -125342
39374 -125342 3577 35832 22835 54869 56993 -43201 -128145 -83279 -5734 -14842 -28010
39363 -28010 63852 168159 155673 93345 96421 105816 33229 -24386 56294 187327 210456 146665
39351 146665 97370 36389 -82722 -150677 -63045 65240 68270 -6619 -20262 -1839 -57119
39340 -57119 -132274 -107779 -30989 -24342 -52423 -7241 61876 32042 -56835 -71103 -17211 5952
39328 5952 12180 69306 110028 25791 -109265 -127890 -35949 19531 4353 15344 80422 132827
39316 132827 155151 175766 159807 66948 -30387 -43274 -19886 -49635 -93264 -73147 -43321
39305 -43321 -87905 -138746 -88608 -1092 -1924 -40022 24117 156247 199330 139412 99844 106451
39293 106451 76589 18040 26116 93445 119499 98911 113181 149021 110905 6034 -58188
39282 -58188 -50338 -25323 15387 103651 173266 126504 12399 -33386 -6778 -23632 -110416 -175756
39270 -175756 -175363 -146543 -100192 -31302 -3012 -64599 -129899 -98670 -41941 -87601 -182569 -172392
39258 -172392 -69549 -23270 -50981 -27091 64893 92459 5841 -92006 -131953 -150672 -156483
39247 -156483 -103181 -21211 -7414 -63566 -98812 -96349 -120698 -165479 -160046 -120837 -126250 -149912
39235 -149912 -94678 16919 69021 60795 97582 177286 186520 121004 108333 184998 242238 224158
39223 224158 195261 180546 120759 20846 -32223 -30743 -55305 -102754 -85029 -19770 -29272 -116045
39211 -116045 -134006 -30345 72080 87783 82512 115331 140613 129558 126132 124618 51838 -74418
39199 -74418 -129180 -75518 -18790 -19570 -18124 5665 -25445 -115261 -135358 -21105 120846 179940
39187 179940 181452 187962 190550 167125 134863 92512 19220 -41403 -17685 54125 65663 15975
39175 15975 3659 35737 17379 -55700 -82573 -57105 -83333 -156787 -141460 -18871 53172
39164 53172 2401 -46745 -7692 30400 -217 -11474 60532 123838 101188 65378 83867 86197
39152 86197 8163 -76684 -86513 -60201 -55647 -50706 -34254 -57904 -115199 -114927 -49563 -31193 -87675
39139 -87675 -102348 -37473 -18798 -95312 -123227 -18739 78322 45615 -10558 44898 142144
39128 142144 153583 115859 120850 129579 79254 42428 95740 153601 112366 40045 44305 73355
39116 73355 33674 -12791 35086 113190 106030 66369 112083 189751 160040 57029 44980 152606
39104 152606 251435 275166 274405 271377 237321 204500 236592 293833 279310 212141 209826 304520
39092 304520 416877 511195 641261 828109 1003025 1086968 1049454 904512 724237 620599
39082 620599 628806 649147 589535 513922 553803 722196 911881 1028193 1030689 903477 689553
39071 689553 504468 418575 376357 313091 270683 297622 324247 263473 160165 110860 104769
39060 104769 77054 51861 90633 155389 165294 140400 152356 181202 159636 113055 114286 139791
39048 139791 112423 52679 47410 94888 114638 89539 74773 88015 103279 123721 155237 150784
39036 150784 86262 35239 57212 81157 24288 -52503 -52667 -28985 -93713 -207759 -238217 -178926
39024 -178926 -132057 -107281 -28897 76491 91054 8770 -46738 -18350 29514 58104 98090
39013 98090 134730 102375 12763 -47286 -56515 -69644 -92550 -81492 -55406 -66746 -74908 -1243
39001 -1243 102594 105060 9387 -50739 -33272 -30166 -71661 -67750 15613 85323 74131 23090
38989 23090 -25357 -78893 -111916 -72591 -1450 -2553 -72685 -102737 -65677 -43606 -44419 33457
38977 33457 206183 342385 356756 313089 277957 227041 159778 150886 211620 242895 200591
38966 200591 167480 188218 179269 88262 761 -8938 -2360 -49125 -95112 -68133 -11922 -5216
38954 -5216 -32202 -32299 -3513 30516 83762 160275 215950 239349 298625 440639 610934 728066
38942 728066 763484 705139 537508 315174 160729 123929 128474 112093 117343 178330 226328
38931 226328 196347 136910 123926 143747 147220 144884 161069 160869 111127 58466 64826 112504
38919 112504 144776 155176 170655 189239 195345 199871 214837 222757 208051 182403 157225 136366
38907 136366 145103 204775 273149 286109 264726 292725 379271 444280 452509 450360 450496 405032
38895 405032 326644 304963 353354 368809 302786 242282 252409 269013 231687 199101 232925
38884 232925 275010 243765 163253 102037 67362 47047 71835 148177 206612 197524 164021 153945
38872 153945 146536 129884 149796 208844 222147 153070 86746 87612 98050 68255 65367 146329
38860 146329 237767 259199 257024 294958 319305 264831 193398 187749 199356 145279 72157 78177
38848 78177 148572 212978 288853 415366 517114 497840 414604 396909 438434 429860 359746
38837 359746 317786 321098 297692 236250 206151 226012 239373 221502 200430 184133 169827 198339
38825 198339 293620 386405 409344 419275 501056 604763 622944 583487 607792 707676 783167
38814 783167 801526 818883 836141 792498 700832 641904 628762 618541 640429 757720 921893
38803 921893 1027505 1090928 1199011 1305388 1281446 1163720 1135390 1251881 1404689 1569176
38793 1569176 1844100 2218519 2570069 2945611 3549822 4389778 5287004 6359323 8018028
38784 8018028 10136916 11618162 11340402 9427306 7116240 5425053 4398592 3646474
38776 3646474 3051674 2697603 2505352 2310641 2120865 2023604 1965015 1843968 1719286 1711013
38766 1711013 1779232 1801453 1799453 1887525 2048912 2172443 2284543 2537251 2966086 3451759
38756 3451759 3924294 4419669 4966063 5664110 6843990 8731278 10789212 11794010 10956660
38747 10956660 8805428 6626360 5165417 4230760 3430835 2771597 2400788 2211501 1999334
38738 1999334 1773565 1645229 1558685 1371269 1099938 880742 747824 629415 512338 450649
38728 450649 445699 453035 474192 523076 545297 490654 422300 433538 496423 511840 468824 429968
38716 429968 395993 318333 224457 198285 241114 270392 253934 235428 231354 212800 190827 214488
38704 214488 277157 319225 327380 342296 369022 368275 335664 306109 285168 255729 237167 252997
38692 252997 262067 217189 170672 216616 341766 439755 464085 460512 456170 427752 378127 336630
38680 336630 286124 198519 134203 183118 305616 360803 306401 242362 236758 241898 217146 202726
38668 202726 219811 216095 169865 143303 172714 200802 176246 132644 112418 96377 66280 59855
38656 59855 104870 163631 193316 202641 209690 204459 186381 176875 167927 124295 58938 34037 65841
38643 65841 104251 124691 156504 202378 223812 230715 283992 375641 410992 353174 280808 252849
38631 252849 225235 164751 135279 185247 243385 224255 165712 164073 226969 283622 302676 315084
38619 315084 343761 378537 403001 397471 340624 249039 184716 187383 232539 283977 342815 413095
38607 413095 468336 490231 496379 495132 457695 369250 265013 184051 127498 86734 69138 74157
38595 74157 87765 115008 169591 225210 238642 227705 254049 316886 344081 308532 269356 268538
38583 268538 268752 228866 164800 101577 39828 829 26369 100798 150243 148301 141535 145994
38571 145994 114039 38056 -13174 -5446 12456 18694 73227 202631 327324 370834 355087
38560 355087 325747 274299 202391 173680 223978 295060 327189 343067 374604 385351 339688
38549 339688 282935 284175 352183 453078 550852 602385 589731 578125 649712 769419 834277
38538 834277 863242 986652 1226208 1462615 1660118 1927331 2316551 2812232 3578685 4858715
38528 4858715 6398580 7306685 6878434 5418649 3904407 2942383 2402703 1976366 1635234
38519 1635234 1453016 1348644 1208439 1051711 924662 786634 613308 474911 418712 393185
38509 393185 357077 343233 356751 335326 269286 237969 268453 279983 229538 191452 223472
38498 223472 266850 254414 216376 202518 189653 143157 94481 87375 111077 142982 193139 256426
38486 256426 285582 260387 224989 218247 226791 235259 252994 263033 222511 145654 104041 107993
38474 107993 75053 -37388 -154694 -195110 -174900 -141738 -83070 23356 132296 184600 191404
38463 191404 193533 180663 124990 61604 58310 118679 177609 187836 162093 133863 117764 110188
38451 110188 102167 91349 91957 118895 153298 149627 94471 34040 21308 52831 76748 52113
38439 52113 -10387 -56553 -36281 42512 113432 125923 108936 129660 200821 271832 306714 318797
38427 318797 320282 291807 227440 166803 148099 156340 150582 124806 110021 122714 141138 141627
38415 141627 139972 175826 254413 323530 326193 265944 197669 160135 144553 127338 103753 86040
38403 86040 93006 138878 208684 259034 274381 295980 348869 377181 325003 249776 260469 361544
38391 361544 464173 540182 643148 778049 886896 979974 1141162 1378666 1613161 1833685
38381 1833685 2106526 2416385 2690473 2998065 3502200 4212594 5101529 6474286 8698074
38372 8698074 11280898 12734267 11936441 9428893 6844652 5195389 4256258 3511947 2968360
38363 2968360 2808783 2842972 2721445 2398651 2052200 1748791 1461099 1246762 1161962 1114676
38353 1114676 999982 873450 828818 819403 753904 656579 586915 509717 384401 277140 249378
38342 249378 237107 169574 104494 117148 158397 154257 147281 204808 279566 296220 289209 319697
38330 319697 340431 286098 224861 271213 400349 493170 535316 641566 888686 1213659 1464154
38319 1464154 1494388 1261469 892048 598861 471986 415640 333811 272381 301661 370457
38309 370457 386843 358540 344189 337868 304562 263946 246570 235258 229878 282486 380549 396554
38297 396554 261239 90853 26616 42097 34133 9968 41774 115055 170412 232619 357597
38286 357597 513930 658124 858624 1182288 1506570 1615245 1463049 1198669 948870 730558
38276 730558 558843 477494 461685 424763 348525 300699 310806 330338 326707 323194 336775 357430
38264 357430 387612 426948 432667 375902 318825 351293 465610 571004 610160 586665 510109
38253 510109 398263 303879 257059 212201 127390 49969 39182 58822 45974 34993 104183
38242 104183 240577 363017 437618 468325 427110 310708 215243 226856 281811 263700 192203
38231 192203 172716 200534 175795 93933 60085 112273 178398 216046 252796 275726 220855
38220 220855 96831 -4201 -39971 -49945 -46918 424 62842 53190 -37726 -114951 -113883 -66936
38208 -66936 -24134 -1036 -10625 -53655 -78957 -44193 280 -14143 -48643 -24691 17287 -29628
38196 -29628 -148067 -212380 -189756 -166913 -172061 -137119 -59824 -36537 -91031 -124796 -87902 -54750
38184 -54750 -75357 -88284 -41425 24123 64498 89594 85647 6652 -110256 -148823 -85574 -33508
38172 -33508 -62168 -101073 -78878 -30249 186 35452 79088 72086 10540 -9512 59439 133485
38160 133485 136986 114190 123165 129208 92773 63084 90338 129963 122266 90953 82813 82890 63407
38147 63407 46127 49237 43066 18225 22903 76289 122710 123161 107811 88956 19358 -103444
38135 -103444 -189858 -182038 -131949 -92554 -31472 74918 161980 174270 153416 150037 136296 83954
38123 83954 39131 37640 33964 -3873 -19351 26845 67420 37331 -14313 -15529 10853 19036
38111 19036 44264 126113 203733 202064 160270 163428 201326 203809 168243 145138 135714 102591
38099 102591 50219 8188 -31568 -83352 -112561 -84867 -28198 19491 70414 129254 142853
38088 142853 87933 43926 88192 173162 194898 133268 43173 -37334 -87692 -73775 -4401
38077 -4401 37105 2797 -38487 -14050 28825 9689 -44442 -55867 -32377 -30791 -38535 -10959
38065 -10959 21746 8335 -6611 49718 128485 115980 23538 -19544 32700 80412 40424 -42369
38053 -42369 -82015 -60269 -12050 30768 52454 57586 72395 102798 101701 24732 -98354 -197067
38041 -197067 -242755 -248521 -218334 -155961 -97458 -75688 -76745 -80205 -104565 -160184 -203946 -200077
38029 -200077 -174976 -150090 -85061 33652 116449 84612 5532 1849 66631 86993 26803
38018 26803 -32281 -24939 28791 88883 135898 144757 101736 47906 34001 43736 32446 16432
38006 16432 39586 74944 54736 -13359 -53468 -39682 -17436 -9342 10702 43290 46582 7713
37994 7713 -36492 -60323 -74647 -91099 -111460 -142789 -172995 -152184 -55652 57057 106241 92129
37982 92129 72433 69928 67797 67971 84279 99852 93154 79689 72263 39793 -33476 -96524 -108493
37969 -108493 -113214 -158389 -198303 -170139 -114042 -112724 -153853 -159762 -119617 -84631 -60942 -15520
37957 -15520 33249 35624 4797 -4338 9130 8461 4532 31856 68009 69573 55869 65425 71648
37944 71648 39519 13615 37808 44448 -44255 -154338 -148081 -40044 28390 8323 -20064 -18011
37932 -18011 -30355 -49312 1765 119100 196452 185672 150204 130932 88147 10260 -43322
37921 -43322 -45689 -38055 -32786 8371 72467 85879 39954 18172 63147 117525 129886 121869
37909 121869 117345 96505 52447 13220 -13800 -45606 -67701 -54249 -36292 -60726 -96271 -80856
37897 -80856 -42675 -57302 -100099 -71665 33958 120054 147448 165618 176209 113411 -11306
37886 -11306 -84121 -48198 33309 104705 184971 273114 307826 266614 204772 164961 142664 152681
37874 152681 220755 298049 300298 246912 246190 330818 425140 482958 534992 594610 645818 727867
37862 727867 891498 1062032 1091425 962932 802238 675993 535945 380607 302443 329448
37852 329448 370179 361451 333952 300099 221314 119830 79167 101484 104135 77090 92197 140640
37840 140640 128878 60384 46961 107264 131984 87399 71134 118423 136050 85689 55492
37829 55492 88608 110975 87516 82227 110275 100645 54639 66597 140806 169044 134785 149723
37817 149723 239777 291066 260151 239888 266689 265990 235249 265936 337821 319995 224730 215808
37805 215808 308958 325367 212707 139210 182671 207102 151071 151076 255287 300350 213192 158667
37793 158667 240825 329857 332976 358624 456561 479513 371735 312383 396718 458826 391457
37782 391457 349558 441411 513204 452751 417404 534815 654779 625052 545438 530543 493804
37771 493804 381316 339403 437162 508165 468270 482969 622617 691154 607433 595448 772882
37760 772882 930407 949273 1031330 1273228 1448587 1468404 1591257 1911515 2147949 2218096
37750 2218096 2459863 2993857 3510226 3999717 4907461 6120693 6686969 6168115 5418630
37741 5418630 5306210 5554044 5671986 6057646 7142848 8405186 9410489 10878445 13394473
37732 13394473 16112858 18305947 21062169 25567059 31103706 37435392 47652282 64178267
37724 64178267 81655338 88713571 79532965 60621181 43477205 33145327 26933190
37717 26933190 21695213 17639778 15385002 13660244 11334648 9096718 7793503 6911296
37709 6911296 5771493 4750832 4315898 4029791 3412869 2821119 2681496 2680167 2409956
37700 2409956 2099025 2061660 2066950 1831230 1566210 1517815 1485091 1268004 1094554 1159200
37690 1159200 1207768 1005564 776337 770390 814728 687150 544513 590839 678811 613419 522075
37679 522075 572419 632621 544316 438324 465327 499797 412641 352890 457292 555563 467782
37668 467782 336258 362357 457827 453226 419446 483623 540029 443132 300542 287907 340602
37657 340602 298243 197932 168046 179402 145295 125705 198227 262779 199146 88346 65689
37646 65689 85766 41161 -16104 20064 102912 128293 122326 149838 154576 71785 -17251 -17271 14404
37633 14404 -216 6103 103771 191834 152578 58621 40731 68739 50493 27857 75445 114494
37621 114494 35309 -85153 -90748 5421 72611 90249 132940 189664 185347 136155 112763 95271
37609 95271 25006 -50436 -44721 2510 -13312 -78848 -94575 -50262 -19405 -12312 22380 79090
37597 79090 111213 134414 188295 231964 205295 158325 190235 288757 356818 377306 431438 564713
37585 564713 734706 875278 928657 848792 661546 485046 406669 381286 324641 243243 185426
37574 185426 137233 70880 28694 48136 67414 21033 -32627 -629 86035 132116 144511
37563 144511 200109 282538 292630 210107 118885 73692 51864 35633 39379 50601 31329 -16971
37551 -16971 -57965 -81596 -102350 -119524 -135412 -176616 -236638 -242691 -149595 -24512 29396 -9608
37539 -9608 -98795 -203136 -281322 -268867 -160830 -54558 -31289 -55427 -62915 -68630 -98297 -102290
37527 -102290 -45215 1646 -23556 -44794 31707 142585 160779 105178 98968 159587 193415
37516 193415 178148 184633 213905 171412 34443 -88304 -106588 -53985 -7986 6595 1623
37505 1623 -15039 -35623 -54296 -76574 -89627 -50324 45732 122933 117883 70086 51262 56146
37493 56146 44844 36997 66649 95347 76398 57992 107960 178359 168790 92775 52977 70560
37481 70560 67227 10018 -47629 -71132 -81681 -86113 -69228 -53253 -72665 -101702 -97266 -88865
37469 -88865 -126337 -169709 -144526 -77949 -56381 -71164 -38502 42129 87602 84703 104776 158521
37457 158521 173230 131003 99103 102477 91067 53660 38211 35303 -31243 -164263 -262174 -262628
37445 -262628 -208187 -143372 -62021 14514 26976 -15760 -31645 -643 7814 -26275 -31486 14153
37433 14153 27539 -30966 -68918 1772 132714 216070 217444 171567 115826 78620 67893 35619
37421 35619 -73991 -216054 -272421 -215656 -149427 -151647 -180557 -179961 -170267 -176010 -162023 -109319
37409 -109319 -68944 -75290 -83513 -53074 -19000 -24781 -57227 -96466 -153045 -208774 -203873 -131584
37397 -131584 -60584 -17907 53270 165114 221549 158807 53993 10466 20099 22104 14235 14656
37385 14656 -9123 -75106 -114421 -59202 51042 136775 194988 260212 305633 280799 207337
37374 207337 147454 112688 84715 84631 133306 178279 150668 71264 18589 14471 20431 25478 53918
37361 53918 93757 91248 19962 -94883 -212417 -294915 -312372 -272306 -222142 -186232 -137259
37350 -137259 -66598 -27700 -53831 -89153 -73464 -45919 -80907 -158666 -190207 -149351 -93210
37339 -93210 -63091 -47788 -42077 -63455 -102894 -123382 -116130 -105482 -96206 -68361 -27951 -13802
37327 -13802 -45960 -102642 -148868 -159803 -127453 -76026 -54124 -77118 -95969 -58672 19367 83026
37315 83026 108793 106796 80510 34363 -1798 -7215 -10353 -46260 -94147 -107083 -83067 -54959
37303 -54959 -31282 -3475 8048 -21585 -62738 -60373 -17846 8737 -1607 -13269 -4524 858
37291 858 -14304 -31540 -39847 -60959 -104971 -135444 -108906 -33508 31103 27696 -46966 -136099
37279 -136099 -173305 -149322 -117807 -122939 -141369 -119509 -50784 15999 37713 17241 -15360 -37614
37267 -37614 -46504 -49152 -45746 -23654 21892 66797 80413 66958 55719 51823 35861 14724
37255 14724 22359 55216 59659 9137 -55331 -90888 -108641 -128022 -125783 -77492 -10383 31719
37243 31719 43255 36273 2311 -60005 -113533 -124974 -109708 -96221 -83334 -73117 -98286 -160007
37231 -160007 -182263 -99229 39116 119158 105272 63594 54892 69509 71778 53598 31847 28352
37219 28352 57995 113142 165592 201924 237860 277286 286582 239513 159731 88790 41451 20191
37207 20191 35554 77281 104085 99542 99074 126614 152684 155595 167754 208483 227884 181577
37195 181577 109642 72697 59728 32915 12180 29617 45922 7489 -49587 -52693 -21421 -36520
37183 -36520 -95317 -107457 -38065 44181 73550 54141 9755 -48389 -89779 -79857 -43817 -43981
37171 -43981 -81361 -90096 -40467 24290 67132 103657 154625 216444 290554 378137 436081 404821
37159 404821 293997 181080 117285 93026 93402 117049 140465 141144 158414 246415 359219 377725
37147 377725 274518 159698 127963 147473 144035 112268 86039 66655 42816 33322 55485
37136 55485 87405 102114 103536 97692 68977 15580 -30728 -46690 -41678 -22515 19203 67488
37124 67488 83767 71256 82270 134913 179203 177382 160599 166348 171520 133621 59066 -11550
37112 -11550 -54984 -69100 -55910 -29387 -12403 -6965 1441 966 -40694 -115335 -170056 -180700
37100 -180700 -177506 -182493 -182050 -181620 -216798 -274714 -274043 -173616 -44451 18037 4276 -35945 -78109
37087 -78109 -120838 -139408 -105887 -35402 35555 95899 145895 164874 136977 86705 49554 28072
37075 28072 9451 -977 514 -8951 -45279 -82546 -87746 -66919 -42311 -9770 42117 92252
37063 92252 106629 83566 46393 6179 -37452 -73903 -91329 -97887 -107383 -114930 -109569 -99723 -104850
37050 -104850 -129318 -158111 -169459 -145762 -87836 -24397 9390 6829 -11474 -27993 -37115 -36085
37038 -36085 -35850 -64409 -122388 -155945 -121941 -57635 -25692 -14456 29118 86915 88462 39202
37026 39202 19999 43475 28990 -42096 -67632 14704 117348 135018 92642 70572 66177 33357
37014 33357 -6364 -1617 25477 15708 -23266 -44337 -57343 -99998 -141924 -121636 -62798 -49801
37002 -49801 -91170 -107801 -65117 -21059 -21896 -37391 -31549 -24062 -42656 -72900 -95195 -126080
36990 -126080 -183299 -241349 -256367 -216991 -149045 -86963 -56392 -67539 -107232 -143138 -144425 -99083
36978 -99083 -19115 61684 104977 99780 74672 67121 84257 100963 90403 51847 15282 16385
36966 16385 53841 78298 45970 -23364 -71304 -78030 -77334 -95933 -121559 -138718 -152471 -161603
36954 -161603 -144553 -87528 -1426 90180 152767 146460 76030 20590 55664 155759 236594
36943 236594 281467 351448 477607 623296 748195 825117 803841 661752 491810 432063
36933 432063 499696 599900 691981 816636 963211 1068027 1160879 1348301 1629786 1908052
36923 1908052 2197661 2614995 3159519 3796530 4783011 6463487 8495229 9697885 9145141
36914 9145141 7227768 5223039 3945592 3242201 2686540 2196786 1848518 1561979 1251094
36905 1251094 1006316 903881 832716 685583 539553 486489 454798 360099 279412 308937
36895 308937 374266 344793 238800 166068 147628 130284 115014 142832 195501 213286 181025
36884 181025 128088 82944 72131 104571 124531 62773 -34268 -32300 90896 193417 176223
36873 176223 114823 108114 128330 122331 136206 212642 267424 205577 84571 31049 57064 84025
36861 84025 94641 133438 192531 216130 199897 189349 199412 215349 242416 277472 268967 184339
36849 184339 80701 33639 36097 40075 48499 83250 109522 81654 27427 3274 1296 -20180
36837 -20180 -52819 -64633 -68809 -85362 -78416 -19042 31706 -3032 -91183 -133103 -101282 -53215
36825 -53215 -32211 -38793 -72375 -118379 -122785 -61332 -2771 -22105 -87941 -121288 -121825 -136110
36813 -136110 -142110 -81781 14793 54531 22534 -7468 2627 21157 29127 36537 24270 -28231
36801 -28231 -64567 -8274 102396 144426 79723 -11030 -69325 -121705 -187435 -235942 -261856
36790 -261856 -298011 -328208 -292429 -207853 -174932 -222496 -254038 -199750 -121433 -105417 -142280
36779 -142280 -179222 -209569 -238706 -232165 -171503 -104599 -73614 -46734 14342 72632 70722 21663
36767 21663 -24734 -66825 -129466 -186997 -183393 -118358 -49441 -10482 19949 67297 120899 151357
36755 151357 141310 98800 56904 49557 71172 76807 39428 -15612 -53862 -80536 -113305 -132167
36743 -132167 -103357 -45261 -21978 -58904 -101450 -82266 -8049 50927 52056 28045 30834 57640
36731 57640 65144 40965 17191 13522 15296 20458 56639 123837 168393 153349 113590 98161
36719 98161 98289 82466 62271 61138 51131 -7401 -83783 -108158 -75915 -52818 -79468 -133588
36707 -133588 -183448 -216467 -218042 -184614 -155794 -172186 -204830 -188741 -119846 -52320 -9961 23441
36695 23441 34841 -6262 -63388 -56456 12803 51959 18796 -23272 -23910 -22444 -55680 -79787
36683 -79787 -49823 -3700 2013 -19285 -25026 -20375 -29999 -37974 -18816 7078 4370 -22313 -49458
36670 -49458 -74519 -93353 -80889 -38976 -17507 -38066 -42864 24423 130129 201838 226189 230481
36658 230481 206631 132195 45068 16772 51806 78030 42620 -32569 -92964 -103298 -57101
36647 -57101 23028 89518 106994 88705 73880 77933 90198 106210 128850 145392 134705 94913
36635 94913 42805 -6617 -41900 -49030 -23134 22640 69281 96886 77619 262 -88003 -110593
36623 -110593 -56635 -2562 -8537 -41205 -41165 -20153 -32214 -78489 -102632 -69385 749 65840
36611 65840 92716 67541 13711 -16967 -5073 7315 -15806 -40311 -16893 28788 27966 -20296
36599 -20296 -40568 6265 62272 50523 -26793 -97667 -105744 -61731 -16372 69 1356 8023
36587 8023 5775 -32142 -90183 -120486 -113725 -114065 -147811 -185383 -197124 -195029 -186994 -144043 -57870
36574 -57870 18385 38809 30166 34537 32268 -11319 -60097 -44669 33297 102884 117420 86571
36562 86571 32487 -22898 -40689 1065 63857 94439 100297 123445 159132 166680 145165 126831
36550 126831 105138 43647 -44888 -99016 -91416 -49584 1568 52754 75097 45959 4816 6722
36538 6722 26989 -627 -55254 -42868 46580 105237 66186 -6163 -33194 -32892 -50932 -67549
36526 -67549 -48910 -23504 -30982 -49347 -44280 -39498 -65536 -87967 -67078 -47712 -99934 -194158
36514 -194158 -226389 -163358 -80578 -49479 -62828 -90825 -139513 -211356 -254914 -207880 -80926
36503 -80926 39033 79347 57741 51061 92633 129342 100827 33778 10771 54051 98713 93623
36491 93623 69870 78589 113008 135649 142757 152991 160042 143795 109732 76320 40667 -5474
36479 -5474 -43350 -48404 -28253 -6832 8317 8940 -34063 -124497 -196913 -178126 -87461 -21554
36467 -21554 -36012 -89541 -111330 -77478 -7264 74599 147206 189155 188731 154873 114014 97804
36455 97804 122694 174313 231675 315651 474220 688512 836710 811783 654874 508245 443992
36444 443992 406093 325059 216830 140528 116675 126010 150231 177828 195919 203500 211116 211469
36432 211469 180123 122483 84813 93505 114844 102745 58569 16264 -3610 5028 49473 116958
36420 116958 159878 144445 103073 100568 154637 223468 266241 281436 286113 290347 297803 305369
36408 305369 295332 249434 179188 127588 132844 195248 277897 334848 345917 330743 321244 320714
36396 320714 309894 294558 312826 380665 466902 545782 635863 757426 898029 1064910 1317332
36385 1317332 1668089 1981903 2064190 1859709 1500689 1161663 932888 826460 815599 844352
36375 844352 867460 902080 989060 1113189 1237330 1398081 1663544 2006032 2341204 2686813
36365 2686813 3134549 3690758 4380581 5509930 7422452 9746939 11232184 10806918 8740427
36356 8740427 6375012 4739552 3809630 3113499 2521409 2163511 1969685 1717396 1389756
36347 1389756 1150654 1030363 903918 738607 622238 563576 479316 376675 353990 411610
36337 411610 440819 413245 409200 438458 406444 297748 228634 258605 296442 261678 207430
36326 207430 205815 227672 221048 213019 247176 293851 298556 260384 204298 137831 86509 105027
36314 105027 199268 299762 359068 406301 460049 472391 426391 410200 508953 678185 803169
36303 803169 837077 810533 760035 730971 801577 999047 1207541 1253101 1088085 828560 612412
36292 612412 482628 409048 358521 320933 303279 315404 346803 362892 341835 301982 274044
36281 274044 264133 264661 281878 331090 419144 539998 666531 754608 800628 884929 1082271
36270 1082271 1324322 1454755 1458781 1518320 1750071 1990812 1973740 1661581 1269970 988041
36260 988041 813126 663970 520391 403633 315800 255605 234727 240233 229451 187795 145850
36249 145850 122999 103629 82925 82192 100471 102582 74586 42825 21589 -6995 -44113 -61135
36237 -61135 -57965 -76621 -124320 -138110 -69613 38564 106037 108891 76995 30691 -28367 -84434
36225 -84434 -117298 -135709 -156846 -159513 -105938 -14985 34829 483 -59830 -51821 35960 114835
36213 114835 105166 32400 -10058 24390 93479 136827 148214 159493 186131 219369 251273 274618
36201 274618 271665 236706 200907 199794 219237 209990 161198 126231 160740 256677 351632 389506
36189 389506 362189 303893 256769 238776 237348 229639 205698 175782 163652 188208 237639 268079
36177 268079 250369 213342 211358 253394 302858 342959 385990 411063 364534 253287 166822
36166 166822 157941 166804 123308 59205 39654 42020 3656 -47269 -20657 86976 179571 202530
36154 202530 197548 202180 192211 154544 131539 152451 188412 209802 226755 245309 248159 246659
36142 246659 283662 353021 387111 362222 343076 373401 393236 329140 209974 124142 103975
36131 103975 118378 145534 186743 230569 261146 285637 307789 298763 242738 186257 188288 239006
36119 239006 279647 287934 292356 312538 336513 353189 361588 348863 300590 235366 195415 200607
36107 200607 235628 273673 285869 243488 150410 65924 53449 103589 142531 121520 67292
36096 67292 36930 51024 85334 111561 131231 169209 234463 292969 296665 242055 175699 131136
36084 131136 90337 29191 -29291 -42735 -11822 23001 39392 53786 85932 131423 172176
36073 172176 194133 194266 184887 186497 202553 209614 187702 150549 128394 128648 129621 106526 51786
36060 51786 -20819 -81631 -106899 -104053 -100018 -98363 -72652 -13618 46713 76828 81838 73785 37461
36047 37461 -39013 -122471 -162301 -148156 -109771 -73036 -46182 -34012 -31081 -10831 44386 107787
36035 107787 132403 106522 59957 23188 6735 12478 35467 57193 62786 64290 86702 132866
36023 132866 177319 189625 154377 82925 17006 -134 27769 52582 47258 37381 47264 55231
36011 55231 37243 15224 15312 13974 -16313 -36659 12580 107926 157072 121722 61093 40582
35999 40582 58118 81963 104197 122746 114123 65179 8214 -10593 11616 30862 5848 -58922
35987 -58922 -115609 -118969 -76382 -41167 -41714 -37253 23257 112084 139108 62909 -55528 -125890
35975 -125890 -123328 -91477 -76641 -84435 -92702 -87680 -80746 -88760 -103149 -96302 -65731 -47469 -64919
35962 -64919 -86640 -65157 -2453 55417 77766 70419 46345 10713 -25206 -43745 -36201 -2543
35950 -2543 53015 108586 128059 104413 78298 85231 109383 119605 116235 102193 50763 -38562
35938 -38562 -91702 -44316 51340 86737 46193 4578 -14203 -70084 -182539 -277175 -294900
35927 -294900 -267642 -242628 -210893 -159461 -120985 -116135 -108985 -73606 -47013 -62324 -86557 -82311
35915 -82311 -75931 -100823 -124199 -101786 -64160 -72817 -118778 -138676 -113031 -78232 -50967 -7293
35903 -7293 61505 124846 148860 121311 50521 -25676 -49567 -5166 47786 45476 5169 -9958
35891 -9958 11318 25148 13086 287 -4485 -22479 -50106 -50396 -17111 3752 -20866 -66187
35879 -66187 -92536 -97159 -97610 -91010 -57843 4858 70145 96702 59461 -20755 -81656 -73593 -9103
35866 -9103 57805 95277 115337 139495 169516 191335 185736 138361 60714 -4753 -23774 -7911
35854 -7911 8590 15751 22064 16911 -19923 -75706 -112796 -120515 -120740 -120813 -104122 -76469 -78419 -131304
35840 -131304 -202523 -242694 -231509 -174832 -87996 -1105 46656 42494 15284 1423 10218 29151
35828 29151 39469 16974 -54051 -149518 -211798 -207881 -163419 -123170 -100263 -85446 -82702 -103595
35816 -103595 -138002 -162472 -176006 -200978 -244910 -283190 -288307 -261967 -229088 -208923 -201891 -201339
35804 -201339 -207294 -222392 -238645 -239034 -216493 -183537 -157339 -143579 -141501 -151790 -165750 -160892
35792 -160892 -130490 -108004 -130815 -179487 -188154 -128400 -51750 -26130 -54086 -83686 -84971 -78352
35780 -78352 -85366 -85648 -43513 37295 106621 116693 67400 589 -42423 -51046 -38445 -18468
35768 -18468 1851 14016 7620 -16480 -41912 -54565 -60608 -77444 -107506 -131607 -132232 -112679
35756 -112679 -83904 -43302 14346 69084 86301 64768 47864 65748 87564 61029 -13530
35745 -13530 -82112 -103044 -79194 -29350 29158 64148 42637 -18223 -55007 -39672 -21570 -56227
35733 -56227 -124734 -163671 -151855 -125149 -118326 -130409 -138962 -116074 -42146 60637 120443 83319
35721 83319 -14990 -84816 -89002 -71258 -74418 -78890 -44665 22742 81044 106670 111300 109176 94065
35708 94065 57757 19272 17646 65503 120110 124326 78331 41056 47402 59031 27797 -21859
35696 -21859 -19960 52112 137945 178976 170268 137641 95869 44586 -15405 -70887 -92250 -52546
35684 -52546 29390 84764 69101 24325 21732 56018 54279 -9567 -75479 -91311 -82757 -92460
35672 -92460 -102417 -70474 -13560 1225 -57430 -146996 -198795 -177697 -98137 -7639 40819 19058
35660 19058 -59473 -149500 -200974 -187391 -123359 -53269 -10028 10474 21869 12324 -31465 -77882
35648 -77882 -74837 -25675 6246 -13777 -42225 -24966 21210 32581 -16019 -85526 -125110 -123231
35636 -123231 -107054 -106998 -122452 -119582 -71095 3807 56735 66953 57416 51673 43691 19844 -16779
35623 -16779 -56879 -95305 -120316 -118973 -105028 -112973 -148936 -174190 -153704 -95943 -29543 32131
35611 32131 85477 121874 138405 143229 136716 108676 62892 18650 -16609 -42863 -34825 36248
35599 36248 134418 168477 98872 -12554 -89205 -124569 -144478 -141564 -102698 -58749 -47031 -54103
35587 -54103 -49239 -43851 -61746 -80168 -62489 -27499 -24393 -55251 -81081 -88774 -93100 -88831 -63282
35574 -63282 -41189 -51243 -62646 -28489 18460 -1857 -84882 -129793 -80342 4475 50271 58673
35562 58673 57065 31557 -29470 -79730 -69928 -27058 -20793 -69373 -125617 -141635 -107483 -38728
35550 -38728 37467 91560 115190 128093 142930 139999 97618 27843 -41174 -97226 -133934 -134910
35538 -134910 -103001 -83176 -111870 -154496 -141091 -66070 -6542 -26253 -99202 -152326 -154498 -130946
35526 -130946 -106537 -73584 -18998 47688 107484 151575 170308 141277 56415 -44814 -97703
35515 -97703 -72848 4202 91742 164086 205187 206068 181286 156213 125034 58077 -32671 -82986
35503 -82986 -64440 -36277 -60781 -107422 -103432 -50392 -17896 -33979 -55492 -48284 -26136 1103
35491 1103 51479 122753 177879 200562 213399 220928 189484 110098 30008 -8791 -16088 -10118
35479 -10118 22375 85656 139091 145242 121520 106414 104678 101164 98753 106228 114972 120394 139829
35466 139829 179115 210808 214851 207089 196398 154523 70699 -2626 -10531 26665 46671 28923
35454 28923 -6806 -56697 -124713 -176787 -170194 -121956 -83690 -50256 37246 184253 304574
35443 304574 320651 254415 185384 155611 152660 161013 188006 240033 300740 344257 362614 370220
35431 370220 376171 360548 297562 203070 130524 105166 91216 48966 -3087 -18182 6850 30292
35419 30292 25676 3901 -20107 -45036 -66427 -74964 -74914 -78686 -84370 -83477 -85083 -102979 -123428 -117290
35405 -117290 -82645 -45002 -17023 9871 33839 37076 18649 3100 6694 17711 17728 4620
35393 4620 -8460 -1746 40033 107878 166149 187538 179988 161179 126613 72215 28309 31266
35381 31266 72978 116685 149398 174818 169238 103331 8154 -41784 -27957 -17306 -66934 -143389
35369 -143389 -170896 -131679 -83731 -87895 -139198 -173380 -140506 -70155 -44200 -93742 -154703 -155107
35357 -155107 -110988 -85941 -86077 -65453 -23491 -16943 -63395 -106391 -103167 -84454 -91855 -106841
35345 -106841 -83495 -18800 44951 67526 40182 -11182 -39173 -12809 48985 98007 104790 66816
35333 66816 -6068 -75762 -76661 6993 88388 75413 2176 -20616 27371 59572 32812 734
35321 734 -3806 -22920 -68181 -72146 -3772 67142 84556 90688 127526 148899 112991 76075 102017
35308 102017 152320 160876 152495 188699 250212 271237 247009 217049 182653 127385 80405 77078
35296 77078 93899 95678 101097 129720 141579 108768 84526 115170 151863 145400 153444 239059
35284 239059 332423 322975 232568 165422 139258 104958 84214 136094 220951 247328 226927 237731
35272 237731 265415 234690 166413 140909 135580 74205 11077 72530 225746 308172 292070
35261 292070 311788 408670 463766 425004 391040 412739 410976 354073 325847 356449 372282 366518
35249 366518 426540 546720 619497 651084 759091 920240 979257 953998 1042823 1269732 1445204
35238 1445204 1558522 1847248 2366896 2886751 3349845 3995639 4864266 5700777 6569132
35229 6569132 7933736 9835006 11820958 14257466 18618815 25151505 30878448 31715670
35221 31715670 26865053 19776426 14335872 11343568 9323403 7375419 5865138 5023828
35213 5023828 4384070 3639059 3029858 2699307 2394810 1984164 1677965 1571813 1453518
35204 1453518 1214955 1028253 970584 863484 634648 487316 548685 655946 647290 589072
35194 589072 563177 489993 327435 215770 254840 332141 329358 318255 392719 472952 447024
35183 447024 372404 369085 416723 413378 353919 307789 281988 233000 169187 134340 125518 113036
35171 113036 106151 126842 155287 163730 167630 189202 206959 189047 143430 98735 69166 63081
35159 63081 86708 120391 131973 122430 113444 96171 54490 28377 72502 153803 180386 136708
35147 136708 94450 82924 57698 15478 20612 78579 98209 33190 -43172 -61021 -49698 -46030
35135 -46030 -5511 115537 267333 371206 410347 393834 305066 158806 43604 29161 76640
35124 76640 101125 77617 36969 10139 22653 87690 161789 168196 102931 48826 48656 49274 16880
35111 16880 9656 68205 126271 112763 62869 43141 40572 15325 -4329 26121 76796 92954
35099 92954 83620 79785 60867 6394 -36708 -25333 -1758 -16563 -31949 881 29685 -21163
35087 -21163 -108849 -124639 -55684 16048 49805 73851 98488 103670 97760 98186 77527 16598
35075 16598 -25319 9019 66195 64792 42734 90361 169436 151092 29553 -54148 -19241 67201
35063 67201 137064 211544 296450 322289 259776 185632 159624 129169 31144 -91360 -152329
35052 -152329 -142780 -117032 -106585 -110703 -136131 -189835 -252202 -292339 -293373 -251889 -182790 -126323
35040 -126323 -107954 -93293 -33341 53783 110085 135685 176973 219267 190969 93322 24285
35029 24285 36585 67822 58129 42946 67305 93755 72322 35852 46277 93371 119735 111782
35017 111782 104085 122840 175424 263609 360328 407408 382133 333589 312269 300849 257400 188014
35005 188014 128231 85867 50428 30801 37955 54801 64505 86076 144863 228684 303796 352616
34993 352616 373567 373397 379800 423668 485472 500652 443010 357418 284134 204916 101162 11519
34981 11519 -17491 2093 26182 34275 21889 -19286 -73808 -97603 -79300 -62458 -71348 -67524
34969 -67524 -20922 34275 63308 90131 137627 170145 160276 153087 190970 231149 218341 186671
34957 186671 200954 243483 253924 240892 252603 270486 240746 188773 189720 237368 255792 237239
34945 237239 250633 306885 340051 346402 416514 581068 738197 798617 807341 852698 942030
34934 942030 1045389 1185615 1397683 1661007 1961444 2358071 2868014 3310312 3397815 3024460
34924 3024460 2384013 1771272 1330707 1032760 817997 675541 596012 532493 448708 371368
34914 371368 352195 384196 391335 313332 178106 73142 59159 127879 228930 311435 343538
34903 343538 321175 272544 242875 261388 318126 370432 375605 328871 271262 247506 256242 261132
34891 261132 250510 253762 288985 333086 365933 402718 444523 435525 328741 178386 104952
34880 104952 162570 288298 389616 434225 437213 407298 344890 271763 223304 208977 205083
34869 205083 197625 215578 297438 426596 535916 599462 681576 840299 1004102 1024321 861314
34858 861314 639414 487061 403389 332779 285575 297513 329726 313336 264282 254418 283287
34847 283287 278157 222265 185272 207046 237678 223546 180769 149131 132761 118942 105397 82381
34835 82381 34633 -19010 -38368 -31525 -54179 -116933 -155978 -130483 -88484 -88949 -109526 -87308
34823 -87308 -14926 59612 104223 120811 106702 48923 -42051 -128663 -181130 -194328 -171839 -115122
34811 -115122 -32799 51922 109512 121285 91922 42784 -10585 -65218 -109865 -118643 -84816 -41384
34799 -41384 -23018 -26581 -35512 -55398 -86823 -92948 -47436 9601 26170 28978 84406 177386
34787 177386 214175 156652 72068 26089 3547 -31184 -65534 -73045 -60447 -41604 -12956 14246
34775 14246 8416 -26404 -43091 -28873 -31325 -73650 -105383 -77270 -6687 70181 146761 202972
34763 202972 186913 101231 40492 68201 113405 70902 -43040 -122587 -124256 -95506 -72089
34752 -72089 -38074 13165 56307 80633 99011 106988 86050 47489 24100 20647 15780 2550
34740 2550 -17543 -62203 -135318 -182217 -139845 -25890 78489 127554 135654 114886 58737 -8937
34728 -8937 -38083 -21655 -2879 1204 26564 93403 164312 196429 190422 163334 115778 55893
34716 55893 21197 42888 106289 168708 202548 207665 195556 172057 129120 58058 -18807 -48837
34704 -48837 -8962 52490 71685 53977 56994 95821 118890 87182 28727 -4163 5196 37213
34692 37213 63332 60593 28757 3688 24138 77118 107957 91980 60682 47172 45440 40979
34680 40979 43132 61080 77897 76385 68949 76759 96053 106660 100009 81275 58562 48006 76513
34667 76513 157975 267940 352481 364140 294234 181962 89784 53715 56156 60089 62976 92150
34655 92150 147780 182716 154575 76738 -711 -48052 -75564 -100981 -116530 -100790 -59425 -33714
34643 -33714 -49458 -69632 -32800 58747 131595 139345 122133 133682 154323 132380 80315 59853
34631 59853 82151 93604 67257 41478 47089 55373 32472 1478 11207 68461 132087 158039
34619 158039 131480 73614 33017 48656 103700 135537 108670 58476 44394 77975 119786
34608 119786 135253 128589 122475 124222 121230 102640 74891 52377 40371 37020 45074 62535 65231
34595 65231 28006 -29680 -51241 -11768 50886 92696 118256 153691 196395 221245 209674 149991
34583 149991 47012 -43668 -45420 32633 77076 18472 -61542 -52015 14222 16423 -60430 -113031
34571 -113031 -95693 -81144 -120889 -162458 -153119 -127105 -131196 -143504 -126160 -92363 -63568 -19266
34559 -19266 51986 101858 81491 13992 -42285 -70205 -91416 -119861 -155794 -196255 -220324 -195600
34547 -195600 -125761 -58170 -24101 -10497 -5238 -18104 -37584 -27193 8021 13463 -25471 -51886
34535 -51886 -32459 -14233 -40221 -77373 -81378 -64093 -37647 35271 161543 256617 251091 202277
34523 202277 205979 244772 227725 149092 97458 114178 142144 124415 73211 29675 21152 63734
34511 63734 145928 206350 183566 89733 -10518 -79440 -113367 -98701 -32649 30941 35418 9887
34499 9887 22247 53166 12763 -108797 -207287 -211066 -170984 -158866 -156989 -110821 -32955 15151
34487 15151 14233 1027 5151 17872 21017 16512 23195 55634 106185 150101 175293 195317 217291
34474 217291 216268 170314 102534 50746 11993 -38008 -85641 -95333 -78928 -88653 -134728 -167258
34462 -167258 -153348 -119721 -102159 -100610 -101248 -97231 -71606 -6935 69491 97760 65040 27343
34450 27343 26445 30843 -8098 -81136 -139937 -161556 -158004 -141865 -114642 -78467 -38275 -118
34438 -118 25516 33687 38359 52749 60873 43140 25823 56397 123010 152966 110484 43080 4661
34425 4661 -12828 -33057 -33284 15824 82697 105421 73215 28901 3539 -5303 -327 22942 51469
34412 51469 64556 71574 102673 157044 196477 199483 187657 184703 182119 166110 149004 145375 141122
34399 141122 123492 124917 188304 291024 360530 383627 441941 602021 831008 1083672 1408233
34388 1408233 1848069 2257962 2365753 2073839 1592035 1197476 953349 752118 545552
34379 545552 395642 333434 302627 253411 192545 129279 59953 17109 46935 120029 145292
34368 145292 93496 31419 13672 19919 25325 51366 106184 145730 140688 125086 138743 175500
34356 175500 222831 292913 373350 404151 351064 256635 180036 133264 110439 122758 159768
34345 159768 169732 127636 74681 44307 3026 -79323 -152234 -146509 -79684 -34408 -54200 -115530
34333 -115530 -180464 -223654 -225665 -188595 -146106 -123994 -112359 -103418 -117532 -154659 -165639 -122175
34321 -122175 -74418 -82553 -127377 -147642 -131329 -105778 -69121 -3981 61475 79515 60979 62648
34309 62648 102623 146723 170430 175499 153626 95613 34010 17130 39240 50848 38535 40964
34297 40964 83906 150850 220140 281702 315109 299858 251352 205030 168804 133746 118131 145593
34285 145593 189775 202257 189356 196235 221012 221114 207609 247311 352070 452147 512067 586646
34273 586646 712994 830309 879002 914588 1039772 1268298 1540943 1842199 2209772 2655691
34263 2655691 3192054 3930295 4995945 6245427 7169833 7246294 6416790 5142819 3973329
34254 3973329 3132322 2532922 2053317 1670968 1380710 1136145 916263 759933 683660 628400
34244 628400 537293 433424 367800 334892 298370 265790 272731 310606 329904 307806 262894
34233 262894 210804 154067 110921 105811 129718 150576 162624 186196 219643 232407 210078 170648
34221 170648 131576 93195 59630 46414 59226 83865 98386 83273 32268 -29802 -58745
34210 -58745 -42105 -16940 -14909 -20629 -12642 -4510 -2060 35615 129640 211834 198724 115078 63668
34197 63668 81451 109319 106280 105060 132243 152430 127883 73449 19641 -26090 -53593 -39699
34185 -39699 4503 25968 2646 -21684 -9023 12624 835 -29980 -36549 -18262 -12283 -28968
34173 -28968 -32556 12949 101658 189174 226500 197284 131177 75487 51844 47601 42139 24038
34161 24038 -11966 -63085 -113686 -147060 -156353 -135454 -81519 -23813 -16487 -69480 -119514 -112031
34149 -112031 -77131 -70539 -76074 -40112 22078 40207 1485 -37430 -56094 -100738 -188639 -260674
34137 -260674 -260737 -200847 -122045 -46855 10712 44903 82436 148822 204080 182028 102055 61854
34125 61854 105196 185722 281151 435043 636266 762429 723308 586047 479230 432046 383305
34114 383305 297704 195990 105762 47739 40765 69434 81609 58825 40797 40037 -224 -102761
$$ [...]
##END NTUPLES=NMR SPECTRUM
##END=
