##TITLE=31Pdec_DE-66_rmOH3
 , 24 sc
 1.10.2024
##JCAMPDX= 6.0         $$ Bruker NMR JCAMP-DX V2.0
##DATA TYPE= NMR SPECTRUM
##DATA CLASS= NTUPLES
##ORIGIN= UXNMR, Bruker Analytische Messtechnik GmbH
##OWNER= root
$$ XWIN-NMR		Version 3.5
$$ Tue Oct  1 15:34:09 2024 Russian Standard Time (UT+4h)  she@DPX200
##.OBSERVE FREQUENCY= 81.013821
##.OBSERVE NUCLEUS= ^31P
##.ACQUISITION MODE= SIMULTANEOUS
##.ACQUISITION SCHEME= undefined
##.AVERAGES= 24
##.DIGITISER RES= 17
##SPECTROMETER/DATA SYSTEM= spect
##.PULSE SEQUENCE= zgpg30
##.SOLVENT NAME= CDCl3
##.SHIFT REFERENCE= (INTERNAL, CDCl3, 0, 198.062)
##AUDIT TRAIL= $$ (NUMBER, WHEN, WHO, WHERE, WHAT)
$$ ##TITLE= Audit trail, XWIN-NMR		Version 3.5
$$ ##JCAMPDX= 5.01
$$ ##ORIGIN= Bruker BioSpin GmbH
$$ ##OWNER= she
$$ F:/spectra/data/she/nmr/P31/2/pdata/1/auditp.txt
$$ ##AUDIT TRAIL=  $$ (NUMBER, WHEN, WHO, WHERE, WHAT)
(   1,<2024-10-01 15:33:07.12 +0400>,<she>,<DPX200>,
      <created by zg, POWCHK disabled, PULCHK disabled
       configuration hash MD5:
       00 E9 B6 7A A2 85 ED C7 34 08 36 98 17 FE 4E 26
       data hash MD5: 32K
       F5 22 17 C6 F8 30 94 EB D6 11 59 9E B9 77 2D F1>)
(   2,<2024-10-01 15:33:13.42 +0400>,<she>,<DPX200>,
      <Start of raw data processing
       efp BC_mod = 2 LB = 1.5 FT_mod = 6 PKNL = 1 PHC0 = 2724.121 PHC1 = 29.08746 SI = 64K 
       data hash MD5: 64K
       44 28 4F 4F 01 07 40 D4 5C D4 A8 1E 95 3E 3C D3>)
(   3,<2024-10-01 15:33:30.06 +0400>,<she>,<DPX200>,
      <pk PHC0 = 1.743991 PHC1 = 0 
       data hash MD5: 64K
       93 8C 22 83 EC 5A 30 54 6F 10 D4 72 5E 7B 8E 5C>)
(   4,<2024-10-01 15:33:33.85 +0400>,<she>,<DPX200>,
      <abs ABSG = 5 
       data hash MD5: 64K
       A7 3B 79 87 6E E7 48 9E 3C 35 D5 63 01 2F A5 89>)
$$ ##END=
$$ 
$$ hash MD5
$$ 8D 6E B1 DE 66 FB 53 53 E9 BA C3 D1 71 10 6B 2D
##$RELAX= 
##$RELAX= 
##$RELAX= 
##$RELAX= 
##$RELAX= 
##$RELAX= 
##$RELAX= 
##$RELAX= 
$$ Bruker specific parameters
$$ --------------------------
##$DU= <F:/spectra>
##$EXPNO= 2
##$NAME= <P31>
##$PROCNO= 1
##$TYPE= <nmr>
##$USER= <she>
##$AMP= (0..31)
100 100 100 100 100 100 100 100 100 100 100 100 100 100 100 100 100 100 
100 100 100 100 100 100 100 100 100 100 100 100 100 100 
##$AQSEQ= 0
##$AQ_mod= 1
##$AUNM= <au_zg>
##$AUTOPOS= <>
##$BF1= 81.014009
##$BF2= 200.13
##$BF3= 200.13
##$BF4= 200.13
##$BF5= 200.13
##$BF6= 200.13
##$BF7= 200.13
##$BF8= 200.13
##$BYTORDA= 1
##$CFDGTYP= 0
##$CFRGTYP= 5
##$CHEMSTR= <none>
##$CNST= (0..31)
1 1 145 1 1 1 1 1 1 1 1 1 1 1 1 1 1 1 1 1 1 1 1 1 1 1 1 1 1 1 1 1 
##$CPDPRG= <waltz16>
##$CPDPRG1= <>
##$CPDPRG2= <waltz16>
##$CPDPRG3= <>
##$CPDPRG4= <mlev>
##$CPDPRG5= <mlev>
##$CPDPRG6= <mlev>
##$CPDPRG7= <mlev>
##$CPDPRG8= <mlev>
##$CPDPRGB= <>
##$CPDPRGT= <>
##$D= (0..31)
0 1 0 0 0 0 0 0 0 0.06 0 0.03 2e-05 3e-06 0 0 0.0002 0 0 0 0 0 0 0 0 0 
0 0 0 0 0 0 
##$DATE= 1727782386
##$DBL= (0..7)
120 120 120 11 120 120 24 19 
##$DBP= (0..7)
150 150 150 150 150 150 150 150 
##$DBP07= 0
##$DBPNAM0= <>
##$DBPNAM1= <>
##$DBPNAM2= <>
$$ [...]
##$SUBNAM3= <"">
##$SUBNAM4= <"">
##$SUBNAM5= <"">
##$SUBNAM6= <"">
##$SUBNAM7= <"">
##$SUBNAM8= <"">
##$SUBNAM9= <"">
##$SW= 400.765351723535
##$SWIBOX= (0..15)
0 1 3 0 0 0 0 0 0 0 0 0 0 0 0 0 
##$SW_h= 32467.5324675325
##$TD= 32768
##$TD0= 1
##$TE= 0
##$TE2= 300
##$TE3= 300
##$TEG= 300
##$TL= (0..7)
0 120 53 12 22 120 120 120 
##$TP= (0..7)
150 150 150 150 150 150 150 150 
##$TP07= 0
##$TPNAME0= <>
##$TPNAME1= <>
##$TPNAME2= <>
##$TPNAME3= <>
##$TPNAME4= <>
##$TPNAME5= <>
##$TPNAME6= <>
##$TPNAME7= <>
##$TPOAL= (0..7)
0.5 0.5 0.5 0.5 0.5 0.5 0.5 0.5 
##$TPOFFS= (0..7)
0 0 0 0 0 0 0 0 
##$TUNHIN= 0
##$TUNHOUT= 0
##$TUNXOUT= 0
##$USERA1= <user>
##$USERA2= <user>
##$USERA3= <user>
##$USERA4= <user>
##$USERA5= <user>
##$V9= 5
##$VALIST= <valist>
##$VCLIST= <CCCCCCCCCCCCCCC>
##$VD= 0
##$VDLIST= <DDDDDDDDDDDDDDD>
##$VPLIST= <PPPPPPPPPPPPPPP>
##$VTLIST= <TTTTTTTTTTTTTTT>
##$WBST= 1024
##$WBSW= 4
##$XGAIN= (0..3)
0 0 0 0 
##$XL= 0
##$YL= 0
##$YMAX_a= 101055
##$YMIN_a= -82987
##$ZGOPTNS= <>
##$ZL1= 120
##$ZL2= 120
##$ZL3= 120
##$ZL4= 120
##$ABSF1= 198.0616
##$ABSF2= -202.7028
##$ABSG= 5
##$ABSL= 3
##$ALPHA= 0
##$AQORDER= 0
##$ASSFAC= 0
##$ASSFACI= 0
##$ASSFACX= 0
##$ASSWID= 0
##$AUNMP= <proc_1d>
##$AZFE= 0.1
##$AZFW= 0.5
##$BCFW= 0
##$BC_mod= 2
##$BYTORDP= 0
##$COROFFS= 0
##$CY= -3
##$DATMOD= 1
##$DC= 0
##$DFILT= <>
##$DTYPP= 0
##$F1P= 0
##$F2P= 0
##$FCOR= 1
##$FTSIZE= 65536
##$FT_mod= 6
##$GAMMA= 0
##$GB= 0
##$INTBC= 1
##$INTSCL= 9.790993e-09
##$ISEN= 30
##$LB= 1.5
##$LEV0= 0
##$LPBIN= 0
##$MAXI= 10000
##$MC2= 0
##$MEAN= 0
##$ME_mod= 0
##$MI= 50
##$NCOEF= 0
##$NC_proc= -2
##$NLEV= 6
##$NOISF1= 182.463
##$NOISF2= 159.3651
##$NSP= 0
##$NTH_PI= 0
##$NZP= 0
##$OFFSET= 198.0616
##$PC= 4
##$PHC0= 2725.865
##$PHC1= 29.08746
##$PH_mod= 1
##$PKNL= yes
##$PPARMOD= 0
##$PSCAL= 0
##$PSIGN= 0
##$REVERSE= no
##$SF= 81.0140089999434
##$SI= 65536
##$SIGF1= 159.3651
##$SIGF2= -187.1042
##$SINO= 113.3802
##$SIOLD= 16384
##$SREGLST= <1H.CDCl3>
##$SSB= 0
##$STSI= 65536
##$STSR= 0
##$SW_p= 32467.5324675325
##$SYMM= 0
##$S_DEV= 0
##$TDeff= 32768
##$TDoff= 0
##$TI= <>
##$TILT= no
##$TM1= 0
##$TM2= 0
##$TOPLEV= 0
##$USERP1= <user>
##$USERP2= <user>
##$USERP3= <user>
##$USERP4= <user>
##$USERP5= <user>
##$WDW= 1
##$XDIM= 65536
##$YMAX_p= 458480302
##$YMIN_p= -1067436
$$ End of Bruker specific parameters
$$ ---------------------------------
##NTUPLES= NMR SPECTRUM
##VAR_NAME=  FREQUENCY,     SPECTRUM/REAL,   SPECTRUM/IMAG
##SYMBOL=    X,             R,               I
##VAR_TYPE=  INDEPENDENT,   DEPENDENT,       DEPENDENT
##VAR_FORM=  AFFN,          ASDF,            ASDF
##VAR_DIM=   65536,         65536,           65536
##UNITS=     HZ,            ARBITRARY UNITS, ARBITRARY UNITS
##FACTOR=    0.49542278885378, 1,            1
##FIRST=     16045.7642231865, 0,            0
##LAST=      -16421.768244346, 0,            0
##MIN=       -16421.768244346, -1067436,     0
##MAX=       16045.7642231865, 458480302,    0
$$ Real data points
##PAGE= N=1
##DATA TABLE= (X++(R..R)), XYDATA
$$ [...]
41035c787o223p548P202J3916j982q540J9159M3780K2047j6203j3654J6656J6066
41022H0889j5812k5353n231l671k9411l2976J865K7914J7840L642P819N885j3151
41009B0249j6017J0863K7833Q248j7452j9033j3420j7471p966K7777M9534K1157
40997G4302k7640m3674k4422o413m382l937L045J1463J8345J9094M048j9876k4431
40984b4478J362K8657K6989M842r642r120o539j0274j8792k6386k1395M561L5754
40971b4461M1528J6704r897j7344j6859k1625k1178n254J1552J1318J300O83J2052
40958b1481K2165K0554O232j3779k5367j7653L580K2631L1884L0765J5389j1107
40946F3813k7497j8512j390j104r565j761J8069K4858J9601K5338L9874L6787
$$ plain form
41035 -3787 -10010 -17558 -10356 3560 1578 -6962 12197 55977 78024 61821 48167 64823 80889
41022 80889 65077 39724 34493 30822 1411 -31565 -29700 -1786 16054 19696 27515 33400 20249
41009 20249 4232 15095 42928 51176 33724 14691 1271 -16200 -24166 3611 53145 74302
40997 74302 46662 2988 -21434 -27847 -32229 -36166 -33121 -21658 -3313 15781 19829 -47 -24478
40984 -24478 -23116 5541 32530 37372 27730 18610 12071 1797 -16995 -43381 -64776 -60215 -24461
40971 -24461 17067 33771 23874 6530 -10329 -31954 -53132 -58386 -46834 -35516 -34216 -33533 -21481
40958 -21481 684 21238 27470 13691 -11676 -29329 -25749 -3118 28766 59531 74920 63813
40946 63813 36316 17804 16414 15310 5745 3984 22053 46911 66512 91850 131724 168511
40934A68511J3791l535p137j1456j3979N71J6308L16l4722l9377p933J0298n497
40921H6159j6510J50Q607j9228n1579n1774l7156m2109o3451q0929r3604r9473
40909d60897p7268k6250J1816Q417p350L554L1483M4710M2646M2667M1263K7364
40897c17845J2137J0828J4860J0267K129k583r650j4322L100L6175M5941K1526
40885a87437L752J7719K9740J0028j1147J499K3445J7123K255J6219L8722K5630
40873a2452p576r160J7035J7370j7541l6616j4551J0889O003r833o324R956J5801
40860c6999P801m160j7191l1222m0124l8593k7063p236J5607K9108K7249K1520
40848a01303K2617K0232J875j7340j0298J9391L6123J7833j6674l1810j3975J8255
$$ plain form
40934 168511 182302 178767 171630 160174 146195 146766 163074 163390 128668 89291 81358 91656 86159
40921 86159 69649 69799 78406 59178 7599 -44175 -81331 -123440 -186891 -267820 -361424 -460897
40909 -460897 -538165 -564415 -552599 -544182 -551532 -547978 -516495 -471785 -429139 -386472 -345209 -317845
40897 -317845 -305708 -294880 -280020 -269753 -267624 -270207 -279857 -294179 -291079 -254904 -208963 -187437
40885 -187437 -183685 -165966 -136226 -126198 -137345 -135846 -112401 -95278 -93023 -76804 -38082 -12452
40873 -12452 -20028 -29188 -12153 5217 -12324 -48940 -63491 -52602 -46599 -56432 -62756 -52800 -36999
40860 -36999 -29198 -33358 -50549 -81771 -121895 -160488 -187551 -194787 -179180 -150072 -122823 -101303
40848 -101303 -78686 -58454 -56579 -73919 -84217 -64826 -28703 -10870 -27544 -59354 -73329 -55074
40836e5074L5872K8852J3467O966K667j4027l1690k2845J0176L1095K0582j7q201
40823A7823j0340j5599j4196l913n918k7831m0602k0862R408J4353o893k8564
40811a33134l3426j6787J9360N2745M8945Q082k4663j9899l344o500j4556k46
40799a23423K3657K9340K5010L5070M8152L0811j5939n2309m8669j3042K2923
40788c8419K7875m436m0338l7739k947J5360m35j3061K427J9045J3343O662J4763
40775c7900J1009j6380k5067J1450M6889L3281j77k009J4870R640o412J012J8034
40762E8240J4107Q995L3569N9181M4096J4903K0334M2430M3789O1187J40907K10894
40750G52632J46923l4512j74292j79112j17856q5034q1267p1441o0156n4337l0555
$$ plain form
40836 -55074 -19202 9650 23117 30083 32750 18723 -12967 -35812 -25636 5459 26041 26024 17823
40823 17823 7483 -8116 -22312 -26225 -32143 -59974 -100576 -121438 -112030 -97677 -104570 -133134
40811 -133134 -166560 -183347 -163987 -111242 -62297 -54215 -78878 -98777 -102121 -108621 -123177 -123423
40799 -123423 -99766 -70426 -45416 -10346 37806 68617 52678 369 -48300 -61342 -38419
40788 -38419 -10544 -14980 -55318 -93057 -96004 -80644 -81079 -94140 -91713 -72668 -59325 -52663 -37900
40775 -37900 -26891 -43271 -68338 -56888 -9999 23282 23105 21096 35966 45606 39194 40206 58240
40762 58240 72347 81342 114911 174092 218188 233091 253425 295855 339644 400831 541738 752632
40750 752632 899555 865043 690751 511639 393783 308749 227482 156041 95885 41548 10993
40739A0993R410J8467j7358m5126k8595j303J845J181J9031L1242J6300j342J379
40726A6124N869l338m621J2644J7101q359k7977j0663J8737K3818R959k182j4077
40713C3035k6079j9287N766J4362o382k0715n559P946r591l4121l2146j4373n143
40700a12287K356J9996L0563J9215N268O297N275j1762k2147p146J0812R116O240
40687c8204K2416L5040J6735j3382j9641m632N424N048K670n175j8416j7919K278
40674b7758J4655J069j4411p320N696J668o335O99Q299p48p681Q415K7165J9812
40660B3225j303p659k638l775m508M177K679k0881l2061P62M3533L9036n387l0299
40646D901j3999P147N953k442j254J225k481l488L87m515k1552l0910j4730J8255
$$ plain form
40739 10993 20403 38870 21512 -23614 -52209 -53512 -51667 -50486 -31455 -213 16087 14745 16124
40726 16124 21993 18655 14034 26678 43779 35420 7443 -3220 15517 39335 49294 47112 33035
40713 33035 6956 -12331 -6565 7797 1415 -19300 -24859 -16913 -26504 -60625 -92771 -107144 -112287
40700 -112287 -109931 -89935 -59372 -40157 -34889 -28592 -23317 -35079 -57226 -64372 -53560 -44444 -38204
40687 -38204 -15788 19252 35987 22605 2964 -1668 3756 8804 11474 6299 -12117 -30036 -27758
40674 -27758 -13103 -12034 -26445 -33765 -28069 -26401 -32736 -32037 -23738 -24486 -32167 -23752 3413 23225
40660 23225 21922 14263 11625 7850 3342 7519 10198 -10683 -42744 -41982 1551 40587 35200 4901
40646 4901 -9098 -1951 4002 1560 306 1531 -950 -4438 -4051 -8566 -30118 -61028 -75758 -57503
40632e7503M0714L3249K556k4523k9434k1638j8661j5694K67J4633J998k2849
40620i6885j8076J3857K1528j1717l6364j6634J5023K0236J5710K5745K6805l310
40608d4082k6068L080N3735O0336K0002j2750j2478l495m552r239j5771k7530
40596a8812l0101j1082Q099K652r079M146K6809J9730j0709k2263p656J354k505
40583d9417P177L1568L4940N422k1280j6540K630P768j329q756r342q255j0844
40570c6258k0489l3264l5000j8086L900J3620J3116J3097J1675L255m494k492
40558i1420M096R271J7422K4818J4439j0595j7695N881K6082J4472n669j133J6902
40545F871K0717J5592J7016J0713j5624l2020j1896J1674m582l5254k4401J6588
$$ plain form
40632 -57503 -16789 16460 19016 -5507 -34941 -56579 -75240 -90934 -90667 -76034 -74036 -96885
40620 -96885 -114961 -101104 -79576 -91293 -127657 -144291 -129268 -109032 -93322 -67577 -40772 -44082
40608 -44082 -70150 -67070 -13335 47001 67003 54253 41775 38280 33728 24489 8718 -18812
40596 -18812 -48913 -59995 -51896 -49244 -58323 -54177 -27368 -7638 -18347 -40610 -48266 -46912 -49417
40583 -49417 -42240 -10672 24268 29690 8410 -8130 -5500 2268 939 -7817 -17159 -25414 -36258
40570 -36258 -56747 -90011 -125011 -143097 -139197 -125577 -112461 -99364 -87689 -84434 -88928 -91420
40558 -91420 -87324 -78053 -60631 -35813 -21374 -31969 -49664 -43783 -17701 -3229 -8898 -10031 6871
40545 6871 27588 43180 60196 70909 55285 23265 11369 23043 18461 -16793 -41194 -24606
40533b4606K2458k1155n7286m5691q241K1218L6044L6704K1526N900P923J3124
40521G918m242k9360k4267P143K2718R156o235j0256j7124k4806j1973J5009K2435
40508d3884M277r695n910j329k862P07M063r199k4921j2244J8732K5331K189j0669
40494f5414L857J7377J1170J646q90r050k1508j5894R825L1025L7341L7733K6415
40481F3633p101l7240k8361J0m151l6914m1884q319R830r905j9772J1985M7075
40468f1114M5384K4773J4978Q860k458P04K3073L0415O852j1398K621J8644K761
40455A04095k5194l0589k1341k3086k9995k1673k784R718J5013J5516J881k2780
40443c1219l1609j2707P350K186j8059k9038k4475r327J1922K6431K0783O540
$$ plain form
40533 -24606 -2148 -23303 -80589 -126280 -134521 -113303 -77259 -40555 -19029 -13129 -5206 7918
40521 7918 3676 -25684 -49951 -42808 -20090 -10934 -17169 -27425 -44549 -69355 -81328 -66319 -43884
40508 -43884 -39607 -49302 -55212 -56541 -59403 -58696 -54633 -63832 -88753 -100997 -82265 -56934 -54745 -65414
40494 -65414 -61557 -44180 -33010 -31364 -32254 -41304 -62812 -78706 -68881 -37856 -515 37218 63633
40481 63633 56532 19292 -9069 -9059 -13210 -50124 -92008 -100327 -90497 -100402 -120174 -108189 -61114
40468 -61114 -15730 9043 24021 32881 30423 31127 54200 84615 91467 80069 82690 101334 104095
40455 104095 78901 48312 26971 3885 -26110 -47783 -50567 -40849 -25836 -10320 -8439 -31219
40443 -31219 -62828 -75535 -68185 -65999 -84058 -113096 -137571 -146898 -134976 -108545 -87762 -81222
40431h1222P139J6588J0137l853P861L9167M4696J3961j2793j5322j7538k5530
40419a6709r806K6567L2027q615l9576k0856J3626K1748J3668P876q187l1072
40407a9309k1030K4645M4119P067k9681j7588L007j6777m2746k3381J3396J3509
40395f4769m255J0108L9452L2002j319j0762j729j6146m0604k3846K4405M0434
40383a7029J2525k605K1812M2275K0485k1951m4129l5737j2102O279M329j0493
40371c6341r137J5800K9429Q847j2909M20K5360K0838L93J104R584j1604m5787
40358d003m4155j1990J490r218l959K0118K1317m609j1025J5646K9479N285j8698
40345a4322p609J5044J2026j0456k2316j5795n837m891j3586k1275j1815J4939
$$ plain form
40431 -81222 -74083 -57495 -47358 -51211 -43350 -4183 40513 54474 41681 26359 8821 -16709
40419 -16709 -26515 52 32079 23464 -16112 -36968 -23342 -1594 12074 19950 11763 -19309
40407 -19309 -40339 -15694 28425 35492 5811 -11777 -8770 -25547 -68293 -91674 -78278 -64769
40395 -64769 -69024 -58916 -19464 12538 11219 457 -1272 -17418 -58022 -81868 -57463 -17029
40383 -17029 -4504 -7109 14703 56978 77463 55512 11383 -24354 -36456 -30177 -25848 -36341
40371 -36341 -45478 -29678 -249 8598 -4311 -3891 21469 42307 42700 43804 53388 41784 -4003
40358 -4003 -48158 -60148 -58658 -67876 -71835 -51717 -30400 -35009 -46034 -30388 -909 4376 -14322
40345 -14322 -21931 -6887 5139 -5317 -27633 -43428 -49265 -54156 -67742 -89017 -100832 -85893
40333h5893L3411K4865P124N387J0976K413j1587j0480m466j3438k1019l07K9286
40320c3728K5706n562k0806r569J53J376J2449K4925R518k3512l0944q087O359
40307e1722J349N992K3141J7049j7346l7355k4944j3837k1205j4533K3318N4522
40295e5571M7714K7988K7750L3024J8276l457n094R427J8658J7426R595p899l0256
40282A07581l8939l0065k1965j9215k412K8404L8086R294k4338k6943j0801o653
40270B034j2430o847P522J1011L795L708J3314J5636J396j8026k5343j4833L420
40257a5643J2514N880n292q535p436r886q282Q339K9600L4631K3202J2183O137
40244G7412k641j0009m733N673K901j0625j6975j5883k1911l1745k7247j0104
$$ plain form
40333 -85893 -52482 -27617 -20493 -15106 -4130 -1717 -13304 -23784 -28250 -41688 -62707 -63014 -33728
40320 -33728 -8022 -13584 -34390 -43959 -43806 -42430 -29981 -5056 4462 -19050 -49994 -58081 -51722
40307 -51722 -50373 -44381 -21240 -4191 -21537 -58892 -83836 -97673 -118878 -133411 -110093 -55571
40295 -55571 -7857 20131 47881 80905 99181 95724 90630 100057 118715 136141 145736 137837 107581
40282 107581 68642 38577 16612 -2603 -5015 23389 61475 70769 46431 19488 8687 2034
40270 2034 -10396 -17243 -9721 1290 5085 8793 22107 37743 39139 21113 -4230 -19063 -15643
40257 -15643 -3129 2751 -2541 -11076 -18512 -28398 -36680 -28341 1259 35890 59092 71275 77412
40244 77412 74771 64762 60029 65702 68603 57978 41003 25120 3209 -28536 -55783 -65887
40232f5887r16l752k345R489K3013L5078M3175K9763j2239m9051m2725r290M682
40219d1005n215k827J9478K9243J3826k697q516j7104k5320j3169O308n953m5530
40206i8481n9113k5499J3514K2472J7945K2487K5797J7244R327N070j1212l0501
40194i0950j7356K6082M7919K4697j894L673J7341Q703m906P26Q121n711k4164
40181g719k4225j8494k4077k4477k872J9386J7593P145J3356K5558J8709l917
40169d034k3388l5697l9359j9735K2932N6029N4883L5315K0973Q954n828p542
40157F3503P210P053k6868o1255n4776j5755J8502L3989L7636K7647J813k3291
40145A5408l1074k6216j7013n26J6629J3465q659j7755l68J7370J8276K0331L0111
$$ plain form
40232 -65887 -66803 -70555 -72900 -63411 -40398 -5320 37855 67618 55379 6328 -36397 -45687 -41005
40219 -41005 -46220 -49047 -29569 -326 13500 10803 2287 -14817 -40137 -53306 -46998 -52951 -98481
40206 -98481 -157594 -183093 -169579 -147107 -129162 -106675 -80878 -63634 -54307 -49237 -60449 -90950
40194 -90950 -108306 -82224 -34305 -9608 -11502 -7829 9512 18215 13309 14035 22156 16445 -7719
40181 -7719 -31944 -50438 -74515 -98992 -101864 -82478 -64885 -57740 -44384 -18826 -117 -4034
40169 -4034 -27422 -63119 -102478 -122213 -99281 -43252 11631 46946 67919 76873 71045 63503
40157 63503 70713 77766 50898 -10357 -65133 -80888 -62386 -28397 9239 36886 38699 15408
40145 15408 -15666 -41882 -58895 -59421 -42792 -29327 -37986 -55741 -56109 -38739 -20463 -132 29979
40132B9979J9703j6428l2532k200K9633J4645k1910k6351j517J1561O962R500
40120B1045J8592J3305j227l526M54j0358k7818k6083p260L867P96l354l523j294
40106b6384Q251K0239J2116j8565l4315r107K6805K9798N165j0896p309J700R380
40093F878J3076R51k4057l2613j3161K797p293j6432K147K4065J8054K483P326
40080a5779J6943N750m869J4493L7265K0506j7554k5423k973P747p82n73P681
40067D2432m449l2090l6916q627K2981L4026K2355j0133m7490n1396j0411K4886
40055e4832P466l2028l4851q767l629j7236n083K9592L8437J7805J4596L6300
40043a2230L3669j1395n1433m7246j6320J0495K6069K6176M095k0405j5669Q686
$$ plain form
40132 29979 49682 33254 722 -1478 28155 42800 20890 -5461 -6978 4583 11545 21045
40120 21045 39637 52942 51715 48189 48643 38285 10467 -15616 -22876 -19009 -18213 -21567 -25090 -26384
40106 -26384 -18133 2106 14222 -4343 -38658 -47765 -20960 8838 14003 3107 -4202 -2502 6878
40093 6878 19954 20905 -3152 -35765 -48926 -46129 -53422 -69854 -67707 -43642 -25588 -23105 -15779
40080 -15779 1164 6914 2045 16538 53803 74309 56755 31332 28359 36106 35324 34751 42432
40067 42432 37983 5893 -31023 -39650 -16669 17357 39712 29579 -17911 -69307 -79718 -54832
40055 -54832 -47366 -79394 -114245 -123012 -126641 -143877 -148960 -119368 -80931 -63126 -48530 -12230
40043 -12230 21439 10044 -41389 -88635 -104955 -94460 -68391 -42215 -38120 -58525 -74194 -65508
40031f5508J1391j2811k7231j8922j3446j6560j000L4134M8131K2602r895k0093
40019f9208j7998j6920p716J0753J6510O01j5290j2872L50J1661J7481J3726J85
40006f8737p502J389R640J224m555J2533K7928J0465j6438j0393J3797R498j6860
39993c8011j8639N158J3662O011J7117L4287P405m9492n8817k354M4032K7652
39981a1989j1194k0631j1043q390m438N456j311k1834j3250L1319N4744K3653
39969A1092j6959j9681n490j1511k3425j2541N885L325r640p581M590R443J0095
39956f2398J3017Q867k103J394K3412L6396K6391J4835J6563J7505J0746Q916
39944A13541N452k3256n9516m8292J5192O2397M6940M904j2828r834j0021j1478
$$ plain form
40031 -65508 -54117 -66928 -94159 -113081 -126527 -143087 -144087 -109953 -61822 -39220 -49115 -69208
40019 -69208 -87206 -104126 -111842 -101089 -84579 -83978 -99268 -112140 -111790 -100129 -82648 -68922 -68737
40006 -68737 -76239 -74850 -65210 -63986 -68541 -56008 -28080 -17615 -34053 -44446 -30649 -21151 -38011
39993 -38011 -56650 -51492 -37830 -31819 -14702 19585 26990 -22502 -81319 -83673 -39641 -11989
39981 -11989 -23183 -43814 -54857 -63247 -67685 -62229 -63540 -85374 -98624 -67305 -12561 11092
39969 11092 -5867 -25548 -31038 -42549 -65974 -78515 -72630 -69305 -78945 -86526 -81936 -72493 -62398
39956 -62398 -49381 -40514 -42617 -41223 -17811 18585 44976 59811 76374 93879 104625 113541
39944 113541 118993 95737 36221 -12071 3121 65518 112458 117362 104534 94700 84679 73201
39932G3201j2485k9114n0983l6087J4570L8444O631k7553j9517l670j7932k7367
39920i1862P894M8131L4664j1143k6757r843m513j4505n941J9732K5535N425p228
39907c0411M265K1057K3360R695j1203k2557q968J6529J8737q546k9414k1454
39895c8910m844K616J2509K5938J9895r84K317K9291K5567k1675m7034j2633K5048
39882A7101J1909j5669q404L773k1564m7134k1108K2061K0496n126J497K0178
39870b1990n260m8779l5747K4451M8736J6637p417R336K6830J8685J0973J7390
39858E3845J3336p176j5740n029J5n620j591P972j694k1270j6695N944N753k0845
39844h795l3285j5272O622J4269J3896M106j7282k2435J1278M5724K6837k4326
$$ plain form
39932 73201 60716 31602 -19381 -55468 -40898 -2454 4177 -23376 -42893 -46563 -64495 -91862
39920 -91862 -83968 -35837 -1173 -12316 -39073 -48916 -53429 -67934 -73875 -54143 -28608 -23183 -30411
39907 -30411 -26146 -5089 18271 27966 16763 -5794 -14762 1767 20504 11958 -17456 -38910
39895 -38910 -43754 -41138 -28629 -2691 17204 16220 18537 47828 73395 51720 4686 -7947 17101
39882 17101 29010 13341 4937 8710 -12854 -59988 -81096 -59035 -38539 -43665 -42168 -21990
39870 -21990 -27250 -76029 -111776 -87325 -38589 -21952 -29369 -20033 6797 25482 36455 53845
39858 53845 67181 60005 44265 39236 39251 33631 32040 40012 38318 17048 353 6297 12050 -8795
39844 -8795 -42080 -57352 -50730 -36461 -22565 -18459 -35741 -58176 -46898 -1174 25663 1337
39832A337l6568J239L0748K4715J7245K4881J7121j4870l2307j5722M170M230
39820B6219L61L274j477j3674j3065n633j8725m0821k8273J5913L5942J2779o887
39807c4067O560K0571P197p849J727J5794J0468J04J723M71j6074k7474j4905
39794c5754P301J9133K1376J5877n089l1840l6356j5465L61m771j2777j1840j4379
39781a04223k1373j1626J7370L8161L6912K9049K1910N494j1577o191R349m132
39769h77m0654m4270K523M4643L6933N324p067k375o6N051J7335J5254r109k3742
39755a097o804J4298J0698R50J2175K8061K0172J532L784K4153L8551M6958O2270
39742B55701P1847N8083M7617Q7505J63838J89208R8509o4890j86485j98983j40130
$$ plain form
39832 1337 -35231 -33992 -3244 21471 38716 63597 80718 65848 33541 17819 21989 26219
39820 26219 26580 29854 28377 14703 1638 -3995 -22720 -63541 -91814 -75901 -39959 -27180 -34067
39807 -34067 -27507 -6936 261 -7588 -5861 9933 20401 20505 22228 22699 6625 -20849 -35754
39794 -35754 -28453 -9320 12056 27933 22844 -8996 -45352 -60817 -60456 -65227 -78004 -89844 -104223
39781 -104223 -125596 -137222 -119852 -81691 -44779 -15730 6180 11674 97 -6094 3255 -877
39769 -877 -41531 -85801 -83278 -38635 -1702 3622 -3445 -5820 -5886 -835 16500 31754 22645 -1097
39755 -1097 -7901 6397 17095 18045 30220 58281 78453 79985 83769 107922 146473 193431 255701
39742 255701 327548 385631 433248 520753 684591 873799 972308 907418 720933 521950 381820
39731C81820q8865p1946o0319l8471k7606l3299k3907J0158K4174j1311n1231
39720I197m0244j88R725q802o777J9022K4459K952o008M713l45k2223j6902K1669
39706i752M1449J8044q388p660l977j6521k0534k576N723j2369j9975J0263M2413
39693A6140L0456j2468l8071k7037K804K7134L0586J4555K474J2221K3001N206
39681H7001k2577j5920J9683L4522J7442P383J6067J0428j4261j7116J2298L2239
39669A67189K4285J7478J5969j6348p0955q0600k9290Q790j2462l7653j0663L1826
39657G566L3586J3565J6188K8612J9220N436J4704K5602J1457l764P488K1926
39645B01586J5457J4796L8910M5065K81m7123l9037m01J2494O930J8457K7417
$$ plain form
39731 381820 292955 221009 160690 122219 94613 61314 37407 47565 71739 60428 9197
39720 9197 -31047 -31235 -21510 -30312 -37089 -18067 6392 9344 3336 8049 7704 -14519 -31421 -9752
39706 -9752 31697 49741 41353 33693 29716 13195 -7339 -9915 -4192 -16561 -36536 -26273 16140
39693 16140 46596 34128 -3943 -30980 -28176 -1042 29544 44099 46573 58794 81795 87001
39681 87001 64424 48504 68187 102709 120151 127534 143601 154029 139768 122652 134950 167189
39669 167189 191474 208952 224921 208573 137618 57018 27728 36518 24056 -13597 -24260 7566
39657 7566 41152 54717 70905 99517 118737 124173 138877 164479 175936 172172 179660 201586
39645 201586 217043 231839 270749 315814 316095 268972 229935 229534 242028 248958 267415 294832
39633B94832k710l9923k4895K6739M6101J7639j1636j4811p240M43Q067p44l3521
39620B58341n6456m1617k0436l3084n5262l9428N52J4098j898j1951j1566j9450
39608a8157k1971N009L7009L0843l267k2356k2360k5392k0957J0121L6727J6461
39596A710k5888l2913r010m428k2183k0619L520J4647J2522K7673M9111L6477
39584C0619J237m492J9366J9529j4511l2404j1770R952O750j876k786j0456k2700
39571a3542j5864M375N945q482l712J8704J7369j3469k9643j1122J0842J4425
39559b4174J5683K2013J4987n028j1423k353o047k3650k1464O728K4316J4353
39547C941N226J6736K8338J8387o509l3201n4321n3891k1407J8211K9454J6989
$$ plain form
39633 294832 292122 252199 227304 254043 300144 317783 306147 291336 284096 284539 292606 291862 258341
39620 258341 201885 160268 139832 106748 51486 12058 12610 26708 24810 12859 1293 -18157
39608 -18157 -40128 -35119 1890 32733 29466 7110 -15250 -40642 -61599 -51478 -14751 1710
39596 1710 -24178 -57091 -66101 -70529 -92712 -113331 -109811 -95164 -82642 -54969 -5858 30619
39584 30619 31856 27364 46730 66259 51748 19344 7574 17526 24276 22400 19614 9158 -13542
39571 -13542 -29406 -25031 -19086 -27568 -31280 -12576 4793 -8676 -38319 -49441 -38599 -24174
39559 -24174 -8491 13522 28509 23481 12058 9705 3658 -19992 -41456 -34728 -10412 3941
39547 3941 9167 25903 54241 72628 66119 32918 -21403 -75294 -96701 -78490 -49036 -32047
39535c2047Q838K092k0577l4887k432N1657O0647J8202j3554n219M672r900k0838
39522F654r253l045k0562l3819j8281Q446K2923K7597K7633J8483J0049J9900
39510E6725L3468J7744j8922l1681j0331Q573Q287J3094L1749L7429J9536J516
39498A67187p154k3832m4729l8690m084J9425J0381j0837k6656m0726m5721k4784
39486g0220Q978K4663K4712L1083K9920m717m1593k5014K5143L0661k0927n6284
39474d3595l4369K546J6001K2813L3333K2771n014m694K8689M2323J7971J583
39462A00358J2768J0487j7831k2100J5117L6962J2045r580J0462L3337K2615O848
39450B11488Q605n275m4452n1547l521K7458j1765o0113m2542P729J5050j4473
$$ plain form
39535 -32047 -23209 -21117 -41694 -76581 -79013 -27356 33291 51493 37939 32720 37392 27492 6654
39522 6654 -2599 -5644 -26206 -60025 -78306 -69860 -46937 -19340 8293 26776 36825 56725
39510 56725 90193 107937 89015 57334 47003 55576 63863 76957 108706 146135 165671 167187
39498 167187 160033 136201 91472 52782 48698 68123 78504 67667 41011 285 -45436 -70220
39486 -70220 -61242 -36579 -11867 19216 49136 44419 2826 -22188 2955 33616 12689 -43595
39474 -43595 -77964 -75418 -59417 -36604 -3271 19500 14486 9792 38481 80804 98775 100358
39462 100358 113126 123613 105782 83682 98799 135761 147806 138226 148688 182025 204640 211488
39450 211488 220093 214818 170366 118819 115298 142756 130991 70878 28336 36065 51115 36642
39438C6642k5501j6846k1666k7592l425K9444L0987J4678J3713J2494j5314l8668
39426a1054j6550J9930J1434l0587m4973j8721Q908K0612K9446K9456N280k1111
39414a7930j4598J2972K1573Q950N411J6155J8769P154n222j3119j4817P18K9288
39401E5304L9916J9790o67J720O392m313q866M378L016k9156n0442l0837q975
39388b740k2491l6428p005L4665L4829P712l88L946j0912k6359o337K5180J8783
39375A2455j2844j8550J919O293j1197k0142j6004j5008o012K6884N3407L4383
39363C5584q702k3773p262O620R861J2039k355m1495o1469k4867K5241K3973j1367
39350f7972j4095K0803M0555K9585J8959J6378N395r0K2834M5972K7193j0138
$$ plain form
39438 36642 11141 -5705 -27371 -54963 -58388 -28944 2043 16721 30434 42928 27614 -11054
39426 -11054 -27604 -7674 3760 -26827 -71800 -90521 -81613 -61001 -31555 -2099 3181 -17930
39414 -17930 -32528 -19556 2017 10967 16378 32533 51302 58456 53234 40115 25298 26016 55304
39401 55304 95220 115010 114343 116063 122455 118142 109276 113654 116670 87514 37072 6235 -2740
39388 -2740 -25231 -61659 -68664 -33999 830 8542 8154 12100 1188 -25171 -31508 -6328 12455
39375 12455 -389 -18939 -17020 -10727 -21924 -42066 -58070 -73078 -79090 -52206 1201 35584
39363 35584 26882 3109 -4153 2467 12328 24367 22012 -19483 -80952 -105819 -80578 -56605 -67972
39350 -67972 -82067 -61264 -20709 8876 27835 44213 49608 49518 72352 118324 145517 135379
39338A35379j2427R972O120j8506j7149K442r125m3730m3546m604J9041J3221
39326C7088J4585K4390N558l0199k7836Q640J3536k6496m9086k5832l328r495
39314f8475p805K2767M3934L0285J2866J6214J7684J208j0181m420m903j9390
39302B9784k0167K545K0563J8075R766p32k3371l7454r881L5637L7887l055k0517
39289C9080J0289L4928J3493k2313l4050l0349k6604j4044K491m618l1196l4317
39277i7210j799K8241L4566L8318M5048K8169q609j9971M409J7153o281k8145
39265C3889j7483L281R659J3839K3798J9783k072j5637j3987j7929k2572J008
39253A5577L7292L1628j6457m0162j1134J7170L088k0691j5019M464J2903J9265
$$ plain form
39338 135379 122952 132924 139044 120538 103389 105831 96706 52976 9430 4826 23867 37088
39326 37088 51673 76063 81621 51422 23586 32226 45762 19266 -29820 -55652 -58980 -68475
39314 -68475 -76280 -53513 -9579 20706 33572 49786 67470 68678 58497 54077 49174 29784
39302 29784 9617 12162 32725 50800 60566 59834 36463 -991 -10872 24765 62652 59597 39080
39289 39080 49369 84297 97790 75477 41427 11078 -15526 -29570 -27079 -31697 -62893 -97210
39277 -97210 -99009 -70768 -36202 2116 47164 75333 66724 46753 51162 68315 62034 33889
39265 33889 16406 19687 29346 43185 66983 86766 84694 69057 55070 37141 14569 15577
39253 15577 52869 84497 68040 27878 16744 33914 37002 16311 1292 5756 18659 37924
39241C7924K7532J6448r064q496K1997L3320Q175p924Q590J7751n174k4535j6761
39228I9783j2139k2901q597L9079N6508Q521m6244m8678k6003k5054l0620j6488
39216c2833j0685l9057o3007m2392m929J1578K6913O0723O9536J8825l7980l4653
39204g7961K034M740k0461j9639N298Q095j0631r059J4029K1554J1925J7864L7882
39191a4330L6228Q756j1175j1647j3323k2393k0868m763Q345R415L364r177k6397
39178f7965l1831j3397J4956L1623L1601J7089j1061l6006k9655O300L5360L7162
39166a5824K6778J2388j7220m7445l8295O042K8317P058j0499K810N124k9354
39154g0120n0464j7160K4687J7763j2186r818J3432J2408n224j764J5226J3091
$$ plain form
39241 37924 65456 81904 72840 64344 86341 119661 127836 119912 128502 146253 141079 116544 99783
39228 99783 87644 64743 56146 95225 151733 160254 114010 65332 39329 14275 -16345 -32833
39216 -32833 -43518 -82575 -145582 -187974 -192903 -181325 -154412 -93689 -24153 -5328 -43308 -77961
39204 -77961 -75927 -71187 -91648 -111287 -105989 -97894 -108525 -117584 -103555 -82001 -70076 -52212 -14330
39191 -14330 21898 30654 19479 7832 -5491 -27884 -48752 -53515 -45170 -35755 -32391 -41568 -67965
39178 -67965 -99796 -113193 -98237 -66614 -35013 -17924 -28985 -64991 -94646 -88346 -52986 -15824
39166 -15824 10954 23342 6122 -41323 -79618 -73576 -45259 -38201 -48700 -45890 -40766 -70120
39154 -70120 -120584 -137744 -113057 -95294 -107480 -117298 -103866 -91458 -96682 -98446 -83220 -70129
39142g0129J338J0623K9101K2642l679k0288k4816k7755j6019J7446L8807J9742
39130b2987j2676k0344j1593o659R559M5308N8856K0564k3363j4043L0312N0874
39118A03808L6980J5512r903m3614n8184l4936r487j5926k5280j218K8493K3220
39106I465M194N531Q82m0430p2920m0207K1453L7867J6899J7123L1425O740m3290
39093d5268n1342j1618J5712R164L936J1800J1333J2172M2215P5413N7139j714
39081A28942l7007l2034k5783k9072j5754Q667J2242M450J8176L3975P602l7334
39069C7070l5822N707J7811j1384k1069J0059L1911J7129k140p630k0564l8270
39057a7192k6988O432J4778l881o84L0695L7704L621k2566j3261k514j4754k4430
$$ plain form
39142 -70129 -68791 -58168 -29067 -6425 -10104 -30392 -55208 -82963 -98982 -81536 -42729 -22987
39130 -22987 -35663 -56007 -67600 -74259 -64700 -19392 39464 60028 36665 22622 52934 103808
39118 103808 140788 156300 146397 102783 44599 9663 176 -15750 -41030 -42248 -13755 9465
39106 9465 13659 19190 20072 -20358 -93278 -133485 -112032 -74165 -57266 -40143 -8718 -1978 -45268
39093 -45268 -96610 -108228 -92516 -83352 -79416 -67616 -56283 -44111 -1896 73517 130656 128942
39081 128942 91935 59901 34118 5046 -10708 -2041 10201 14651 32827 66802 74404 37070
39069 37070 1248 6955 24766 13382 -7687 2372 34283 51412 49272 41642 21078 -17192
39057 -17192 -44180 -37748 -22970 -26851 -27535 3160 40864 44485 21919 8658 6144 -8610 -33040
39044c3040j1681N455J4740K5955L0608O045l1636m0576k2875j6819k1188k00
39032i5212L6815M0655J1900L305K3858K3559j2121l4384j6761P178J0304N954
39020E050J369j4748k9486j8388j394j3939l0282J80N0247M7091K041j997M2706
39007C8450N3648Q059j4780K4749O1077M5166K1055K8597L2967P188j1183j859
38995B93134q302m7049o1794k5414K462j9578m0842j4321J9304J2543m544P868
38983A13467K3266J3176J4703N6411Q3137L6039m6389q4319o7768m2497k8378
38972G0848j7642j5700k4160j8268R403K1986j834k6264j8039K461J0703K2998
38960A6492M7975N1233J7180j0545j87J3570k859j8450K043K9666K3855M593J1367
$$ plain form
39044 -33040 -44721 -39266 -24526 1429 32037 38082 6446 -34130 -57005 -73824 -95012 -95212
39032 -95212 -58397 -17742 -5842 -2537 21321 44880 32759 -1625 -18386 -11208 -904 5050
39020 5050 6419 -8329 -37815 -56203 -57597 -71536 -101818 -101638 -51391 -4300 -2259 -4256 38450
39007 38450 92098 100157 85377 110126 171203 216369 237424 266021 298988 306176 294993 293134
38995 293134 284832 237783 175989 150575 153037 133459 92617 78296 97600 110143 105599 113467
38983 113467 136733 149909 164612 221023 304160 340199 293810 209491 141723 99226 70848
38972 70848 53206 37506 13346 -4922 4481 26467 24633 -1631 -19670 -17209 -6506 16492
38960 16492 64467 115700 132880 122335 122148 135718 132859 114409 116452 146118 169973 174566 185933
38947A85933L1539K7276l50k3128l0434k4932q707q31k4704n6335m1777J1924
38935D5474L1847o955l9920k2324J706j2401l3177k2249m518p703k517L3520N9051
38922A9834L8811P431L282K437k2166m1124k7491r303o960R922M6377M4477j2811
38909E2716m6261m626M2321K0400k5185k0080O123j3211n1073l9237L816J3232
38897f1065M08K0748N6505M5533m91j5538L727L184k2759k8509r335m518j6478
38884b8588j0677J0561J0752j0625j9023o983L987Q334J0263k957l0701l5047
38872a00704J780L6953L5104K5472L5488K9812j6866n2346l0724J920r509k8200
38860g1820k144K7137N78l7420j3074L6724K6045k3322k0898K9068L9904l87j8963
$$ plain form
38947 185933 217472 244748 244398 221270 190836 165904 157197 156366 131662 75327 33550 45474
38935 45474 77321 70366 30446 8122 9828 -2573 -35750 -57999 -62517 -70220 -72737 -39217 19834
38922 19834 58645 66076 69358 71795 49629 8505 -18986 -28289 -35249 -25327 21050 65527 52716
38909 52716 6455 1829 44150 64550 39365 19285 25408 12197 -38876 -78113 -74297 -61065
38897 -61065 -60657 -39909 16596 62129 61638 46100 49827 53011 30252 1743 -7592 -12110 -28588
38884 -28588 -39265 -28704 -17952 -28577 -47600 -54583 -50596 -42262 -31999 -34956 -65657 -100704
38872 -100704 -98924 -61971 -26867 -1395 34093 63905 47039 -5307 -36031 -34111 -43620 -71820
38860 -71820 -73964 -46827 -46249 -83669 -96743 -60019 -33974 -57296 -78194 -49126 -9222 -9609 -28572
38847b8572J732L282k6126l0235L605K2038P609K590K1638L4511L9551O2405Q2717
38834A96745N5798M475o086J9107J5601k1069k8437Q982L8933L8546L5901L2740
38822C91236K795l0926j5810L0255L6246k524k1807o101l829k0239m856M0803
38810C95243N1285J3201r634J0412K5401R950K469K1390L0713J5799Q812J6176
38798E91217L917k5733k6363P025K6721J9387K0245L1350J5579j7958j6393J6689
38786F45683J9340j6591l0294o086j020l5147n5176l7197k8657n4368p1437n2548
38774B76502l0604k9449k8662k1078k7308l6403j3305K4232K3279m091M895M3924
38762A81932M0040j2529l5799n604J1374j4412k8429p054k097l0178l3047O906
$$ plain form
38847 -28572 -26840 -23558 -49684 -79919 -76314 -54276 -46667 -44077 -22439 12072 51623 114028 196745
38834 196745 252543 257018 250932 270039 285640 264571 236134 245116 284049 322595 358496 391236
38822 391236 394031 363105 347295 377550 413796 411272 389465 383364 379535 359296 354440 395243
38810 395243 446528 459729 450095 460507 485908 495858 498327 519717 550430 566229 575041 591217
38798 591217 595134 569401 543038 550063 576784 596171 616416 647766 663345 645387 628994 645683
38786 645683 665023 648432 618138 612052 611032 575885 520709 483512 454855 400487 329050 276502
38774 276502 245898 216449 187787 166709 139401 102998 89693 113925 137204 133113 138008 181932
38762 181932 221972 209443 173644 168040 179414 165002 136573 129519 127422 97244 64197 71103
38750G1103K4602o947k5379J739J7775r723k7822p688n028m7782o9953k6025K7670
38737h3458L4095K3239L2938L5535J0087k413J9206K6725n724l0199k0166k0415
38725A9450m6551m0377J2576L2832j4205m3435M014N3972L2284n574J5479N1519
38713G1984K8301j7856r590L0675K8222j1871l0976k7006l5413m3372j8630J4954
38701b0578J6673M565J4669K8886J6187k602j045m100k9679l3799J2620N4893
38689E6690L9347L599K959J3122p977k7111J212L6932J6962l3554m6267k1448
38677C4466n601j042J4734K1851l538k3704M804M9109N2453K6867J6737J4913
38665B02049o182k4681r679J1733K721j3771n459K023j8059k8520N29J8059k2806
$$ plain form
38750 71103 95705 88758 63379 65118 82893 73170 45348 37660 32632 -15150 -85103 -111128 -83458
38737 -83458 -49363 -26124 6814 42349 52436 50023 69229 95954 90230 60031 39865 19450
38725 19450 -27101 -67478 -54902 -22070 -36275 -79710 -75696 -21724 10560 4986 20465 71984
38713 71984 100285 82429 72839 103514 131736 119865 88889 61883 26470 -16902 -35532 -20578
38701 -20578 -3905 660 15329 44215 60402 57800 56755 52655 22976 -10823 1797 56690
38689 56690 96037 99636 102595 115717 107740 80629 81841 118773 135735 102181 55914 34466
38677 34466 28865 27823 42557 64408 60870 37166 41970 91079 143532 170399 187136 202049
38665 202049 195867 171186 161507 173240 175961 162190 156731 158754 140695 112175 112704 130763 107957
38652A07957o8028m5891J1039K6413P953J1401K6724Q006k4939k1358K18j1118
38640B8377l7188k7117J072k333j5938J1626N0313K9926l0690m6106j800L4847
38628e011L1112J8385J2207m957k5189k1697p005j1001j6465J0467M7251M7365
38616G5462K2660J8502L1541K6383P430J282k587k2774l3056r465J1705l924j8084
38603A05075R458L5048N536l7240k5135J5135J4263j4762j3566M149j4157m6809
38591C6995l2221J5221L2968K2123K5392K9985J237k6428m593K5127r45m2716
38579H2145k4553J8620L229l8634j1469N7903N2369k9394o5307j5001K7624P071
38567F4603j9654j1950r123k8488k5633P224J6662q043j3880J0289J4152r275
$$ plain form
38652 107957 39929 -5962 5077 31490 39443 50844 77568 85574 60635 39277 39495 28377
38640 28377 -8811 -35928 -34856 -37189 -53127 -41501 8812 38738 8048 -38058 -39858 -5011
38628 -5011 26101 44486 56693 51736 26547 4850 -2155 -13156 -29621 -19154 28097 75462
38616 75462 98122 116624 148165 174548 181978 183260 180673 157899 124843 115378 127083 123159 105075
38603 105075 114533 149581 155117 117877 92742 107877 122140 107378 93812 97961 83804 36995
38591 36995 4774 19995 52963 75086 100478 130463 131700 105272 100679 125806 124861 82145
38579 82145 57592 76212 79441 40807 29338 87241 139610 110216 44909 29908 57532 64603
38567 64603 44949 32999 23876 -4612 -30245 -23021 -6359 -14402 -28282 -17993 -3841 -13116
38555a3116p746K3220K6311o135j4880J3294K2532l161j3295P777J5929J357O410
38542E8497L3165L2329j775k0867j4781j7991k5081j546K6277J488m9544m8551
38530b8380k640J1573q655K303L5748J6661m1156l8998L0942O4426K5073n277
38518F1620J1185P153m3767o5829k0947K3328K0317J3930L1312K8856m742j1840
38506E0576J9751K4381j4644k6688J3045L4841N741j3427R350K0263m397p034
38494A11758L4228N5136K2696j1368j8043l3489n5367k4914M4675N5682j0462
38483A70532n2285k1341M333k3762l9705k087K3093n802k4521R166L3030L012
38471G3663k3491j286K3235J3700P009J6136n703n0189l9071K2878K8702l9373
$$ plain form
38555 -13116 -20862 2358 28669 22534 7654 20948 43480 40319 27024 34801 50730 52087 58497
38542 58497 91662 123991 122216 101349 86568 68577 43496 41950 68227 69715 20171 -28380
38530 -28380 -31020 -19447 -28102 -25799 9949 26610 -14546 -53544 -22602 41824 66897 61620
38518 61620 72805 79958 36191 -29638 -50585 -27257 -6940 6990 38302 67158 62416 50576
38506 50576 70327 94708 80064 53376 66421 101262 107003 93576 102926 123189 118792 111758
38494 111758 145986 201122 223818 212450 194407 160918 105551 80637 125312 180994 170532
38483 170532 118247 96906 101239 77477 37772 35685 58778 52976 28455 37621 70651 73663
38471 73663 50172 48886 72121 85821 92830 108966 103263 53074 14003 36881 65583 26210
38459B6210o1375R074N6878J3343k3633K0872O1637K2453k1872K051K7848p376
38447A26110l3158P841L3178k0865o1994r028M8707J3152m1988j5458L1444J686
38435G9627m5058p219O1670N2768R66M566L4825M119n4752n1503r487q329k5513
38422C6680L613L8527P233m1947k2033K7494J6071k6387j4576K3041M431l9712
38410A2435k4770K1666J6082j5856N875N1231L5227j5134j3389J8513K0m1234
38398E0666k0902L1381K3218k2317j1382L8013L1762j7667j8957J8794J0058l0230
38386H2437j0915N2635N5551p291l8427j6747j4460m1012l2366O133L519l1571
38374G486k1507K8147L6587J850j968K5975J6496k5342k9564n733k5657p0661
$$ plain form
38459 26210 -35165 -26091 30787 44130 20497 41369 103006 125459 103587 105638 133486 126110
38447 126110 92952 100793 133971 113106 51112 42084 90791 103943 61955 46497 77941 79627
38435 79627 34569 27350 89020 141788 142754 147320 182145 186264 131512 80009 70522 62193 36680
38422 36680 40293 78820 86053 44106 22073 49567 65638 39251 24675 47716 52147 12435
38410 12435 -12335 9331 25413 9557 15432 66663 101890 86756 73367 91880 91900 50666
38398 50666 29764 61145 84363 62046 50664 88677 120439 102772 83815 102609 112667 82437
38386 82437 71522 124157 179708 172417 133990 117243 102783 61771 29405 35538 39057 7486
38374 7486 -14021 14126 50713 52563 50595 76570 93066 67724 38160 32427 6770 -63891
38362f3891n2222J9854M5844J0508n250J5331Q883k4261j6828K2321J6415k5560
38350d8856j8008L6492M7874O890m831K3931K2452q498M257M7570L0836l5198
38338A04911m0324K6618N4269Q314j8903R856J8102k0376k7244K1524M1857r79
38326A77625l1130q910N113j9468k8608m595l612l2164k3661K5216L4995n574
38314H5227j3502K9572M2077K536r362K6945K9114k3289l8708J5237M6150N341
38302A97338k9471p246P972k5822m3944m089L0649J2270j0913j195N27k3950k1579
38289H0547J9004K6717k1573m9514j5575K0558J7163J4457L1304K3097j0947o361
38277A28877L7453M0100p660j8039K5345K8221l4020n9331n924K8148j1851l7281
$$ plain form
38362 -63891 -116113 -96259 -50415 -39907 -45157 -29826 -20943 -45204 -62032 -39711 -23296 -48856
38350 -48856 -66864 -30372 17502 24392 19561 43492 65944 57446 61703 109273 140109 104911
38338 104911 64587 91205 145474 153788 134885 144741 162843 142467 115223 136747 178604 177625
38326 177625 146495 137585 142698 123230 94622 90027 86415 54251 30590 55806 90801 85227
38314 85227 71725 101297 143374 145910 136548 163493 192607 169318 130610 145847 191997 197338
38302 197338 167867 160621 168593 142771 98827 94738 125387 137657 126744 125549 126076 102126 80547
38289 80547 99551 126268 104695 55181 39606 60164 77327 91784 123088 146185 135238 128877
38277 128877 166330 206430 198770 180731 206076 234297 200277 140946 135022 163170 151319 114038
38265A14038J2958N8210L0306m950J7084M0516Q239k7400j4891l428l4938n3496
38253A42248j6597J7122Rj9017l677n506m6861n3577P610M9251J2807k5537N870
38240F4145M9921L4916j586k305L744j9946l4350q306J3892L429J500J9061P5
38227A24190n3349n1915J7780M5171j3447m8849Q126O3408L2247j7366o274J6441
38215A16163o103j8239K6204N3669M936m6135k5214J4923J0718L421K8760K5766
38203A88869l1992n3430O985M7686K30m0886M255N1016J7258j8633K1187N2625
38191B45170n026n5730J719P3103L1391n1341l5251L9011L8307k2687l1067J2031
38179B39630J9189q264o176J3224L366l958K9434M5587j783l4117J5149O0323
$$ plain form
38265 114038 126996 185206 215512 210562 227646 268162 276401 249001 234110 230682 195744 142248
38253 142248 125651 142773 142782 123765 120088 114582 67721 14144 21754 71005 83812 58275 64145
38240 64145 114066 148982 147396 145091 148835 128889 94539 86233 100125 103554 105054 124115 124190
38227 124190 70841 18926 36706 81877 68430 19581 27707 91115 123362 105996 99722 116163
38215 116163 110060 91821 118025 171694 176630 130495 105281 120204 130922 134343 163103 188869
38203 188869 156877 103447 110432 158118 158348 117462 121717 172733 189991 171358 192545 245170
38191 245170 240144 184414 186133 259236 290627 239286 204035 243046 281353 258666 227599 239630
38179 239630 258819 250555 244379 257603 260969 257011 286445 332032 330249 296132 311281 371604
38167C71604J2261n0171k2475L2265J1846k2825L0738J03291O9146k0899l1601
38156D83180J6459Q302l9898k6954K6643K3047j9829j4866J3799j2017m9875j1681
38144C96310M9962K3966n2723o3025j9553j3656k4542K0407O4914J2276p1001
38133C23335n3286K2908J7891m8759m5165K0675K7243k1513j4092M1924L7313
38122C08474j9203j9843K6199J3196m6280m2225J8119K8610o924M569M5131K2539
38110C32362k5342J2402Q9801O4328l9157o3695J275K0352k4326j9726L4435K1189
38098D03898n1006n1295J9277K5123m1674m7825J8194K5086l8151l6479M4138
38087B69286O3134l043j4157O2394Q8999K0061k4445l877k4559j01253j01914
$$ plain form
38167 371604 383865 333694 311219 343484 355330 332505 363243 466534 535680 514781 483180
38156 483180 499639 507941 468043 441089 467732 490779 470950 456084 469883 457866 407991 396310
38144 396310 446272 470238 417515 354490 334937 321281 296739 317146 382060 394336 323335
38133 323335 270049 292957 310848 262089 216924 237599 264842 243329 229237 271161 308474
38122 308474 289271 269428 295627 308823 262543 220318 238437 267047 260123 264692 309823 332362
38110 332362 307020 319422 409223 473551 434394 370699 371974 392326 368000 348274 382709 403898
38098 403898 352892 301597 320874 345997 304323 256498 274692 299778 261627 225148 269286
38087 269286 332420 329377 315220 377614 466613 486674 462229 458352 433793 332540 230626
38076B30626j268N4421Q379k0139K0030K4248l7651m8082K0711L7882l3989o0305
38064A94863O254L3288l1821n7490J4239N0541j8964o9996k2491J9210j5867l4068
38052F7698J6600L3445k7018m5141L0668P2288J2792k7367K1112M3715k1076m8405
38040A29311K7462P0055n002o5879j4934K9224k9164p2071n52O3635N761o2595
38028G5251j5761N2276J4617n2842l1441J7020o805l7412J3365O8819L7178o471
38016A27794K3316M4604k2996p6550j3514O5843L9340j6747Q939M4836o555n8086
38004A60224n095N6743P599o0059j5938N3079R517o1993q386J01124J03470L7278
37992C77563M2709Q2883L7958l1519O245Q2103M4734m3272j7614O8310L8648o6288
$$ plain form
38076 230626 229358 283779 292158 272019 292049 316297 278646 230564 251275 289157 255168 194863
38064 194863 201117 234405 202584 145094 159333 209874 190910 120914 98423 117633 101766 67698
38052 67698 84298 117743 90725 45584 76252 148540 161332 133965 155077 198792 177716 129311
38040 129311 156773 226828 221826 155947 141013 170237 141073 69002 68450 132085 137846 75251
38028 75251 59490 111766 126383 73541 42100 59120 52315 14903 28268 97087 134265 127794
38016 127794 151110 195714 172718 96168 82654 148497 187837 171090 180029 224865 218310 160224
38004 160224 155129 211872 219471 159412 143474 196553 206070 144077 135691 236815 340285 377563
37992 377563 420272 503155 541113 509594 515839 597942 642676 599404 581790 650100 688748 622460
37980F22460o0038M0065N2309k2964k0649N3632L6064n8261m6534O7005Q6726
37969G49815k593o379R9433J16994J5431J450J15293J38639K2510R982J76971
37958A437546K62003J54291J25601L22074M69765M08126M47353P74874R95834
37949E397467Q22108P30423J201360J783455J932771K394676M240017O368227
37941B4870504N736011J151898m421411o849512n431087l012366j957510j854616
37933H231911j412723p24436n91474q71982q20383m36517l12681m82771m47916
37924B131028j65179q5640k70254k99724q0722J3318j27386j73959j9541L4044
37914I55985j10930j56793K070P3521o3157j27905J1892Q6000n3937j50599l4151
$$ plain form
37980 622460 562422 602487 654796 631832 611183 664815 700879 642618 596084 663089 749815
37969 749815 747222 740843 840276 957270 972701 974151 1089444 1228083 1250593 1260575 1437546
37958 1437546 1699549 1853840 1979441 2301515 2771280 3179406 3626759 4401633 5397467
37949 5397467 6219575 6949998 8151358 9934813 11867584 14262260 18502277 24870504
37941 24870504 30606515 31758413 27337002 20487490 15056403 12044037 10086527 8231911
37933 8231911 6819188 6094752 5503278 4631296 3810913 3374396 3061715 2578944 2131028
37924 2131028 1965849 1880209 1609955 1310231 1229509 1242827 1115441 941482 921941 955985
37914 955985 845055 688262 690332 763853 700696 572791 584683 670683 616746 466147 431996
37903D31996O8873j4682q9957m151N3574n2721j17974J986R1461j8776j21852
37892B27777k4285R4635L4094o0488o972O3834l320o5170K4189R9712m16j05014
37880B78576k8575P3451P474q9084k9054N6266j3195j00734k0686Q9269L0101
37869B53809p5811l0618N6897L613p6950q345Q4429K0077o9421M153J00430J5602
37857B77865j08043m4639P8555K6828q8430l6016P5297J2317j13381n2974R2350
37846A19729O0012p2069m5253P7752M8128p5920m9776P3262N3743n7804k9805
37835A01999P9294L3743j01657p2479P3569P9514k9547k1572O8556K0688j02494
37824A29614n6322R5129P9496o4343o1580O9615O6260n7805m5954Q6656P9368
$$ plain form
37903 431996 500869 486187 396230 392079 445653 392932 274958 276944 368405 349629 227777
37892 227777 203492 298127 332221 271733 264761 328595 325275 260105 284294 384006 383590 278576
37880 278576 250001 323452 330926 241842 212788 269054 255859 155125 134439 223708 253809
37869 253809 177998 147380 204277 207890 130940 122595 207024 227101 157680 161833 262263 277865
37857 277865 169822 125183 203738 230566 142136 106120 181417 193734 80353 27379 119729
37846 119729 179741 107672 62419 140171 188299 112379 62603 135865 189608 131804 101999
37835 101999 181293 215036 113379 40900 114469 193983 164436 142864 211420 232108 129614
37824 129614 73292 168421 247917 183574 121994 191609 257869 200064 154110 240766 320134
37813C20134o2011q0047L1701L6944n7730k3554J08712Q9437n0596m6200Q3314
37802C50104P5596m3029j218J61105J30815q3879j52090k6475P326r2536o7761
37791B57958Q3194O8748j16896j49920J8168P7843m2342o6125O2572P4815o8617
37780A99398q9671M3502M1051j20848j22887P5658J32153l6663j04278L5094Q6468
37769A38977m3971p0064Q4754J19914m3401r3704N9018J04173n0155q8564Q2944
37758A99921J36368l7489j08065M9004J08887n9172j32279K6955R8768n7712j24538
37747A00648L8549J08303n7536j24462N9814J47504l8508j50095K1570J53147
37737B58934K1509q9717J6729O9144q7832j43688N7810J67701p806j20986M3075
$$ plain form
37813 320134 258123 178076 209777 246721 188991 165437 274149 363586 312990 266790 350104
37802 350104 425700 382671 381453 542558 673373 589494 437404 410929 418255 325719 257958
37791 257958 341152 409900 293004 143084 161252 239095 196753 130628 193200 268015 199398
37780 199398 109727 153229 194280 73432 -49455 26203 158356 121693 17415 52509 138977
37769 138977 95006 24942 109696 229610 186209 92505 151523 255696 205541 116977 199921
37758 199921 336289 298800 190735 239739 348626 289454 157175 184130 282898 225186 100648
37747 100648 139197 247500 189964 65502 125316 272820 234312 84217 105787 258934
37737 258934 280443 190726 207455 276599 188767 45079 102889 270590 262784 141798 184873
37726A84873J44043m0013j62227K0153J64602P726j25080L2480J60193j3080j65199
37715B08471n996J57323K5403j15389K4731J63458J9560j13919N2913K20804P9294
37704G16653q2836O1452K47769J51555K3721J94947M44310M35501K87595J82102
37694B662769n6791m64020o05285k96510m1580j94652l40932j04167J31345k8962
37684F61215k22792m2196J69842Q66k13501m9605J68344J1628k00016k9517K05197
37673D59465M9711j93164o1660J60928K6693j77150j2206K09993L3972k12105
37663B84477l8764K32056Q2972j85415m8903K03639M7466k26262p9161K06100
37653D78205Q6712j61539p961K45308N1823k56464q1522K52702J03309k40593
$$ plain form
37726 184873 328916 288903 126676 146829 311431 319157 194077 226557 386750 373670 208471
37715 208471 202475 359798 385201 269812 294543 458001 477561 363642 416555 637359 716653
37704 716653 633817 695269 943038 1094593 1118314 1313261 1757571 2193072 2480667 2662769
37694 2662769 2605978 2141958 1536673 1240163 1198583 1003931 662999 558832 690177 661215
37684 661215 438423 396227 566069 566935 353434 303829 472173 483801 283785 254268 459465
37673 459465 509176 316012 254352 415280 441973 264823 252617 462610 496582 284477
37663 284477 245713 477769 560741 375326 326423 530062 577528 351266 272105 478205
37653 478205 564917 403378 395417 640725 692548 436084 354562 607264 710573 469980
37643D69980j21921K00562P8222k36252r9092K29438J00920k11410m6892L00184
37633F63739J35663k39049r1013K85985J29211k72925j23600L01726J74369k51519
37623G12587j28504L02363J75416k75462j60403K96797J82436k90081j83314L00065
37613I31900K00534k87851j85213L16012K11208l01418j78859L76994K68049l19886
37603A031470k35210L71757L19676k67175j89436M29537L51077l06116k51275
37594A254305M20022L82087k80799k13233M81460L81818l95628l28444M99430
37585B201018M89825l05117k29648O57454N97860l58402l20166P16507P51156
37576D200487k72014k47151R22157J007613j30466j26910J204641J351163R3065
$$ plain form
37643 469980 348059 548621 626843 390591 291499 520937 621857 410447 363555 663739
37633 663739 799402 560353 469340 755325 884536 611611 488011 789737 964106 712587
37623 712587 584083 886446 1061862 786400 625997 922794 1105230 815149 631835 931900
37613 931900 1132434 844583 659370 975382 1186590 885172 706313 1083307 1351356 1031470
37603 1031470 796260 1168017 1487693 1220518 1031082 1460619 1811696 1505580 1254305
37594 1254305 1674327 2056414 1775615 1562382 2043842 2425660 2030032 1701588 2201018
37585 2201018 2690843 2385726 2156078 2813532 3411392 3052990 2732824 3449331 4200487
37576 4200487 3928473 3681322 4603479 5611092 5480626 5353716 6558357 7909520 8002585
37567H002585J33227J740055J999335O08437P67219K858883L388459J953713K542438
37558B3994351N764420P207883O102736P303508J1486460J2971355J1470446J4757296
37550A01058455K3909495K9643437L2352248M8664216Q0500021R2786768M9565662
37543D58480302l1818198r0686135r1648680n8965758l4903322k9018086k4702591
37536I6737532j5288209r631887j0724883j0840673o927352m566023n811407n830981
37528B7116117k950032j464662k885083l357390j410933m14092j688896k185973
37520A0759056o70042Q3398j080548j592263l27978L43877o76045j210713j86966
37511E441776M03328m67940r68754j22735L78346l75086p92534k4022M06213l22204
$$ plain form
37567 8002585 8135812 9875867 11875202 12483639 13250858 16109741 19498200 21451913 23994351
37558 23994351 29758771 36966654 43069390 50372898 61859358 74830713 86301159 101058455
37550 101058455 124967950 154611387 186963635 235627851 316127872 408914640 458480302
37543 458480302 426662104 335975969 244327289 185361531 150458209 121440123 96737532
37536 96737532 81449323 71817436 61092553 50251880 43324528 38758505 32947098 27116117
37528 27116117 24166085 22701423 19816340 16458950 15048017 14633925 12945029 10759056
37520 10759056 10089014 10172412 9091864 7499601 7171623 7515500 6839455 5628742 5441776
37511 5441776 5845104 5377164 4408410 4285675 4664021 4288935 3496401 3472379 3878592 3556388
37501C556388p45556m9764L79120k56008o41108m479L90758k16628o09812k0264
37491A782647L98375j23898n06766K75L76350j02175m54125K6895L89078p6684
37481A709972m62681n7851K90937r9687m17785m015L44024l7537l83070k2717
37471H59590L25489O22l28001k5727K72222l7113l32904l0611K61971k6806l02853
37460F35879q439K68437k3512k99172k171K91312J3107k81689j9095K69588R627
37449H53872k88445m5634K55501L7953k47264l9680K26347L584k80982p9759J98816
37438E94309J4838k37362k9184K44099M4502k44448p0077K14048N4797k25947
37428C59575q5678J82208N6312j88314n7879J71996K5096k10053n1176K12032
$$ plain form
37501 3556388 2810832 2761068 3140188 2884180 2243072 2238593 2629351 2412723 1802911 1782647
37491 1782647 2181022 2057124 1550358 1550633 1926983 1824808 1370683 1397578 1786656 1709972
37481 1709972 1247291 1189440 1480377 1380690 962905 958890 1302914 1265377 882307 859590
37471 859590 1185079 1185701 857700 831973 1104195 1067082 734178 703567 965538 938732 635879
37460 635879 627440 895877 872365 573193 571022 862334 875441 593752 574657 844245 853872
37449 853872 565427 519793 775294 813247 565983 526303 752650 756234 475252 395493 594309
37438 594309 609147 371785 342601 586700 631202 386754 316677 530725 585522 359575
37428 359575 273897 456105 512417 324103 266224 438220 463316 253263 202087 414119
37418D14119Q0051j79738o6807J74906N7736j82298o0839J95351R8378j46660
37408C84199n9072J76584R5011j31577n2109J72254J10098p6228L2772K65870
37398I17802J94124k0149P1847L64316M39200L26206K74647J29459l02673o39115
37388A755664m57676q5665p4565k63429j68602P5445J8499k03804j42261Q4263
37378E37869L9912j61010r0880J32132P2470j57071j05700J36050J10019j27106
37368C86685j28719P8396P6185j19016j14605P4366P8514p8569m6077J27108Q0099
37357D14367j25828j01830J12085J17711p8757j01033N6418M3388j33208j24735
37347G8578O0492P3336q4165p0809J08931J12672o1371p6917P0297N4573j14396
$$ plain form
37418 414119 494170 314432 247625 422531 480267 297969 237130 432481 530859 384199
37408 384199 325127 501711 596722 465145 413036 585290 695388 619160 651932 917802
37398 917802 1111926 1091777 1163624 1527940 1967140 2293346 2567993 2697452 2394779 1755664
37388 1755664 1297988 1212323 1137758 874329 705727 781172 799671 595867 453606 537869
37378 537869 577781 416771 325891 458023 530493 373422 267722 403772 513791 386685
37368 386685 257966 336362 412547 293531 178926 253292 331806 253237 207160 334268 414367
37357 414367 288539 186709 298794 416505 337748 236715 293133 336521 203313 78578
37347 78578 139070 212406 128241 57432 166363 279035 217664 140747 211044 265617 151221
37336A51221r7614R8907J21673m6948o4458R4136R5704q3233j06737N7533P6475
37325B96659r1091j18733L9864O4497r3386j15614N2039R4417n1379q0323P0436
37314F7386J00118n3838q8373O8185J17667j9850n6999Q4321J16317m7121j21327
37303A66486k667N1118n4504p7506N4870R0178m2718q4256M4645Q9283l0330o4942
37291A39657N8960Q8792m3548p1650Q0029J30093k4436j09962J766P0029k5150
37280B94580o0651O1227J03838l4401j09460j173O4747k8228o6419M9407R2825
37269C66292l6552r8340K7298J04068o223q7284J011O1891l1572q6034J6914Q2281
37257C13750o295n8198L0453O0163o3608j15835J5327R3194k1205r9670J4061
$$ plain form
37336 151221 53607 152514 274187 227239 162781 256917 352621 269388 162651 220184 296659
37325 296659 205568 86835 126699 191196 97810 -17804 34235 128652 77273 -3050 67386
37314 67386 167504 113666 25293 93478 211145 191295 134296 218617 334934 287813 166486
37303 166486 163819 214937 160433 82927 137797 227975 185257 101001 145646 234929 204599 139657
37291 139657 198617 287409 243861 172211 252240 382333 357897 247935 249701 319730 294580
37280 294580 233929 295156 398994 364593 255133 253960 318707 290479 224060 273467 366292
37269 366292 329740 231400 258698 362766 356543 269259 270270 332161 300589 214555 231469 313750
37257 313750 307455 249257 279710 339873 276265 160430 175757 268951 247746 148076 162137
37246A62137J04224R01r8827j8667O8670k304p1829P895P1766k1357r4219N310
37234A13700R9615K0936o9861n503O5864j3888r5101j6551P6810J9067n8539K796
37222A39345P8326J7141n8057k501O2021j447o4797Q757Q4799J6918o7430j8711
37210A94364M8928j322n5561Q891O2808j8186r0977j5662O6952P416o1458Q694
37198A54887Q3230Q080q1335j7265P9030L7991l5405J3126P4099r31q8540k3085
37186B03882Q0467M6625l0649J0183P7958K4732m6656J1724Q4548J1634q6320
37175C88128k6488Q5899N5927l9524k0879M4071n136q8423m3422M5354R998o5608
37163C39897q629R7471O7646k9966j1450O9386M2863l3557N336R3084N2275n7062
$$ plain form
37246 162137 266361 267262 168435 149768 218438 216134 144305 152200 223966 202609 108390 113700
37234 113700 213315 234251 164390 158887 224751 210863 115762 99211 176021 195088 136549 139345
37222 139345 217671 234812 176755 174254 236275 234828 170031 178788 263587 280505 213075 194364
37210 194364 243292 241970 186409 195300 258108 239922 148945 133283 200235 207651 146193 154887
37198 154887 238117 246197 164862 147597 226627 264618 229213 242339 316438 315507 226967 203882
37186 203882 284349 330974 300325 310508 388466 413198 366542 378266 462814 474448 388128
37175 388128 361640 447539 503466 463942 443063 487134 481998 393575 350153 395507 405505 339897
37163 339897 331268 428739 496385 466419 454969 524355 567218 533661 538997 632081 684356 627294
37151F27294m7253M1468K7793o2888o4774J594j1741p6626n4323J6755L90n4888
37139C42801r515P9913O2471j1767N534O2046J1685p9604m6395N2773M0190m3625
37127D66507k7155N4090L2753n5095l8860N0154L9170m8608m1851M6484N5074
37116E32663p439K838O1506K4971o4228m0213O1861O3347j8707j2754O6085M5234
37104G15164o3488p9981N159L0661j3908J0240Q2819M4327q1804j10380l5693
37093E03116l0209j03781r1698J0177K8496n1348n8569K8736M6373k8691l6750
37082B15852M1594M2426n5260p7996J3480N5093l238j8584M5269M5135m5876p1284
37070A86611O260L1062m1108n9065K2462N1263k2690m5284M4507R4789K3978m2750
$$ plain form
37151 627294 580041 621509 649302 586414 521640 523234 511493 434867 380544 397299 397689 342801
37139 342801 333286 413199 475670 463903 469437 531483 543168 463564 417169 469942 510132 466507
37127 466507 439352 493442 526195 471100 432240 482394 521564 472956 431105 477589 532663
37116 532663 525224 528062 589568 614539 550311 510098 571959 635306 616599 603845 669930 715164
37104 715164 651676 571695 576854 607515 593607 603847 686666 730993 649189 538809 503116
37093 503116 472907 369126 277428 287605 316101 264753 206184 234920 281293 252602 215852
37082 215852 257446 299872 244612 166616 180096 235189 231951 213367 258636 303771 257895 186611
37070 186611 192871 223933 182825 123760 146222 197485 174795 129511 174018 268807 292785 250035
37058B50035k4448j3321n1839l7194M9829P2830k031k6176N1880P9833j6264r1706
37046B41428m3798K3130J3439l352L0952M4348L122o130L8367L1602m7382p4625
37034B51101j3604J1702m2319n4360J8887N0363j2878m8755j350J6061l8186l5605
37022A01057O5077J07239J2456p0410l0308K1800k0009o6393k4393K5533m72l0720
37010I0457M012L1892m992l2036k525J741n3306o2931J6032O5296K1214p391M3653
36997A11116O4796r719o1851q176M2617j468m3966R098P0987M3126r690k549J5542
36984B19863r775j9852J6794J5349n1157o8197Q142M7245k0428o6196l52O1099
36972A32535J8819k9055P492L1187l8125q2219L26Q8088M6109l6742k3042K9020
$$ plain form
37058 250035 225587 212266 160427 123233 173062 245892 243861 217685 269565 349398 333134 241428
37046 241428 197630 220760 234199 230847 261799 306147 309269 303139 341506 373108 325726 251101
37034 251101 237497 249199 206880 152520 171407 221770 208892 160137 158787 174848 136662 101057
37022 101057 166134 273373 285829 215419 185111 206911 186902 120509 96116 121649 121177 90457
37010 90457 94469 126361 121369 89333 86808 88549 35243 -27688 -11656 53640 74854 67463 111116
36997 111116 175912 166193 104342 96166 138783 137315 93349 102447 173434 216560 206870 204321 219863
36984 219863 210088 190236 207030 222379 171222 103025 111167 158412 137984 71788 71436 132535
36972 132535 151354 122299 129791 160978 122853 40634 40960 129048 175157 138415 115373 144393
36960A44393M163m4058j5198L2600K666m7313k6349P243k7585n8964j193O3828
36948C4233L3274k0368J0353O2664L2462j9246J3365P3509N1231j0971j2038J6911
36936B65379o01j9897K3515N9461R318m9756k5075J0842l6569q8814l7485M2366
36924A52684K3958m4136m5505j3780l7060o0539J901O9270K4483n9722m4421K6351
36912f516K1423l0064j3966L6399J3198m2568k0100L5739Q178n5313k4099O3803
36900a3886O5939n049j9134K3534J4217l7795k8564K5395J7166l7204l0575K2747
36888c209J8892k5165o373N2518M0156k5002k7878K0851J1400m3264l1418L3267
36876A4775L2296k7753k5726M1704N5119k284k5994K761j422l8938k3271L0022
$$ plain form
36960 144393 148556 104498 89300 121900 124566 77253 50904 58147 30562 -28402 -29595 34233
36948 34233 67507 47139 57492 120156 152618 133372 146737 220246 271477 260506 248468 265379
36936 265379 264778 244881 268396 327857 337175 287419 262344 273186 236617 147803 110318 152684
36924 152684 176642 132506 87001 73221 36161 -24378 -22477 46793 71276 11554 -32867 -6516
36912 -6516 14907 -15157 -29123 7276 20474 -22094 -42194 -6455 1723 -53590 -77689 -13886
36900 -13886 52053 47004 27870 51404 65621 27826 -738 24657 41823 4619 -25956 -3209
36888 -3209 15683 -9482 -15855 36663 76819 51817 23939 44790 56190 12926 -18492 14775
36876 14775 47071 19318 -6408 35296 90415 88131 62137 64898 63476 24538 1267 31289
36864C1289J7017m8800m8245K1883M2799m805j8572J7693J1111m1455l8562K1886
36852c6761K8473k9843l8345K6339N4152J0363j0159K4802L0317j6389k8708J3815
36840B8056K3024k1582k9990K2459M7856J4961k082J9220J1799k8550k2649K7283
36828H9805K4335l8441n4303J535K9666k120n103M7856O4997J3212j9465O872
36816A58846J8829j3852k1594J3513J3490l6436m7665J540J9432k3966m0378M109
36804D5868K6891l511n730M5396N5189j3981o2406k5643K2564J4178q639k650
36792H7526n32j5883m798K4890L313n7789n7874J2867M3130m212l0789J0546L7174
36779D7569O541n682L2583L7870k2230n3537o113L7415K2690J5005N1347O0721
$$ plain form
36864 31289 48306 -494 -48739 -26856 15943 11138 -7434 10259 21370 -20085 -58647 -36761
36852 -36761 -8288 -38131 -76476 -50137 4015 14378 4219 29021 59338 42949 14241 28056
36840 28056 51080 29498 -492 21967 69823 84784 82702 101922 113721 85171 62522 89805
36828 89805 114140 75699 21396 22931 52597 50477 45374 93230 158227 171439 151974 158846
36816 158846 177675 163823 142229 155742 169232 132796 85131 86671 106103 82137 41759 45868
36804 45868 72759 69248 63518 108914 164103 150122 87716 62073 84637 98815 90176 87526
36792 87526 86994 71111 66313 91203 94516 36727 -21147 -8280 34850 30638 -151 10395 47569
36779 47569 54110 48428 81011 118881 96651 43114 37001 74416 97106 112111 163458 224179
36767B24179J4429l031M3032O3309J8698N595P5684J33856J14360R7864J50690
36756I38665K07133K16954K44937L06155K67799N5060j89242k92903k76272k53702
36746A224584k38728j87850j29327j08713r2326m2018k245j4177l4581k7507l4668
36735C12444p2270p2252j1322K3020j7072n0045j5269K0731L264n010L8683N6053
36723B10955l776n4381k7761N27l5532n8103J109N4002R653n6233l8283J4074
36711A6251N571k5028N727N8129M8320M624k953R7l3231n3886j2732K3147r642
36698B4394l7581J6263P2151K6251n7694n7790l253o61l3477j3242L8016L2822
36686F199j1096j2553J3583l44k5237J0370O6331N1193q750j7770J4459K511m7158
$$ plain form
36767 224179 238608 235577 278609 341918 360616 366211 441895 575751 690111 787975 938665
36756 938665 1145798 1362752 1607689 1913844 2181643 2236703 2047461 1754558 1478286 1224584
36746 1224584 985856 798006 668679 559966 467640 425622 423377 409200 374619 347112 312444
36735 312444 240174 167922 156600 179620 162548 112503 97234 117965 121229 116219 154902 210955
36723 210955 207179 152798 125037 125564 90032 31929 33038 87040 96693 40460 2177 16251
36711 16251 21822 -3206 2521 60650 108970 113594 110641 110738 77507 23621 10889 34036 24394
36698 24394 -13187 3076 75227 101478 43784 -14006 -17259 -17920 -51397 -64639 -26623 6199
36686 6199 -4897 -17450 -3867 -4211 -29448 -19078 47253 98446 89696 71926 86385 88896 41738
36673D1738n1779o418K0847K0059L2701M6536K4066l054R483J7239l3057q1695
36661C6666m8567J5043J1260k9653j3361L7435K9447k0957k1185K0767J8925k0957
36649A4863j8439J8640J0630l2937k8112K1298L1997L38j87K8620J3024m0240
36637A9495m5084P724L7641K0824J3880K9838K2955j777P541L7620K6182j5889
36625A60950k2134J273q551m1548l2408O087K901k9803j4009M2472N1744K269
36613A19243k7014j0341o79j1085p40K1051N047k7407j1722L1087K5118j3451
36601I9107j165N1169N1245l300k0028J5814J9371k7606m2372N40K2417j5313
36589A49879n3628n3629m6221l9697j326M8171M4614J029m785K7353K0834k6367
$$ plain form
36673 41738 -10041 -16459 4388 24447 57148 103684 127750 124696 134179 151418 118361 36666
36661 36666 -11901 3142 14402 -15251 -28612 8823 38270 17313 -3872 16895 35820 14863
36649 14863 -3576 15064 25694 -7243 -35355 -14057 17940 18278 18091 46711 59735 19495
36637 19495 -25589 -17865 19776 40600 54480 84318 107273 105496 113037 150657 176839 160950
36625 160950 138816 140089 131538 89990 57582 63669 66570 36767 22758 65230 116974 119243
36613 119243 92229 81888 81209 70124 69384 90435 95482 68075 56353 87440 112558 99107
36601 99107 97942 149111 200356 197056 177028 192842 212213 184607 142235 142775 165192 149879
36589 149879 96251 42622 -3599 -43296 -44622 3549 48163 49192 44407 71760 92594 66227
36577F6227l1928J3635K4567k0910m2174p902J3353j0025k0409O310J4787j4601
36565i070k7626p047j420j6645k826K8340N758n6529n5989K4852Q0861N7686K3896
36552D4241K8514K5577j0522k8058q096n542l2858k7186K2877M4332J5075K244
36540G0598K5131J7004l2024l7456K0320M3291j4363o3435l6232P787N871o807
36528c15N847N241k6477l2521O974K5109n324j5505K5336M4987O254j8368J4766
36515C6004L4978p561m4702j5541K7514K4403P641J3618N217l4765m5057k443
36503f94J7595k1150l7108K0420O6552K5559l6169l0099Q789P826j0088Q520L6571
36490E6524K7711R792J9426K1427j5851m4959k4406L877K174J1041N5520P5234
$$ plain form
36577 66227 34299 47934 72501 51591 9417 1515 14868 4843 -15566 -9256 5531 -9070
36565 -9070 -36696 -43743 -45163 -61808 -64634 -36294 -30536 -87065 -143054 -118202 -37341 20345 44241
36552 44241 72755 98332 87810 59752 51656 46114 13256 -13930 8947 53279 68354 70598
36540 70598 95729 112733 80709 43253 63573 106864 92501 29066 -7166 621 6492 -315
36528 -315 5532 10773 -15704 -48225 -41251 -16142 -21466 -36971 -11635 33352 39606 21238 36004
36515 36004 70982 63421 18719 3178 30692 55095 62736 76354 81571 46806 1749 -694
36503 -694 16901 -4249 -41357 -20937 45615 71174 35005 4906 13695 21521 11433 19953 56524
36490 56524 84235 94027 113453 134880 119029 74070 49664 53541 55715 66756 122276 197510
36478A97510L2986o719N641J4360k5111n0690j4180J5266k2783o0932k8153J4783
36466G1978r960m9615k2460K6620J2856k9124j5854K6705J7475k7945l6138j2606
36454d8068j0030j2355K2712N5529K4612l0301k6780K0138L2584M892p581K673
36442B8025K072n208Q31j576k5633k4086K6498N8142K0435k0798L857M0016J0514
36429A13089l9683k8811R360k557l2007k250M9098L0908k9734l0856K4481M1988
36417A03026M749j5732J088Q608j02N548N886l2885o2077j5564N6652N0123k3097
36404H6223n6824k3706O301M570R500K2845N990k5936k2163K843k367j8744O289
36391e179M1475J6874l8491l6326J3925K3661j4846k5886K052O453j5204j906
$$ plain form
36478 197510 230496 223777 229418 243778 218667 167977 153797 169063 146280 85348 57195 71978
36466 71978 62018 12403 -10057 16563 29419 295 -15559 11146 28621 676 -35462 -48068
36454 -48068 -58098 -70453 -47741 7788 32400 2099 -24681 -4543 28041 32933 25352 28025
36442 28025 30097 24889 25720 24144 -1489 -25575 923 59065 79500 58702 62559 102575 113089
36429 113089 73406 44595 53955 51398 19391 17141 66239 97147 67413 36557 61038 103026
36417 103026 107775 92043 93131 101739 101637 107185 113071 80186 18109 2545 59197 109320 86223
36404 86223 29399 5693 11994 16564 26064 48909 54899 28963 6800 9643 7276 -11468 -5179
36391 -5179 36296 53170 14679 -21647 -7722 15939 1093 -24793 -22741 -16288 -31492 -33398
36379c3398L8767L4569q618o776M6835O2949J2147l2043k9193k4953m2042l8972
36367b0728o645N803j1599j0540J7443K5757R000J1787L3172K7340L017J1703
36355I5510L6524J1659m5550m8575M831K4423j3726l4496j0052k149k8686k4148
36343c4435K7199M9064R874k1403l436J2208p002j3073J9176L6764J0319j1452
36331G3803O90N042j7162j8224J5907K3047k3894n9429l4669O440J3933Q732K0206
36318A4422K8503J9173J9711L8937M4163L2535M5839Q4319R1339N4045L0029M3027
36306E46042M5408J7243N129K4332K0407k7852o1342m2057j2099q431o756Q709
36294E08733P762j4621j7523J861l967l1363j5255M5338O3025P412l8262j8193
$$ plain form
36379 -33398 5369 39938 31320 24544 71379 134328 146475 114432 85239 60286 18244 -20728
36367 -20728 -27373 -21570 -33169 -43709 -26266 -509 8491 20278 53450 80790 83807 95510
36355 95510 132034 143693 98143 49568 54399 78822 65096 30600 20548 18399 -10287 -34435
36343 -34435 -7236 41828 51702 30299 26863 39071 32069 18996 38172 74936 85255 73803
36331 73803 74493 79535 62373 44149 60056 83103 59209 -220 -34889 -28449 -14516 -5784 14422
36318 14422 42925 62098 81809 120746 164909 197444 243283 327602 418941 472986 503015 546042
36306 546042 591450 608693 613822 638154 658561 630709 569367 527310 515211 506780 500024 508733
36294 508733 516495 501874 484351 486212 482245 450882 435627 480965 543990 551402 513140 494947
36282D94947J1155k423j6998O644K2625q689m0367k6030j593p896j4868O572J7895
36269D40974j1419l8308k2966K335K011j343Q666k716m3373n4945j2719J8690
36257B84887q449m7639m9875m5359o5560p0537k8339J3203Q002j0150l69J0252
36245i933p262j9245M23J1099j6233l6791j3536J5182J2346P517K4576K8250L533
36232g4j049K8616K8243k4409m9926m165L4165J63m2197k0623J5994q13k6909
36219f2984M898N0743L5319j0372j3216R310P63j5636Q813L6138N821m2544l0910
36206b3857J9793K9767m369k4112j9033j9213j7881L221J6064J634N686N0599
36194A8299O3589n757p4010m6365K5430L5555J536P503L4934N766n2540m4924
$$ plain form
36282 494947 506102 503679 486681 493325 515950 507261 466894 440864 439271 431375 416507 423079 440974
36269 440974 429555 391247 368281 370616 372627 371284 379950 377234 333861 278916 266197 284887
36257 284887 276438 228799 178924 133565 68005 -2532 -30871 -17668 -9666 -19816 -20185 -9933
36245 -9933 -17195 -36440 -36017 -24918 -41151 -77942 -91478 -76296 -63950 -56433 -31857 -3607 -74
36232 -74 -1123 27493 55736 31327 -18599 -22764 11401 11564 -30633 -51256 -35262 -36075 -62984
36219 -62984 -58086 -7343 27976 17604 4388 13698 14461 -1175 7638 43776 49597 7053 -23857
36206 -23857 -4064 25703 21334 -2778 -21811 -41024 -58905 -55684 -39620 -37986 -32300 18299
36194 18299 81888 76131 2121 -44244 -18814 16741 18277 25780 60714 66480 13940 -30984
36182c0984J7167L3938q210k8261n754q28k2987j7243J7067K2922K545J3027M4894
36169C7293K9825k7106m5748q086K0968J5995J7738L1221J4258k2668j9496J9380
36157F3574K5826p180j3781K0208L4435J1182L328K6372L2294J2415J7676N1790
36145B78139N1101N61l2118j0663J6824J1167k194k449j2128l5921m0832k3985
36133A97502k3682m2791l8968q036L086j7695k9182j7472j2957j6206O602M2886
36121D3087L8077n552k5436p252k044k0061r395L6069N0870J3714j0155J7698
36109A19620M6378L0439N33o841r999k5719k5489N959L3539L2513K4862K4319
36097B50114J0249j5143j2084K4335M4681K6882R535J5910J5185j0125k7650j8394
$$ plain form
36182 -30984 -13817 20121 11911 -16350 -22104 -22932 -45919 -63162 -46095 -23173 -20628 -7601 37293
36169 37293 67118 40012 -5736 -13822 7146 23141 40879 72100 86358 63690 44194 63574
36157 63574 89400 82220 68439 88647 123082 134264 137592 163964 196258 208673 226349 278139
36145 278139 329240 329801 297683 287020 303844 315011 312817 310368 298240 262319 221487 197502
36133 197502 173820 131029 92061 84025 87111 69416 40234 22762 9805 -6401 201 43087
36121 43087 81164 75612 50176 42924 40880 20819 11424 47493 98363 112077 101922 119620
36109 119620 165998 196437 196970 190129 180130 154411 128922 134881 168420 200933 225795 250114
36097 250114 260363 245220 233136 257471 302152 329034 338569 354479 369664 359539 331889 313495
36085C13495j0768k1096k4857j5497k5714o0702p5310m7905j5472q392j1002r714
36073a2934j6904k5417n013L4473M2810J1904r857l570o325l1132l7700j0133
36061f9798J0502L10j1317o149p051j8278p756K5366L6507J3008m817L53N4j0306
36047d9372jK2070R068k7492j8505L9449O1966J3686l3395k2533N497L587m015
36034A0P295L840l1804m9591j6985K0172J8441L923N709J52k4708k8782R31J2526
36020g8871j3461j5748L5727O9135K6669l2987l0904Q886J8749L173O511K1370
36008A8249J4940o9J990J222k3073l6608q256K3934J3542j4765j4433K244J212
35995a9871k416J8380L6750J4599k4433l0208l320J9602K5438K0305K196j8442
$$ plain form
36085 313495 302727 281631 256774 241277 215563 154861 79551 31646 16174 7782 -3220 -12934
36073 -12934 -29838 -55255 -60268 -25795 17015 28919 19062 15492 9167 -21965 -59665 -69798
36061 -69798 -59296 -58986 -70303 -76452 -83503 -101781 -109537 -84171 -47664 -34656 -39473 -39120 -39066 -49372
36047 -49372 -49373 -27303 -18235 -45727 -64232 -24783 37183 50869 17474 -5059 438 4025 10
36034 10 7305 11145 -20659 -70250 -87235 -67063 -48622 -44699 -38990 -38838 -63546 -92328 -91397 -78871
36020 -78871 -92332 -108080 -72353 -3218 23451 -9536 -40440 -31554 -12805 -9632 -3121 18249
36008 18249 33189 33120 35110 36332 13259 -23349 -31605 -7671 5871 -8894 -23327 -21083 -19871
35995 -19871 -22287 -3907 32843 47442 23009 -7199 -10519 9083 34521 54826 57022 38580
35983C8580j2200J7095K3664k026r005K1934L6103L496k1036L396K6046k923m0271
35970H2853l0013k756q721j9316J2235N1821M0516j193j6621j3243l0410n1211
35958A3941l5838l368L975j220J0951J7045j1239l4920r876K5206J1617k4340
35946c8066k1315N810J011k5324k2147K035J497j3506k11K7386K4354K396K283
35933e3797R308j2809l6068j1862L0361K6604p931r272J7737J5973j2443j6493
35921f0692L35p661k8624j2111K4991J9266k1354k8466L735J5207k114N155L8050
35908e4283L3397j8835n0698k9480k36M386O115J4707P782n990J0361M1411K9012
35895a2351k2553m1408o851J8016k561k2452k899K5254K5530J1849O203R35r554
$$ plain form
35983 38580 26380 43475 67139 65113 56108 78042 114145 117641 96605 100001 126047 123124 82853
35970 82853 52840 50084 41363 22047 34282 86103 126619 125426 108805 95562 65152 13941
35958 13941 -21897 -25265 -21290 -22510 -11559 5486 -5753 -40673 -50549 -25343 -13726 -38066
35946 -38066 -59381 -53571 -52560 -77884 -100031 -97996 -96499 -110005 -110216 -82830 -58476 -56080 -53797
35933 -53797 -44489 -57298 -93366 -105228 -74867 -48263 -56194 -65466 -47729 -31756 -44199 -60692
35921 -60692 -60357 -68018 -96642 -108753 -83762 -64496 -85850 -114316 -110581 -95374 -97488 -92333 -54283
35908 -54283 -20886 -39721 -90419 -119899 -120135 -115749 -109634 -94927 -87145 -93135 -82774 -41363 -12351
35895 -12351 -34904 -76312 -83163 -65147 -67708 -90160 -93059 -67805 -42275 -30426 -24223 -23288 -32842
35882c2842j4355j9573m0228n2456j8807L4384L8870p175l0986j003K8296J1401
35870a04474k2311k7593n367K1805M2300M4622K4736J2684L8286P0670N4220R87
35858A50565k4990j3179j4161l7688l2538J4924M9356L9448K1704K3028J7017
35847A93486j0440k4597o622R068m165k3880k5976j8811p991J7546M5042L9256
35835A81916J458k6504k8113k6425k7618j2985Q192M659j3360o596J4859J889
35823G1372m0231n0635j4485J6926J8724K0161K7849J0904k0991j6548K0466K6566
35811G0078q049j9390J0778J8572k2212m6787j3208K6532K1974K048L952P929
35799E2217l633k128K0637J9999j7689l7730j1801J1278j637r832J3756K4501
$$ plain form
35882 -32842 -47197 -66770 -106998 -159454 -178261 -143877 -105007 -112182 -143168 -144171 -115875 -104474
35870 -104474 -126785 -154378 -159745 -137940 -95640 -51018 -26282 -13598 24688 95358 149578 150565
35858 150565 125575 112396 98235 60547 28009 42933 92289 131737 153441 176469 193486
35847 193486 183046 158449 151827 160895 156730 132850 106874 88063 80072 97618 142660 181916
35835 181916 183374 156870 128757 102332 74714 61729 69921 74580 61220 54624 69483 71372
35823 71372 31141 -19494 -33979 -17053 1671 21832 49681 60585 39594 23046 43512 70078
35811 70078 62029 42639 53417 71989 49777 2990 -10218 16314 38288 40336 44288 52217
35799 52217 48584 46456 67093 87092 69403 31673 19872 31150 29513 19681 33437 57938
35787E7938n245k5823k435J6854p347k9628p429J6527k913k5335j563L2925K5764
35774D2290K703R786K2927K220k1383k926K4910O752l4064l7511j1339p122k4404
35761b7161k1137N672K3771K7272L0534K6178N931p141K230Q660j153N475L7016
35748A16147L7045k1561o7811l6829J9054J3229l5225m3169k936K2129J3251P796
35736B1120J2873R42j8066o127K6763L2924Q427o463j428l041j4182j1036L924
35723D6630M047j2057k3824k9999l8913l5017l472L1555L9785L2404L1951K5032
35711F8122o060l6900l6838j8870n966J2497M0741M0626n843m6154l2611J042
35699b6214M250l181J7047L7968J9619o798L332J7072j2471m2379q711M5587L2014
$$ plain form
35787 57938 52693 26870 24435 41289 33942 4314 -3115 13412 10499 -14836 -16399 16526 42290
35774 42290 44993 54779 77706 79926 58543 55617 80527 87279 53215 15704 4365 -2757 -27161
35761 -27161 -48298 -42626 -18855 8417 38951 65129 71060 63919 66149 74809 73656 79131 116147
35748 116147 153192 131631 63820 26991 46045 59274 24049 -19120 -22056 73 13324 21120
35736 21120 33993 34935 16869 10742 37505 70429 78856 72393 70965 67924 53742 42706 46630
35723 46630 50677 38620 14796 -15203 -54116 -89133 -92605 -61050 -21265 11139 43090 68122
35711 68122 62062 25162 -11676 -30546 -36512 -24015 16726 57352 51509 5355 -27256 -26214
35699 -26214 -21964 -25145 -8098 29870 49489 42691 46023 63095 50624 8245 -466 45121 77135
35686G7135k7699l5457J3070K5394k3394n5295l2250r336j8640j5330K3562M8867
35674b9373K9266L398L269N727m153K315L3144M6303K0172r661j4771j4705k5218
35661D5713k4554j18K3310K6585K0552J1967o509k2610j2715R324O409j4620r774
35648E2960K3870M1308K8152J8920K6072J9507o858j5433O798K2050O463j4598
35636B09211j6344q398k576M444N700j0489k5635j3544M288j4810n5785o0533
35624A5529k1774R196J1441J5272K7178J3942k3162l6212j1888Q698Q184J4696
35612C1100K8652J0009l7346n1172j1232K5343K1255J1661K3817K5589j878j7934
35600E7864J301J2398j6361m2127j9881K1895L4723K5978K5873K6796J0541m725
$$ plain form
35686 77135 49436 13979 27049 52443 29049 -26246 -58496 -67832 -86472 -101802 -78240 -29373
35674 -29373 -107 3291 6560 12287 8134 10449 43593 89896 110068 100407 85636 70931 45713
35661 45713 21159 21041 44351 70936 91488 103455 96946 74336 61621 70945 77354 62734 52960
35648 52960 76830 118138 146290 165210 191282 210789 203931 188498 195296 217346 223809 209211
35636 209211 192867 184469 181893 186337 192037 181548 155913 142369 146657 131847 76062 15529
35624 15529 -6245 2951 14392 29664 56842 70784 47622 11410 -478 8220 16404 31100
35612 31100 59752 69761 32415 -18757 -29989 -4646 16609 28270 52087 77676 75798 57864
35600 57864 59165 71563 55202 13075 -6806 15089 49812 75790 101663 128459 139000 134275
35588A34275M884K5335L1613K3409M012l2942o7334n5246q79K9000n68m0194l8207
35575A7158j5979j2995j4526P985L2880K5463Q43p095n576j7717k8982j2891J5033
35562a6399J9347O53j3603j4538j0245N45J8912K9671K3284J2014K926j5094l6392
35549A081k8685J4536M9713M1808J1731l904l883l456j433K221r609l8974n6527
35536b5381m3349j7094L088J9934K9705J6181q296o394J9400K1578j0322k6242
35524b7192l811R145j8828m2522j8093K1383K6067R324Q040J4028N611Q50J8215
35511B217K7773K288k4509j1683J6919J6095l414l716R386P476r45N793R790j3587
35497C9883l8846k7514M314J4897O673Q065J1959o591l3287l3998j2245M881J5565
$$ plain form
35588 134275 139159 164494 196107 219516 223528 190586 123252 68006 67127 96127 95559 55365 17158
35575 17158 1179 -11816 -26342 -18357 14523 39986 40829 33734 28158 10441 -18541 -31432 -16399
35562 -16399 2948 3601 -10002 -24540 -34785 -34240 -15328 14343 37627 49641 52567 37473 1081
35549 1081 -27604 -13068 36645 78453 90184 86280 82397 78941 77508 79729 70120 31146 -25381
35536 -25381 -68730 -85824 -82736 -62802 -33097 -16916 -25212 -31606 -12206 9372 -950 -27192
35524 -27192 -31003 -21858 -40686 -83208 -101301 -79918 -53851 -44527 -36487 -22459 -16848 -15998 2217
35511 2217 29990 32278 7769 -3914 13005 29100 25686 21970 31356 38832 37887 43680 53470 39883
35497 39883 1037 -26477 -22163 -7266 -593 7472 19431 12840 -20447 -54445 -66690 -61809 -46244
35484d6244K8178K6059O05j0859K2224O1990N2179K913l2688l8109l0342p635
35472B8271L5402O7803O2028M7185N9026O8427L1085k2260k6044J2251K7653N615
35460C96442r810o056j5080l7427l5676r608j173j5947j3161J4992K5962M843
35448B98301p489J3900L6729K5653r580l9263m7490k9645O550L1877K2758l665
35436B98636j5765j7424l0699m4709l2813q039o666k5394k9595j5475q456q437
35424E5164N803K5294K2163N056N554J8590J5931O822K0149L8492K1411j4586
35412B25843j5734J3972J7037j7811m1469l4771k9701l1717p826L1358K6349k7520
35400A08010n6070k0425K3960K1974j309p17J4596J5255O286L436N51m480L248
$$ plain form
35484 -46244 -18066 7993 8598 -2261 19963 81953 134132 137045 104357 66248 35906 28271
35472 28271 63673 131476 193504 240689 299715 368142 399227 376967 350923 363174 390827 396442
35460 396442 386632 380576 365496 328069 292393 282785 281612 265665 252504 267496 293458 298301
35448 298301 290812 304712 341441 367094 357514 318251 270761 241116 247666 279543 302301 298636
35436 298636 282871 265447 234748 190039 157226 149187 142521 117127 87532 72057 63601 55164
35424 55164 60967 86261 108424 113480 119034 137624 153555 160377 180526 219018 240429 225843
35412 225843 210109 224081 241118 223307 181838 147067 117366 85649 77823 109181 135530 108010
35400 108010 51940 31515 55475 77449 76140 75423 90019 105274 111560 114996 115547 111067 114315
35387A14315J4939m446n0511o6766k8445J6880K5769J9152K8365L6397J7366j1831
35375A11184k2391j7293r166N701K1111J2346j6855k4497L518K6345J6096o65
35363A05434r92p235l2434m2643j8676P47j3226k3732N462M0058L2728M257K057
35350E1805J6259M926k6070l4681j4572L582P497Q653P827R13J780J7932K4746
35337G0597M192j6570p175J3411J0543q392j5341j1369r338R84K2411K1495j5545
35324E9903l6928J193N2733M6271n38j3171J6486K8014K795j4085m528l165k0828
35311A14152k3072k512L070j4263j1598K5851N2073L4499M95j6293j8273j0160
35299A33969J6690M3285K8812j7608l4109K47L5478L8641L7176M5919L4480N125
$$ plain form
35387 114315 129254 124808 74297 7531 -20914 -4034 21735 40887 69252 105649 123015 111184
35375 111184 88793 71500 62334 68035 89146 101492 84637 60140 63658 90003 106099 105434
35363 105434 104442 97207 64773 22130 3454 4201 -9025 -32757 -27295 12763 45491 49748 51805
35350 51805 68064 72990 46920 12239 -2333 1249 8746 17399 25226 26139 27919 45851 70597
35337 70597 74789 58219 51044 64455 74998 66606 51265 39896 30558 31542 53953 75448 59903
35324 59903 22975 24168 76901 123172 122634 109463 125949 153963 156758 142673 138145 134980 114152
35311 114152 91080 88568 91638 77375 65777 91628 143701 178200 178695 162402 144129 133969
35299 133969 150659 193944 222756 205148 171039 171286 206764 245405 282581 328500 362980 368105
35287C68105J2774O0344P1763K7297J7614Q8049J47734J32425J30087K15271K93171
35276A564634K76844K80717M18929N57172N71740P24181J314339J939089J657044
35267I304689J89155j475413k106245j598806q67475n81376n68459m49191k59229
35258A587650k07250k43102j95855r7800q2400j18268r1468l3551m6343r3203
35248C78410o9327m912n573n0802l7700K0437K0618l5220m7128m042L085m4770
35236A23076o3650k2170J3060O242p66J0618N829j4471p413J6826K144l9828l5190
35223e693J9399M3314J0066j4490M197J8950K863n836P550L934k0350j5885J8917
35210F6936K3159j0993j7240J7806K2569k2787l7798J4582N3347J6901l4453k9895
$$ plain form
35287 368105 380879 441223 512986 540283 557897 645946 793680 926105 1056192 1271463 1564634
35276 1564634 1841478 2122195 2541124 3098296 3670036 4394217 5708556 7647645 9304689
35267 9304689 9493844 8018431 5912186 4313380 3445905 2864529 2296070 1846879 1587650
35258 1587650 1380400 1137298 941443 843643 761243 642975 551507 517956 471613 378410
35248 378410 309083 304171 298598 247796 210096 230533 251151 215931 168803 164761 167846 123076
35236 123076 59426 37256 50316 56558 55792 66410 72239 57768 50355 67181 69325 29497 -5693
35223 -5693 13706 57020 67086 52596 56793 75743 78606 72770 80320 84254 63904 48019 66936
35210 66936 90095 79102 61862 79668 102237 79450 41652 56234 109581 126482 92029 62134
35198F2134o79N12j043K8740M7339R826m2147n0755l6282m0543m1427o811K6754
35185d4382J3342j7320j3056J2694K0170J9211L2794L6661Q605j3481M657K4602
35173H4497L032k6666j7202L871j0257l4829k3882q33r960k4797K555M3420L8928
35160B7877P077P477L1950K7051k336r319j087k0297m8588k8103K9974N4098K6759
35147A02533J152M150P755l51J456J1299J462k2401k6667j3297j2950k0321l318
35134C0502K9922M0448K7103J8996J1647j8108m6531l0281R219R445k8770m1879
35122A1713j0086J7992J3910M117N302o65j4230j0229N409j876k5490j8163K5470
35109C174N3220L7045P598p372j8131l1152k9968j3919m964m666P365K7561L0469
$$ plain form
35198 62134 61455 61967 60924 89664 137003 146829 104682 53927 17645 -22898 -64325 -71136 -44382
35185 -44382 -31040 -48360 -61416 -48722 -28552 -9341 23453 60114 68719 55238 59895 84497
35173 84497 87529 60863 43661 47532 37275 2446 -21436 -22269 -32229 -57026 -54471 -11051 27877
35160 27877 34954 42431 74381 101432 99096 89777 88690 68393 19805 -8298 21676 75774 102533
35147 102533 103685 107835 115590 115239 116695 127994 129456 107055 80388 67091 54141 33820 30502
35134 30502 60424 100872 127975 146971 158618 140510 93979 63698 72917 82362 53592 11713
35122 11713 1627 19619 33529 37646 42948 42283 28053 17824 23233 21357 -4133 -22296 3174
35109 3174 56394 93439 101037 93665 75534 44382 14414 495 -4469 -9135 -1770 25791 56260
35096E6260J6893Q904K006k1811m1703k2034J7323K1938r646k7653j6214m943
35084b0680N42K1695M1116J6050l6365n0700j9882n687k9454m0006j1485J3904
35072a20952R151N538K0536K2137J18l597K6448M3360K0124k544P871J9385k30
35059D7345k4983k2234p438m481k456Q995J0578n040j1239K074O543q023j0170
35046b0529J1056J8380p174k9786k2257q518r098k817K0816K9420O673j2328k617
35033b8779R121J205k539J2787J7592k165r408J5155K8633l21l1193j8688J2867
35020D267J7746L620K685J0528P056J35M02q951l3269l8860p773K2799J8811K100
35006A296K251M658p220q558J6839L2547R554j7241q619R824k106k4396j6076
$$ plain form
35096 56260 73153 82057 84063 62252 20549 -1485 15838 37776 28130 477 -15737 -20680
35084 -20680 -20138 1557 42673 58723 22358 -28342 -48224 -53911 -83365 -123371 -134856 -120952
35072 -120952 -111801 -106263 -85727 -63590 -63472 -67069 -40621 2739 22863 20319 28190 47575 47345
35059 47345 22362 128 -7310 -11791 -14247 -5252 5326 286 -10953 -8879 -2336 -10359 -20529
35046 -20529 -9473 8907 1733 -28053 -50310 -58828 -67926 -70743 -49927 -20507 -13834 -26162 -28779
35033 -28779 -19658 -18453 -20992 -8205 9387 7222 -2186 12969 41602 41281 10088 -8600 4267
35020 4267 22013 25633 28318 38846 45902 46037 46439 37488 4219 -34641 -42414 -19615 -804 1296
35006 1296 3547 8205 985 -7573 9266 41813 51367 34126 25507 35331 33225 8829 -7247
34993g247R738J4835O119J3212K5524J3840j0632j7006j0725j5202k2480j4148
34981a4172m882j3713j9289M174L3533L1495Q676k7N055K347l919M22K769j0743
34967B1726k1445j3169o879j6557j2290K2820M5121J8184j8272j3068Q528l629
34955A1070k7536r295L1680K9400j4830l5381j2076Q253K50r490o330r013j7469
34942f0767n215K5120L7541K3253J1538J3999J1107r7K441J8666J9825j625j8515
34929G7271j2909M011J8875K7621K1185n545l3299l8409k6293j6962j2351p312
34917d117j0852k2653j6229J5812L1553N42l8837l5346m458O907J785J2138K6356
34904c7399J2023j2093m692J5477k392m1992l5112K3774O2570M1939L247j0161
$$ plain form
34993 -7247 2491 17326 23445 36657 62181 76021 65389 48383 37658 22456 -24 -14172
34981 -14172 -19054 -32767 -52056 -47882 -14349 17146 25822 25795 30850 33197 29278 29700 32469 21726
34967 21726 281 -12888 -19767 -36324 -48614 -25794 19327 37511 19239 6171 14699 11070
34955 11070 -16466 -25761 5919 35319 20489 -14892 -26968 -18715 -18465 -27955 -34285 -43298 -60767
34942 -60767 -65982 -40862 -3321 19932 31470 45469 56576 56479 58920 77586 97411 95786 77271
34929 77271 64362 68373 87248 114869 136054 130509 97210 58801 32508 15546 3195 -4117
34917 -4117 -14969 -37622 -53851 -38039 -6486 -5944 -44781 -80127 -84585 -77678 -75893 -63755 -37399
34904 -37399 -25376 -37469 -42161 -26684 -29076 -71068 -106180 -82406 -19836 22103 25350 15189
34892A5189q434j0613o786J0501K5436K7880K4037J2604j0584k7915k2926j6831
34880A1558l3483m5423j4614L0523K9742q767k0598N813J4897j3877l2191j1061
34868h7481J2271L279j7429j9041n647O998J5843J7142Q474P273K6164L8733J9007
34855B5586k788J4170M1206K2473k0886k0185J6811J3747l8603o2437k7228M082
34843c4052o228j1573J7440L4007R508p460J5492L0466J688k2098K355K7967q4
34830E7428m4472m0043k018J2132K773Q441K2410R616j7482j5054J3926K2872
34818C0529m494l7381m9299m1483k1256N360K4616K6660J9184J2565O355J534
34806b7110L169L523p056j0064J7781M8968L0763k3478l6787J3974N5689L1429
$$ plain form
34892 15189 6755 -3858 -10644 -143 25293 53173 77210 89814 79230 51315 28389 11558
34880 11558 -21925 -67348 -81962 -51439 -21697 -30464 -51062 -45249 -30352 -44229 -76420 -87481
34868 -87481 -75210 -71931 -89360 -108401 -114048 -107050 -91207 -74065 -65591 -58318 -32154 6579 25586
34855 25586 22798 36968 78174 100647 79761 59576 76387 90134 51531 -10906 -38134 -34052
34843 -34052 -40280 -51853 -34413 -406 9102 1642 17134 47600 49288 27190 29545 57512 57428
34830 57428 12956 -27087 -29105 -16973 -14200 -5759 16651 26267 8785 -6269 7657 30529
34818 30529 26035 -11346 -60645 -102128 -123384 -118024 -93408 -66748 -47564 -34999 -28644 -27110
34806 -27110 -23941 -20418 -27474 -37538 -19757 29211 59974 36496 -291 13683 69372 100801
34794A00801j5357j9561O483J2338m335j3390j3624k0077k2924r990O73n650q566
34781a3179O218J3832k320j5390q036q815k9464k3531L4257Q3361O0666k12k6037
34768G1350j6435k0176l5763k1746J5870K9692J3357L285O131m990k6635k5103
34756a1163p34Q877o516j5118L524L4794N7568N8720K9114j7199l7188j3026J0657
34743A02310j0599m8508m6902j2783K199q272m260K0037K5436m42k3545k2323
34731b7652j1786l547P798J5235M513r956j058K0662J9938l186j5650r827p619
34718b2135r556M508K4156J6359j1001j3237J3902K1248j2067m1240k5894J1545
34706d3412K7397J7214M864J823M691J1093J6609J2628N99p042o528o008p415
$$ plain form
34794 100801 85444 65883 72366 84704 80369 66979 53355 33278 10354 364 1037 -4613 -13179
34781 -13179 -6961 6871 4551 -10839 -18875 -27690 -57154 -80685 -46428 36933 97599 97387 71350
34768 71350 54915 34739 -1024 -22770 -6900 22792 36149 39434 45565 40575 13940 -11163
34756 -11163 -11897 -3020 -9536 -24654 -21130 13664 71232 129952 159066 141867 104679 91653 102310
34743 102310 91711 43203 -3699 -16482 -14283 -22555 -26815 -6778 18658 18216 -5329 -27652
34731 -27652 -39438 -42985 -35187 -19952 -15439 -25395 -26453 -5791 14147 10961 -4689 -14516 -22135
34718 -22135 -31691 -27183 -3027 13332 2331 -10906 2996 24244 12177 -29063 -54957 -43412
34706 -43412 -16015 1199 6063 7886 12577 23670 40279 52907 53506 46464 39936 33928 26513
34693B6513m973j501n059j1026q682r20M034J1222K4835K8512R922q977j844J4882
34679G6938N714k2589k9513p422P384n463k3282k1949o425J0117K3930K8936J7931
34666E4307K357K538J4288J3443m645j9242j9107j3851r397r48Q644J0626R007
34653D8020J1291O508j7762m3489m0548j2164J1024J6673J7123J7107J1324Q265
34641C3372J9614L1760K4905J1932J7389K7337P911l1094m2816j5796J0475R760
34629A04749J102N849J6131J9150J5422L219k0148l6913k6078m283q122l3051
34617C7027l5645l494K4796K1542O065K704M961L17n723p754j0751j0227N136
34604B8954K2306J1628k4353m6673l5334j2741k079M02J508k410m310J0517L1074
$$ plain form
34693 26513 21540 20039 14980 3954 -4728 -5648 -1614 9608 34443 62955 72877 63900 62056 76938
34679 76938 82652 60063 30550 23128 30512 25049 1767 -20182 -26607 -16490 7440 36376 54307
34666 54307 56664 59202 73490 86933 82288 63046 43939 30088 20691 19743 28387 39013 48020
34653 48020 59311 65819 48057 4568 -35980 -48144 -37120 -20447 -3324 13783 25107 33372
34641 33372 52986 84746 109651 121583 138972 166309 174220 143126 100310 84514 94989 104749
34629 104749 105851 111700 127831 146981 162403 165622 145474 108561 82483 78200 70078 37027
34617 37027 1382 -2112 22684 44226 50291 52995 57956 58273 52550 44796 34045 23818 28954
34604 28954 51260 62888 38535 -8138 -43472 -56213 -58292 -57890 -56382 -58792 -63102 -52585 -21511
34591b1511K9480J1092J1923L6226M4783K0541m404q289j4965m0135n0638j6679
34579b576L2640M8059K8143J0007J0758J3311Q8k6220n0050n5614m0125k1254
34567e2833j7714k0847p113K0258L1342J6377K66O29M113k360q645o085n765j3923
34553f2300j5241M73J7410J7941R324R554K0159K6213J5193r497k7885k1304J207
34540a8753Q764o739j6067l287K809j7067k5220J2924N4628L4931k6101m9239
34528d8417j8622N099n353r016J3556K2833O52j2592L411Q114k0645l7032m933
34515a02945L7115L9999J8577J1017J2718K264r835q160r711k8031l7211j5844
34503i0047R635Q854j291P557K3848K4202J8853K5216K8470J1781n258p95P746
$$ plain form
34591 -21511 7969 19061 30984 67210 111993 132534 128130 119841 104876 64741 14103 -2576
34579 -2576 30064 78123 106266 116273 127031 140342 140430 114210 64160 8546 -31579 -52833
34567 -52833 -70547 -91394 -98507 -78249 -46907 -30530 -30264 -29635 -25522 -27882 -36527 -42612 -48377 -62300
34553 -62300 -77541 -77068 -59658 -41717 -32393 -22839 -2680 23533 38726 29229 1344 -19960 -18753
34540 -18753 -9989 -16728 -32795 -36082 -33273 -50340 -75560 -62636 -8008 26923 822 -48417
34528 -48417 -67039 -61940 -67293 -76309 -62753 -39920 -39268 -51860 -48449 -40335 -60980 -98012 -102945
34515 -102945 -65830 -25831 -7254 3763 16481 18745 8910 750 -8961 -36992 -74203 -90047
34503 -90047 -80412 -71558 -72849 -65292 -41444 -17242 1611 26827 55297 67078 61820 61025 68771
34490F8771j591j0824L183K0162R751j3398j5650k580l843j8512k1569j1350q254
34477e704j5407j6464n090J1473K8123L8909L2529J0016j0023j8271k4190k8019
34465b118j5135Q663J4066l112j1623j253k256k5210l3162n296K2342J6644k41
34452c7691K352J1674P928O345J9151K0710m091k1316m647J4337J427j9603j3555
34439a6979L104K01p427M394J5684J935j3026k133Q123j2456l2331r333L0556
34426b9688L4626R288m977j0441l0877m4825j7540K5131L1047Q679N032J8100
34414f445R226j4481j0171J8593K6381O283o204k579m453n362J8809M7518L5401
34401A12516r026l3856k8687k9186m1106l2422j948J5146J3607K2336L9907L3461
$$ plain form
34490 68771 67180 56356 59539 79701 89452 76054 60404 57824 53981 35469 13900 2550 -5704
34477 -5704 -21111 -37575 -42665 -31192 -3069 35840 68369 78385 68362 50091 25901 -2118
34465 -2118 -17253 -8590 5476 2364 -9259 -10512 -12768 -37978 -71140 -76436 -54094 -37450 -37691
34452 -37691 -35339 -23665 -15737 -9392 9759 30469 26378 5062 415 14752 16179 -3424 -16979
34439 -16979 -13875 -13674 -21101 -16707 -1023 912 -12114 -14247 -6124 -18580 -50911 -60244 -29688
34426 -29688 4938 14226 9249 -1192 -32069 -76894 -94434 -69303 -38256 -29577 -24545 -6445
34414 -6445 2781 -11700 -21871 -3278 23103 29386 23182 20603 16150 10788 29597 77115 112516
34401 112516 103490 69634 40947 11761 -29345 -61767 -63715 -48569 -34962 -12626 27281 60742
34389F0742N800l140J2642J6581l300k0410k4924l1109l0320j865L0662K2944
34377C4303j0701j4163J3353J5811j7270l0471k446J5961p411l1856j7582R991
34365d2481J0126r771j8185q486N239J1167K286j5677j6438J2899L7628J8853
34353a2840k1029l0033j0610p429k1326j0263K4848L4464Q944n500O600N471k1775
34340f0478l1494l625J9979R102p446m84J2010P706j986m290p512j0436K946K3459
34326e2549K1640K214m97J3505J1621l195L543K1527L512l9761m0010J2358M2493
34313c599J2430k1431j2159M270j0369k4339l716J9085P529r451O422K9252J4567
34300H491k2868l5362j5399O162J0039N9j1744p835J9609M3943L0685n492j6648
$$ plain form
34389 60742 66542 63402 76044 92625 89325 68915 43991 12882 -17438 -19303 11359 34303
34377 34303 23602 9439 22792 38603 21333 -9138 -11584 4377 -3034 -34890 -52472 -42481
34365 -42481 -32355 -42126 -60311 -68797 -63558 -52391 -50105 -65782 -82220 -69321 -31693 -12840
34353 -12840 -33869 -63902 -74512 -81941 -103267 -113530 -88682 -54218 -45274 -50774 -44174 -38703 -60478
34340 -60478 -91972 -95597 -75618 -66516 -73962 -74446 -62436 -54730 -56716 -61006 -68518 -78954 -76008 -52549
34326 -52549 -30909 -28695 -29192 -15687 -4066 -7261 -3718 17809 21321 -18440 -58450 -46092 -3599
34313 -3599 8831 -12600 -24759 -20489 -30858 -55197 -58913 -39828 -32299 -41750 -35328 -6076 8491
34300 8491 -14377 -49739 -65138 -58976 -48937 -48878 -60622 -68457 -48848 -4905 25780 20288 3640
34287C640L058J3840L955J484Q519l092k3474j1847J9420J5313j6204p363M1574
34274D8823M5836j9233o7262m0520O560J6698J6102L0093J8228l3579n5064n012
34262c8330M8002L8128P992J9456M4112L1055N115O785O130l3484p1855n8702
34250D404k1341n593M953L1964L5941r786m8392k7556J0583J0203l50K2112M3197
34237E0339J9644j0972o94J9424Q941P55K4296K9065j8967n1897j3841L0075R352
34224I5520k0692J4645O3468M0551j7575k6517l278o338q357L2668N9254J4387
34212B37736l1483L64M5183J6082k6313P392N7050L5221J1404P5118J38611R6551
34200F62916N1408J33141K33752K02709J60090K89739M70900M95501M97864P14305
$$ plain form
34287 3640 6698 20538 24493 25977 34496 31404 7930 -3917 15503 30816 14612 7249 48823
34274 48823 94659 75426 8164 -32356 -25796 -9098 7004 37097 55325 21746 -33318 -38330
34262 -38330 9672 47800 55792 75248 119360 150415 155530 162315 168445 134961 63106 4404
34250 4404 -16937 -22530 -17577 14387 50328 40542 -7850 -35406 -24823 -14620 -14970 7142 50339
34237 50339 69983 59011 58317 77741 86682 87437 111733 140798 121831 69934 56093 86168 95520
34224 95520 74828 89473 152941 193492 175917 149400 146122 139784 131427 164095 223349 237736
34212 237736 206253 206617 251800 267882 241569 248961 306011 341232 352636 427754 566365 662916
34200 662916 714324 847465 1081217 1283926 1444016 1733755 2204655 2700156 3198020 3912325
34190C912325R78348J042987J270143K171506L154152K692389K94836k446052
34182A3070634l517777k726866j526504r97135r16329p26992m54148l57679l61547
34173A485657k64713j31026j13874j51553j14394n1377o0882q7372m5412K901
34163D67955k7584p4008m1982K0267J5213l3543m2700j8461j7995l2614k3187
34152A91361r969k5717l7196n842K9011J4351k2136k4738o663j2747l0069j6546
34140D3100J6525K5612J0767L862O028k874j5124j1072l716j6685l5924k9623
34128i124p17K0962K3937J7408M386j5074k8217k4701j3593n293M467J5628J3644
34115C713k652r822L029J3296K726j1515p400O307R719M079Q03n34k092L592J5523
$$ plain form
34190 3912325 4890673 5933660 7203803 9375309 12529461 15221850 15516686 13070634
34182 13070634 9552857 6825991 5299487 4302352 3386023 2659031 2204883 1847204 1485657
34173 1485657 1220944 1089918 976044 824491 710097 658720 597838 510466 465054 467955
34163 467955 440371 366363 324381 344648 359861 326318 283618 265157 247162 214548 191361
34152 191361 181392 155675 118479 112637 141648 155999 133863 109125 102462 89715 59646 43100
34140 43100 59625 85237 96004 99866 105894 103020 87896 76824 73108 56423 20499 -9124
34128 -9124 -9841 11121 35058 52466 56852 41778 13561 -11140 -24733 -30026 -25559 -9931 3713
34115 3713 1061 -8761 -5732 7564 10290 -1225 -8625 -2318 7401 11480 12283 11749 9657 13249 28772
34100B8772J6063r83j6057j5099j1888k0871l0891k5543q521R357K6845L9088
34088i728L0941K256k1850k4097j7156j6298j4404l127N969L458K127J2317J9891
34075b9701J3100Q783K3770M0508L2368P503m873k46J746m135m269K010j384j5565
34061F9615k0336p737L168l300j5261j4116l011L271N865J8473L8666M3087J8676
34048A37060j5590l0661k3020j4115j7526k2932j6073RJ1622J2074M730l743o815
34035A5020k790k77q261j6910m146L0219N4347M2245P463j5594j0595J4194M2527
34022A47442N7476M9608L5826M9293Q7416R4438L0906n9224r5683o6510l6554
$$ plain form
34100 28772 44835 43852 27795 12696 808 -20063 -50954 -76497 -85018 -75661 -48816 -9728
34088 -9728 21213 23469 1619 -22478 -39634 -55932 -70336 -73463 -67494 -64036 -61909 -49592 -29701
34075 -29701 -16601 -7818 15952 56460 88828 96331 91458 91212 92958 88823 84554 86564 85180 69615
34061 69615 49279 41542 44710 41410 26149 12033 9022 12293 18158 36631 75297 118384 137060
34048 137060 121470 90809 67789 53674 36148 13216 -2857 -2848 8774 20848 25578 21835 15020
34035 15020 12230 11953 3692 -13218 -17364 12855 67202 109447 116910 101316 90721 104915 147442
34022 147442 204918 254526 290352 339645 427061 521499 552405 493181 397498 330988 294434
$$ [...]
##END NTUPLES=NMR SPECTRUM
##END=
