##TITLE=31Pdec_DE-66_rmOH
 , 24 sc
 1.10.2024
##JCAMPDX= 6.0         $$ Bruker NMR JCAMP-DX V2.0
##DATA TYPE= NMR SPECTRUM
##DATA CLASS= NTUPLES
##ORIGIN= UXNMR, Bruker Analytische Messtechnik GmbH
##OWNER= root
$$ XWIN-NMR		Version 3.5
$$ Tue Oct  1 13:51:25 2024 Russian Standard Time (UT+4h)  she@DPX200
##.OBSERVE FREQUENCY= 81.013821
##.OBSERVE NUCLEUS= ^31P
##.ACQUISITION MODE= SIMULTANEOUS
##.ACQUISITION SCHEME= undefined
##.AVERAGES= 24
##.DIGITISER RES= 17
##SPECTROMETER/DATA SYSTEM= spect
##.PULSE SEQUENCE= zgpg30
##.SOLVENT NAME= CDCl3
##.SHIFT REFERENCE= (INTERNAL, CDCl3, 0, 198.062)
##AUDIT TRAIL= $$ (NUMBER, WHEN, WHO, WHERE, WHAT)
$$ ##TITLE= Audit trail, XWIN-NMR		Version 3.5
$$ ##JCAMPDX= 5.01
$$ ##ORIGIN= Bruker BioSpin GmbH
$$ ##OWNER= she
$$ F:/spectra/data/she/nmr/P31/2/pdata/1/auditp.txt
$$ ##AUDIT TRAIL=  $$ (NUMBER, WHEN, WHO, WHERE, WHAT)
(   1,<2024-10-01 13:50:32.15 +0400>,<she>,<DPX200>,
      <created by zg, POWCHK disabled, PULCHK disabled
       configuration hash MD5:
       00 E9 B6 7A A2 85 ED C7 34 08 36 98 17 FE 4E 26
       data hash MD5: 32K
       D3 90 3B 3E A3 05 DC 2A 33 2E DB 34 C4 96 FB F4>)
(   2,<2024-10-01 13:50:34.45 +0400>,<she>,<DPX200>,
      <Start of raw data processing
       efp BC_mod = 2 LB = 1.5 FT_mod = 6 PKNL = 1 PHC0 = 2706.321 PHC1 = 68.08746 SI = 64K 
       data hash MD5: 64K
       A2 9D 1E 3D CA 6F 96 36 64 AC C5 7A 82 6D 4A DD>)
(   3,<2024-10-01 13:50:53.75 +0400>,<she>,<DPX200>,
      <pk PHC0 = 17.79993 PHC1 = -39.00001 
       data hash MD5: 64K
       9A 88 22 38 F9 EE DD 9F EE CA 6B D8 C9 07 31 C6>)
$$ ##END=
$$ 
$$ hash MD5
$$ B2 EE 9A F3 A0 80 E8 AA 11 B0 3C EC A7 F6 3B 6F
##$RELAX= 
##$RELAX= 
##$RELAX= 
##$RELAX= 
##$RELAX= 
##$RELAX= 
##$RELAX= 
##$RELAX= 
$$ Bruker specific parameters
$$ --------------------------
##$DU= <F:/spectra>
##$EXPNO= 2
##$NAME= <P31>
##$PROCNO= 1
##$TYPE= <nmr>
##$USER= <she>
##$AMP= (0..31)
100 100 100 100 100 100 100 100 100 100 100 100 100 100 100 100 100 100 
100 100 100 100 100 100 100 100 100 100 100 100 100 100 
##$AQSEQ= 0
##$AQ_mod= 1
##$AUNM= <au_zg>
##$AUTOPOS= <>
##$BF1= 81.014009
##$BF2= 200.13
##$BF3= 200.13
##$BF4= 200.13
##$BF5= 200.13
##$BF6= 200.13
##$BF7= 200.13
##$BF8= 200.13
##$BYTORDA= 1
##$CFDGTYP= 0
##$CFRGTYP= 5
##$CHEMSTR= <none>
##$CNST= (0..31)
1 1 145 1 1 1 1 1 1 1 1 1 1 1 1 1 1 1 1 1 1 1 1 1 1 1 1 1 1 1 1 1 
##$CPDPRG= <waltz16>
##$CPDPRG1= <>
##$CPDPRG2= <waltz16>
##$CPDPRG3= <>
##$CPDPRG4= <mlev>
##$CPDPRG5= <mlev>
##$CPDPRG6= <mlev>
##$CPDPRG7= <mlev>
##$CPDPRG8= <mlev>
##$CPDPRGB= <>
##$CPDPRGT= <>
##$D= (0..31)
0 1 0 0 0 0 0 0 0 0.06 0 0.03 2e-05 3e-06 0 0 0.0002 0 0 0 0 0 0 0 0 0 
0 0 0 0 0 0 
##$DATE= 1727776231
##$DBL= (0..7)
120 120 120 11 120 120 24 19 
##$DBP= (0..7)
150 150 150 150 150 150 150 150 
##$DBP07= 0
##$DBPNAM0= <>
##$DBPNAM1= <>
##$DBPNAM2= <>
##$DBPNAM3= <>
##$DBPNAM4= <>
##$DBPNAM5= <>
##$DBPNAM6= <>
##$DBPNAM7= <>
##$DBPOAL= (0..7)
0.5 0.5 0.5 0.5 0.5 0.5 0.5 0.5 
##$DBPOFFS= (0..7)
$$ [...]
##$SUBNAM3= <"">
##$SUBNAM4= <"">
##$SUBNAM5= <"">
##$SUBNAM6= <"">
##$SUBNAM7= <"">
##$SUBNAM8= <"">
##$SUBNAM9= <"">
##$SW= 400.765351723535
##$SWIBOX= (0..15)
0 1 3 0 0 0 0 0 0 0 0 0 0 0 0 0 
##$SW_h= 32467.5324675325
##$TD= 32768
##$TD0= 1
##$TE= 0
##$TE2= 300
##$TE3= 300
##$TEG= 300
##$TL= (0..7)
0 120 53 12 22 120 120 120 
##$TP= (0..7)
150 150 150 150 150 150 150 150 
##$TP07= 0
##$TPNAME0= <>
##$TPNAME1= <>
##$TPNAME2= <>
##$TPNAME3= <>
##$TPNAME4= <>
##$TPNAME5= <>
##$TPNAME6= <>
##$TPNAME7= <>
##$TPOAL= (0..7)
0.5 0.5 0.5 0.5 0.5 0.5 0.5 0.5 
##$TPOFFS= (0..7)
0 0 0 0 0 0 0 0 
##$TUNHIN= 0
##$TUNHOUT= 0
##$TUNXOUT= 0
##$USERA1= <user>
##$USERA2= <user>
##$USERA3= <user>
##$USERA4= <user>
##$USERA5= <user>
##$V9= 5
##$VALIST= <valist>
##$VCLIST= <CCCCCCCCCCCCCCC>
##$VD= 0
##$VDLIST= <DDDDDDDDDDDDDDD>
##$VPLIST= <PPPPPPPPPPPPPPP>
##$VTLIST= <TTTTTTTTTTTTTTT>
##$WBST= 1024
##$WBSW= 4
##$XGAIN= (0..3)
0 0 0 0 
##$XL= 0
##$YL= 0
##$YMAX_a= 115392
##$YMIN_a= -92391
##$ZGOPTNS= <>
##$ZL1= 120
##$ZL2= 120
##$ZL3= 120
##$ZL4= 120
##$ABSF1= 0
##$ABSF2= 0
##$ABSG= 0
##$ABSL= 0
##$ALPHA= 0
##$AQORDER= 0
##$ASSFAC= 0
##$ASSFACI= 0
##$ASSFACX= 0
##$ASSWID= 0
##$AUNMP= <proc_1d>
##$AZFE= 0.1
##$AZFW= 0.5
##$BCFW= 0
##$BC_mod= 2
##$BYTORDP= 0
##$COROFFS= 0
##$CY= -3
##$DATMOD= 1
##$DC= 0
##$DFILT= <>
##$DTYPP= 0
##$F1P= 0
##$F2P= 0
##$FCOR= 1
##$FTSIZE= 65536
##$FT_mod= 6
##$GAMMA= 0
##$GB= 0
##$INTBC= 1
##$INTSCL= 9.790993e-09
##$ISEN= 30
##$LB= 1.5
##$LEV0= 0
##$LPBIN= 0
##$MAXI= 10000
##$MC2= 0
##$MEAN= 0
##$ME_mod= 0
##$MI= 50
##$NCOEF= 0
##$NC_proc= -2
##$NLEV= 6
##$NOISF1= 182.463
##$NOISF2= 159.3651
##$NSP= 0
##$NTH_PI= 0
##$NZP= 0
##$OFFSET= 198.0616
##$PC= 4
##$PHC0= 2724.121
##$PHC1= 29.08745
##$PH_mod= 1
##$PKNL= yes
##$PPARMOD= 0
##$PSCAL= 0
##$PSIGN= 0
##$REVERSE= no
##$SF= 81.0140089999434
##$SI= 65536
##$SIGF1= 159.3651
##$SIGF2= -187.1042
##$SINO= 113.3802
##$SIOLD= 16384
##$SREGLST= <1H.CDCl3>
##$SSB= 0
##$STSI= 65536
##$STSR= 0
##$SW_p= 32467.5324675325
##$SYMM= 0
##$S_DEV= 0
##$TDeff= 32768
##$TDoff= 0
##$TI= <>
##$TILT= no
##$TM1= 0
##$TM2= 0
##$TOPLEV= 0
##$USERP1= <user>
##$USERP2= <user>
##$USERP3= <user>
##$USERP4= <user>
##$USERP5= <user>
##$WDW= 1
##$XDIM= 65536
##$YMAX_p= 443664645
##$YMIN_p= -1106911
$$ End of Bruker specific parameters
$$ ---------------------------------
##NTUPLES= NMR SPECTRUM
##VAR_NAME=  FREQUENCY,     SPECTRUM/REAL,   SPECTRUM/IMAG
##SYMBOL=    X,             R,               I
##VAR_TYPE=  INDEPENDENT,   DEPENDENT,       DEPENDENT
##VAR_FORM=  AFFN,          ASDF,            ASDF
##VAR_DIM=   65536,         65536,           65536
##UNITS=     HZ,            ARBITRARY UNITS, ARBITRARY UNITS
##FACTOR=    0.49542278885378, 1,            1
##FIRST=     16045.7642231865, 0,            0
##LAST=      -16421.768244346, 0,            0
##MIN=       -16421.768244346, -1106911,     0
##MAX=       16045.7642231865, 443664645,    0
$$ Real data points
##PAGE= N=1
##DATA TABLE= (X++(R..R)), XYDATA
$$ [...]
40965h2902n192L961K2032K6336J5058K262p217j7029k3632j9886r647n432j2363
$$ -82902 -88094 -84133 -62101 -35765 -20707 -18445 -25662 -42691 -66323 -86209 -95856 -101288 -113651
40952a13651k0572j4632P299K3867J1126k2737m2058l5201l6815p4213j14827
$$ -113651 -134223 -148855 -141556 -117689 -106563 -129300 -171358 -206559 -243374 -317587 -432414
40941d32414j03375l8241K6570M8868L2933L403j9080j8931L843K5364K7517K6302
$$ -432414 -535789 -574030 -547460 -498592 -465659 -462256 -481336 -500267 -496424 -471060 -443543 -417241
40929d17241M0332M8623K1796j9584k7790l5K4368L1745M1002M5690J4723l9599
$$ -417241 -376909 -328286 -306490 -326074 -353864 -353899 -329531 -297786 -256784 -211094 -196371 -235970
40917b35970n8605k1600K3798L6066K9248K6454K0369P740R422K4947J8317j7732
$$ -235970 -294575 -316175 -292377 -256311 -227063 -200609 -180240 -172500 -163078 -138131 -119814 -137546
40905a37546l4557l064L2771K2567j3837k5685j0500j909o691n991O58Q99L832
$$ -137546 -172103 -175167 -142396 -119829 -133666 -159351 -169851 -171760 -178451 -184442 -183784 -182885 -179053
40892a79053K3880M2733L0313m466k3629j5262k193M25N80K273m234j9065k5278
$$ -179053 -155173 -112440 -82127 -86593 -110222 -125484 -127677 -127252 -126672 -124399 -128633 -147698 -172976
40879a72976j2822P394J9108J8121J0705L589j337n430o767J643K0520L6169L5988
$$ -172976 -185798 -178404 -159296 -141175 -130470 -126881 -128218 -133648 -140415 -138772 -118252 -82083 -46095
40866d6095K7399K5180K5562J5123K907J8043P1843J41123J86422J68991O7403
$$ -46095 -18696 6484 32046 47169 50076 68119 139962 281085 467507 636498 703901
40855G03901q5435j95274j88231j00940l9152m3835n6734k8682Q489J0285n493
$$ 703901 618466 423192 234961 134021 94869 51034 -5700 -34382 -25893 -15608 -21101
40844b1101j918Q979k294j9271n745K7343L5657R450j9265k9087k7190k1001r977
$$ -21101 -23019 -14040 -16334 -35605 -41350 -14007 21650 31100 11835 -17252 -44442 -65443 -75420
40831g5420l012j1267k4257j9944K775K3193K6286J2630j1062l2138l1919n896
$$ -75420 -78432 -89699 -113956 -133900 -131125 -107932 -81646 -69016 -80078 -112216 -144135 -150031
40819a50031K2592K6536P286j1091j1453L925K0504K1339J319k0878j9610L016
$$ -150031 -127439 -100903 -93617 -104708 -116161 -112236 -91732 -70393 -69074 -89952 -109562 -106546
40807a06546J7975J1050M55L444J0714Q008K94j141L177P932J0888P249m412j0037
$$ -106546 -88571 -77521 -77066 -73622 -62908 -54900 -54606 -55747 -52570 -44638 -33750 -26501 -30913 -40950
40793d0950O41O755j5710m2020k3432L1119N4420J9002k1799j8192O764R625k953
$$ -40950 -40309 -33554 -49264 -91284 -114716 -83597 -29177 -10175 -31974 -50166 -43402 -33777 -36730
40780c6730k259N511n54j0366l831O860k493k5984m0257l8529k4335K310K7060
$$ -36730 -38989 -33478 -34032 -44398 -48229 -41369 -43862 -69846 -110103 -148632 -172967 -170657 -143597
40767a43597K2017r020k2550m26J9524R249j976J4004K9056J2328q916N85J7041
$$ -143597 -121580 -130600 -153150 -153576 -134052 -124803 -126779 -112775 -83719 -71391 -80307 -79722 -62681
40754f2681L754j5617P95L1327K5205p306j5573p34q331l7788l8239J558L1086
$$ -62681 -58927 -74544 -73749 -42422 -17217 -24523 -40096 -40830 -49161 -86949 -125188 -123630 -92544
40741i2544J7932j1323k3926k1822j5817m560P422P625l64j297M118N519P430
$$ -92544 -74612 -85935 -109861 -131683 -147500 -152060 -144638 -137013 -137377 -138674 -134556 -129037 -121607
40728a21607J4448P759k3497m4961j9114K9373M1971J0892j6557j2189O158J8875
$$ -121607 -107159 -99400 -122897 -167858 -186972 -157599 -115628 -104736 -121293 -133482 -127324 -108449
40716a08449K5658K2548L984j2827p292N993q43j8956j9363o394n209r641L363
$$ -108449 -82791 -60243 -56259 -69086 -76378 -70385 -71228 -90184 -109547 -115941 -121150 -130791 -127428
40703a27428J9661P190j9941j8523P796J3396r541k1023o948Q87j2463k1972j3137
$$ -127428 -107767 -100577 -120518 -139041 -131245 -117849 -127390 -148413 -155361 -154474 -166937 -188909 -202046
40690b02046j126Q644K5980L7347J7472j6440j9859N618J4401l330r370O776Q979
$$ -202046 -203172 -194528 -168548 -131201 -113729 -130169 -150028 -144410 -130009 -133339 -142709 -135933 -126954
40677a26954j3251k1650p2J5507K545j2088o883l5m280j437J4416K0736J3755
$$ -126954 -140205 -161855 -161927 -146420 -143875 -155963 -162846 -162881 -167161 -168598 -154182 -133446 -119691
40664a19691J8095L1276J7612k2572m0406j9357m005j9352k7826k789K0163R033
$$ -119691 -101596 -70320 -52708 -75280 -115686 -135043 -139048 -158400 -186226 -189015 -168852 -159819
40652a59819o868O438K5037J1640k0133l3079k1722p47K5190M5036L4169k580
$$ -159819 -166687 -160249 -135212 -123572 -143705 -176784 -198506 -199253 -174063 -129027 -94858 -97438
40640i7438k1711o523M266j3280k1939R942M6019L7870J645j3699k2J7788L1191
$$ -97438 -119149 -125672 -121406 -134686 -156625 -146683 -100664 -62794 -61149 -74848 -74870 -57082 -25891
40627b5891M0911K9646j0275m6177m5077k1420p680m615J924M320o413j1252O052
$$ -25891 15020 44666 34391 -11786 -56863 -78283 -85963 -90578 -88654 -84334 -90747 -101999 -95947
40614i5947K4515J9317K891k265k147p397m051J3667J5694j6585m8641m2234j3453
$$ -95947 -71432 -52115 -49224 -51489 -53636 -61033 -65084 -51417 -35723 -52308 -100949 -143183 -156636
40601a56636M289J9327M9944O6582L0016l2445n3232j9502J5155J1766j2760k7901
$$ -156636 -152347 -133020 -83076 -16494 13522 -18923 -72155 -91657 -76502 -64736 -77496 -105397
40589a05397k7480j7954m141N704N047J067L165N387j989j3068j5384o720J0055
$$ -105397 -132877 -150831 -154972 -149268 -144221 -143154 -139989 -134602 -136591 -149659 -165043 -171763 -161708
40576a61708L1931M4467K8955o885l2185l6874l8706l7970j1955K8793L4261n486
$$ -161708 -129777 -85310 -56355 -63240 -95425 -132299 -171005 -208975 -220930 -192137 -157876 -163362
40564a63362l1081l714L1631K2125p727p748Q058n199l3703k4217K3911N5247
$$ -163362 -194443 -198157 -166526 -144401 -152128 -159876 -151818 -157017 -190720 -214937 -191026 -135779
40552a35779M1292R646o928l397J0799J9059J823l3159m3999j1861K2322J6676
$$ -135779 -94487 -84841 -91769 -95166 -84367 -65308 -63485 -96644 -140643 -152504 -130182 -113506
40540a13506q792j3495n016j2095k1611m650K0140J3445j3983j9999l039O217
$$ -113506 -122298 -135793 -140809 -152904 -174515 -179165 -159025 -145580 -159563 -179562 -182601 -176384
40528a76384P747K2493L5056J3058k6149l3871q154R729R192J5542K7205J5505
$$ -176384 -168637 -146144 -111088 -98030 -124179 -158050 -166204 -156475 -147283 -131741 -104536 -89031
40516h9031j3082j9601m0J1279O145Q043J3809m089l3569k9229Q837K8904J2310
$$ -89031 -102113 -121714 -121754 -110475 -104330 -96287 -82478 -86567 -120136 -149365 -140528 -111624 -99314
40503i9314r17J3788K9343K4010J4833J3756O686m153O858L3403L1885n169k7265
$$ -99314 -100231 -86443 -57100 -33090 -18257 -4501 2185 -1968 4890 38293 70178 65009 37744
40490C7744n858J8499L128l1510m2305k9172j9928j9252j0739Q540K4700K6707
$$ 37744 31886 50385 53513 22003 -20302 -49474 -69402 -88654 -99393 -90853 -66153 -39446
40478c9446J2602j1293k9148k8391j5842n065M927J5884J0008k2573n0169l5513
$$ -39446 -26844 -38137 -67285 -95676 -111518 -116583 -111656 -95772 -85764 -108337 -158506 -194019
40466a94019N567K7127K3448K4087K8931J0460k1032k1412J0010K2940Kj6617
$$ -194019 -188452 -161325 -137877 -113790 -84859 -74399 -95431 -116843 -106833 -83893 -83891 -100508
40454a00508k278J0422l823j8439p905P306L493m228L407J3451J0286M739O434
$$ -100508 -102786 -92364 -96187 -114626 -122531 -115225 -111732 -115960 -112553 -99102 -88816 -84077 -77643
40441g7643L022q785q525Q558J5273j505j6849j2318n271j0595j2886j722M111
$$ -77643 -74621 -83406 -91931 -83373 -68100 -69605 -86454 -98772 -104043 -114638 -127524 -129246 -125135
40428a25135o193j0708O775K7358K9690J9363O315j1839k6110j4798J4458K1131
$$ -125135 -131328 -142036 -135261 -107903 -78213 -58850 -52535 -64374 -90484 -105282 -90824 -69693
40416f9693q771l8651l6429j4056N473J7701J6409q782l5750k1896K6056M8870
$$ -69693 -78464 -117115 -153544 -167600 -162127 -144426 -128017 -136799 -172549 -194445 -168389 -119519
40404a19519K5170M934K2191L8607J6152j5607j6113k998q710j6756o04J6328
$$ -119519 -94349 -89415 -67224 -28617 -12465 -28072 -44185 -47183 -55893 -72649 -73253 -56925
40392e6925J121k3806j7512P582R917j0068j9347j0706L89J4282L2075K8161q890
$$ -56925 -55804 -79610 -97122 -89540 -79623 -89691 -109038 -119744 -119355 -105073 -72998 -44837 -53727
40379e3727l4831p862L5771K8653k2410m5835j3281K7538L1126O392j7458k6161
$$ -53727 -88558 -96420 -60649 -31996 -54406 -100241 -113522 -85984 -54858 -48466 -65924 -92085
40367i2085j2507K1949M9229L9294P102m461Q776O918k5133m9252l2141O721K7736
$$ -92085 -104592 -82643 -33414 5880 12982 8521 17297 24215 -918 -50170 -82311 -75590 -47854
40354d7854K2895J1969Q291J0589J5778K0789J7660P74k2340l6117l4435k8248
$$ -47854 -24959 -12990 -4699 5890 21668 42457 60117 60891 38551 2434 -32001 -60249
40342f0249l0611l5228k1579J1313L1792J5435j5754k2668o825p20o295P684M0655
$$ -60249 -90860 -126088 -147667 -136354 -104562 -89127 -104881 -127549 -134374 -135094 -141389 -133705 -93050
40329i3050M7657J2985j6022j456K5659J8755j1490k4228j6217j2821j4751l846
$$ -93050 -45393 -32408 -48430 -49886 -24227 -5472 -16962 -41190 -57407 -70228 -84979 -88825
40317h8825J2783J1521l341o039N209P556m877j3510r170l582o160j3151j9067
$$ -88825 -76042 -64521 -67862 -73901 -68692 -61136 -66013 -79523 -88693 -92275 -98435 -111586 -130653
40304a30653j9807q746J2580K6273J7626l118j2268L03K3848L6471J9130k3019
$$ -130653 -150460 -159206 -146626 -120353 -102727 -105845 -118113 -117810 -93962 -57491 -38361 -61380
40292f1380n2273l5917O459K4784R499m09J2766J8512l18j2318N277K3280J2116
$$ -61380 -113653 -149570 -143111 -118327 -108828 -109237 -96471 -77959 -78277 -90595 -85318 -62038 -49922
40279d9922p265m879O337K570n084r80l232k4489l1638K099L7901K2148k9047
$$ -49922 -57187 -62066 -55729 -53159 -58243 -59223 -62455 -86944 -118582 -116483 -78582 -56434 -85481
40266h5481n4815l9991k2251k1059j6218N167K7877L6649L0800J3925m710q958
$$ -85481 -140296 -180287 -202538 -223597 -239815 -234648 -206771 -170122 -139322 -125397 -130107 -139065
40254a39065J609N818l111l726J0462J1748j0785k4463j0027K642o294o477J7257
$$ -139065 -137456 -131638 -134749 -138475 -128013 -116265 -127050 -151513 -161540 -158898 -165192 -171669 -154412
40241a54412K0492j9501m1041P053O5740N1428p497k1592R963J2507k3423l2023
$$ -154412 -133920 -153421 -194462 -187409 -121669 -70241 -77738 -99330 -89367 -76860 -100283 -132306
40229a32306M39J3273j1382j7485J4778K9105k419k6909m956K3891J7154O04J2379
$$ -132306 -131867 -118594 -129976 -147461 -132683 -103578 -105997 -132906 -137862 -113971 -96817 -96213 -83834
40216h3834L3124K3735q629k6802j6711O761K1637R115k9310n6484l6458R439
$$ -83834 -50710 -26975 -35604 -62406 -79117 -72356 -50719 -41604 -70914 -127398 -163856 -154417
40204a54417K5356K345j2186P894L4215L9872L4863K9334J2398j3270k2001q594
$$ -154417 -129061 -126716 -138902 -131008 -96793 -56921 -22058 7276 19674 6404 -15597 -24191
40192b4191N14p035j4064j2978j5825j8467k318K1973K2948N234L144J3550j523
$$ -24191 -23677 -30712 -44776 -57754 -73579 -92046 -94364 -72391 -49443 -44209 -41065 -27515 -29038
40179b9038l6065l4266J5574N0559K7511j5108k4986q932L00m23j989j2726l2948
$$ -29038 -65103 -99369 -83795 -33236 -5725 -20833 -45819 -54751 -54451 -54874 -56863 -69589 -102537
40166a02537l6927j3467R558R118J404P590J9557K2206J6593L159k2355m2547
$$ -102537 -139464 -152931 -143373 -134255 -132851 -125261 -105704 -83498 -66905 -63746 -86101 -128648
40154a28648k8802Q080K1948J45j8913j1538MK25Q856L1639L6614R556j5902j3566
$$ -128648 -157450 -149370 -127422 -127277 -146190 -157728 -157724 -157499 -148643 -117004 -80390 -70834 -86736 -100302
40140a00302l941r383j5708p884m86m195l256Q849J3092M888M998J2383k029l4518
$$ -100302 -104243 -113626 -129334 -137218 -137704 -141899 -145155 -136306 -123214 -118326 -113328 -100945 -102974 -137492
40126a37492l8555o39L1508K4330L835k923j0163k4860j9567Q819J6334j2221
$$ -137492 -176047 -176686 -145178 -120848 -117013 -119936 -130099 -154959 -174526 -165707 -149373 -161594
40114a61594k8831n972J2998m199j6969R635L3671J2767j1741J4228N6550M8398
$$ -161594 -190425 -196397 -183399 -187598 -204567 -194932 -161261 -148494 -160235 -146007 -89457 -41059
40102d1059M509q386J4032J6672j3619l2237j8670j842l70J856J3798J9797J0558
$$ -41059 -36550 -44936 -30904 -14232 -27851 -60088 -78758 -80600 -80970 -79114 -65316 -45519 -34961
40089c4961m442j5961j9170p468J3739K2673J2238K460J710j0995l9699m7644
$$ -34961 -39403 -55364 -74534 -82002 -68263 -45590 -33352 -30892 -29182 -40177 -79876 -127520
40077a27520j3827K5517K9566R731l033p301q989N894L3365L2303r363l6328o545
$$ -127520 -141347 -115830 -86264 -76533 -79566 -86867 -95856 -89962 -56597 -24294 -33657 -69985 -76530
40064g6530L6711L1509r221l3066l3250l1122j5783K4990M9738J7231l3556l4840
$$ -76530 -39819 -8310 -17531 -50597 -83847 -114969 -130752 -105762 -56024 -38793 -72349 -107189
40052a07189L820J8818o70j0832j984n786k1404j4833R240J0295j1717j4551Q580
$$ -107189 -103369 -84551 -85221 -96053 -98037 -103823 -125227 -140060 -130820 -120525 -132242 -146793 -138213
40039a38213J8705M078l693N050J207k1863k9605m694K5937L5570K5820M312k2410
$$ -138213 -119508 -115430 -119123 -114073 -112866 -134729 -164334 -169028 -143091 -107521 -81701 -77389 -99799
40026i9799l1571m573L3410L7966R589j0048l723M692j782j3286k1799k9281k8858
$$ -99799 -131370 -135943 -102533 -64567 -54978 -65026 -68749 -64057 -65839 -79125 -100924 -130205 -159063
40013a59063j4369j133j737K845K7670M2369J5955j9802j2771K1069J9433k3782
$$ -159063 -173432 -174565 -176302 -173457 -145787 -103418 -87463 -107265 -120036 -98967 -79534 -103316
40001a03316m8302k3099J4017K4039J5834J1606J1458Q559L518m655j3127n524
$$ -103316 -151618 -174717 -160700 -136661 -120827 -109221 -97763 -89204 -85686 -90341 -103468 -108992
39989a08992K1852L8461K0222p839j0475J003j422m760J4977L2619J0197k9310
$$ -108992 -87140 -48679 -28457 -36296 -46771 -45768 -47190 -51950 -36973 -4354 5843 -23467
39977b3467l5519j7715k2110l9056j7558L4783N3248K0915j0409j2225j2443k4823
$$ -23467 -58986 -76701 -98811 -137867 -155425 -120642 -67394 -46479 -56888 -69113 -81556 -106379
39965a06379k3320l511K909p780j432K3958K6893j874j8820j493J9434J8685P850
$$ -106379 -129699 -133210 -130301 -138081 -139513 -115555 -88662 -90536 -109356 -110849 -91415 -72730 -64880
39952f4880l470j8665j9931J3354M8395L0492k5570n0234k8978j5607k8678k4775
$$ -64880 -68350 -87015 -106946 -93592 -45197 -14705 -40275 -90509 -119487 -135094 -163772 -188547
39940a88547Q325K4491J0382J2205M0733M1776j075k6333k505J4409j5075l9764
$$ -188547 -180222 -155731 -145349 -133144 -92411 -50635 -51710 -78043 -80548 -66139 -81214 -120978
39928a20978j1502K6028J4044k2217k4859J34Q446m333j3786j7969k2015r300
$$ -120978 -132480 -106452 -92408 -114625 -139484 -139350 -130904 -135237 -149023 -166992 -189007 -198307
39916a98307K1939L3160N264j8060L575L9062L5696M9k2903j9589q260K258J0513
$$ -198307 -176368 -143208 -137944 -156004 -152429 -113367 -77671 -77622 -100525 -120114 -128374 -126116 -115603
39903a15603M776j5499k6167j5502m267m400L876K8025L9234K1018r75m914m143
$$ -115603 -110827 -126326 -152493 -167995 -172262 -176662 -172786 -144761 -105527 -84509 -85484 -90398 -94541
39890i4541q468m003M994q934l4938k3044K4690L6664j2802m8848j3520L8090
$$ -94541 -103009 -107012 -102018 -110952 -145890 -168934 -144244 -107580 -120382 -169230 -182750 -144660
39878a44660K9670j5806k8414q479m307j4209M55L0478L0489J352j2643p77M306
$$ -144660 -114990 -130796 -159210 -167689 -171996 -186205 -185750 -155272 -124783 -123431 -136074 -136851 -132545
39865a32545j1156k5261k2439p100J7294M3830M9398K3472m978l630J7025K5456
$$ -132545 -143701 -168962 -191401 -198501 -181207 -137377 -87979 -64507 -69485 -73115 -56090 -30634
39853c0634J7212R748Q538P881Q779J4374K4842M6416Q0388J05161J09308J30970
$$ -30634 -13422 -3674 4864 12745 21524 35898 60740 107156 187544 292705 402013 532983
39841E32983J97606K33878J27284r3131k49336k32816j30895p5640p0412n0344
$$ 532983 730589 964467 1091751 998620 749284 516468 385573 309933 239521 189177
39831A89177k0365k4190m1899k6855R45n230k7764k3985j3324l3613n2935k0854
$$ 189177 168812 144622 102723 75868 76813 71583 43819 19834 6510 -27103 -80038 -100892
39819a00892K9911L0747o325j7008p3m419k5280j5729J4352J0785k3443l4326
$$ -100892 -70981 -40234 -46559 -63567 -63640 -68059 -93339 -109068 -94716 -83931 -107374 -141700
39807a41700j5916j0413j7128M281M3349M5790J3232N073L4324M8519K4287j113
$$ -141700 -157616 -168029 -185157 -180876 -137527 -91737 -78505 -73432 -39108 9411 33698 32585
39795C2585m645p833k0253k2323j3765j5681k1830r733N127q255l0223j7592J5492
$$ 32585 27940 20107 -146 -22469 -36234 -51915 -73745 -83478 -78351 -86606 -116829 -134421 -118929
39782a18929J9822N12K072J7765L828k5696j5354K3545K2340k2447l8663l257
$$ -118929 -99107 -98595 -96523 -78758 -74930 -100626 -115980 -92435 -70095 -92542 -131205 -134462
39770a34462K4495J3112R67M123j6100o0480o5452j0682L7170L1554J1772J7639
$$ -134462 -109967 -96855 -95888 -91765 -107865 -168345 -233797 -244479 -207309 -175755 -163983 -146344
39758a46344K2445P34j4965J650J8657P874n831k459q179l3655l8951q075R681
$$ -146344 -123899 -123165 -138130 -136480 -117823 -109949 -115780 -118239 -126418 -160073 -199024 -207099 -197418
39745a97418j4532l0104O454M9742L8415m244j5011O721J4343J898N743L3931
$$ -197418 -211950 -242054 -235600 -185858 -147443 -151687 -166698 -159977 -145634 -143736 -137993 -104062
39733a04062N4314M6915K2644l923k5014l0941j8975k292Q305J6811K4035K0371
$$ -104062 -49748 -2833 19811 15888 -9126 -40067 -59042 -61334 -53029 -36218 -12183 8188
39721H188Q735O689J3136M520k2052l6323k1234L003J7124K9040M4088M5161K3065
$$ 8188 16923 23612 36748 41268 19216 -17107 -38341 -35338 -18214 10826 54914 100075 123140
39708A23140m440k0638k7392k4294m655J7870J5409j1164l1736l5067l6531l4733
$$ 123140 118700 98062 70670 46376 41721 59591 75000 63836 32100 -2967 -39498 -74231
39696g4231j0156K4839K8349l564k2979j379L3517M8562M4366K8486j56k3965
$$ -74231 -84387 -59548 -31199 -34763 -57742 -59121 -25604 22958 67324 95810 95654 71689
39684G1689j4827J4494J8805o051j5168N397J4490n823j3907J7221M9880M3447
$$ 71689 56862 71356 90161 84110 68942 74339 88829 83006 69099 86320 136200 179647
39672A79647J4054l307n468k046R391K1186J2428r839j2397N151O854j0108o266
$$ 179647 193701 190394 184926 182880 192271 213457 225885 216046 203649 208800 215654 205546 199280
39659A99280K1855K5711p531k6670q809j864l3150n4477l0976r157l3571o3221
$$ 199280 221135 246846 239315 212645 203836 201972 168822 114345 83369 74212 40641 -22580
39647b2580m1092R171K7485J2755N449J1734Q602m781j4907k5565l7899l1743
$$ -22580 -63672 -54501 -27016 -14261 -8812 2922 11524 6743 -8164 -33729 -71628 -103371
39635a03371m905Q610l933n872K0796L3722K936k9940j8254J6006L0185L1431
$$ -103371 -108276 -99666 -103599 -109471 -88675 -54953 -52017 -81957 -100211 -84205 -54020 -22589
39623b2589M1220L9430O265k4777j8237J2r404k9472k4764q882j3530k7868k6117
$$ -22589 18631 58061 64326 39549 21312 21324 11920 -17552 -42316 -51198 -64728 -92596 -118713
39610a18713j7517j5286N32L5246M4411N615k7457p069K7305K0369l216N001J9995
$$ -118713 -136230 -151516 -150984 -115738 -71327 -65712 -93169 -100238 -72933 -52564 -55780 -50779 -30784
39597c0784o697m6223l9271o078q591l1888q560N4616P8021L4602j9015l8616
$$ -30784 -37481 -83704 -122975 -129053 -137644 -169532 -178092 -123476 -45455 -10853 -29868 -68484
39585f8484l5520k1961O671L1414K4010K422N192J8186j279l7690l4128R014L3274
$$ -68484 -104004 -125965 -119294 -87880 -63870 -61448 -56256 -38070 -39349 -77039 -111167 -102153 -68879
39572f8879K0606J2014K3187K2224K036l125J1033M836k8727m2270j1753K5310
$$ -68879 -48273 -36259 -13072 9152 11188 8063 19096 23932 -4795 -47065 -58818 -33508
39560c3508L1970J7776L517r039j5321l273J5923J6054J458j173K529j8740n6750
$$ -33508 -1538 16238 19755 10716 -4605 -7878 8045 24099 25557 24384 26913 8173 -48577
39547d8577o2514k1253K4674M0623L7168L0471J5933k039m99K1882L3737J7658
$$ -48577 -111091 -132344 -107670 -67047 -29879 592 16525 14486 13987 35869 69606 87264
39535H7264n022j0414m317o141k2366m2068m4457j7026K0263K7897J665j5412
$$ 87264 82242 71828 67511 61370 39004 -3064 -47521 -64547 -44284 -16387 -14722 -30134
39523c0134o42R533j4177l5398j4211J5751P59l6812l2498J3037L9520K6517J0764
$$ -30134 -30776 -21243 -35420 -70818 -85029 -69278 -68519 -105331 -137829 -124792 -85272 -58755 -47991
39510d7991J0795P244m003o230o566k3567l7844j9000J0027M324j9927q963L1228
$$ -47991 -37196 -29952 -33955 -40185 -46751 -70318 -108162 -127162 -117135 -112811 -132738 -141701 -110473
39497a10473M1360J0330j0231L569K0698K4961L6277N3305M6687J9498P456J3341
$$ -110473 -69113 -58783 -69014 -65445 -44747 -19786 16491 69796 116483 135981 143437 156778
39485A56778O817j1001j2665r746l6399p1422o0173j4030M39k4305k6443J0408
$$ 156778 163595 152594 139929 130183 93784 22362 -37811 -51841 -51402 -75707 -102150 -91742
39473i1742K7713k141l2462l0226k0604j7720L470L8724M2093J0039m389J2975
$$ -91742 -64029 -66170 -98632 -128858 -149462 -167182 -163712 -124988 -82895 -72856 -77245 -64270
39461f4270J3770j4719j9739J5287L2242K001k3639q267Q722m455j4454N38J460
$$ -64270 -50500 -65219 -84958 -69671 -37429 -35428 -59067 -67334 -58612 -63067 -77521 -76983 -75523
39448g5523k9933m2676o938K7513K1566J4316L7440M4178l108m9972l4493R806
$$ -75523 -105456 -148132 -155070 -127557 -105991 -91675 -54235 -10057 -13165 -63137 -97630 -87824
39436h7824J5807r381j7346p870p581m473K0253L5450Q149k7970k2262Q309J1716
$$ -87824 -72017 -81398 -98744 -106614 -114195 -118668 -98415 -62965 -54816 -82786 -105048 -96739 -85023
39423h5023j2466k3703j1027O335K2938L7846K9414q766l6184j9967R674Q285
$$ -85023 -97489 -121192 -132219 -125884 -102946 -65100 -35686 -44452 -80636 -100603 -90929 -82644
39411h2644j0917o222K1181L7212L1999K0290P886k688J078J5110J0449j7449
$$ -82644 -93561 -99783 -78602 -41390 -9391 10899 18785 16097 17175 32285 42734 25285
39399B5285l0003p842J3540N139q800m352l893k3555l0281k539K0476N012j5944
$$ 25285 -4718 -12560 980 6119 -2681 -7033 -10926 -34481 -64762 -67301 -46825 -41813 -57757
39386e7757o007M896k0538n0092l5692J489J2965R088K7566N1675L7860k105k0715
$$ -57757 -63764 -58868 -79406 -129498 -165190 -163701 -150736 -141648 -114082 -62407 -24547 -26652 -47367
39373d7367j3668j0062p270J4712L4710J6314k2793l3109j2477j785j3217k0601
$$ -47367 -61035 -71097 -78367 -63655 -28945 -12631 -35424 -68533 -81010 -82795 -96012 -116613
39361a16613j1954l00Q296J4866J1754L358J5459M6719M9560M145l4297j7363
$$ -116613 -128567 -128867 -120571 -105705 -93951 -90593 -75134 -28415 21145 25290 -9007 -26370
39349b6370J5216K961l1975k7159J0902K5186J0870J2858L3843K8459j2604m6166
$$ -26370 -11154 -8193 -40168 -67327 -56425 -31239 -20369 -7511 26332 54791 42187 -3979
39337c979m6425k9169q653J2108J4749j3616m1232k8678O036J4585m317j3181
$$ -3979 -50404 -79573 -88226 -76118 -61369 -74985 -116217 -144895 -138859 -124274 -128591 -141772
39325a41772n805o085r277R826L6919L1023m068k0892j979K1183K3484J2300K7
$$ -141772 -147577 -153662 -162939 -153113 -116194 -85171 -89239 -110131 -112110 -90927 -67443 -55143 -55116
39312e5116o894J480K0183J7336j9052m5870k3460J7266J9547j3302l4446l0919
$$ -55116 -62010 -60530 -40347 -23011 -42063 -87933 -111393 -94127 -74580 -87882 -122328 -153247
39300a53247k3059r801J9994M0320J8258k2587l0956n738J4401K0393L0048L5720
$$ -153247 -176306 -186107 -166113 -125793 -107535 -130122 -161078 -166816 -152415 -132022 -101974 -66254
39288f6254J9178J78O688J7876J397j9179n799J4143q464m5515k8227L1813N3742
$$ -66254 -47076 -46898 -40210 -22334 -20937 -40116 -45915 -31772 -40236 -85751 -113978 -82165 -28423
39275b8423J7002j3628N80K4190K4939J8871K0161J6288R145J7978L1077J5127
$$ -28423 -11421 -25049 -24469 -279 24660 43531 63692 79980 89125 107103 138180 153307
39263A53307k1334l3427j1330J1754J9472K0277M653l9581p8232o6323k4504j0216
$$ 153307 131973 98546 87216 98970 118442 138719 143372 103791 25559 -40764 -65268 -75484
39251g5484k4385k1223J852N404j0491r396M475l381j9849n264J8582j731m1954
$$ -75484 -99869 -121092 -119240 -113836 -124327 -133723 -129248 -132629 -152478 -157742 -139160 -140891 -182845
39238a82845k6739L5310N4953R886k4302q710O264j0577k0064l218J788j1541
$$ -182845 -209584 -174274 -119321 -109435 -133737 -142447 -136183 -146760 -166824 -170042 -168254 -179795
39226a79795N105N2198N9528O913l4019k2322r451l0796l9836p042J6699j086
$$ -179795 -174690 -122492 -62964 -56051 -90070 -112392 -121843 -152639 -192475 -199517 -182818 -183904
39214a83904q669K9041N6148K5339j5038j0032P525q163k3756M661L9026K3878
$$ -183904 -192573 -163532 -107384 -82045 -97083 -107115 -99590 -107753 -131509 -126848 -87822 -63944
39202f3944j3712j4831J0098J3265j247L79Q742m463k3254j7933n819j6097k7944
$$ -63944 -77656 -92487 -82389 -69124 -70371 -69992 -61250 -65713 -88967 -106900 -112719 -128816 -156760
39189a56760q071K3297K7884J8367K7294L7530J1260l4088m4670j1789K1608K6002
$$ -156760 -164831 -141534 -113650 -95283 -67989 -30459 -19199 -53287 -97957 -109746 -88138 -62136
39177f2136J0279o729j0539Q282L4578L0674j1127m4774l1376N705K1029J1478
$$ -62136 -51857 -58586 -69125 -60843 -26265 4409 -6718 -51492 -82868 -77163 -56134 -44656
39165d4656L146K349j274n301k811j076n756p147j444L68k64J3626L6009L4743
$$ -44656 -41510 -39161 -40435 -45736 -48547 -49623 -55379 -62526 -63970 -63602 -63866 -50240 -14231 20512
39151B0512L149k5126k7412j6210j407K2587M1350K7460m783j1572K358j2714
$$ 20512 23661 -1465 -28877 -45087 -46494 -23907 17443 44903 40120 28548 30906 18192
39139A8192n5664o2662j6397J7500l27k1484k445K4009K2266J9065L6661L6875
$$ 18192 -37472 -100134 -116531 -99031 -99358 -120842 -123287 -99278 -77012 -57947 -21286 15589
39127A5589m136l6298j8049P816j0610m5355m4264j7421M73J7232M4261M6863
$$ 15589 11453 -24845 -42894 -35078 -45688 -91043 -135307 -152728 -152255 -135023 -90762 -43899
39115d3899L810l6649k8934n084j0405k1530j134K2646R639j2215j55J9062m17
$$ -43899 -40089 -76738 -105672 -110756 -121161 -142691 -143825 -121179 -111540 -123755 -123910 -104848 -105265
39102a05265l3913k8720M012J8018J3303J4478J0166j1789j4885K2967M6074L730
$$ -105265 -139178 -167898 -163886 -145868 -132565 -118087 -107921 -119710 -134595 -111628 -65554 -61824
39090f1824n3120m7884l765L754k2055j9506J2322K0591L518N692K3212J1671
$$ -61824 -114944 -162828 -166593 -162839 -184894 -204400 -192078 -171487 -167969 -162277 -139065 -127394
39078a27394k0834k2853M256R115j4054j8270Q500K8256K5380K0571J5549n693
$$ -127394 -148228 -171081 -166825 -157710 -171764 -190034 -181534 -153278 -127898 -107327 -91778 -97471
39066i7471k6253j5271J1066J3626J422J0249K7654J3241k1050k6815l732O145
$$ -97471 -123724 -138995 -127929 -114303 -112881 -102632 -74978 -61737 -82787 -109602 -113334 -107189
39054a07189k251K957K1094K1819Q318Q418J4407J17j6833j53L3355L7399J4249
$$ -107189 -109440 -106483 -85389 -63570 -55252 -46834 -32427 -32310 -49143 -49296 -15941 21458 35707
39041C5707m29p751k5786k5545K8868R6263J01636M9574J0894J1077J5964J2205
$$ 35707 35278 27527 1741 -23804 5064 101327 202963 252537 263431 274508 290472 302677
39029C02677J4806R435k5055n2759k8417J1584K022l0458q975M8191M6369k2683
$$ 302677 317483 326918 301863 249104 220687 232271 234293 203835 194860 243051 289420 266737
39017B66737o3389l7251j6730m6858o9919l5556J3653K0514k318j4751j1742n242
$$ 266737 203348 166097 149367 102509 32590 -2966 10687 31201 28883 14132 2390 -2852
39005b852J052n133l3378n3085k7293J5623J4472k2996l1735j912J1168m357L531
$$ -2852 -1800 -6933 -40311 -93396 -120689 -105066 -90594 -113590 -145325 -147237 -136069 -140426 -136895
38992a36895M5246O1588K9079J289J2485K6476J6635J3873L5926M5301J8480j0398
$$ -136895 -91649 -30061 -982 307 12792 39268 55903 69776 105702 151003 169483 159085
38980A59085j2011o424j4102k1093j8914k2829l1047k1767k264k188j4667r407
$$ 159085 147074 140650 126548 105455 86541 63712 32665 10898 8634 6446 -8221 -17628
38968a7628r10k6780o2348m5694J1718L5513J4119J0142L5293K7208k5033m7876
$$ -17628 -18538 -45318 -107666 -153360 -141642 -106129 -92010 -81868 -46575 -19367 -44400 -92276
38956i2276j2780J3473o626j6461J9782M3551J0282k4358j140M1348L7344k307
$$ -92276 -105056 -91583 -98209 -114670 -94888 -51337 -41055 -65413 -66553 -25205 12139 9832
38944I832k7736l2635l5137k8254o192O563j639m287J0506J5746M034Q521L5123
$$ 9832 -17904 -50539 -85676 -113930 -120122 -113559 -115198 -119485 -108979 -93233 -89199 -80678 -45555
38931d5555M0485R451j5226j2655j8452m4568m3799K628L9323K6768M507J5200
$$ -45555 -5070 4381 -10845 -23500 -41952 -86520 -130319 -127691 -88368 -61600 -57093 -41893
38919d1893L4625K7383Q429J672l171j2059n650R353n913m5712m9224L26M1605
$$ -41893 -7268 20115 28544 30216 27045 14986 9336 18689 12776 -32936 -82160 -81834 -40229
38906d0229L3993J1868O231m434k7739k7289J114Q670j3511j1941K1137J8546
$$ -40229 -6236 5632 11863 7429 -20310 -47599 -46485 -37815 -51326 -63267 -42130 -23584
38894b3584l6565o2370j3306M0039L0605n214j4205j3744k2407k987M9745O2438
$$ -23584 -60149 -122519 -135825 -95786 -65181 -70395 -84600 -98344 -120751 -123738 -73993 -11555
38882a1555L564m6222k5082P915j0625l1205Q425N9088M5368m170j8255k653K459
$$ -11555 -7991 -54213 -79295 -71380 -82005 -113210 -104785 -45697 -329 -4499 -22754 -25407 -22948
38869b2948J3340N0257O4845K1608j6161J6372O9691O3744K1276J2543L0075K4608
$$ -22948 -9608 40649 105494 127102 110941 127313 197004 260748 282024 294567 324642 349250
38857C49250P024J0764J0283k2769m3270j2701J1532k7002o7670l0341L7192L5459
$$ 349250 356274 367038 377321 354552 311282 298581 310113 283111 215441 185100 222292 257751
38845B57751j9316l3395M786L0199K8039L2993L6772J3200n33L7704P4821L7817
$$ 257751 238435 205040 209826 240025 268064 301057 337829 351029 350496 388200 463021 500838
38833E00838l1132l6545J1695K7452K051r27K2340J9273l248P343L5539K0623
$$ 500838 469706 433161 444856 472308 474359 473432 495772 515045 511797 519140 554679 575302
38821E75302k1535k0752J7398K4585m69K476K9989J8791k9759n0077l6525m9019
$$ 575302 553767 533015 550413 574998 574529 577005 606994 625785 596026 545949 509424 460405
38809D60405r1982j02721o7231l9760m0944l7825k6083l2679m0615j1069K7921
$$ 460405 368423 265702 198471 158711 117767 79942 53859 21180 -19435 -30504 -2583
38798b583J7233k1588j7831J9779K0590j4396j8078J0460N255l3831l4509J2148
$$ -2583 14650 -6938 -24769 -4990 15600 1204 -16874 -6414 -1159 -34990 -69499 -57351
38786e7351L2921M794j2394O041J2824r872k0112o286n021j5924k19K8301J7050
$$ -57351 -24430 -19636 -32030 -25989 -13165 -23037 -43149 -49435 -54456 -70380 -70599 -42298 -25248
38773b5248j7137o646L6141K8388l3014n7947j8942P609j5662k9234J174K4828
$$ -25248 -42385 -49031 -12890 15498 -17516 -75463 -94405 -86796 -102458 -131692 -130518 -105690
38761a05690J1627N539K7750L1791R1j4499J2569L1998J4714MJ0996J0964j8415
$$ -105690 -94063 -88524 -60774 -28983 -28892 -43391 -30822 1176 15890 15894 26890 37854 19439
38748A9439l9165l0152j8530j4773K227K0352K845k7784j0445M0637M6582r94
$$ 19439 -19726 -49878 -68408 -83181 -80954 -60602 -57757 -85541 -95986 -55349 -8767 -9761
38736i761k6110l415J0056l878N167L9000L0267k6728m9421j0273J7382j677p059
$$ -9761 -35871 -39286 -29230 -33108 -27941 11059 41326 14598 -34823 -45096 -27714 -29391 -36450
38723c6450K6843L2114k0569n4653k0743J8115M882j7025p15J6203l731k0245
$$ -36450 -9607 22507 1938 -52715 -73458 -55343 -50461 -67486 -68201 -51998 -55729 -75974
38711g5974K752K4428O049j8074j1041M265P048K0248M2076K5401k6094l5788
$$ -75974 -73222 -48794 -42745 -60819 -71860 -67595 -60547 -40299 1777 27178 1084 -34704
38699c4704K0893O6101M6585J1853J0634J1216j4632k8131o769M763j4090j5271
$$ -34704 -13811 52290 98875 110728 121362 132578 117946 89815 83046 87809 73719 58448
38687E8448J4817J3037l9240o2416j3878L3053J8388o010J3858L4170R001j6623
$$ 58448 73265 86302 47062 -15354 -29232 3821 22209 16199 30057 64227 73228 56605
38675E6605J527J8370r203l5124j4292J1534J252n994J8127J8884l4513o8906
$$ 56605 58132 76502 67299 32175 17883 29417 30669 24675 42802 61686 27173 -41733
38663d1733k7951K4181J6248j0077N186K2598j0428m5853k1135K2455J9633J612
$$ -41733 -69684 -45503 -29255 -39332 -34146 -11548 -21976 -67829 -88964 -66509 -46876 -45264
38651d5264K5552N8178M1758O569Q370K1412O50j8087J1962M5532K0672k7524
$$ -45264 -19712 38466 80224 86793 95163 116575 117225 99138 111100 156632 177304 149780
38639A49780l4450k1365l6968n1190j7908K0593L901l2327k2393R014J729k4347
$$ 149780 115330 93965 56997 5807 -12101 8492 12393 -19934 -42327 -33313 -31584 -55931
38627e5931j8122k168j9351l5175l903K9245M772l4403j8845J7472M201k8913
$$ -55931 -74053 -76221 -95572 -130747 -134650 -105405 -100633 -135036 -153881 -136409 -132208 -161121
38615a61121r384L8726M1500J2371J4635L2615R237k9432j6758K3477J6378k5537
$$ -161121 -170505 -131779 -90279 -77908 -63273 -30658 -21421 -50853 -67611 -44134 -27756 -53293
38603e3293k7388J2416L0836J7380R377P18l3724n6821k3377K1854J1547k1267
$$ -53293 -80681 -68265 -37429 -20049 -10672 -9954 -43678 -100499 -123876 -102022 -90475 -111742
38591a11742l398M0974L6653j574k990K2050R696k7050k6010j567j2405l6300
$$ -111742 -115140 -74166 -37513 -39087 -42077 -20027 -10331 -37381 -63391 -64958 -77363 -113663
38579a13663j0367L5254K1425l0208l0947J5992L0969R870J6351M0544J3728m5795
$$ -113663 -124030 -88776 -67351 -97559 -128506 -112514 -81545 -71675 -55324 -14780 -1052 -46847
38567d6847m9169L386K2567j0155k3162K576J0493p117J206K6282N674m1441k5989
$$ -46847 -96016 -92630 -70063 -80218 -103380 -100804 -90311 -97428 -96222 -69940 -64266 -105707 -131696
38554a31696N0280Q2851L3733j8326j9589p621j1432n435J1721L536j9917j0395
$$ -131696 -81416 1435 35168 16842 -2747 -10368 -21800 -27235 -15514 -11978 -31895 -42290
38542d2290J6394k241n1929n0817R789N1802M3920L0597K4052q684m4972k0839
$$ -42290 -25896 -28137 -80066 -130883 -121094 -69292 -25372 5225 29277 20593 -24379 -45218
38530d5218M3208N6959J1592j1784O681J002l9532m4346j210J4679j8096k8714
$$ -45218 -2010 54949 66541 54757 61438 62440 22908 -21438 -22648 -7969 -26065 -54779
38518e4779R859L4529J7174J1262L6364L7007m461k8834j0326L540p654n810J2093
$$ -54779 -44920 -10391 6783 18045 54409 91416 86955 58121 47795 51335 43681 37871 49964
38505D9964K29l5165l4265M20M299k1413r202L5215L0582k4224l6937Q845K0028
$$ 49964 50193 15028 -19237 -18817 -14518 -35931 -45133 -9918 20664 -3560 -40497 -31652 -11624
38492a1624l3174o0326j4968K8414J7312M277K8190M1694J6486l21J0980K310
$$ -11624 -44798 -105124 -120092 -91678 -74366 -70089 -41899 -205 16281 15960 26940 29250
38480B9250l2726l0660J6681L4544M387j705L2260K6891l4795n6963m31M0865
$$ 29250 -3476 -34136 -17455 17089 21476 19771 52031 78922 44127 -12836 -13267 27598
38468B7598K958m5654l7693j1462q337N449M1576M0461q989k5963J7399L6726
$$ 27598 30556 -15098 -52791 -64253 -72590 -67141 -25565 14896 5907 -20056 -2657 34069
38456C4069j0319m4946j6008R386j5808k6994J7682M5242K896m1976k8875o271
$$ 34069 23750 -21196 -37204 -27818 -43626 -70620 -52938 -7696 -4800 -46776 -75651 -81922
38444h1922j6291n297N5373Q6243L6914j5787n580R951k5908n5226k3065J1445
$$ -81922 -98213 -103510 -48137 38106 75020 59233 53653 63604 37696 -17530 -40595 -29150
38432b9150r204l0108K144K9800j467l1950l496K6892J695k1773J3514M6115J2808
$$ -29150 -38354 -68462 -66318 -36518 -37985 -69935 -73431 -46539 -44844 -66617 -53103 -6988 5820
38419E820k6389k524L0626M492l0485q362J7865k0084o4521l2513K9618K9443
$$ 5820 -20569 -23093 7533 12025 -18460 -26822 -8957 -29041 -93562 -126075 -96457 -67014
38407f7014j3499k4501j2062k1385k4242J8597N5792K7495k0652j9512J636j2883
$$ -67014 -80513 -105014 -117076 -138461 -162703 -144106 -88314 -60819 -81471 -100983 -99347 -112230
38395a12230l0422k084K9286Q454k2030k653L1213K6085J3573K9963K6675k7006
$$ -112230 -142652 -144736 -115450 -106996 -129026 -131679 -100466 -74381 -60808 -30845 -4170 -31176
38383c1176n2312P509O6544L4809k5303j6503K2225O361l0136j3166J9178m084
$$ -31176 -83488 -75979 -9435 25374 71 -16432 5793 12154 -17982 -31148 -11970 -16054
38371a6054l9485j3324K9792J5245r649K9776P3426K6801n2984m5308K4861L9610
$$ -16054 -55539 -68863 -39071 -23826 -33475 -3699 69727 96528 43544 -1764 23097 62707
38359F2707n419j7911J3199K0271o65n69Q795j0714k4652P081K7648j8286n9569
$$ 62707 57288 39377 52576 72847 72182 71613 80408 69694 45042 52123 79771 61485 1916
38346A916j5320M7099K6487k6960r961L5959Q134n4085m2531J1918J950m6514
$$ 1916 -13404 33695 60182 33222 23261 59220 67354 13269 -29262 -17344 -15394 -61908
38334f1908k7591L5638L7615l243J1362N4906K4486m6616l8903K4421J6910m9175
$$ -61908 -89499 -53861 -16246 -19489 -8127 46779 71265 24649 -14254 10167 27077 -22098
38322b2098m4012L2146M9029q569k0861L3451M5858j280j166O0917O9599k724
$$ -22098 -66110 -33964 15065 6496 -14365 19086 64944 63664 62498 123415 193014 190290
38310A90290m1877j300K5670q641k9473J281J8228p374j7488M049K991j8713R35
$$ 190290 148413 147113 172783 164142 134669 135950 154178 146804 129316 133365 136356 117643 118578
38297A18578M4647K9455k9628l3305J7393K2784k2769k3512K0868N482o9140p5325
$$ 118578 163225 192680 163052 129747 147140 169924 147155 123643 144511 149993 80853 5528
38285E528J4248P0714K8937k1566j7093j1990l5800l0288J4343K2143j9615l0156
$$ 5528 19776 90490 119427 97861 80768 68778 32978 2690 17033 39176 19561 -10595
38273a0595O815J3813k0370j7803K3266J5338l7539l0378L8803M8222k4413n5694
$$ -10595 -3780 10033 -10337 -28140 -4874 10464 -27075 -57453 -18650 29572 5159 -50535
38261e0535k205K8161j1619k5379K9022N8398K4146J8476P1799P7075p493o7948
$$ -50535 -52740 -24579 -36198 -61577 -32555 25843 49989 68465 140264 217339 209846 141898
38249A41898l5913J909j5716j7156L6341N8152P148k3751J3308K6515l3357o8994
$$ 141898 105985 107894 92178 75022 111363 169515 176663 152912 166220 192735 159378 90384
38237I0384j6414L9311K8614J1761L1001J8120m9444p0607l380M2931K739k9305
$$ 90384 73970 113281 141895 153656 184657 202777 153333 82726 79346 122277 125016 95711
38225I5711J5874N3037J4100k2586O734K8667q964k4193L0684N6560q134n8197
$$ 95711 111585 164622 178722 156136 162870 191537 182573 158380 189064 245624 237490 179293
38213A79293j1271L8646j603n4136k3957K9320K2282M783L8497N9444R186l3025
$$ 179293 168022 206668 205065 150929 126972 156292 178574 183357 221854 281298 290484 257459
38201B57459N557M8510J4280l1021p296K7138J034k4276J9330O3988L3843r624
$$ 257459 263016 311526 325806 294785 287489 314627 315661 291385 310715 374703 408546 398922
38189C98922Q525L3270j172l6536j2253Q452k9789n2256j215L6209j0695n3112
$$ 398922 407447 440717 439545 403009 390756 399208 369419 317163 315948 352157 341462 288350
38177B88350r685L3644j0650n6619n949O0999L4078k3709n341L7515O682m8419
$$ 288350 278665 312309 301659 245040 239091 300090 334168 310459 305118 342633 349315 300896
38165C00896l3072R837k757k6861N188L1110j8410o3842j8668L7544N604m3861
$$ 300896 267824 277661 274904 248043 253231 284341 265931 202089 183421 220965 226569 182708
38153A82708j2277L0285j3278o3640j2204N8117J9730n3664j7796P5415P6373
$$ 182708 170431 200716 187438 123798 111594 169711 189441 135777 117981 193396 269769
38142B69769N687r934J9583Q18l1681J0612O3801J1669q1599p0818Q687J2585
$$ 269769 275456 265522 285105 285923 254242 264854 328655 340324 258725 187907 196594 209179
38130B09179m5930l8794K4699K5365l1925l9674n95r94j9843J9649O2904R145
$$ 209179 163249 124455 149154 174519 142594 102920 102325 101331 81488 101137 164041 173186
38118A73186p4437n0745L4054L0594l8257k8773M6981N2527j939J8457J01262
$$ 173186 98749 48004 82058 112652 74395 45622 92603 145130 143191 161648 262910
38107B62910R7005m209n7444k6571k1008o3748n9748n452k57l8975j6901N1750
$$ 262910 359915 355706 298262 271691 250683 186935 127187 121735 121478 82503 65602 117352
38095A17352M4922l1612m5460J6478K9058l1069n0467j470J9058q134J775M5439
$$ 117352 162274 130662 85202 101680 130738 99669 49202 47732 66790 58656 60431 105870
38083A05870K5323m7869n6862M559K3838j2348m375M9860M6933j2335k1735J7502
$$ 105870 131193 83324 26462 31021 54859 42511 38136 87996 134929 122594 100859 118361
38071A18361L118m8999k2444O0707N7660k9943n2515J2820L3253j5573j1784N8434
$$ 118361 121479 72480 50036 110743 168403 138460 85945 98765 132018 116445 104661 163095
38059A63095O5532p831k9706K3450K5895m1135n0613J0988J0431o0141n1442M7946
$$ 163095 228627 220796 191090 214540 240435 199300 148687 159675 170106 109965 58523 106469
38047A06469O7046k8575o0516L4823Q9286J5585m4498o49K9587k8107n8419N437
$$ 106469 173515 144940 84424 119247 208533 224118 179620 178971 208558 180451 122032 127469
38035A27469M5452o415l6848J7560M5725o442k0849N1943Q2198J7946l00Q4971
$$ 127469 172921 166506 129658 147218 192943 186501 165652 217595 299793 317739 317439 402410
38023D02410J17958K0074n2045L149M7234k1913p1871J41O1595J388n6006K283
$$ 402410 520368 540442 488397 491546 538780 516867 444996 445137 506732 508120 452114 454397
38011D54397N9843J0683k6306M8660J00699J8110n6769M830O4272j4366q7422
$$ 454397 514240 524923 498617 547277 647976 666086 609317 614147 678419 664053 576631
38000E76631l700R0560K2047p0977J227J07842M1986p3794j0459J29095J03100
$$ 576631 572931 663491 685538 614561 615788 723630 765616 691822 681363 810458 913558
37989I13558o202M3223J72023J25621j6025L3094K13559K20943J01740J83338
$$ 913558 907356 950579 1122602 1248223 1232198 1265292 1478851 1699794 1801534 1984872
37979A984872M24513M56212L11240M24953P85664Q55508N88685O73596J331168
$$ 1984872 2409385 2865597 3176837 3601790 4387454 5242962 5831647 6505243 7836411
37970G836411J828083J915719K710245M811325O254848M231889r77794n532666
$$ 7836411 9664494 11580213 14290458 19101783 25356631 29588520 28610726 23078060
37962B3078060o271540m094648k117570j674497j662762j121757n71108o28609
$$ 23078060 16806520 12711872 10594302 8919805 7257043 6135286 5564178 4935569
37954D935569q64771o93288l60980l35229m40230k95608o6262j08682k79997k25312
$$ 4935569 4070798 3377510 3016530 2681301 2241071 1945463 1879201 1770519 1490522 1265210
37944A265210l7192l9929j70046j36027O850j4175j45559j17684K7614K7330q7772
$$ 1265210 1228018 1188089 1018043 882016 888866 874691 729132 611448 639062 666392 578620
37933E78620o6948N4777K2187j27322j13480N5341R1466l9013p7639K0705K6629
$$ 578620 511672 566449 588636 461314 347834 403175 494641 455628 377989 398694 425323
37922D25323q6501q4255N4319P6027n9058r4486L0658O8955n1983r2564K9053
$$ 425323 338822 254567 308886 384913 325855 231369 262027 330982 278999 186435 215488
37911B15488Q1902k4217p2570K3712N5991m9759p3128N8523J02088m0324j21707
$$ 215488 297390 273173 200603 224315 280306 230547 157419 215942 318030 277706 155999
37900A55999j1171O9861j6130p1871K4356P4648l3364q7529L2640J05030j0667
$$ 155999 144828 214689 198559 126688 151044 225692 192328 104799 137439 242469 231802
37889B31802r8413n221O4574m1807j18869n734R2047j334r1123O124J06749K2548
$$ 231802 133389 128168 192742 150935 32066 26332 118379 117045 25922 32046 138795 161343
37877A61343p6127l375Q1137K215p7278J3746J02119O408r9316k0626P9120L944
$$ 161343 85216 81841 162978 165193 87915 101661 203780 210188 110872 90246 169366 173310
37865A73310q9672q801Q9166R814q7599l590J02616K5026q0954p218R2017R631
$$ 173310 83638 74837 164003 173817 86218 82628 185244 210270 129316 122098 214115 223746
37853B23746r0504J0434J40822N4353r3259l9566Q7227L2671q6499k6082R5992
$$ 223746 133242 143676 284498 338851 245592 206026 293253 325924 239425 213343 309335
37842C09335L7185q3142k2913Q9885P79j56782r6674P6745O9072n4775l1002P7945
$$ 309335 346520 263378 240465 330350 331129 174347 77673 154418 223490 168715 137713 215658
37830B15658L1237q9514l7483J03379Q2537k0162L5480J49377O2389j23518j22898
$$ 215658 246895 157381 119898 223277 305814 285652 321132 470509 532898 409380 286482
37819B86482o112l9694j47316o5850J10483Q7330o6116n6155O6675K8233j10675
$$ 286482 280370 240676 93360 27510 137993 225323 159207 103052 169727 197960 87285
37808H7285p5540O5558L1595j04811n2601J11600P6684r1643o8080J01475R1980
$$ 87285 11745 77303 108898 4087 -48514 63086 139770 48127 -19953 81522 173502
37797A73502o4110m7664J11103Q9808q7715r3707O4043O6555q4950q2873O7724
$$ 173502 109392 61728 172831 262639 174924 81217 145260 211815 126865 43992 111716
37786A11716O5181p5700n0383J14586R6378q3588q8305P8128Q4432o8506n7025
$$ 111716 176897 101197 50814 165400 261778 178190 89885 168013 252445 183939 126914
37775A26914J03235P5224j16353j04870R9091J06877r9322j27836O3607R2398
$$ 126914 230149 305373 189020 84150 183241 290118 190796 62960 126567 218965
37765B18965r5573j24349O8785J15432n0608o8430J19835J41200o9592j28831
$$ 218965 123392 -957 67828 183260 132652 64222 184057 325257 255665 126834
37755A26834N1617J02324o7140r7525Q9846J24232p5980j27745O7980J34839l1357
$$ 126834 178451 280775 213635 116110 205956 330188 254208 126463 194443 329282 297925
37744B97925o3515J30360J70569l5671r5038R4811J37224o4435q5600J86610K96284
$$ 297925 234410 364770 535339 499668 404630 499441 636665 572230 486630 673240 969524
37733I69524Q4277J7621L25848N70367M17865J21957p7394l10305n45141m50170
$$ 969524 1053801 1071422 1397270 1967637 2385502 2507459 2430065 2119760 1574619 1124449
37723A124449q1329M0734j85818k57522j1376Q4427j37081k08349M3861J41369
$$ 1124449 1043120 1083854 898036 640514 629138 713565 576484 368135 411996 553365
37713E53365j02823j96688P1535K03084m6275j89929L6713J67452o0569j85709
$$ 553365 450542 253854 325389 528473 482198 292269 328982 496434 435865 250156
37703B50156N0354J75608p4291k13422M2034K03991k9607j78493O2928K12154
$$ 250156 300510 476118 401827 188405 230439 434430 404823 226330 289258 501412
37693E01412l8981j95825O1714K27008m0117k27901K7172K20808k2213k05225
$$ 501412 462431 266606 328320 555328 515211 287310 314482 535290 513077 307852
37683C07852M6118K29879k7342k07221O8130K52766n1320k68124M4266L01249
$$ 307852 353970 583849 556507 349286 417416 670182 618862 350738 395004 696253
37673F96253J2465k55211J5205K75459j599k73793l632K69492J969k60768L1024
$$ 696253 708718 453507 468712 744171 742572 468779 465147 734639 736608 475840 506864
37662E06864L11958J0645k89150J6849L34967K5257l13495n50L71266Q1834k96415
$$ 506864 818822 829467 540317 557166 892133 917390 603895 603345 974611 1056445 760030
37651G60030k1344L52257P3295l09162l8077L33613M7453l17686J3859M23778
$$ 760030 738686 1090943 1164238 855076 816999 1150612 1198065 880379 894238 1318016
37641A318016Q4666l69902n5684M04028R4845l54300Q82N07641J63405l76705
$$ 1318016 1402682 1032780 977096 1381124 1475969 1121669 1122551 1630192 1793597 1416892
37631A416892n3588M92282J70156l76178k6887N48335J79796m33219m9302O14814
$$ 1416892 1363304 1855586 2025742 1649564 1622677 2171012 2350808 1917589 1868287 2483101
37621B483101K37260m59279o9350O90176L36041m25572m5603P69040M06044m07587
$$ 2483101 2720361 2261082 2191732 2881908 3217949 2792377 2746774 3515814 3921858 3514271
37611C514271J7268R19964N13660l99653R2694J153646P25890l22600K28160J483502
$$ 3514271 3531539 4451503 4965163 4565510 4658204 5811850 6537740 6215140 6443300 7926802
37601G926802J050219j31874N48628K120709J737636M23336J322691L381693L147965
$$ 7926802 8977021 8845147 9393775 11514484 13252120 13675456 14998147 18379840 21527805
37592B1527805J778761L186906O198130O453437N229685P381628J1265948J1267778
$$ 21527805 23306566 26493472 32691602 39145039 44374724 51756352 63022300 74290078
37584G4290078J0002273J5342221K4907048K9470610L4281348N5664305Q6059508
$$ 74290078 84292351 99634572 124541620 154012230 188293578 243957883 330017391
37577C30017391Q5235579K8411675n1132815r3469635q0235154m6900878k9544360
$$ 330017391 415252970 443664645 392531830 299062195 218827041 171926163 142381803
37570A42381803k7012498k1963186j3007446r537493j1106116r941897n956391
$$ 142381803 115369305 93406119 80398673 70861180 59755064 49813167 43856776
37563D3856776m898308o389733n434488k442446j875100l415818l046976r43047
$$ 43856776 38958468 32568735 27134247 24691801 22816701 19400883 16353907 15410860
37555A5410860o69754k088260j946632l12498j42110j400840j363751k2572J11653
$$ 15410860 14741106 12652846 10706214 10393716 10251606 8850766 7487015 7464443 7576096
37546G576096r92231j004075J20378K01791q11087q54679J48156K48973o49309
$$ 7576096 6583865 5579790 5700168 5901959 5090872 4236193 4384349 4633322 3984013
37537C984013p04572J90454K80276n55179o30997K00638L31723m11531n05433
$$ 3984013 3279441 3469895 3750171 3194992 2563995 2764633 3096356 2684825 2179392
37528B179392K27976L25906l99943n34540J42577K87235l35854m53952J62250
$$ 2179392 2407368 2733274 2333331 1798791 1941368 2228603 1892749 1438797 1601047
37519A601047K89182l00119m19340J66175L08697k35438l58875J83493L11275
$$ 1601047 1890229 1590110 1170770 1336945 1645642 1410204 1051329 1234822 1546097
37510A546097k32332l92672J11090K66970k16030l62753J25257K99860j61152
$$ 1546097 1313765 921093 1032183 1299153 1083123 720370 845627 1145487 984335
37501I84335l54970N8351K40869j29096k57532J42259K78418j32877l02027P7791
$$ 984335 629365 687716 928585 799489 541957 684216 962634 829757 527730 605521
37491F05521K49728r9340k49142J01781K52523r1597k43276R1379K38662r8019
$$ 605521 855249 755909 506767 608548 861071 769474 526198 617577 856239 758220
37481G58220k61012M8836J92405j25597k74772M4928K14226p6373k27020P3623
$$ 758220 497208 546044 738449 612852 338080 383008 597234 520861 293841 367464
37471C67464K39917m4980k12822N7032K15381n7417k25995L1762J96108n6283
$$ 367464 607381 562401 349579 406611 621992 564575 338580 370342 566450 510167
37461E10167k19511L4260K16418p891j81399J8162J57731n5073j81234N7242K01241
$$ 510167 290656 324916 541334 533443 352044 370206 527937 472864 291630 348872 550113
37450E50113m2109k09123J9043J97010r821j84520P228J72842j2433j70740J3160
$$ 550113 508004 298881 317924 514934 505113 320593 327821 500663 488230 317490 330650
37439C30650J70361o664j52292M1702K17412O2851q1233R0867K50993J00503m2355
$$ 330650 501011 494347 342055 383757 601169 664020 582787 673654 924647 1025150 982795
37428I82795J24698L25892L00487K84212L94866K49988k70811o02390l90942j04289
$$ 982795 1107493 1433385 1733872 2018084 2412950 2662938 2392127 1789737 1398795 1294506
37418A294506j82453l04590j06002R7469m0199j99083k6938J62993O954j97762
$$ 1294506 1112053 807463 701461 798930 758731 559648 532710 695703 702657 504895
37408E04895p5387J09356o162j73091m4620J29259J222j81631o1435J34509M9288
$$ 504895 429508 538864 532702 359611 314991 444250 445472 263841 202406 336915 386203
37397C86203j14640k2810J23949P392j57674m5437J29006K9978j37114l4659J37270
$$ 386203 271563 248753 372702 380094 222420 176983 305989 335967 198853 164194 301464
37386C01464L5125j48654n9575J30103O5190j04598l6859J28259N6849j18410
$$ 301464 336589 187935 128360 258463 323653 219055 182196 310455 367304 248894
37376B48894o8440Q7967L8577r9362k8853J21898N4866r7877l3722J15902M1981
$$ 248894 180454 268421 306998 207636 178783 300681 355547 257670 223948 339850 381831
37365C81831j29116p9938P9176L4801j14131o3765Q7996L8286j19611q2414O6341
$$ 381831 252715 172777 251953 286754 172623 108858 196854 235140 115529 33115 99456
37354I9456K9817j11984o4749R5581P2320p4069n7328P3954N4985o1344k6842
$$ 99456 129273 17289 -47460 48121 120441 46372 -10956 62998 117983 56639 29797
37343B9797R0605M7166p2987j8682J15394O2953q1446l6304J13534P7159p5916
$$ 29797 120402 167568 94581 75899 191293 254246 172800 136496 250030 327189 251273
37332B51273n6248P6620L9103j08060p3927Q9555Q4589n8310n5213O8164L9608
$$ 251273 195025 271645 310748 202688 128761 218316 302905 244595 189382 257546 297154
37321B97154j06827r0293O3515P0231o0378n4544Q2106Q1584n4571o3300N8849
$$ 297154 190327 100034 163549 233780 173402 118858 200964 282548 227977 164677 223526
37310B23526N6609p2992p5637N7703P7332l5292m7478N3760M6213p0437p0385
$$ 223526 280135 207143 131506 189209 266541 231249 183771 237531 283744 213307 142922
37299A42922M4285M6530o2105n9086M6998L2885q2253o2470P2562P2496n4286
$$ 142922 187207 233737 171632 112546 159544 192429 110176 47706 120268 192764 138478
37288A38478n4517P0234O5499o7940o3849Q8307J09593m0623r5602O971L1323
$$ 138478 83961 154195 219694 151754 87905 176212 285805 245182 149580 156551 187874
37277A87874p3816q0635N2417R0772j6528m4931N5052O8538m0813n2816N9779
$$ 187874 114058 33423 85840 176612 160084 115153 170205 238743 197930 145114 204893
37266B04893O1001p8061r9230N0267J06260j6474p5417K4312O1081n2486r6401
$$ 204893 265894 187833 88603 138870 245130 228656 153239 177551 238632 186146 89745
37255H9745J9156P4937k9572q5688J3101P2279j3570o1570K8684Q1128j725n3109
$$ 89745 108901 183838 154266 68578 81679 153958 140388 78818 107502 188630 186905 133796
37243A33796J5732M3191m5277p8568J7087O3700k0103o1467K0316N6902k5482
$$ 133796 149528 192719 147442 68874 85961 149661 129558 68091 88407 145309 119827
37232A19827n5236L6044O6824l3568p2363L4201R2431N679m0742N1045R5203j2183
$$ 119827 64591 100635 167459 133891 61528 95729 188160 193839 153097 204142 299345 287162
37220B87162q2741N661Q0469J2466m8788J2859N6528j5703n3465L4152P9192k1022
$$ 287162 204421 210082 290551 303017 254229 267088 323616 307913 254448 288600 367792 346770
37208C46770q9600L65Q5763K6263m0638J5295O7351j060n9677O062O4612j278
$$ 346770 257170 257535 343298 369561 328923 344218 411569 410509 350832 356894 421506 420228
37196D20228o4358n546N8804J8123j8141M2131P7434J115m9943K0935P6313J4243
$$ 420228 355870 350324 409128 427251 409110 451241 528675 529790 479847 500782 577095 591338
37184E91338l4407K2092M3973n3456j05701j0291N6377l4647j11475k2098P7190
$$ 591338 556931 579023 622996 569540 463839 453548 509925 475278 363803 341705 418895
37173D18895J8449o8094j8069N4447n372q6650l2852N7660L3230k4525J1488N4100
$$ 418895 437344 369250 351181 405628 400256 313606 280754 338414 371644 347119 358607 412707
37161D12707j359l7586N6200J33530M4888p1772l6037N1200J7638n3443n167P7662
$$ 412707 411348 373762 429962 563492 608380 536608 500571 551771 569409 515966 510799 588461
37149E88461L8914m0935o844O7692L3263m0393j0423N4089J6140n4307k7112K3052
$$ 588461 627375 586440 579596 647288 680551 640158 629735 683824 699964 645657 618545 641597
37137F41597k5552q0205j0527P5677K0401q1357n9322J0354l6254j23333p9660
$$ 641597 616045 535840 525313 600990 621391 540034 480712 491066 454812 331479 251819
37126B51819K8035K1020n7490m5456J9735m411o6369k4557N7280K5526n7860l2677
$$ 251819 279854 300874 243384 197928 217663 213252 146883 122326 179606 205132 147272 114595
37114A14595M2114L282q4608l8003Q9665R0920k3039n7578R573K5985k2968r870
$$ 114595 156709 159991 75383 37380 127045 217965 194926 137348 146921 172906 149938 140068
37102A40068N6135M4482k7243k3409L6645J3769p1467p0368R689K4766k8326k3673
$$ 140068 196203 240685 213442 190033 226678 240447 168980 98612 108301 133067 104741 81068
37090H1068L1053J2959n7434m3009M2363N4424j0501k1398K9168K7057k2595r438
$$ 81068 112121 125080 67646 24637 67000 121424 110923 89525 118693 145750 123155 113717
37078A13717M7233K9129l7981k4715M2820K2532o6836p1143J1986L4764k1075
$$ 113717 160950 190079 152098 127383 170203 192735 125899 54756 66742 101506 80431
37067H0431k8151K6778K6133l4429l8550J3541R211l9641j5491N6188L6264n4807
$$ 80431 52280 79058 105191 70762 32212 45753 54964 15323 -168 56020 92284 37477
37055C7477n8754K4335L4156m4976n5360L2405O5196l732l8964J2545L6915r476
$$ 37477 -21277 3058 37214 -7762 -63122 -30717 34479 30747 -8217 4328 41243 31767
37043C1767k2347L1716N0700P011j653M0357L0503l6508m0434L3644N9125M825
$$ 31767 9420 41136 91836 98847 97194 137551 168054 131546 91112 124756 183881 188706
37031A88706j6791J9809N059p3764q4048Q002O7314K8668p214K1040M0908J7704
$$ 188706 171915 191724 196783 123019 38971 46973 114287 142955 135741 156781 197689 215393
37019B15393J9982N5920L9750k7849l9457J6810L0357k1906m0757r676k3110p9432
$$ 215393 235375 291295 331045 303196 263739 280549 310906 289000 248243 238567 215457 136025
37007A36025o5906J4883K9405l7979n2015J5454L3670k9995m5064K6950N5264
$$ 136025 70119 85002 114407 76428 24413 39867 73537 43542 -1522 25428 80692
36996H0692r754m7048l417J3928l5322l9772L4383O2480J400k1520M4475P0027
$$ 80692 70938 23890 20473 34401 -921 -40693 -6310 56170 57570 36050 80525 150552
36984A50552o707n8655q754L3333q172l4877K1705O3667K0010k0760P907K8172
$$ 150552 143845 85190 76436 109769 101597 66720 88425 152092 172102 151342 159249 187421
36972A87421r326k2523K2875K7410m0524n8459K3833P6872K4689k3221Q054K1372
$$ 187421 178095 155572 178447 205857 165333 106874 130707 207579 232268 209047 217101 238473
36960B38473m1393o7909L879M7084k1420p8930k5989K9334j4413n5415J0719Q3082
$$ 238473 197080 129171 133050 180134 158714 79784 53795 83129 68716 13301 24020 107102
36948A07102M1547l1402j0677M6274K8257j9344k982L2547Q694k0807J5744M9566
$$ 107102 148649 117247 106570 152844 181101 161757 158775 191322 200016 179209 194953 244519
36936B44519j230o4335m1138J3294J915l6523k3155l29l5581p1546l1036K9518
$$ 244519 243289 178954 137816 151110 153025 116502 93347 93018 57437 -14109 -45145 -15627
36924a5627K3911p168J0082L5022L967l2500n987L5329K3514j034J3387J6955
$$ -15627 8284 1116 11198 46220 50187 17687 11700 47029 70543 69509 82896 99851
36912I9851k8880m7023J2947N5014Q21n6628j4601N3530L6070j7234l263M0805
$$ 99851 70971 23948 36895 91909 92730 36102 21501 75031 111101 93867 90604 131409
36900A31409K5522j2930M711L6254M497m2899k3902J6902k046l8702j5711K1538
$$ 131409 156931 144001 148712 184966 189463 146564 122662 139564 137518 98816 83105 104643
36888A04643m933m7948k8333N342k5849o4336j6521O3702O3940R952L821L6798
$$ 104643 99710 51762 23429 28771 2922 -61414 -77935 -14233 49707 59659 63480 100278
36876A00278L1092J861J3188L4888K232m2990k4733J7971M944k9242n548M2142
$$ 100278 131370 133231 146419 181307 183539 140549 115816 133787 138731 109489 103941 146083
36864A46083L3880k28J3949M0822O154m3281j3227O2245P6950L1882O698O444
$$ 146083 179963 179735 193684 234506 240660 197379 184152 246397 323347 355229 361927 368371
36852C68371j3879k7578J1784N1848K1149k9742j1765L8974K9532j9004k1263
$$ 368371 354492 326914 338698 390546 411695 381953 370188 409162 438694 419690 398427
36841C98427R198o19l3615k3290O740q768l8836j1063M6424N8453M4170O4552
$$ 398427 407625 407006 373391 350101 356841 348073 309237 298174 344598 403051 447221 511773
36829E11773Q6008M0972k8716l2205J6402M0330M1881O7257Q7538N1977N572K0624
$$ 511773 597781 638753 610037 577832 594234 634564 676445 743702 831240 883217 888789 909413
36817I09413O4859O4235L9277N5579R7891J11144J06288J19682J35569J41648
$$ 909413 974272 1038507 1077784 1133363 1231254 1342398 1448686 1568368 1703937 1845585
36807A845585J77193K42512K66393K43415K74098L87747M80284N14605O01481
$$ 1845585 2022778 2265290 2531683 2775098 3049196 3436943 3917227 4431832 5033313
36798E033313P84298R48680J053916J225407J505467J779265K069541K589955
$$ 5033313 5817611 6766291 7820207 9045614 10551081 12330346 14399887 16989842
36790A6989842L377698M262365N308107O643841P494061O176877J976139l353140
$$ 16989842 20367540 24629905 29938012 36581853 44075914 50252791 52228930 48875790
36782D8875790o918517p501958o296620m975810m023247l157408k374272j897497
$$ 48875790 41957273 34455315 28158695 23182885 19159638 16002230 13627958 11730461
36774A1730461j644372j371823j098166r61159q84099p24688n53529m95822m82107
$$ 11730461 10086089 8714266 7616100 6654941 5770842 5046154 4492625 3996803 3514696
36765C514696m00680l13031l00461k82304j86407j14304j49155j85390j27009
$$ 3514696 3114016 2800985 2500524 2218220 2031813 1917509 1768354 1582964 1455955
36756A455955o7181r7487j28208p1490j6850n2475r3533n6408k3543o8864r9294
$$ 1455955 1388774 1291287 1163079 1091589 1074739 1022264 928731 872323 848780 779916 680622
36745F80622l7227J6841k8480q0619m2608O100k2835n0786K703M6673j1404q2447
$$ 680622 643395 660236 631756 551137 508529 514629 491794 441008 443711 490384 478980 396533
36733C96533o0326j5044m3480p8254k7489L7547J7047k8982n167L5466P083l5340
$$ 396533 336207 321163 277683 199429 171940 209487 226534 197552 192385 227851 234934 199594
36721A99594j0245K5375n784m0273O39M6570Q521m6493k1443K8541J0765k6311
$$ 199594 189349 214724 208940 168667 169306 215876 224397 177904 156461 185002 195767 169456
36709A69456k304K4463k5570p8277l2740M2592K7226l6268l2185J4699N045l7269
$$ 169456 167152 191615 166045 87768 55028 97620 124846 88578 56393 71092 76137 38868
36697C8868k1743K5636J8244j7092K151M4206K2882l0252k1353L1555M1211J5415
$$ 38868 17125 42761 61005 43913 46064 90270 113152 82900 61547 93102 134313 149728
36685A49728K1997M1456Q572m6955m8742j5561j6901l8548k5245j15j2051k8004
$$ 149728 171725 213181 221753 174798 126056 110495 93594 55046 29801 29686 17635 -10369
36673a0369m337R433l1845n4289J0537P7592M0109l9443l6806J9557J8627k3885
$$ -10369 -14706 -5273 -37118 -91407 -80870 -3278 36831 -2612 -39418 -19861 -1234 -25119
36661b5119j2862L1496J6063l5872k4667L2977L3111k2102l5185N324K1317J799
$$ -25119 -37981 -6485 9578 -26294 -50961 -17984 15127 -6975 -42160 -36836 -15519 -13720
36649a3720L249J6532j0257m1929n052O0798N7366M005J44M1540M0429L903J9650
$$ -13720 -10471 6061 -4196 -46125 -51177 9621 66987 70992 71136 112676 153105 157008 176658
36636A76658P8582Q3787L0114O292K0073r699q0435r2918k9645J1109j5675m3691
$$ 176658 255240 339027 369141 375433 395506 385807 305372 212454 182809 193918 178243 134552
36624A34552l1413j9500k5733r721L0532M0090M939l2138n6402q2029q1154k1872
$$ 134552 103139 83639 57906 48185 78717 118807 123746 91608 35206 -46823 -127977 -149849
36612a49849M0784K8836k4157k4882J8622K1361j5730j2196L4695M6346J3775
$$ -149849 -109065 -80229 -104386 -129268 -110646 -89285 -105015 -117211 -82516 -36170 -22395
36601b2395P114L1942J9749l0037l8813P151L4324J6260L164Q495p902l6922k5450
$$ -22395 -15281 16661 36410 6373 -32440 -25289 9035 25295 28459 36954 29052 -7870 -33320
36588c3320J2408J3451r553Q457M4678J4940o1855p5802j0014L7000K5260J8595
$$ -33320 -20912 -7461 -17014 -8557 36121 51061 -10794 -86596 -96610 -59610 -34350 -15755
36576a5755L8602K6680k1183l1099N173Q572l2503l2168K9338N8380J2650k7171
$$ -15755 22847 49527 28344 -2755 2418 10990 -21513 -53681 -24343 34037 46687 19516
36564A9516n595J9541l218l2448k7512j8917k9213k4497O515K0601O234O983K9161
$$ 19516 13921 33462 30244 -2204 -29716 -48633 -77846 -102343 -95828 -75227 -68993 -62010 -32849
36551c2849K4824q681j6294O066l99l9296m3090J166K5658N704o077P956L546
$$ -32849 -8025 -16706 -33000 -26934 -27333 -66629 -109719 -108553 -82895 -77191 -83268 -75312 -71766
36538g1766j8088m82M6090M1148j9702m5047m376K7369J3222O329K4260J1467
$$ -71766 -89854 -90336 -44246 -3098 -22800 -67847 -72223 -44854 -31632 -25303 -1043 10424
36526A0424l2049k6350L7698O4049J7106j9667j285R203j5004l382N9906P4997
$$ 10424 -21625 -47975 -10277 53772 70878 51211 49926 59129 44125 40743 100649 175646
36514A75646r80o4819l8952O789k301j8423J1232K9205j7946o4634l8612J2702
$$ 175646 174666 109847 70895 77684 75383 56960 68192 97397 79451 14817 -23795 -11093
36502a1093J5467n340L276J6510l154j9764K327K0380k609j9563R006L1755J944
$$ -11093 4374 -966 2310 18820 15666 -4098 -1771 18609 16000 -3563 5443 37198 39142
36489C9142l0928j3543J3248j439k1090J06K3806M139k0861n262J3944q314l4394
$$ 39142 8214 -5329 7919 6480 -14610 -14504 9302 13441 -7420 -12682 1262 -7052 -41446
36476d1446j6568J2617Q596l29J9373K9916p43k1990J0461M3416J5407l3421l1586
$$ -41446 -58014 -45397 -36801 -37130 -17757 12159 11416 -10574 -113 43303 58710 25289 -6297
36463f297Q727L3098L7065L6387J2713l2699m1893N943L8751O157l2935j8283
$$ -6297 2430 35528 72593 108980 121693 88994 47101 53044 91795 97952 65017 46734
36451D6734N669j6401m0271q607L4116K1229j5022r914J4763N401j4738J801K6028
$$ 46734 52403 36002 -4269 -12876 21240 42469 27447 17533 32296 37697 22959 24760 50788
36438E0788Q385k3475k1796j1639k9155l4775R495M6358J5803k8311r456L2212
$$ 50788 59173 35698 13902 2263 -26892 -61667 -52172 -5814 9989 -18322 -27778 4434
36426D434J5307l1090k3278K1574K1212j9544k5063J1297K8981J8776K1295K8856
$$ 4434 19741 -11349 -34627 -13053 8159 -11385 -36448 -25151 3830 22606 43901 72757
36414G2757K980k9927j1017M0237N2395K0844l82m030k4892m9093k9780J9480
$$ 72757 75737 45810 34793 75030 127425 148269 147887 143857 118965 69872 40092 59572
36402E9572L9399J9053o400k7580n0219m6689k069L0870Q950j6839J2589M9309
$$ 59572 98971 118024 111624 84044 33825 -12864 -14933 15937 24887 8048 20637 69946
36390F9946J8227m1445l7845J3835K3884j2193j9894J0463J9240L249J5227M4664
$$ 69946 88173 46728 8883 22718 46602 34409 14515 24978 44218 47467 62694 107358
36378A07358K7628k5476l7180r68J0307j9811k8376K672J7391k065p033J4636
$$ 107358 134986 109510 72330 71362 81669 61858 33482 36154 53545 51480 44447 59083
36366E9083J5249j2358j6312R882P463l6465n6915k1546J8050J8676O243J1606
$$ 59083 74332 61974 45662 55544 63007 26542 -30373 -51919 -33869 -15193 -8950 2656
36354B656K0734J9276K0969K7671K0731P096J5776M1368M9906M0881M2082M8901
$$ 2656 23390 42666 63635 91306 112037 119133 134909 176277 226183 267064 309146 358047
36342C58047L5429J7073L0554O0105N7207K4598N985M106j2861l6986l4947k2457
$$ 358047 393476 410549 441103 501208 558415 583013 588998 593104 580243 543257 508310 485853
36330D85853l8261n8549k9303K8112M0625N165j2220M747O107j9442k4296L518
$$ 485853 447592 389043 359740 387852 428477 433642 421422 426169 432276 412834 388538 392056
36318C92056J9729Q512M98J256j1722k1822N837M0507K0133l4342m2551j049J4032
$$ 392056 411785 420297 420795 422051 410329 388507 394344 434851 454984 420642 378091 377042 391074
36305C91074j5986k8769o426n463l8465m2634J199K8578P722q332J3864L0208
$$ 391074 375088 346319 339893 334430 295965 253331 254530 283108 290830 282498 296362 326570
36293C26570Q246j6750j7095j9775l9863m6820l1049k6717m0882l8550j9550k5714
$$ 326570 334816 318066 300971 281196 241333 194513 163464 136747 95865 57315 37765 12051
36281A2051n2088m2380N097K3201o579k1839M393J6688j4334l6147j3381J0257
$$ 12051 -40037 -82417 -77320 -54119 -60698 -82537 -78144 -61456 -75790 -111937 -125318 -115061
36269a15061j539j5234l82J4978P594J621Q062j659k5254j3116M0671P1686M6509
$$ -115061 -116600 -131834 -132216 -117238 -109644 -108023 -99961 -101620 -126874 -139990 -99319 -27633 18876
36256A8876J0416m17j0009l0540k6944O205J7233j2720l4565k1941j1362j8364
$$ 18876 29292 28875 18866 -11674 -38618 -32413 -15180 -27900 -62465 -84406 -95768 -114132
36244a14132o121K5938K0522k8225m4482J969L9352J8419q165R005L1528K0634
$$ -114132 -120253 -94315 -73793 -102018 -146500 -144531 -105179 -86760 -94925 -85920 -54392 -33758
36232c3758J3076L7590M5522J31m7450m5074k3803k5094k3415O757K5362K269
$$ -33758 -20682 16908 62430 62561 15111 -29963 -53766 -78860 -102275 -95518 -70156 -67887
36220f7887j6673P356L1021J0406j5720m11K4365J2937q353J576J8030L648j6377
$$ -67887 -84560 -77204 -46183 -35777 -51497 -51908 -27543 -14606 -22959 -21383 -3353 295 -16082
36207a6082n244J4397P589r118j0936j3243k2909q497K8364K9835j3460k3040
$$ -16082 -21326 -6929 660 -8458 -19394 -32637 -55546 -64043 -35679 -5844 -19304 -42344
36195d2344L5160P3858K2428n0066m6339O634K0903o840j9174r169n281M374L7339
$$ -42344 -7184 66674 89102 39036 -7303 -669 20234 13394 -5780 -14949 -20230 -15856 21483
36182B1483N5036K5016n949J2432M1319K5219k356J6850N1401L3228k1356m5147
$$ 21483 76519 101535 95586 108018 149337 174556 172200 189050 240451 273679 252323 207176
36170B07176l4134l1468l6474k2957r246k0183k2082J5176M0260K46n2760l9305
$$ 207176 173042 141574 105100 82143 72897 52714 30632 45808 86068 86314 33554 -5751
36158e751J0552J0285l3644m3189j0119K828j5443j5158R242J1564j0953j2149
$$ -5751 4801 15086 -18558 -61747 -71866 -69038 -84481 -99639 -90397 -78833 -89786 -101935
36146a01935J3875K5859J5302J2914K1619J7900Q582J5507K2098M513j0711Q004
$$ -101935 -88060 -62201 -46899 -33985 -12366 5534 14116 29623 51721 56234 45523 53527
36134E3527K8308Q107j9498p71L7809L5495P190J0270L5941L4759J8340L0800
$$ 53527 81835 89942 70444 69673 107482 142977 150167 160437 196378 231137 249477 280277
36122B80277M8674J8719l1137l1778q92j3895o5071p8604m6707l3778m7537l1025
$$ 280277 328951 347670 316533 284755 283863 269968 204897 126293 79586 45808 -1729 -32754
36110c2754J3480J7390k4597l8431l173J6520n936j5728J2812K8596J925k6080
$$ -32754 -19274 -1884 -26481 -64912 -68085 -51565 -57501 -73229 -60417 -31821 -29896 -55976
36098e5976k6210k3785k8496r774K8288L3868n99j7139P318K2337k131k3546n137
$$ -55976 -82186 -105971 -134467 -144241 -115953 -82085 -82684 -99823 -92505 -70168 -72299 -95845 -100982
36085a00982K5374L1293J9228O793n490j0133M648J7647k407l4617l0451K365
$$ -100982 -75608 -44315 -25087 -18294 -23784 -33917 -29269 -11622 -14029 -48646 -79097 -76732
36073g6732J2164m979n802J0918K872k6021k5262N768J2855j1765j6604Q223J3020
$$ -76732 -64568 -69547 -75349 -64431 -61559 -87580 -112842 -107074 -94219 -105984 -122588 -114365 -101345
36060a01345j2417j8696M521P976j5596r268L9013O3915L4485K794L210j979l3724
$$ -101345 -113762 -132458 -127937 -119961 -135557 -144825 -105812 -41897 -7412 -4618 -1408 -3387 -37111
36047c7111m5953j3262J6515P919l268J4211K8496J1492o602J885J1832o67j5932
$$ -37111 -83064 -96326 -79811 -71892 -75160 -60949 -32453 -20961 -27563 -25678 -13846 -14513 -30445
36034c0445j8792k6086l5975j8117J7976J9343j6850k5978J5581M7601K8761j348
$$ -30445 -49237 -75323 -111298 -129415 -111439 -92096 -108946 -134924 -119343 -71742 -42981 -44329
36022d4329m288l904k0297k3151J646J5163J74l399K0599K8654M576l034K4776
$$ -44329 -48617 -52521 -72818 -95969 -94323 -79160 -78986 -82385 -61786 -33132 -28556 -31590 -6814
36009f814L5378O942j955L6322N3981M751m7757l8224r497k6245n6764l6933J0732
$$ -6814 28564 35506 33551 69873 123854 128605 80848 42624 33127 6882 -49882 -86815 -76083
35996g6083J8132j5014l5305k5150m660J8237L6724K6114q705j6572J7500L3743
$$ -76083 -57951 -72965 -108270 -133420 -138080 -119843 -83119 -57005 -65710 -82282 -64782 -31039
35984c1039l378l7213j4395K3801J9333m039m12Q257j1594k4276P418L5184L904
$$ -31039 -34417 -71630 -86025 -62224 -42891 -46930 -47342 -39085 -50679 -74955 -67537 -32353 -28449
35971b8449l9980k2592K6493K7530r123j1894J5930Q729l1750l7307J292K0999
$$ -28449 -68429 -91021 -64528 -36998 -46121 -58015 -42085 -33356 -65106 -102413 -101121 -80122
35959h0122K717l321J9878K4913q937l8985l6053k4053k2061j4456J673J366j7343
$$ -80122 -77405 -80726 -60848 -35935 -44872 -83857 -119910 -143963 -166024 -180480 -178807 -177441 -194784
35946a94784k3593j0352o684j8640j1904K6475N7265M4969Q289r345M283K2595
$$ -194784 -218377 -228729 -235413 -254053 -265957 -239482 -182217 -137248 -128959 -138304 -134021 -111426
35934a11426J6515j0728k3530L347M2747M1798l561l9394l4205k0474k8328l1208
$$ -111426 -94911 -105639 -129169 -125822 -83075 -41277 -44838 -84232 -118437 -138911 -167239 -198447
35922a98447j327K9664K0146j1183k1214j3588j5512j5663J2120M8078N0981K4490
$$ -198447 -199774 -170110 -149964 -161147 -182361 -195949 -211461 -227124 -215004 -166926 -115945 -91455
35910i1455L566n601j8447k6723j5252k941j2741k2599k113K4748J3237k4608
$$ -91455 -87889 -93490 -111937 -138660 -153912 -156853 -169594 -192193 -194306 -169558 -156321 -180929
35898a80929l6255q497K5154M3228M9032L9613J4639J333K0574M5290M0074J8698
$$ -180929 -217184 -225681 -200527 -157299 -108267 -68654 -54015 -52682 -32108 13182 53256 71954
35886G1954J2088Q476j6156l7404j8391J7688K0044m373q670P135O38l0719m4271
$$ 71954 84042 92518 76362 38958 20567 38255 58299 53926 45256 52391 53029 22310 -21961
35873b1961k6708p908j376P588J5978M590j6283j7679l517R77R76J6553L0772
$$ -21961 -48669 -56577 -57953 -50365 -34387 -29797 -46080 -63759 -67276 -66299 -65323 -48770 -17998
35860a7998J4720j0410k437K3753J8188j3902j9440P923J8144n289k1198q550
$$ -17998 -3278 -13688 -16125 7628 25816 11914 -7526 397 18541 13252 -7946 -16496
35848a6496K219p703j5695r675j0478k2723j7749J3578L8619L2975J2412M95J16
$$ -16496 -14277 -21980 -37675 -47350 -57828 -80551 -98300 -84722 -46103 -13128 -716 -221 -105
35835a05O184J3941J1783m549j6965j4035j7415m2505n8170l3322L387P464m132
$$ -105 6079 20020 31803 27254 10289 -3746 -21161 -63666 -121836 -155158 -151771 -144307 -148439
35822a48439J4422N0772N3788K4000O925O355j4519m8843m6368l897K4168J6157
$$ -148439 -134017 -83245 -29457 -5457 1468 7823 -6696 -55539 -101907 -105804 -81636 -65479
35810f5479Q194J6944J3152j0388j6946O033K2229J1573J45N770J0459L814M15
$$ -65479 -57285 -40341 -27189 -37577 -54523 -48490 -26261 -14688 -14543 -8773 1686 5500 5915
35797E915J792o554j4743o51J7245J577l0678k6824Q323J5110j7430l1988k611
$$ 5915 7707 1153 -13590 -14241 3004 4581 -26097 -52921 -44598 -29488 -46918 -78906 -81517
35784h1517K6476K3645J3695J3453l99k9855l4909o406R053j1420k9144j6020
$$ -81517 -55041 -31396 -17701 -4248 -4647 -34502 -69411 -75817 -66764 -78184 -107328 -123348
35772a23348K460P368K1113M7640M6055L689k7759j0364K3370L0353J7114L309
$$ -123348 -120888 -113520 -92407 -44767 1288 4977 -22782 -33146 -9776 20577 37691 41000
35760D1000j7661m2927m0067k427K6127J7687Q39J751l16k1846l3522j0802K1163
$$ 41000 23339 -19588 -59655 -62082 -35955 -18268 -17429 -15678 -15994 -37840 -71362 -82164 -61001
35747f1001L1203K7095K4627J6561J839j08R396Q90k6171l2122o026J1266k450
$$ -61001 -29798 -2703 21924 38485 40324 40216 49612 50502 24331 -7791 -13817 -2551 -5001
35734e001j7047j2144r381j5674j967L0401L2772n713k7745k230K3548J0240q620
$$ -5001 -22048 -34192 -43573 -59247 -61214 -30813 1959 -3754 -31499 -33729 -10181 59 -8561
35721h561K227J5449K295j0419k87J171k3970l1827L286L0494R995j1740J1760
$$ -8561 -6334 9115 11410 991 704 1875 -22095 -53922 -50636 -20142 -10147 -21887 -10127
35708a0127L5186J408m8609l9993J0114K6843J703j1808j074k103j8798j6849
$$ -10127 25059 26467 -22142 -62135 -52021 -25178 -23475 -35283 -36357 -38460 -57258 -74107
35696g4107P662K2600J7550J0631Q128N936J2527K5420J3175l1850n9037l1142
$$ -74107 -66445 -43845 -26295 -15664 -7536 -1600 10927 36347 49522 17672 -41365 -72507
35684g2507R873R072j1096K937L6995L5673Q35j5788n84J6132K7427N0215O9523
$$ -72507 -62634 -53562 -64658 -61721 -24726 10947 11782 -4006 -4590 11542 38969 89184 158707
35671A58707N2218R581j6688k2012l2843m6070l6250j1602j988k769R901K2535
$$ 158707 210925 220506 203818 181806 148963 102893 66643 55041 53053 50284 60185 82720
35659H2720N319k4658k6092o747p539k4456j6445J4809K4225L277q366L011M360
$$ 82720 88039 63381 37289 30542 23003 -1453 -17898 -3089 21136 24413 16047 19058 23418
35646B3418j9684m0023l4353j5729L21J3402J7843O489m117O684K2696J2554j3660
$$ 23418 3734 -36289 -70642 -86371 -86050 -72648 -54805 -48316 -52433 -45749 -23053 -10499 -24159
35633b4159j5812J2442L6937L6456J9417o499l7198n1551l1836K563K2033L2939
$$ -24159 -39971 -27529 9408 45864 65281 58782 21584 -29967 -61803 -59240 -37207 -4268
35621d268N3574O4819L8119m886j9001q406j3320l5158l7997j8442j0693k2644
$$ -4268 49306 114125 152244 147358 128357 119951 106631 71473 33476 15034 4341 -18303
35609a8303k6432j3312k282M482J9715K9097Q968j9308j4146J1384N545l0860
$$ -18303 -44735 -58047 -60329 -55847 -36132 -7035 1933 -17375 -31521 -20137 -14592 -45452
35597d5452l9416L92L8195L2453L304j4000j6379j4735j2525j5640k5532k0726
$$ -45452 -84868 -84476 -46281 -13828 -10524 -24524 -40903 -55638 -68163 -83803 -109335 -130061
35585a30061J3120M1809K3205j8787k2110J5548L4767J2809q657n826q988l3449
$$ -130061 -116941 -75132 -51927 -70714 -92824 -77276 -42509 -29700 -38357 -44183 -53171 -86620
35573h6620m2286r807L3324M8338L4730O267l0637n4037l2741K0796N1221L6402
$$ -86620 -128906 -138713 -105389 -57051 -22321 -16054 -46691 -100728 -133469 -112673 -61452 -25050
35561b5050J6175K3439L5456K1280o446j8075j1020j251J520o853k3579k8506
$$ -25050 -8875 14564 50020 71300 64854 46779 35759 34508 36028 29175 5596 -22910
35549b2910n485K3841K3798O74q486k81o125k7567k8367j21K1606J9807J8603
$$ -22910 -28395 -4554 19244 19918 11432 11151 5026 -22541 -50908 -51029 -29423 -9616 8987
35536H987K8742K6817O410n007J206j068j8052k0181K29J1103O19j230J7080K3757
$$ 8987 37729 64546 70956 65949 67155 66087 48035 27854 28083 39186 39805 38575 55655 79412
35522G9412L253j5739j6357k0312l3165k3698J1901K6425j690k6790j0577J7713
$$ 79412 82665 66926 50569 30257 -2908 -26606 -14705 11720 10030 -16760 -27337 -9624
35510i624J8246N025P784J7353J4898J2477K0317J5586j2290k5817N812N2576
$$ -9624 8622 13647 21431 38784 53682 66159 86476 102062 89772 63955 69767 122343
35498A22343O7314M9498K5927L922j5881j5905P016J9021k168k7665k3871m996
$$ 122343 189657 239155 265082 269004 253123 237218 244234 263255 261087 233422 209551 204555
35486B04555o92m866K597J3587J0720J056m062j3823l0547l0203k812K1940K1107
$$ 204555 203863 198997 201594 215181 225901 226957 222895 209072 178525 148322 145510 167450 188557
35473A88557J3130J4647O760j8438k4917P753L6104J5468k8452m3907l1873k4348
$$ 188557 201687 216334 223094 204656 179739 187492 223596 239064 210612 166705 134832 110484
35461A10484j8337P241L5080L1112M014j1992j5799k8003l9134k3608Q483K4727
$$ 110484 92147 99388 134468 165580 169594 157602 141803 113800 74666 51058 59541 84268
35449H4268K3121K4016K4323Q598q285P0K0621J7186j1006l2696l7372l9661m0051
$$ 84268 107389 131405 155728 164326 156041 156111 176732 193918 182912 150216 112844 73183 33132
35436C3132k6207o891k357p627m019L282j201n920P821K1891N141k8274l3780
$$ 33132 6925 34 -2323 -9950 -13969 -10687 -11888 -17808 -9987 11904 17045 -11229 -45009
35423d5009n360J8110J4619J898k774l367k910J701J565j2417k2389n202K2849
$$ -45009 -50369 -32259 -17640 -15742 -18516 -21883 -24793 -23092 -21527 -33944 -56333 -61535 -38686
35410c8686K3281m077j9667n595J2572J1707P19n415p805q998l729N819P518j938
$$ -38686 -15405 -19482 -39149 -44744 -32172 -20465 -19746 -25161 -32966 -41964 -45693 -39874 -32356 -34294
35396c4294j3640k1744k4587j6105L975J9501J8532J3824K0137K6107J5986L019
$$ -34294 -47934 -69678 -94265 -110370 -106395 -86894 -68362 -54538 -34401 -8294 7692 10711
35384A0711P821J7969O150k2161l7307l3165k7608k2703n322J6227J7147k035
$$ 10711 18532 36501 42651 20490 -16817 -49982 -77590 -100293 -105615 -89388 -72241 -74276
35372g4276j6005j6312j5615j2722N972K9403K8154K925j3174o968J49k489K632
$$ -74276 -90281 -106593 -122208 -134930 -128958 -99555 -71401 -68476 -81650 -88618 -88469 -90958 -88326
35359h8326J9147J8294j5300n1649n3715k4215O974K3057K8686L2373L7355M2064
$$ -88326 -69179 -50885 -66185 -117834 -171549 -195764 -188790 -165733 -137047 -104674 -67319 -25255
35347b5255M0516K8685J2110j129j0956j7302j1190P995J7866J219k0559j3739
$$ -25255 15261 43946 56056 54927 43971 26669 15479 23474 41340 42559 22000 8261
35335H261J3504J8831j0699l9096l3978n980J5982K0140R461j0147k4726j7304
$$ 8261 21765 40596 29897 -9199 -43177 -49157 -33175 -13035 -3574 -13721 -38447 -55751
35323e5751Q172K5894K0803M201r416j8951k2168r086J7427L5385L1004J4347
$$ -55751 -47579 -21685 -882 3319 -6097 -25048 -47216 -56302 -38875 -3490 27514 41861
35311D1861j524j6117k6811k2852p198L39k919P721M0399O0994L9807n65j8092
$$ 41861 40337 24220 -2591 -25443 -32641 -32302 -35221 -27500 12899 73893 113700 113135 95043
35298I5043j1299p289p366P302K4261Q914k9909l8880k030K8596J0752k8205m3303
$$ 95043 83744 76455 69089 76391 100652 109566 79657 40777 38747 67343 78095 49890 6587
35285F587l7231l1451j6188J8691M1315K5107M769K1880M8643L8463J7882M0764
$$ 6587 -30644 -62095 -78283 -59592 -18277 6830 11599 33479 82122 120585 138467 179231
35273A79231Q1460P7025N2084Q1933J46482J58581J31955J61761K33320K39479
$$ 179231 260691 337716 389800 471733 618215 776796 908751 1070512 1303832 1543311
35263A543311K09797K92704M62469N37975O00427J002885J676769J814391P67811
$$ 1543311 1753108 2045812 2508281 3046256 3646683 4649568 6326337 8140728 8908539
35254H908539r12963j923418j700005r38626n26370n25658m96517l17628k10160
$$ 8908539 7995576 6072158 4372153 3433527 2907157 2381499 1884982 1567354 1357194
35245A357194k26107j98585j03001p9265j29645j12588k3428m311p4844j01166
$$ 1357194 1131087 932502 829501 750236 620591 508003 484575 480264 405420 304254
35235C04254m3939j1124m4480n9789k5259j1144l4175k6108J7090J8671k3823
$$ 304254 260315 249191 204711 144922 119663 108519 74344 48236 65326 83997 60174
35224F0174k6445J7531K0863k8917m4496q325l936m3995l3641M5847Q0068J3083
$$ 60174 33729 51260 72123 43206 -1290 -9615 -13551 -57546 -91187 -45340 34728 47811
35212D7811n5196l8136Q686Q151j3551p216L802q797j1047J7407K8568m941l1660
$$ 47811 -7385 -45521 -36835 -28684 -42235 -49451 -45649 -54446 -65493 -48086 -19518 -24459 -56119
35199e6119j3595Q970K239m23J9685J5804l0953n7359k3138J5936P123j1491P123
$$ -56119 -69714 -60744 -58505 -58928 -39243 -23439 -54392 -111751 -134889 -118953 -111830 -123321 -116198
35186a16198L0136J3278j4132p376J4317J5948J3923L0346L8975J7378m864m713
$$ -116198 -86062 -72784 -86916 -94292 -79975 -64027 -50104 -19758 19217 36595 31731 27018
35174B7018j0214l4286l3422J0231L7195M894l5902k6473M878M816j0797o13J9279
$$ 27018 16804 -17482 -50904 -40673 -3478 1416 -34486 -60959 -56081 -51265 -62062 -62675 -43396
35161d3396J2113o518l551N843o937k3820j5528K141K239m065j294o710k6796
$$ -43396 -31283 -37801 -41352 -35509 -42446 -66266 -81794 -79653 -77414 -81479 -82773 -89483 -116279
35148a16279k8165J462J9612L342n868J7761K8986m273l2879j1170J9488P514
$$ -116279 -144444 -142982 -123370 -120028 -125896 -108135 -79149 -83422 -116301 -127471 -107983 -100469
35136a00469j4425N321L7366K5338j0370j2800Q874M864k0364k2537o40R901M008
$$ -100469 -114894 -109573 -72207 -46869 -57239 -70039 -61165 -56301 -76665 -99202 -99842 -89941 -85933
35123h5933J849K671l20P574K5419J7667j7529k1246K5700M6386j2039p4911n0834
$$ -85933 -84084 -81413 -81733 -74159 -48740 -31073 -48602 -69848 -44148 2238 -9801 -84712 -135546
35110a35546J9832L5072m153j6014J4975L3106K9443M5721P0663M5678k3433o2392
$$ -135546 -115714 -80642 -84795 -100809 -85834 -52728 -23285 22436 93099 138777 115344 52952
35098E2952m4037j7614j5250j3891k99L711o957r591j479j660p002p19O102m016
$$ 52952 8915 -8699 -23949 -37840 -38139 -34428 -41385 -50976 -52455 -54115 -61117 -61836 -55734 -59750
35084e9750j0761Q799K5950M789k7202k2062M988Q772q12J1813K5397j314l7914
$$ -59750 -70511 -61712 -35762 -30973 -58175 -80237 -75249 -66477 -67289 -55476 -30079 -31393 -69307
35071f9307k4167J7814J4454l0925m5012j3134M771j1126j4042J0955K1229M872
$$ -69307 -93474 -75660 -61206 -92131 -137143 -150277 -145506 -156632 -170674 -159719 -138490 -133618
35059a33618J324J6923J0121k0435k1526J9181M7594L5876J9335J7886J935l5331
$$ -133618 -132294 -115371 -105250 -125685 -147211 -128030 -80436 -44560 -25225 -7339 -5404 -40735
35047d0735m8626j6631J8638J8813j735j5730j7488l456K6667M2178J2894l0023
$$ -40735 -89361 -105992 -87354 -68541 -70276 -86006 -103494 -106950 -80283 -38105 -25211 -55234
35035e5234k8479R559K3072J317o804J0542R376j9563k8466r73J8755Q139l12
$$ -55234 -83713 -74154 -51082 -49765 -56569 -46027 -36651 -56214 -84680 -85653 -66898 -58759 -59071
35022e9071R963J0918n519q332O412L918j6868j5321R567J0356j8582k6417j692
$$ -59071 -49108 -38190 -43709 -52041 -45629 -41711 -58579 -73900 -64333 -53977 -72559 -98976 -100668
35009a00668N978j5535j3910K4170L7889J695k3664J014K3763k909l8777l1480
$$ -100668 -94690 -110225 -124135 -99965 -62076 -60381 -84045 -83031 -59268 -62177 -100954 -132434
34997a32434l328J720m771O127J9496J1406j748K405J2562J6774K6673L7405J9882
$$ -132434 -135762 -134042 -138813 -132686 -113190 -101784 -103532 -101127 -88565 -71791 -45118 -7713 12169
34984A2169j7388k3436O881J2366k8870n1729j1090M0156L8238L633j2991j5183
$$ 12169 -5219 -28655 -21774 -9408 -38278 -90007 -101097 -60941 -22703 -19070 -32061 -47244
34972d7244k5799k5704N892L8386L7213J9344J0163m259l1254l4392K832L1892
$$ -47244 -73043 -98747 -92855 -54469 -17256 2088 12251 7992 -23262 -57654 -54822 -22930
34960b2930J4301j4568j3745p856k6485l4473K963M1360K4385j6644j4220K2010
$$ -22930 -8629 -23197 -36942 -44798 -71283 -105756 -102793 -61433 -37048 -53692 -67912 -45902
34948d5902K7934n882k8839j7547L209J4973J9863J2837p298j5487L854K1296
$$ -45902 -17968 -23850 -52689 -70236 -67027 -52054 -32191 -19354 -26652 -42139 -38285 -16989
34936a6989P608j5230j5865j1495k9322m4710j9817K3523L2681N718j5061j3983
$$ -16989 -9381 -24611 -40476 -51971 -81293 -126003 -145820 -122297 -89616 -83898 -98959 -112942
34924a12942j0991j4184j3749j0654r399R02K1802K7767R960M345L3711N8714
$$ -112942 -123933 -138117 -151866 -162520 -171919 -171017 -149215 -121448 -111488 -107143 -73432 -14718
34912a4718L6364q301k3646j2147j2122k6398k7766j4558o176j057J2630K3552
$$ -14718 21646 13345 -10301 -22448 -34570 -60968 -88734 -103292 -109468 -110525 -97895 -74343
34900g4343J8010J1040J6285J3763j1221l0873k0243k595l776l367J7713K6632
$$ -74343 -56333 -45293 -29008 -15245 -26466 -57339 -77582 -80177 -83953 -87320 -69607 -42975
34888d2975m539l5706j9400J5403J1865j7853k0167M622J2886J979O779K6024
$$ -42975 -47514 -83220 -102620 -87217 -75352 -93205 -113372 -108750 -95864 -93885 -87106 -61082
34876f1082K4635O24j4962j5007j4800q716J3996K8935J0392j5789j1873M842
$$ -61082 -36447 -35823 -50785 -65792 -80592 -89308 -75312 -46377 -35985 -51774 -63647 -58805
34864e8805l149k0939j2135O555l220k1789l668L2896L3097M584J289K1165J2463
$$ -58805 -61954 -82893 -95028 -88473 -91693 -113482 -117150 -84254 -51157 -46573 -45284 -24119 -11656
34851a1656k2503k4656J4419L3560N785k3468k1707j4084j9062j2338J6593L5065
$$ -11656 -34159 -58815 -44396 -10836 -5051 -28519 -50226 -64310 -83372 -95710 -79117 -44052
34839d4052K2333J213o130m977K698K4465M2012K2411k3858m7945l4810j7631
$$ -44052 -21719 -20506 -26636 -31613 -28915 -4450 37562 59973 36115 -11830 -46640 -64271
34827f4271j3133n40K2760K3419r602l9527l5709j0958J0774K4307K8304J8238
$$ -64271 -77404 -77944 -55184 -31765 -41367 -80894 -116603 -127561 -116787 -92480 -64176 -45938
34815d5938M733N319J3435P666j0665k2699k6176k7731j5738J6143L5414J0597
$$ -45938 -41205 -35886 -22451 -14785 -25450 -48149 -74325 -102056 -117794 -101651 -66237 -55640
34803e5640l1100l8851j4787P77K663J6026L3216K3826j714p236j036k0023n0691
$$ -55640 -86740 -125591 -140378 -139601 -136938 -120912 -87696 -63870 -65584 -72820 -73856 -93879 -144570
34790a44570m1537O500L7603L1972K4613K8508J5154j7722l2045j6835l293k776
$$ -144570 -186107 -179607 -142004 -110032 -85419 -56911 -41757 -59479 -91524 -108359 -111652 -114428
34778a14428M486J3169m134l1080j8483K8864M9624K1974j0000j6709j5900j4557
$$ -114428 -109942 -96773 -100907 -131987 -150470 -121606 -71982 -50008 -60008 -76717 -92617 -107174
34766a07174M458K4759N204l7746l7816J1918M0834J5184j3426l426J5086R586
$$ -107174 -102716 -77957 -72753 -110499 -148315 -136397 -95563 -80379 -93805 -97231 -82145 -72559
34754g2559p03K057l311k5482l5661k3916j6914j7257M884L9545L4268j2832l8893
$$ -72559 -73262 -71205 -74516 -99998 -135659 -159575 -176489 -193746 -188862 -149317 -115049 -127881 -166774
34741a66774k0658o979j9080j1818K9124M8026K2886J2101M4094N6551R100l6064
$$ -166774 -187432 -194411 -213491 -225309 -196185 -148159 -125273 -113172 -69078 -12527 -3427 -39491
34729c9491j8641J9999J8707j053L788Q113k3026n0608k5439J8287J9802n909
$$ -39491 -58132 -38133 -19426 -20479 -16691 -8578 -31604 -82212 -107651 -89364 -69562 -75471
34717g5471p037P586n001l3358l1151J917L0160M5560N6448M4087l658m5210l6021
$$ -75471 -82508 -74922 -79923 -113281 -144432 -142515 -112355 -66795 -10347 33740 30082 -15128 -51149
34704e1149R72J4107J332p398j1295k2275k1651N399K5148O324j7773q88L5635
$$ -51149 -50177 -36070 -34738 -42136 -53431 -75706 -97357 -91958 -66810 -60486 -78259 -79147 -43512
34691d3512L9516J4384K294N592n396k6395k6862r722m244j1100p352O270J0458
$$ -43512 -3996 10388 12682 18274 12878 -13517 -40379 -50101 -54345 -65445 -72797 -66527 -56069
34678e6069O161P382J1983J3707J8981K2336Q04l6123l7730Q767M3585K4626o100
$$ -56069 -49908 -42526 -30543 -16836 2145 24481 25285 -10838 -48568 -39801 3784 28410 22310
34665B2310j312R070j5876l8962o548M7315M8414O60l1078l0174l3342m5468l4440
$$ 22310 20998 30068 14192 -24770 -31318 15997 64411 65071 33993 3819 -29523 -74991 -109431
34652a09431j512J9351K4609L5533M1551J6554k0846k9368j4604j2875k1772j2344
$$ -109431 -110943 -91592 -66983 -31450 10101 26655 5809 -23559 -38163 -51038 -72810 -85154
34640h5154N931P96j6022o075K2636K6033j291k3444k4715j5564O492M1920N4709
$$ -85154 -79223 -78427 -94449 -100524 -77888 -51855 -53146 -76590 -101305 -116869 -110377 -68457 -13748
34627a3748J6568l4017m1443j8655j4390k0740O521N4028O2593K5740l956m030
$$ -13748 2820 -31197 -72640 -91295 -105685 -126425 -119904 -65876 -3283 22457 18501 14471
34615A4471j963q509m979M194l687j5544j482K0200Q254k1491j8526Q394K397
$$ 14471 12508 3999 -980 3214 -473 -16017 -17499 2701 10955 -10536 -29062 -20668 -18271
34602a8271l8415n3549k1409J2680J8490J4439R848j1218l7266l1772Q72J8263
$$ -18271 -56686 -110235 -131644 -118964 -100474 -86035 -76187 -87405 -124671 -156443 -155571 -137308
34590a37308J3717J9199L4145K5087j907n551J0538J337l1301l6033m891J5368
$$ -137308 -123591 -104392 -70247 -45160 -47067 -52618 -42080 -40743 -72044 -108077 -112968 -97600
34578i7600J3415K6888N4065M4869q15k0250Q52p74m9726q0810m8488l3J0899
$$ -97600 -84185 -57297 -3232 41637 40822 20572 21424 20650 -29076 -109886 -158374 -158407 -147508
34565a47508L435Q922O612k0872l3555K528N0190N4990K0211j7213m0378m1584
$$ -147508 -144073 -135151 -128539 -149411 -182966 -180438 -130248 -75258 -55047 -72260 -112638 -154222
34553a54222o626M7365O4176K0848l2855m3540k1271m832l558p165j2464j0740
$$ -154222 -160848 -113483 -49307 -28459 -61314 -104854 -126125 -130957 -134515 -141680 -154144 -164884
34541a64884J1096L4601K1750j7930k7913N684K8282R623o106J6558L8067J3394
$$ -164884 -153788 -119187 -97437 -115367 -143280 -137596 -109314 -99691 -105797 -89239 -51172 -37778
34529c7778k9333l7106j2973O125J2737J7640J0884j4711l1004j3153J4345J2467
$$ -37778 -67111 -104217 -117190 -111065 -98328 -80688 -69804 -84515 -115519 -128672 -114327 -101860
34517a01860j3954k9389j8585N703K5296K4660O54k0339o417K6725K7645j1823
$$ -101860 -115814 -145203 -163788 -158085 -132789 -108129 -107475 -127814 -134231 -107506 -79861 -91684
34505i1684l8087j7191J6488K0610M707k344J90L021J2353K6983K6623P684o105
$$ -91684 -129771 -146962 -130474 -109864 -105157 -107501 -107311 -104290 -91937 -64954 -38331 -30647 -36752
34492c6752n622o587p039J2347L4496J6803k7745l3140J1643L6179M750k4849
$$ -36752 -42374 -48961 -56000 -43653 -9157 7646 -20099 -53239 -41596 -5417 -667 -25516
34480b5516o450J4048j3742n2661m6890j7895j3536j7228J0111M3454L2677o109
$$ -25516 -31966 -17918 -31660 -84321 -131211 -149106 -162642 -179870 -169759 -126305 -93628 -99737
34468i9737j8099j833J841r351l238J6645J4553j1224k6073j8003o413K158J9036
$$ -99737 -117836 -119669 -117828 -127179 -130417 -113772 -99219 -110443 -136516 -154519 -160932 -158774 -139738
34455a39738L8145L7005J1432j9742l7325l0079J177L1500L1066J0278Q205K3788
$$ -139738 -101593 -64588 -53156 -72898 -110223 -140302 -139125 -107625 -76559 -66281 -58076 -34288
34443c4288J2084l0623m4468m854K6314k17l7941k4887J3995J9327R36P820L3366
$$ -34288 -22204 -52827 -97295 -102149 -75835 -76052 -113993 -138880 -124885 -105558 -104622 -96802 -63436
34430f3436L2344N186j1126j4377k7776l9146j8543J9301L3566K2500J2529L634
$$ -63436 -31092 -25906 -37032 -51409 -79185 -118331 -136874 -117573 -84007 -61507 -48978 -45344
34418d5344j6049k5943n177J5693q23k7966j5568K2040L0927R675P24N743j0490
$$ -45344 -61393 -87336 -92513 -76820 -77643 -105609 -121177 -99137 -68210 -58535 -57811 -52068 -62558
34405f2558l8921k9525J9846N0879L1712o197k7548l2181k5885n604J6096J7425
$$ -62558 -101479 -131004 -111158 -60279 -28567 -34764 -62312 -94493 -120378 -125982 -109886 -92461
34393i2461M385J723Q884N581n312l422Q263J0650O262P498L145j7233k5399N362
$$ -92461 -88076 -86353 -77469 -71888 -77200 -80622 -72359 -61709 -55447 -47949 -44804 -62037 -87436 -82074
34379h2074M0798K6962k2469m3610j9458M632M06j1609j3794j5431j6928l120
$$ -82074 -41276 -14314 -36783 -80393 -99851 -95219 -94813 -106422 -120216 -135647 -152575 -155695
34367a55695J8816K1389K957j0583j1227j3224j4422J144K3557K5915J2479J2873
$$ -155695 -136879 -115490 -112533 -123116 -134343 -147567 -161989 -160845 -137288 -111373 -98894 -86021
34355h6021K8514K9517O642j5674k0362j4540o261J440j151j4933j6097R079K9675
$$ -86021 -57507 -27990 -21348 -37022 -57384 -71924 -78185 -76745 -77896 -92829 -108926 -99847 -70172
34342g0172J1057k6152l3549p636J2266Q405k35q22j033l670k835m18N61N866
$$ -70172 -59115 -85267 -118816 -126452 -114186 -105781 -106016 -106838 -107871 -111541 -114376 -114794 -114233 -108367
34328a08367J1884K953j2247j189K9373K4134k8248n5380r219M9475M5346O638
$$ -108367 -96483 -93530 -105777 -106966 -77593 -53459 -81707 -137087 -146306 -96831 -51485 -44847
34316d4847M435K7900J8129j5029j5073J0511O710k0260j4377K1708L2200J6216
$$ -44847 -40412 -12512 5617 -9412 -24485 -13974 -7264 -27524 -41901 -20193 12007 28223
34304B8223K8035O8766P8853M7599L3742O1014Q0927N7604J1601l4090p7949j01660
$$ 28223 56258 125024 203877 251476 285218 346232 427159 484763 496364 462274 384325 282665
34292B82665q0608l7751j8049j4072R043K8503o813p0640q1246l0223R184P722
$$ 282665 202057 164306 146257 132185 141228 169731 162918 92278 11032 -19191 -10007 -2285
34280b285J1780L6733L3221j3873m8267l5282q068N418K0262L5573J8605k6170
$$ -2285 9495 46228 79449 65576 17309 -17973 -26041 -20623 -361 35212 53817 27647
34268B7647m7364k9135j2626j8712k0915q449m204r543j136J3911J0492O299L2364
$$ 27647 -19717 -48852 -61478 -80190 -101105 -109554 -113758 -123301 -124437 -110526 -100034 -93735 -61371
34255f1371N7291K9465k2034k8042k274j2570m6741l2995J5056J1006m4270n6979
$$ -61371 -4080 25385 3351 -24691 -26965 -39535 -86276 -119271 -104215 -93209 -137479 -194458
34243a94458p692J9981j158j054L8105L9903j6217m5971j0961J7577l530j9955
$$ -194458 -202150 -182169 -183327 -184381 -146276 -106373 -122590 -168561 -179522 -161945 -165475 -185430
34231a85430J403J3791o34P469L8851K3938l9040o0268j6114R017j9927l4915
$$ -185430 -184027 -170236 -170870 -163401 -124550 -100612 -139652 -199920 -216034 -207017 -226944 -261859
34219b61859q719l15j7685M763N6551N1014O589L8159J34807J57369R5124Q9943
$$ -261859 -270578 -270893 -288578 -283815 -227264 -176250 -169661 -131502 3305 160674 255798 345741
34207C45741J58688J54875O9938Q2008K18108K81044K20144K33854L75280M39587
$$ 345741 504429 659304 729242 811250 1029358 1310402 1530546 1764400 2139680 2579267
$$ [...]
##END NTUPLES=NMR SPECTRUM
##END=
