##TITLE=31Pdec_DE-66
 CDCl3, 24 sc
 1.10.2024
##JCAMPDX= 6.0         $$ Bruker NMR JCAMP-DX V2.0
##DATA TYPE= NMR SPECTRUM
##DATA CLASS= NTUPLES
##ORIGIN= UXNMR, Bruker Analytische Messtechnik GmbH
##OWNER= root
$$ XWIN-NMR		Version 3.5
$$ Tue Oct  1 16:43:47 2024 Russian Standard Time (UT+4h)  she@DPX200
##.OBSERVE FREQUENCY= 81.013821
##.OBSERVE NUCLEUS= ^31P
##.ACQUISITION MODE= SIMULTANEOUS
##.ACQUISITION SCHEME= undefined
##.AVERAGES= 24
##.DIGITISER RES= 17
##SPECTROMETER/DATA SYSTEM= spect
##.PULSE SEQUENCE= zgpg30
##.SOLVENT NAME= CDCl3
##.SHIFT REFERENCE= (INTERNAL, CDCl3, 0, 198.062)
##AUDIT TRAIL= $$ (NUMBER, WHEN, WHO, WHERE, WHAT)
$$ ##TITLE= Audit trail, XWIN-NMR		Version 3.5
$$ ##JCAMPDX= 5.01
$$ ##ORIGIN= Bruker BioSpin GmbH
$$ ##OWNER= she
$$ F:/spectra/data/she/nmr/P31/2/pdata/1/auditp.txt
$$ ##AUDIT TRAIL=  $$ (NUMBER, WHEN, WHO, WHERE, WHAT)
(   1,<2024-10-01 16:42:52.42 +0400>,<she>,<DPX200>,
      <created by zg, POWCHK disabled, PULCHK disabled
       configuration hash MD5:
       00 E9 B6 7A A2 85 ED C7 34 08 36 98 17 FE 4E 26
       data hash MD5: 32K
       CE C5 D2 4E D7 D2 22 A9 F7 5A 15 6D 1A 68 CF 8C>)
(   2,<2024-10-01 16:42:55.18 +0400>,<she>,<DPX200>,
      <Start of raw data processing
       efp BC_mod = 2 LB = 1.5 FT_mod = 6 PKNL = 1 PHC0 = 2725.865 PHC1 = 29.08746 SI = 64K 
       data hash MD5: 64K
       7F E6 10 7D 49 61 43 18 F8 D8 3E 46 75 93 26 41>)
(   3,<2024-10-01 16:43:12.46 +0400>,<she>,<DPX200>,
      <pk PHC0 = -32.38957 PHC1 = 78.79999 
       data hash MD5: 64K
       93 6C 2D E6 50 53 2C E0 94 11 9E A7 12 49 4C 87>)
$$ ##END=
$$ 
$$ hash MD5
$$ 99 B9 AF 35 96 68 99 AB 60 53 CC 80 C9 C7 82 87
##$RELAX= 
##$RELAX= 
##$RELAX= 
##$RELAX= 
##$RELAX= 
##$RELAX= 
##$RELAX= 
##$RELAX= 
$$ Bruker specific parameters
$$ --------------------------
##$DU= <F:/spectra>
##$EXPNO= 2
##$NAME= <P31>
##$PROCNO= 1
##$TYPE= <nmr>
##$USER= <she>
##$AMP= (0..31)
100 100 100 100 100 100 100 100 100 100 100 100 100 100 100 100 100 100 
100 100 100 100 100 100 100 100 100 100 100 100 100 100 
##$AQSEQ= 0
##$AQ_mod= 1
##$AUNM= <au_zg>
##$AUTOPOS= <>
##$BF1= 81.014009
##$BF2= 200.13
##$BF3= 200.13
##$BF4= 200.13
##$BF5= 200.13
##$BF6= 200.13
##$BF7= 200.13
##$BF8= 200.13
##$BYTORDA= 1
##$CFDGTYP= 0
##$CFRGTYP= 5
##$CHEMSTR= <none>
##$CNST= (0..31)
1 1 145 1 1 1 1 1 1 1 1 1 1 1 1 1 1 1 1 1 1 1 1 1 1 1 1 1 1 1 1 1 
##$CPDPRG= <waltz16>
##$CPDPRG1= <>
##$CPDPRG2= <waltz16>
##$CPDPRG3= <>
##$CPDPRG4= <mlev>
##$CPDPRG5= <mlev>
##$CPDPRG6= <mlev>
##$CPDPRG7= <mlev>
##$CPDPRG8= <mlev>
##$CPDPRGB= <>
##$CPDPRGT= <>
##$D= (0..31)
0 1 0 0 0 0 0 0 0 0.06 0 0.03 2e-05 3e-06 0 0 0.0002 0 0 0 0 0 0 0 0 0 
0 0 0 0 0 0 
##$DATE= 1727786572
##$DBL= (0..7)
120 120 120 11 120 120 24 19 
##$DBP= (0..7)
150 150 150 150 150 150 150 150 
##$DBP07= 0
##$DBPNAM0= <>
##$DBPNAM1= <>
##$DBPNAM2= <>
##$DBPNAM3= <>
##$DBPNAM4= <>
##$DBPNAM5= <>
##$DBPNAM6= <>
##$DBPNAM7= <>
##$DBPOAL= (0..7)
0.5 0.5 0.5 0.5 0.5 0.5 0.5 0.5 
##$DBPOFFS= (0..7)
$$ [...]
##$SUBNAM2= <"">
##$SUBNAM3= <"">
##$SUBNAM4= <"">
##$SUBNAM5= <"">
##$SUBNAM6= <"">
##$SUBNAM7= <"">
##$SUBNAM8= <"">
##$SUBNAM9= <"">
##$SW= 400.765351723535
##$SWIBOX= (0..15)
0 1 3 0 0 0 0 0 0 0 0 0 0 0 0 0 
##$SW_h= 32467.5324675325
##$TD= 32768
##$TD0= 1
##$TE= 0
##$TE2= 300
##$TE3= 300
##$TEG= 300
##$TL= (0..7)
0 120 53 12 22 120 120 120 
##$TP= (0..7)
150 150 150 150 150 150 150 150 
##$TP07= 0
##$TPNAME0= <>
##$TPNAME1= <>
##$TPNAME2= <>
##$TPNAME3= <>
##$TPNAME4= <>
##$TPNAME5= <>
##$TPNAME6= <>
##$TPNAME7= <>
##$TPOAL= (0..7)
0.5 0.5 0.5 0.5 0.5 0.5 0.5 0.5 
##$TPOFFS= (0..7)
0 0 0 0 0 0 0 0 
##$TUNHIN= 0
##$TUNHOUT= 0
##$TUNXOUT= 0
##$USERA1= <user>
##$USERA2= <user>
##$USERA3= <user>
##$USERA4= <user>
##$USERA5= <user>
##$V9= 5
##$VALIST= <valist>
##$VCLIST= <CCCCCCCCCCCCCCC>
##$VD= 0
##$VDLIST= <DDDDDDDDDDDDDDD>
##$VPLIST= <PPPPPPPPPPPPPPP>
##$VTLIST= <TTTTTTTTTTTTTTT>
##$WBST= 1024
##$WBSW= 4
##$XGAIN= (0..3)
0 0 0 0 
##$XL= 0
##$YL= 0
##$YMAX_a= 84030
##$YMIN_a= -70854
##$ZGOPTNS= <>
##$ZL1= 120
##$ZL2= 120
##$ZL3= 120
##$ZL4= 120
##$ABSF1= 0
##$ABSF2= 0
##$ABSG= 0
##$ABSL= 0
##$ALPHA= 0
##$AQORDER= 0
##$ASSFAC= 0
##$ASSFACI= 0
##$ASSFACX= 0
##$ASSWID= 0
##$AUNMP= <proc_1d>
##$AZFE= 0.1
##$AZFW= 0.5
##$BCFW= 0
##$BC_mod= 2
##$BYTORDP= 0
##$COROFFS= 0
##$CY= -3
##$DATMOD= 1
##$DC= 0
##$DFILT= <>
##$DTYPP= 0
##$F1P= 0
##$F2P= 0
##$FCOR= 1
##$FTSIZE= 65536
##$FT_mod= 6
##$GAMMA= 0
##$GB= 0
##$INTBC= 1
##$INTSCL= 9.790993e-09
##$ISEN= 30
##$LB= 1.5
##$LEV0= 0
##$LPBIN= 0
##$MAXI= 10000
##$MC2= 0
##$MEAN= 0
##$ME_mod= 0
##$MI= 50
##$NCOEF= 0
##$NC_proc= -2
##$NLEV= 6
##$NOISF1= 182.463
##$NOISF2= 159.3651
##$NSP= 0
##$NTH_PI= 0
##$NZP= 0
##$OFFSET= 198.0616
##$PC= 4
##$PHC0= 2693.475
##$PHC1= 107.8875
##$PH_mod= 1
##$PKNL= yes
##$PPARMOD= 0
##$PSCAL= 0
##$PSIGN= 0
##$REVERSE= no
##$SF= 81.0140089999434
##$SI= 65536
##$SIGF1= 159.3651
##$SIGF2= -187.1042
##$SINO= 113.3802
##$SIOLD= 16384
##$SREGLST= <1H.CDCl3>
##$SSB= 0
##$STSI= 65536
##$STSR= 0
##$SW_p= 32467.5324675325
##$SYMM= 0
##$S_DEV= 0
##$TDeff= 32768
##$TDoff= 0
##$TI= <>
##$TILT= no
##$TM1= 0
##$TM2= 0
##$TOPLEV= 0
##$USERP1= <user>
##$USERP2= <user>
##$USERP3= <user>
##$USERP4= <user>
##$USERP5= <user>
##$WDW= 1
##$XDIM= 65536
##$YMAX_p= 337058308
##$YMIN_p= -1545866
$$ End of Bruker specific parameters
$$ ---------------------------------
##NTUPLES= NMR SPECTRUM
##VAR_NAME=  FREQUENCY,     SPECTRUM/REAL,   SPECTRUM/IMAG
##SYMBOL=    X,             R,               I
##VAR_TYPE=  INDEPENDENT,   DEPENDENT,       DEPENDENT
##VAR_FORM=  AFFN,          ASDF,            ASDF
##VAR_DIM=   65536,         65536,           65536
##UNITS=     HZ,            ARBITRARY UNITS, ARBITRARY UNITS
##FACTOR=    0.49542278885378, 1,            1
##FIRST=     16045.7642231865, 0,            0
##LAST=      -16421.768244346, 0,            0
##MIN=       -16421.768244346, -1545866,     0
##MAX=       16045.7642231865, 337058308,    0
$$ Real data points
##PAGE= N=1
##DATA TABLE= (X++(R..R)), XYDATA
$$ [...]
41399d6688j4177J0427L7075M4159K0347j3929l2757l5381l0474j3785J2542K3016
$$ -46688 -60865 -50438 -13363 30796 51143 37214 4457 -30924 -61398 -75183 -62641 -39625
41387c9625L542j6980l959K9780M2179K0691r977k8543l3738k7948j3923k680
$$ -39625 -36083 -53063 -57022 -27242 14937 35628 25651 -2892 -36630 -64578 -78501 -81181
41375h1181o67L426J8545L0925K5763J2998P545K749r014j0838R842K6827Q893
$$ -81181 -81848 -78422 -59877 -28952 -3189 9809 17354 20103 11089 251 10093 36920 45813
41362D5813k7498m0440k5530j3601j4422q128R960K0341J7042J3914J1762r86
$$ 45813 18315 -22125 -47655 -61256 -75678 -83806 -73846 -53505 -36463 -22549 -10787 -11773
41350a1773j3722k490K2652K3860k113j3273J0853L5560K5682m977k4398k8622
$$ -11773 -25495 -27985 -5333 18527 16414 3141 13994 49554 75236 70259 45861 17239
41338A7239k8816k0701J486K0856J8237L722J682J3741J9827R539q010k2240l1453
$$ 17239 -11577 -32278 -30792 -9936 8301 12023 13705 27446 47273 56812 48802 26562 -4891
41325d891l5647l2496k2960j2977o572OJ3899L2301L6677J1985k5945l9618j6667
$$ -4891 -40538 -73034 -95994 -108971 -115543 -115537 -101638 -69337 -32660 -20675 -46620 -86238 -102905
41312a02905J1742J5416N900P922J3102n47j9380j0698J7444K2306m106k1265
$$ -102905 -91163 -75747 -69847 -61925 -48823 -49370 -68750 -79448 -62004 -39698 -43804 -65069
41300f5069p450Q090K42j1301m531L835m853r002J6844M8912M1760m709m5289
$$ -65069 -72519 -64429 -64187 -75488 -80019 -76184 -81037 -90039 -73195 -24283 17477 12768 -32521
41287c2521m9207k5870L219K5486L1678J9015L084L834J7647K2376R661o558j3009
$$ -32521 -81728 -107598 -104379 -78893 -47215 -28200 -25116 -21282 -3635 18741 28402 21844 8835
41274H835r972j402J0016J6868J2045R83m747m963p838j2009q759j336l719j7721
$$ 8835 -1137 -2539 7477 24345 36390 37373 32626 27663 19825 7816 -943 -2279 -5998 -23719
41260b3719k9055l0292k9928l1800k3755O57K3499K2193Q93j3767o344J1581J9974
$$ -23719 -52774 -83066 -112994 -144794 -168549 -167892 -144393 -122200 -121307 -135074 -141418 -129837 -109863
41247a09863J2462l729j9287k7818k7235k3972k9746m5632n4888m3061k1473j5474
$$ -109863 -97401 -101130 -120417 -148235 -175470 -199442 -229188 -274820 -329708 -372769 -394242 -409716
41235d09716k7893l0611q35M6463P3365N9944K2523l862L360L3714N1692L4594
$$ -409716 -437609 -468220 -469055 -422592 -349227 -289283 -266760 -270622 -267262 -233548 -181856 -147262
41223a47262K177p456Q591J4622n684k1267n397J6964R072j4999j2320J7829L3572
$$ -147262 -145085 -152541 -143950 -129328 -135012 -156279 -161676 -144712 -135640 -150639 -162959 -145130 -111558
41210a11558J8771L202O999J0761k579j5957j0088N327J4667K2166L1735K7654
$$ -111558 -92787 -89585 -82586 -71825 -74404 -90361 -100449 -95122 -80455 -58289 -26554 1100
41198A100J566k2832j9370K402J4080J0067O896J0664J0483Q37j0359j5763j5949
$$ 1100 2666 -20166 -39536 -37134 -23054 -12987 -6091 4573 15056 15893 5534 -10229 -26178
41185b6178j3389r800p915q352p147o48J0886K4823L4516K9292P594j4320k2095
$$ -26178 -39567 -49367 -57282 -65634 -72781 -73429 -62543 -37720 -3204 26088 33682 19362 -2733
41172b733k4510l3699l4170m988L2212L1410n531k3214L317K8827J1759j9980
$$ -2733 -27243 -60942 -95112 -100100 -67888 -36478 -42009 -65223 -61906 -33079 -21320 -41300
41160d1300j9618K476O076n360K187K3088J6773j8983l6604j0771K5956L5063
$$ -41300 -60918 -58442 -52366 -57726 -55539 -32451 -15678 -34661 -71265 -82036 -56080 -21017
41148b1017J9859L390p848j7209j9653j0411L625J3826J7873J2311n698k4283
$$ -21017 -1158 2232 -5616 -22825 -42478 -52889 -49264 -35438 -17565 -5254 -10952 -35235
41136c5235k4345q070j24j2013k4618j6995M465J8152J5369M689k251K3Q942J5409
$$ -35235 -59580 -67650 -67774 -79787 -104405 -121400 -116935 -98783 -83414 -78725 -80976 -80953 -72011 -56602
41122e6602J2576L732n439j7740l4732m2120k5155L136J3330K933K332K7485N2565
$$ -56602 -44026 -40294 -45733 -63473 -98205 -140325 -165480 -162344 -149014 -146081 -143749 -116264 -63699
41109f3699M7846K3709J2674K0867K4227Q992r451j3188p686j0522k5225l7341
$$ -63699 -15853 7856 20530 41397 65624 74616 65165 51977 44291 33769 8544 -28797
41097b8797l2527j1304J1786J9011L657j9410k1533R342M6113M6388N519l2181
$$ -28797 -61324 -72628 -60842 -41831 -38174 -57584 -79117 -69775 -23662 22726 28245 -3936
41085c936l0060q008p948k5041j4845K9897N7716L4804l01L853K9703J8707l2717
$$ -3936 -33996 -42004 -49952 -74993 -89838 -59941 -2225 32579 32278 36131 65834 84541 51824
41072E1824o0183k1985M2780O7554L8624l354k3312k6193l4655n1849n5281k5682
$$ 51824 -8359 -30344 12436 79990 118614 115260 91948 65755 31100 -20749 -76030 -101712
41060a01712K3955N7297N4857L2905J4715Q1j9250l0297j3909J7465K8947J3288
$$ -101712 -77757 -20460 34397 67302 82017 82098 62848 32551 18642 36107 65054 78342
41048G8342K618K0963N0597N9801M4682K8255L1274N5259Q1770P9561K8804m8499
$$ 78342 80960 101923 152520 212321 257003 285258 316532 371791 453561 533122 561926 513427
41036E13427r7070q4967m2372k6086n1765q1529p8543n1864l5724l9513l9280
$$ 513427 416357 331390 289018 262932 211167 129638 51095 -769 -36493 -76006 -115286
41025a15286j7878P087P796j3788k8689j9453L229K3010L6412M2966L7573K3840
$$ -115286 -133164 -126077 -118281 -132069 -160758 -180211 -176982 -153972 -117560 -74594 -37021 -13181
41013a3181J7204K2010K2320Q451o248j0442j5071k7850k9989o613J8233J1319
$$ -13181 4023 26033 48353 56804 50556 40114 25043 -2807 -32796 -39409 -21176 -9857
41001i857j7729l0112j5892r13J251N158J7195K0169M863j2751j6703q793N847
$$ -9857 -27586 -57698 -73590 -74503 -73252 -68094 -50899 -30730 -25867 -38618 -55321 -64114 -58267
40988e8267K5527L7669K4119r949l5338l4110j4542J0289L2067L4700N872l2591
$$ -58267 -32740 4929 29048 19099 -16239 -50349 -64891 -54602 -22535 12165 18037 -14554
40976a4554m0766j6974k088j4525k0574Q509M6718N0930K0475j1626k5387k3158
$$ -14554 -55320 -72294 -74382 -88907 -109481 -100972 -54254 -3324 17151 5525 -19862 -43020
40964d3020j0565M129N845q796k2223k2996k3136k9646k3285Q340L9532L9870
$$ -43020 -53585 -49456 -43611 -52407 -74630 -97626 -120762 -150408 -173693 -165353 -125821 -85951
40952h5951K0216J2419J8750J7217N480R06K248r573l0110k7766P668M2561M1228
$$ -85951 -65735 -53316 -34566 -17349 -11869 -10963 -8715 -18288 -48398 -76164 -68496 -25935 15293
40939A5293J0092j5445j5664l657k244j4771k3704j7046p040j1025k0039q608
$$ 15293 25385 9940 -5724 -9381 -11625 -26396 -50100 -67146 -74186 -85211 -105250 -113858
40927a13858K2387M0132K7628Q467O481J0179K804j016J6256L2552J4267k6266
$$ -113858 -91471 -51339 -23711 -15244 -8763 1416 4220 3204 19460 52012 66279 40013
40915D0013m4149k6831m020M954J0722J6896O997j8880l2383j9469k875l827j0242
$$ 40013 -4136 -30967 -34987 -30033 -19311 -2415 4582 -14298 -46681 -66150 -69025 -72852 -83094
40902h3094l507Q846J0501N807P803J2304O936n058j0823q859n358J712J5205
$$ -83094 -86601 -77755 -67254 -61447 -53644 -41340 -34404 -39462 -50285 -59144 -64502 -62790 -47585
40889d7585K1995N343k5969m0080j9217J8307L9308L0357N517j3926j9332j4726
$$ -47585 -25590 -20247 -46216 -86296 -105513 -87206 -47898 -17541 -12024 -25950 -45282 -60008
40877f0008m484J1432K8920L4520J7983j1111k8361j9649L965J9224J4617r09
$$ -60008 -64492 -53060 -24140 10380 28363 17252 -11109 -30758 -26793 -7569 7048 6139
40865F139r867m444O241P015n211j8024k0033j4184q537j315J2953K6044K0347
$$ 6139 -3728 -8172 -1931 5084 -127 -18151 -38184 -52368 -60905 -62220 -49267 -23223 -2876
40852b876n498k8182k5696m022J1802R606K479P313J9961K0440J157j9932j9936
$$ -2876 -8374 -36556 -62252 -66274 -54472 -44866 -42387 -35074 -15113 5327 6484 -13448 -33384
40839c3384J231K1891K4469J1072n025j2527o193R926K0030R802j2242j9264m05
$$ -33384 -32153 -10262 14207 25279 20254 7727 1534 11460 31490 41292 29050 9786 9381
40826I381K1535J8825m116j7519o432J1052Q920j3481l0775k3156j882M762r388
$$ 9381 30916 49741 45625 28106 21674 32726 41646 28165 -2610 -25766 -27648 -22886 -32274
40813c2274j8250k916J5267M436k5178l0743Q79L4834M0874K9587K0528Q743j2784
$$ -32274 -50524 -53440 -38173 -33737 -58915 -89658 -88779 -53945 -13071 16516 37044 45787 33003
40800C3003k7374k0945r694j1238j0751J0867L6165L6468K1100K0142L0568K3956
$$ 33003 5629 -15316 -25010 -36248 -46999 -36132 33 36501 57601 77743 108311 132267
40788A32267J240o863N044P209j2371k7906k1198q171m460j45J2653J8835P662
$$ 132267 133507 126644 131688 138897 126526 98620 77422 69251 64791 64646 77299 96134 103796
40775A03796o657j1909j9430l7151m5452k5114Q952K6492K1076Q806m56r595j9616
$$ 103796 97139 85230 65800 28649 -16803 -41917 -32965 -6473 14603 23409 22953 13358 -6258
40762f258k6249k6700j8886j025K0166L1705L1638L0282K8096J2111j5185k6810
$$ -6258 -32507 -59207 -78093 -79118 -58952 -27247 4391 34673 62769 74880 59695 32885
40750C2885r363J0885L866j9073k3645n386O937j397r789L780K8530L3155L751
$$ 32885 23522 34407 38273 19200 -4445 -9831 -2894 -4291 -14080 -10300 18230 51385 55136
40737E5136l8248n4715k8612J4820L1780R570j8882j9571j735R02j7932l0227
$$ 55136 16888 -37827 -66439 -51619 -19839 -10269 -29151 -48722 -50457 -49555 -67487 -97714
40725i7714j7589N171J8315K5086L5411L9624K1069j1855k8649j4865R352J5979
$$ -97714 -115303 -110132 -91817 -66731 -31320 8304 29373 17518 -11131 -25996 -16644 -665
40713f65K192j2349j2151J230J6722K2573J2043o984j2045Q450L1931K4153j2956
$$ -665 1527 -10822 -22973 -21743 -5021 17552 29595 22611 10566 19016 50947 75100 62144
40700F2144l9527l1891j2236q032q727R383L5513L7764J5095j107K490M285j1121
$$ 62144 22617 -9274 -21510 -29542 -38269 -28886 6627 44391 59486 58379 60869 65154 54033
40687E4033k6388k0370M64J5522J7469J1576R92j3637k7392l2177k0367J0886
$$ 54033 27645 7275 7739 23261 40730 52306 53298 39661 12269 -19908 -40275 -29389
40675b9389M8336O1325L1585j6451l7596k0943J74k281j7441k1382j1501L59R067
$$ -29389 18947 80272 111857 95406 57810 36867 37041 34760 17319 -4063 -15564 -15205 -6138
40662f138J4109J1698L224j503k87l493j3638j6976o209N936P924O829J1415J4843
$$ -6138 7971 19669 22893 21390 21103 17610 3972 -13004 -19213 -13277 -5353 1476 12891 27734
40648B7734Q779p88n495p470p606K054K0251K7679J1710j4878l2816l7286k8725
$$ 27734 36513 35725 30230 22760 15154 17208 37459 65138 76848 61970 29154 -8132 -36857
40635c6857n336J9281J6246j8040m4171k9267O027J9956J0769J0029K6413L4583
$$ -36857 -42193 -22912 -6666 -24706 -68877 -98144 -92117 -72161 -61392 -51363 -24950 9633
40623I633J8971m886j7489j7446j1048j447O043M253n739j5462j8940j3448J864
$$ 9633 28604 23718 6229 -11217 -22265 -23712 -17669 -13416 -19155 -34617 -53557 -67005 -65141
40610f5141J7998J9322P732P034K5823L6782J7990o660k725J6952J2541j4727
$$ -65141 -47143 -27821 -20089 -13055 12768 49550 67540 60880 58155 75107 87648 72921
40598G2921k3113L34J9599R447r743j4448j4306k2421k5115r733O011K210r078
$$ 72921 49808 50142 69741 79188 69445 54997 40691 18270 -6845 -16578 -10567 -8357 -17435
40585a7435p596j968j0402k0905p712K0682K7886O080q634J0961M2311M3752R791
$$ -17435 -25031 -26999 -37401 -58306 -66018 -45336 -17450 -11370 -20004 -9043 33268 77020 86811
40572H6811k3999k5789j037K0568K0925R121L889Q781J0929J347j3426k2761k5647
$$ 86811 62812 37023 35986 56554 77479 86600 90489 99270 110199 111546 98120 75359 49712
40559D9712k6204k3413j5313q490j1488j9919j9621n990J0493K0517K6145K9465
$$ 49712 23508 95 -15218 -23708 -35196 -55115 -74736 -80726 -70233 -49716 -23571 5894
40547E894K3178L081j8519k4912j6168n852j00N746J1531J0359M579N832J3044
$$ 5894 29072 32153 13634 -11278 -27446 -33298 -33398 -27652 -16121 -5762 -1183 4649 17693
40534A7693Q537j3196l0059k0969L318J5269O833o282r087j52J3530K0538J1535
$$ 17693 26230 13034 -17025 -37994 -34676 -19407 -12574 -18856 -27943 -28095 -14565 5973 17508
40521A7508n696r317N133J3390M35j1876j852R939p370l8995m5042k4662j0342
$$ 17508 11812 2495 7628 21018 21453 9577 7725 17664 10294 -28701 -73743 -98405 -108747
40508a08747o035J2585L6643K6144j5078l1044k426K0408M671r088J6354M2759
$$ -108747 -114782 -102197 -65554 -39410 -54488 -85532 -87958 -67550 -62879 -71967 -55613 -12854
40496a2854K1050j9794j7591K1485L6609R240k1003k8792k8379k6932j0393J7383
$$ -12854 8196 -11598 -29189 -7704 28905 38145 17142 -11650 -40029 -66961 -77354 -59971
40484e9971L0082K1925J4449J5765J2173L478O825J9999J8495m116k6747l6244
$$ -59971 -29889 -7964 6485 22250 34423 37901 44726 64725 83220 79104 52357 16113
40472A6113l9498l7335k0492M190J6340J4608J5475J8705P921j3100k0986j3246
$$ 16113 -23385 -60720 -81212 -77022 -60682 -46074 -30599 -11894 -3973 -17073 -38059 -51305
40460e1305j1651k0176j6796M990K2591K2110J6168J4710J0896N190J0222K1641
$$ -51305 -62956 -83132 -99928 -94938 -72347 -50237 -34069 -19359 -8463 -3273 6949 28590
40448B8590J6446q850k9172k9451k1751j6197p294K695L80r585n773J0989J5248
$$ 28590 45036 36186 7014 -22437 -44188 -60385 -67679 -64984 -64604 -74189 -79962 -68973 -53725
40435e3725K246k868Q026J0924l513j0297L000J1075k437j1632Q275L6011L4340
$$ -53725 -51479 -54347 -46321 -35397 -38910 -49207 -46207 -35132 -37569 -49201 -40926 -4915 29425
40422B9425J972l1129m1246k4456P158K8086K0507K887J0285L9101M6932J7472
$$ 29425 31397 268 -40978 -65434 -58276 -30190 -9683 -6796 3489 42590 89522 106994
40410A06994j5667k4697k2774k4251j7215j150m083l0804m1160j5618N576r129
$$ 106994 91327 66630 43856 19605 2390 1240 -2843 -33647 -74807 -90425 -84849 -93978
40398i3978k3221O412N0926N3387J9743K484J4449K1162P094q381j5701k4507
$$ -93978 -117199 -110787 -59861 -6474 13269 15753 30202 51364 58458 50077 34376 9869
40386I869l1592k4245j0956q026m598J7278L9844L3449J2504J6328L9409L4251
$$ 9869 -21723 -45968 -56924 -64950 -69548 -52270 -12426 21023 33527 49855 89264 123515
40374A23515j3373o1564p2133n0019j6598J4653K8939J6504l803k905J2955J1985
$$ 123515 110142 48578 -23555 -73574 -90172 -75519 -46580 -30076 -33879 -36784 -23829 -11844
40362a1844p646j5374m443k435j5808j3586J5330L5380K0089o078j0163K06Q65
$$ -11844 -19490 -34864 -39307 -41742 -57550 -71136 -55806 -20426 -337 -6415 -16578 -16372 -15507
40349a5507n943n721m899j6176k7396j7334P513K0365J2696J242n56L056M840
$$ -15507 -21450 -27171 -32070 -48246 -75642 -92976 -85463 -65098 -52402 -51160 -51716 -48660 -43820
40336d3820O397J1153J5904J4493O529k54K064J0431J2093Q28j4820k5770l4700
$$ -43820 -37423 -26270 -10366 4127 10656 10402 12466 22897 34990 35818 20998 -4772 -39472
40323c9472m2918l7230r030K1704K4999J340j8850j6614l226M759P166J0594J5490
$$ -39472 -82390 -119620 -128650 -106946 -81947 -80607 -99457 -116071 -119297 -114538 -107372 -96778 -81288
40310h1288J9525K0185J1712o084j7404p686R854P946j2589k0259J73K4154K3952
$$ -81288 -61763 -41578 -29866 -35950 -53354 -61040 -51186 -43240 -55829 -76088 -75915 -51761 -27809
40297b7809N787p164j0184j4053j8714j2966K749J3088J0578O977J4640K6267
$$ -27809 -22022 -29186 -39370 -53423 -72137 -85103 -82354 -69266 -58688 -51711 -37071 -10804
40285a0804K4288P437n164p93Q994Q683M692J0982J7612K404k6595l4256j2982
$$ -10804 13484 20921 15757 14964 23958 32641 37333 48315 65927 68331 41736 7480 -5502
40272e502J221j4632l2352j8044J4377K8414J9704R848N274o85j042J1437J7665
$$ -5502 -4281 -18913 -51265 -69309 -54932 -26518 -6814 3034 8308 7623 6581 18018 35683
40259C5683k447k9795k9936o275J0286J3109J7785J9201K83k2116j2902J9048
$$ 35683 33236 3441 -26495 -32770 -22484 -9375 8410 27611 27894 5778 -7124 11924
40247A1924K7347J536k0189k0326k6110m6320m2414O175N6855O1229L0306O381
$$ 11924 39271 40807 20618 292 -25818 -72138 -114552 -108377 -51522 9707 40013 46394
40235D6394O41n121j7180k3170j3336J2383M3948N6879L1964j0280k4924m928
$$ 46394 47035 41914 24734 1564 -11772 611 44559 101438 133402 123122 98198 93270
40223I3270O880j5642m3357m3322k7674j8943n883K4859M5149K1596k4918m2596
$$ 93270 100150 84508 41151 -2171 -29845 -48788 -54671 -29812 15337 36933 12015 -30581
40211c0581j9943Q133J6953J4306R856J000p785l781R636J2555k103j8573k1219
$$ -30581 -50524 -42391 -25438 -11132 -1276 -276 -8061 -11842 -2206 10349 8246 -10327 -31546
40198c1546j0847L607J4708J6052M394j5383l3533m1461l2156m831K5161L4323
$$ -31546 -42393 -38786 -24078 -8026 -3632 -19015 -52548 -94009 -126165 -130996 -105835 -71512
40186g1512J9016L259P467K0733J6655j1667m3328n0904k5087J5003L6109K5923
$$ -71512 -52496 -49237 -41770 -21037 -4382 -16049 -59377 -110281 -135368 -120365 -84256 -58333
40174e8333R547J4863K9997K1812r700l1347l0519k7457k7984j1016K1515L1246
$$ -58333 -48786 -33923 -3926 17886 8186 -23161 -53680 -81137 -109121 -120137 -98622 -67376
40162f7376M997j6683m092J3680L925j0164O469L3679K8554j154j2794J82R219
$$ -67376 -62379 -79062 -83154 -69474 -65549 -75713 -69244 -35565 -7011 -8165 -20959 -20777 -11558
40149a1558R929K2558L8391K3815j6816l5521j1110J9607J7852o956k1391j3214
$$ -11558 -1629 20929 59320 83135 66319 30798 19688 39295 57147 50191 28800 15586
40137A5586N563J9578J9577N676j0105j4669p845L390J6105K3769J2704j3479
$$ 15586 21149 40727 60304 65980 55875 41206 33361 36751 52856 76625 89329 75850
40125G5850k3710j610K0035K552l5782m3345j3571Q176k185j5358j712K5676L8931
$$ 75850 52140 50530 70565 73117 37335 -6010 -19581 -11405 -13590 -28948 -30660 -4984 33947
40112C3947L2410J3892j2464l6602l9878j8199J0222K9331L8540L7849K4459Q993
$$ 33947 66357 80249 67785 31183 -8695 -26894 -16672 12659 51199 89048 113507 122500
40100A22500P270J0069q024m1292m9364j6240K1626K7913J5240J4027K0154Q358
$$ 122500 129770 139839 131815 90523 41159 24919 46545 74458 89698 103725 123879 132237
40088A32237j8925l1696j6408Q103J8365R356r757k6037k8818j8376q173r186
$$ 132237 113312 81616 65208 73311 91676 101032 91275 65238 36420 18044 9871 685
40076F85j5621j5174p856l293l632j296P881J9438K7607K9341K2337Q085l158
$$ 685 -14936 -30110 -37966 -41259 -44891 -46187 -38306 -18868 8739 38080 60417 68502 65344
40063F5344j45J3285J8245L898j5045j4417O074J8459K476k5870l5823k3647j2814
$$ 65344 65199 78484 96729 100627 85582 71165 77239 95698 98174 72304 36481 12834 20
40050B0j5213j6836p481R62r77r43J1297K0672J0661o077p040K706J187j0309
$$ 20 -15193 -32029 -39510 -38548 -39525 -40468 -29171 -8499 2162 -3915 -10955 -8249 -7062 -17371
40036a7371q619J1015K5839K1631J1939J2604J8525J7309J0867J1496K4294M0667
$$ -17371 -25990 -14975 10864 32495 44434 57038 75563 92872 103739 115235 139529 180196
40024A80196M5471L0369N291o608P580L7298O6029R1461J14147J16029P2700j1036
$$ 180196 225667 256036 261327 254719 262299 299597 365626 457087 571234 687263 759963 748927
40012G48927r3790j31166j11060n8553j3994k755j7921l2768l0425j4557N156
$$ 748927 655137 523971 412911 354358 340364 337609 319688 286920 256495 241938 247094
40001B47094K0713K0052k177k5069k1959o129j8684n8406o9968k7952J6259J2234
$$ 247094 267807 287859 285682 260613 238654 232525 213841 155435 85467 57515 73774 86008
39989H6008j1097L28L1760K8076q236k1654K085J8483M780r093k123N391k313
$$ 86008 74911 75239 106999 135075 126839 105185 107270 125753 130533 121440 119317 124708 122395
39976A22395j0695j1033j4221j5729M113L3037L2575M574l943K0039L1296O453
$$ 122395 111700 100667 86446 70717 74830 107867 140442 145016 141073 161112 192408 198861
39964A98861j3183N474K9427J9314l810j923J2517O719r064l655J5421J7951O676
$$ 198861 185678 191152 220579 239893 236083 234160 246677 253396 244332 240677 256098 274049 280725
39951B80725N111O281j3914m2584m1816j2753R96k0864m8451m9910l0962j4468
$$ 280725 285836 292117 278203 235619 193803 181050 182046 161182 112731 62821 31859 17391
39939A7391r224j1634j6635j6080l050J3857J4493p388l3148l9234k1354M179
$$ 17391 8167 -3467 -20102 -36182 -39232 -25375 -10882 -18270 -51418 -90652 -112006 -107827
39927a07827J8465J7777J4257J7741K1125J2593k244o583J53J218p909j0739K200
$$ -107827 -89362 -71585 -57328 -39587 -18462 -5869 -8113 -14696 -14543 -13325 -21234 -31973 -29773
39914b9773J7980K3416K1768J7252M690j3106j9016o824O880R034P857J1066Q906
$$ -29773 -11793 11623 33391 50643 55333 42227 23211 16387 23267 32301 40158 51224 60130
39901F0130m822j6142j3033m715k265QP349R972L339J209R435R175j2575l7294
$$ 60130 55308 39166 26133 21418 19153 19161 26510 36482 39821 41030 50465 59640 47065 9771
39887I771m2178l1996k0469k389K7678M8618L6877M629j6262j9023k2188l1421
$$ 9771 -32407 -64403 -84872 -87261 -59583 -10965 25912 30541 14279 -4744 -26932 -58353
39875e8353k9271m389K8565M1896K0283k2489m9762l7606o142M518q804r289J8210
$$ -58353 -87624 -92013 -63448 -21552 -1269 -23758 -73520 -111126 -117268 -112750 -121554 -130843 -112633
39862a12633L9828K6758K19o589l57p025k3462k5615q425J3871L2777M3772L5895
$$ -112633 -72805 -46047 -45828 -52417 -52774 -59799 -83261 -108876 -117301 -103430 -70653 -26881 9014
39849I014R710j1264j1830q597j8232k6411j6300j812M0L735K5498M4162L2596
$$ 9014 18724 7460 -4370 -12967 -31199 -57610 -73910 -75722 -75682 -71947 -46449 -2287 30309
39836C0309N822n218o111j8343k6577n94M2732N5703L3123J4179J1685k939l5273
$$ 30309 36131 30913 24802 6459 -20118 -20712 22020 77723 110846 125025 136710 133771 98498
39823I8498m5226j0884L0391L2657J018k5418k6766j4877p777j1361j9794k2599
$$ 98498 53272 42388 72779 105436 106454 81036 54270 39393 31616 20255 461 -22138
39811b2138j3913K072J5968J9158N011k2246l7687j7375K1949L3356M089k3864
$$ -22138 -36051 -33979 -18011 1147 6158 -16088 -53775 -71150 -49201 -15845 -11756 -35620
39799c5620j8083j749m163o588J7484M3758L3930M267j373J2801P398j7223k3011
$$ -35620 -53703 -55452 -59615 -66203 -48719 -4961 28969 33236 31863 44664 52062 34839 11828
39786A1828n044L648j960Q591L6623M3837J9144o20P270K0164J7129Q913M423
$$ 11828 6784 10432 8472 17063 53686 97523 116667 116047 123317 143481 160610 169523 173946
39773A73946o723k2260k2547j2216k1068m8380n3805k2060J0273J3573N265P751
$$ 173946 167223 144963 122416 110200 89132 40752 -13053 -35113 -24840 -11267 -6002 1749
39761A749J0929L556J019J2567J7052l21j9795k1482j5784j5065q454Q940J5060
$$ 1749 12678 16234 17253 29820 46872 46551 26756 5274 -10510 -25575 -34029 -25089 -10029
39748a0029j537j3722L100K7832K3794q094l5851m0387k7191p243J1334K1463
$$ -10029 -11566 -25288 -22188 5644 29438 21344 -14507 -54894 -82085 -89328 -77994 -56531
39736e6531K2675K1274J9221J4623J2167J4186O005k2426m5820l0760Q625K4776
$$ -56531 -33856 -12582 6639 21262 33429 47615 53620 31194 -14626 -45386 -36761 -11985
39724a1985Q670m93J4705K3646Q363l091J0062K4214J7854Q872J2260N773k4209
$$ -11985 -3315 -3808 10897 34543 42906 39815 49877 74091 91945 100817 113077 118850 94641
39711I4641m4704k7229l4l086k2043j5889J3487K8244J6106K32l510j553j224
$$ 94641 49937 22708 22674 19588 -2455 -18344 -4857 23387 39493 39725 36215 34662 33438
39698C3438m241j3812k4665j9280L611J5639q49k0056r745J8461K8539J4408J594
$$ 33438 29197 15385 -9280 -28560 -24949 -9310 -10159 -30215 -39960 -21499 7040 21448 23042
39685B3042N147J6159K3175K1977J1205j944k218J0554J4474j102j5585j1008
$$ 23042 28189 44348 67523 89500 100705 98761 96543 107097 121571 120469 104884 93876
39673I3876k676j0364k1253j2611O721J0678j035o518N37O854P719J0781J3681
$$ 93876 91200 80836 59583 46972 53693 64371 63336 56818 57355 64209 71928 82709 96390
39660I6390L221k0089l4954k2682R802L2940K2278j2337l2578j8556K810j738
$$ 96390 99611 79522 44568 21886 31688 64628 86906 74569 41991 23435 26245 24507
39648B4507j9279j4720N719M391j8376k1800K433J5418L488J411K0522K0876j1664
$$ 24507 5228 -9492 -3773 618 -17758 -39558 -37125 -21707 -18219 -16808 3714 24590 12926
39635A2926k8254j143K0671m988l5236j3546L2239L6780K546j6666p854j380m058
$$ 12926 -15328 -16471 4200 -788 -36024 -49570 -17331 19449 21995 5329 -2525 -3905 -7963
39622g963Nj41k2865m0518j3333L5125M3784P671j9843j3475J83M181J2449K4374
$$ -7963 -7958 -8099 -30964 -71482 -84815 -49690 -5906 1765 -18078 -31553 -31370 -27189 -14740 9634
39608I634J6793r617k5629k0656j0406J153K1744L7892L0669J7122K4775L4887
$$ 9634 26427 16810 -8819 -29475 -39881 -38728 -16984 20908 51577 68699 93474 128361
39596A28361R344l4525m1894j0360Q072j474K165K9556L1475j4125n3624l6028
$$ 128361 137705 103180 61286 50926 58998 57524 59689 89245 120720 106595 52971 16943
39584A6943J3353L8258K8218J1575N239O762J2391J5933Q273o312j3707j5692
$$ 16943 30296 68554 96772 108347 113586 120348 132739 148672 156945 150633 136926 121234
39572A21234k4912l3073k0695l74n635k9668k5598J6796M6582K8694l026k837
$$ 121234 96322 63249 42554 42180 36545 6877 -18721 -1925 44657 73351 70325 67488
39560F7488J7948J7742r485l4004l7958l0672k5981k6257k3077m874K5107L9408
$$ 67488 85436 103178 93693 59689 21731 -8941 -34922 -61179 -84256 -89130 -64023 -24615
39548b4615J6640k0487k7473P41K6116K8457K8367L9006L9572J7450l456k601
$$ -24615 -7975 -28462 -55935 -55194 -29078 -621 27746 66752 106324 123774 120318 117717
39536A17717K803r338k7906l1139k2718j8264j6384q660j420m197j0467r977p932
$$ 117717 120520 111182 83276 52137 29419 11155 -5229 -13889 -15309 -19506 -29973 -39950 -47882
39523d7882j4208k3543k1171j516K6352M4525L7137P952j5194j0392P744Q443
$$ -47882 -62090 -85633 -106804 -108320 -81968 -37443 -306 7646 -7548 -17940 -10196 -1753
39511a753r027j6516l069R842L803j2252k0231j4648j990N926M15r111j748J7439
$$ -1753 -10780 -27296 -30365 -20523 -16720 -28972 -49203 -63851 -65841 -59915 -59500 -68611 -70359 -52920
39497e2920J2240k5090m2612j836N0108M2126j0635l0330K464L0578K3384J4753
$$ -52920 -40680 -65770 -108382 -110218 -60110 -17984 -28619 -58949 -56485 -25907 -2523 12230
39485A2230K3442J7339j4872l0876r478Q124r260k9924k0233j973l950p348J2550
$$ 12230 35672 53011 38139 7263 -2215 5909 -3351 -33275 -53508 -55481 -59431 -66779 -54229
39472e4229L3416K2933n291j5875l526J3644K4330K0081o850l8220l8679r962
$$ -54229 -20813 2120 -3171 -19046 -22572 -8928 15402 35483 28633 -9587 -48266 -58228
39460e8228O666L47Q703M1578M9994R498k8210j6402J1364M133j9772j2945J5843
$$ -58228 -51562 -51215 -42512 -934 49060 58558 30348 13946 25310 29443 9671 -3274 12569
39447A2569K2847N087p019q119j2774j4694k999M101r070j6353Q126L5810K4683
$$ 12569 35416 40503 33484 25365 12591 -2103 -5102 -1001 -10071 -26424 -18298 17512 42195
39434D2195j0764k4693j2578m594o897l685k94j1652k3401j3764K720J118m426
$$ 42195 31431 6738 -5840 -10434 -17331 -21016 -21310 -32962 -56363 -70127 -67407 -66289 -70715
39421g0715J2711L6533L3320J2488P678J4668M807j5077j4485J382J841j0219
$$ -70715 -58004 -21471 11849 24337 32015 46683 51490 36413 21928 23310 25151 14932
39409A4932p271M547m326k5370k1742L666J1210l727l635K0050K8917M154k2708
$$ 14932 7661 12208 7882 -17488 -39230 -35564 -24354 -28081 -31716 -11666 17251 21405 -1303
39396a303k2795p764J787N627O840O85p304l017R047R234l857j2164r257l659
$$ -1303 -24098 -31862 -30075 -24448 -17608 -16923 -24227 -27244 -18197 -8963 -12820 -24984 -34241 -37900
39382c7900L380J2642R636j2183k3684K698M0102L9517O227q701R534K1351K189
$$ -37900 -34520 -21878 -12242 -24425 -48109 -45411 -5309 34208 40435 31734 41268 62619 64808
39369F4808k3251k8819k2497j9105j6696j3047j1267j222K9814O2977O1571K4928
$$ 64808 41557 12738 -9759 -28864 -45560 -58607 -69874 -71096 -41282 21695 83266 108194
39357A08194p684j2302l257K458M990L98k0977m6701m9599l0658j8692k0852j1983
$$ 108194 100510 88208 84951 87409 92399 92797 71820 25119 -24480 -55138 -73830 -94682 -106665
39344a06665J6478L4809J8124j8483m2147l6694o960K9304M8981M2734K7254K2374
$$ -106665 -90187 -55378 -37254 -55737 -97884 -134578 -141538 -112234 -63253 -20519 6735 29109
39332B9109K5348K6794L3322M6344M1050M379k7488j4496K2504L1717R072p052
$$ 29109 54457 81251 114573 160917 201967 206346 178858 164362 186866 218583 227655 220603
39320B20603o706j4641l2293l4121k1336k0922k9741j7367J2857K3392O415r080
$$ 220603 213897 199256 166963 132842 111506 90584 60843 43476 56333 79725 86140 77060
39308G7060j5618l1871m7377k9342R045J6740q013j0873K3284M4680L1013K5984
$$ 77060 61442 29571 -17806 -47148 -38103 -21363 -29376 -40249 -16965 27715 58728 84712
39296H4712N0865N5273M614n1394n4430k6265k2241m0244l6868m534K3139K5643
$$ 84712 135577 190850 195464 144070 89640 63375 41134 890 -35978 -40512 -17373 8270
39284H270J2475j170m848O740K2818K3546J0365M650R433O603k126N069K1262
$$ 8270 20745 19575 14727 21467 44285 67831 78196 82846 92279 98882 96756 101825 123087
39271A23087J2448j9059k9215q183R8k0236k2246J8724N0417K4596k3856l5251
$$ 123087 135535 116476 87261 79078 79176 58940 36694 55418 105835 130431 106575 71324
39259G1324j4307j765J111J5863K6740K796l8818n0647k5299J792J1077J5949
$$ 71324 57017 55252 56363 72226 98966 101762 62944 12297 -13002 -11210 -133 15816
39247A5816K6987L6695L6440K1656j0719m8259o2011m1061j0174O215J4446K6461
$$ 15816 42803 79498 115938 137594 126875 78616 16605 -24456 -34630 -28415 -13969 12492
39235A2492L1745J8771q93j3184k1920k9622k6080j3363j0038j4328j427K5597
$$ 12492 44237 63008 62115 48931 27011 -2611 -28691 -42054 -52092 -66420 -67847 -42250
39223d2250K8534K43j3255J2258L4726J5415j7426j9836j079P555J0323K2360
$$ -42250 -13716 -13473 -26728 -14470 20256 35671 18245 -1591 -2670 4885 15208 37568
39211C7568K6452O687j0679j751N867j7576m2060k4897J2071J5449j4634l4295
$$ 37568 64020 70707 60028 58277 64144 46568 4508 -20389 -8318 7131 -7503 -41798
39199d1798k9560j9372l820K8141N2358L2501j6159m0643k4347P48J0345J0574
$$ -41798 -71358 -90730 -94550 -66409 -14051 18450 2291 -38352 -62699 -61951 -51606 -41032
39187d1032R385O775Q600J5929J1662j1121k6397j3256P890J1821J0299J7946
$$ -41032 -31647 -24872 -16272 -343 11319 198 -26199 -39455 -31565 -19744 -9445 8501
39175H501J3129j8479l8776j2885K4646K2429j491M389L1214K8840j273j1616
$$ 8501 21630 3151 -35625 -48510 -23864 -1435 -2926 1463 32677 61517 60244 48628
39163D8628M961J2980J0916L0364O0573N3992J2653q248P775J8645P598R427L3282
$$ 48628 53589 66569 77485 107849 168422 222414 235067 226819 234594 253239 260837 270264 303546
39150C03546L5693K81k5163p440J7214O837j9737k2049j913J2751J6369K1211
$$ 303546 339239 339520 314357 306917 324131 330968 311231 289182 287269 300020 316389 337600
39138C37600K6805K3154R399q116k1997k1161j331K0548K5038J9607K2291K4919
$$ 337600 364405 387559 396958 388842 366845 345684 344353 364901 389939 409546 431837 456756
39126D56756Q482j3603j0997R232J0687j0458k0485p891K016p78N356K6054L4678
$$ 456756 465238 451635 440638 449870 460557 450099 429614 421723 423739 422961 428317 454371 489049
39113D89049J8665n36p762j4393k6750l3452l3898m0262m5104k9389p419j5780
$$ 489049 507714 507178 499416 485023 458273 424821 390923 350661 305557 276168 268749 252969
39101B52969m9571o0647l1697q73K893k770p13o796k9077m0490k1746O233J7806
$$ 252969 203398 142751 111054 110181 113074 110304 109591 102795 73718 33228 11482 17715 35521
39088C5521J5507P648q887k3706j0967K5224M2561K1085o523r475m328j6886l4105
$$ 35521 51028 58676 49789 26083 15116 40340 82901 103986 97463 87988 83660 66774 32669
39075C2669k7415J427K6488L0715J3886j2021k2791j784L0714L5942J0895r460
$$ 32669 5254 6681 33169 63884 77770 65749 42958 41174 71888 107830 118725 109265
39063A09265r240r288j8573j5774K630L765k6156n0432l5566J73K0200J8387Q004
$$ 109265 100025 90737 72164 56390 59020 62785 36629 -13803 -49369 -49196 -28996 -10609 -2605
39050b605n186j2643J944L1006L7442O874k4207j8737J0760K7935K1918N911r198
$$ -2605 -7791 -20434 -18490 12516 49958 56832 32625 13888 24648 52583 74501 80412 71214
39037G1214j7190j3903q939j7252k9335j9552P784J8293M167k601J1292J6573
$$ 71214 54024 40121 31182 13930 -15405 -34957 -27173 -8880 -4713 -7314 3978 20551
39025B0551k684j8700j2826q686j9378j2584K8716N7929K9736k3569l6558n092
$$ 20551 17867 -833 -13659 -22345 -41723 -54307 -25591 32338 62074 38505 1947 -3145
39013c145J8959R700r591j6574j5058j0504P39J4635J9683J5040Q630J815p206
$$ -3145 15814 25514 15923 -651 -15709 -26213 -25474 -10839 8844 23884 32514 34329 27123
39000B7123j2863j0358m361K258J4252K7897K7608J0620m563n388N12P490K1324
$$ 27123 14260 3902 -459 1799 16051 43948 71556 82176 77613 72225 72737 80227 101551
38987A01551L4998K5476q657l4991l0787j2400n246j1417k1632l0694k7816l086
$$ 101551 136549 162025 153368 118377 87590 75190 69944 58527 36895 6201 -21615 -24701
38975b4701K4100J8791j4475l0802j3916K31j0748j7205M712K6173J5743o459
$$ -24701 -601 18190 3715 -27087 -41003 -40772 -51520 -68725 -64013 -37840 -22097 -28556
38963b8556p123N144O277M359J6022K4952R278j4403j7285n865j971J766K2715
$$ -28556 -35679 -30535 -24258 -19899 -3877 21075 30353 15950 -1335 -7200 -9171 -7405 15310
38950A5310M3357L0883q227l2442j8893J6694M6641N3738L6063R187n756o735
$$ 15310 58667 89550 81323 48881 29988 46682 93323 147061 183124 192311 186555 179820
38938A79820p439o350J0654L1767K4608p925k3992j2501j3682m4906o3584m0657
$$ 179820 172381 166031 176685 208452 233060 225135 201143 188642 174960 130054 66470 25813
38926B5813j4172k2716l8448k1580N415L2k2191j6555J2663K6103J9092J7546
$$ 25813 11641 -11075 -49523 -71103 -65688 -65656 -87847 -104402 -91739 -65636 -46544 -28998
38914b8998K2161J3901P06M763J5526N802j6731k1653p979R18K331J0274J8713
$$ -28998 -6837 7064 7770 12533 28059 33861 17130 -4523 -12502 -11584 -9253 1021 19734
38901A9734J1971O41N957J9192J5356l972j7358j9852j8639q471J4723L2595K8940
$$ 19734 31705 32346 38303 57495 72851 68879 51521 31669 13030 4559 19282 51877 80817
38888H0817J7122J3909R801m893j3066k129Q890O740J2634L6730M3847Q685l3412
$$ 80817 97939 111848 121649 116756 103690 101561 110451 117191 129825 166555 210402 219087 185675
38875A85675l8546j9891j2515j1900q07K172j9969l3267l463L6043L0096j3065
$$ 185675 147129 127238 114723 102823 102016 104188 84219 50952 47489 83532 113628 100563
38863A00563m3448m7058m1901k7878k850L371k4938m2892r760L6529L8968J5233
$$ 100563 57115 10057 -31844 -59722 -62572 -59201 -84139 -127031 -136791 -100262 -61294 -46061
38851d6061J4807K4520N082j6086J2624O0220N2885J577j5798J1230J7116j5521
$$ -46061 -31254 -6734 -1652 -17738 -5114 55106 107991 109568 93770 105000 122116 106595
38839A06595l0828q146O528o444j0940K984k106l0225l5665p952Q597j559k725
$$ 106595 75767 67621 74149 67705 56765 59749 57643 27418 -8247 -16199 -7602 -9161 -11886
38826a1886J4342J4966j870O996M1955M9032J8480P713L7189N0683J5577k0551
$$ -11886 2456 17422 15552 22548 64503 113535 132015 139728 176917 227600 243177 222626
38814B22626j5994r48j1677k7179j9023n135q820j4534l347J1680J5145J2412
$$ 222626 206632 205684 194007 166828 147805 142670 133850 119316 115969 127649 142794 155206
38802A55206M076j7288l3803j6998J7794K8507J8545K5790M1455J9920k6765l3760
$$ 155206 159282 141994 108191 91193 108987 137494 156039 181829 223284 243204 216439 182679
38790A82679M075J7756j7292m3870l0995k0282k9751j3109L8520N4620L195m2833
$$ 182679 186754 204510 187218 143348 112353 92071 62320 49211 87731 142351 145546 102713
38778A02713k2419J7044J1044j3935j620L2264L8404J9769P337j912j8661k0187
$$ 102713 80294 97338 108382 94447 92827 125091 163495 183264 190601 188689 170028 149841
38766A49841N463K1824M890r716O394J6852j1905m2341k8933K530M024j4341j7971
$$ 149841 155304 177128 182018 172302 178696 195548 183643 141302 112369 114899 118923 104582 86611
38753H6611j5874k9125l3982m209K6720J2380k8013l9356j3207J4236K1931J4142
$$ 86611 70737 41612 7630 3421 30141 42521 14508 -24848 -38055 -23819 -1888 12254
38741A2254l478j7555o185K2396K8217N684Q51K9453L9020l128m7559m2207j2474
$$ 12254 8776 -8779 -14964 7432 35649 41333 42184 71637 110657 107529 59970 17763 5289
38728E289k275M383L4945N6593K7169k6001m8091l7867k3121J22L6686M6093J056
$$ 5289 3014 7397 42342 98935 126104 100103 52012 14145 -8976 -8854 27832 73925 74981
38715G4981m6869l3928J7775M0242K3992J0530J0934M699m916k397l769k6422
$$ 74981 28112 -5816 11959 52201 76193 86723 97657 102356 97440 95043 91274 64852
38703F4852m1123j5300K3704K9485J1319P348J4410O994n477l332n948l2172m5985
$$ 64852 23729 8429 32133 61618 72937 80285 94695 101689 96212 92880 86932 54760 8775
38690H775r643M1980N0289K4125J0975R808j0592l4908k3240J0754K0253O112
$$ 8775 -868 41112 91401 115526 126501 136309 125717 90809 67569 78323 98576 104688
38678A04688M299J1024n785l5953m0424k2220j5930k0541q866J1810J4273Q899
$$ 104688 108987 120011 114226 78273 37849 15629 -301 -20842 -29708 -17898 -3625 5274
38666E274K0914L0209L303l3989k8477J0558K5657L755j5170j2989r793j1924
$$ 5274 26188 56397 59700 25711 -2766 7792 33449 37204 22034 9045 -748 -12672
38654a2672m598J0154K0161L3048N1994M8637J1142j7037m375P201k3340m9913
$$ -12672 -17270 -7116 13045 46093 98087 146724 157866 140829 136454 143655 120315 70402
38642G0402j2411M9386N3449J2081M460L6074L6567j0478m3730l3807j8158j7748
$$ 70402 57991 107377 160826 172907 177367 213441 250008 239530 195800 161993 143835 126087
38630A26087r229R855J0761l739k660O702p680k7905p943L4710L6429m628k6425
$$ 126087 116858 126713 137474 133735 131075 137777 130097 102192 94249 128959 165388 160760 134335
38617A34335r946J395o975j059K1718K1764j988o087J2502J0719j1753o100L0340
$$ 134335 124389 125784 118809 117750 139468 161232 159244 153157 165659 176378 164625 158525 188865
38604A88865M1095J0225j1174K313J4485M997J647J3583R890j3830k1514o945
$$ 188865 229960 240185 229011 231324 245809 250806 252453 266036 275926 262096 240582 233637
38592B33637n174k1051k1713r486k0918m4165k6101K4411L4136j1961m0001q774
$$ 233637 228463 207412 185699 176213 155295 111130 85029 109440 143576 131615 91614 82840
38580H2840K9701K7846J4230K4884M0097L3339J6581M22k7046n2004l3138K2496
$$ 82840 112541 140387 154617 179501 219598 252937 269518 269940 242894 190890 157752 180248
38568A80248N0124K3866m652N499K5173J7054n836j7306j8851j5907l578O096
$$ 180248 230372 254238 249586 255085 280258 297312 291476 274170 255319 239412 235834 241930
38556B41930o204k1859n249K8973L5023J9724L0563O0490N1413P34k5498j889
$$ 241930 235726 213867 208618 237591 272614 292338 322901 383391 434804 435538 410040 408151
38544D08151K0979Q954j2680k6330m7190o4149m1923P84K759l4634m4263r496
$$ 408151 429130 438084 425404 399074 351884 287735 245812 246596 249355 214721 170458 160962
38532A60962J2253j218m197J9642K8187J1789J2353L0100J5493k5136k5730J6340
$$ 160962 173215 171997 167800 187442 215629 227418 239771 269871 285364 260228 234498 250838
38520B50838K8890j210p471J7595L51o0876o6217R422N7123J7870j9670J4489
$$ 250838 279728 278518 271047 288642 288993 228117 161900 171322 228445 246315 226645 241134
38508B41134N0192J8095k1048L170L9453J7784k0197p715K2679J1872j2412j036
$$ 241134 291326 309421 288373 291543 330996 348780 328583 320868 343547 355419 343007 341971
38496C41971J5819n530l0360j4793P147l593q361K9025N8468L1346o761j422J3739
$$ 341971 357790 352260 321900 307107 314254 310661 302300 331325 389793 421139 414378 412956 426695
38483D26695l378j2050K6377N7358K8274q571P486K9051q795o1347n3694j4495
$$ 426695 423317 411267 437644 495002 523276 514705 522191 551242 542447 481100 427406 412911
38471D12911j3515l3490k1498l424k8255n7887l1396J5831J4173j2091M089M2853
$$ 412911 399396 365906 344408 340984 312729 254842 223446 239277 253450 241359 245448 288301
38459B88301L6366n870k3858j8931l0730m3031j8108J4869P617j2422O483L8881
$$ 288301 324667 318797 294939 276008 245278 202247 184139 199008 206625 194203 200686 239567
38447B39567K9921k794j2405j6300m7063o4411k0296M0641M9718K9453L6200M6671
$$ 239567 269488 266694 254289 237989 190926 126515 106219 146860 196578 226031 262231 308902
38435C08902J2748k8259j4581K1934J4265j6290j0745R245o639k4286J0397N0146
$$ 308902 321650 293391 278810 300744 315009 298719 287974 297219 290580 266294 276691 326837
38423C26837K1936k8879r531N0579M5793k3961o0373l3218n239p933j5610k4765
$$ 326837 348773 319894 310363 360942 406735 382774 322401 289183 283944 276011 260401 235636
38411B35636m6191m4811M832M2095Q818l6937j4308L2920J5412l5487k8507J4418
$$ 235636 189445 144634 149466 191561 200379 163442 149134 182054 197466 161979 133472 147890
38399A47890M305l9801k6908K7719K7341k5207l5423P843K4052k609j1703j073
$$ 147890 152195 112394 85486 113205 140546 115339 79916 87759 111811 109202 97499 96426
38387I6426k2734n6126l4281J7569J8312j3543N323N4853M2324j6323j7119L9470
$$ 96426 73692 17566 -16715 854 19166 5623 10946 65799 108123 91800 74681 114151
38375A14151N0463K100j4829J5246J2147l1375l3639R127J0533l4121l3379K2748
$$ 114151 164614 166714 151885 167131 179278 147903 114264 123391 133924 99803 66424 89172
38363H9172L9275n224k2787J3321K4877j3380k9373J355J6494m52N017L1627J8149
$$ 89172 128447 123223 100436 113757 138634 125254 95881 97236 113730 113278 118295 149922 168071
38350A68071k1126r079L7481K3178m5581o1122n833K5661O444P342L5607K0018
$$ 168071 146945 137866 175347 198525 152944 91822 85989 111650 118094 125436 161043 181061
38338A81061k9369k4657K3907J6051m4355m9917O581K2843r934L071N7333M7123
$$ 181061 151692 127035 150942 166993 122638 72721 79302 102145 92211 95282 152615 199738
38326A99738j8992j9006M8235N4604j0665j9463M4377N4544n205n961P0492R3026
$$ 199738 180746 161740 209975 264579 253914 234451 278828 333372 328167 322206 392698 485724
38314D85724L9799L7068R6780Q4127n757j8052O3098P5905l936j2962P4948R2905
$$ 485724 525523 562591 659371 743498 737741 719689 782787 858692 854756 841794 916742 1009647
38302A009647J8568L0706J50859J82598R5989R8934K28794K72583K01144K49186
$$ 1009647 1028215 1058921 1209780 1392378 1488367 1587301 1816095 2088678 2289822 2539008
38292B539008M38762M97408L97909M55111P06763P90193O68637Q08460J321782
$$ 2539008 2977770 3475178 3873087 4328198 5034961 5825154 6493791 7302251 8624033
38283H624033J715458J940647K729495M052517M171543J585917k500062n088834
$$ 8624033 10339491 12280138 15009633 19062150 23233693 24819610 22319548 17230714
38275A7230714m785706l032587j808161j422463j124718p08787n36031o03957
$$ 17230714 12445008 9412421 7604260 6181797 5057079 4348292 3812261 3208304
38267C208304n44246l15417k04769k61264k56789j33381o0654r5508j24871j08451
$$ 3208304 2664058 2348641 2143872 1882608 1625819 1492438 1431784 1336276 1211405 1102954
38257A102954j07236j14003p6103l3062m8798p5644m3888k063k1701n6582l7291
$$ 1102954 995718 881715 805612 772550 723752 648108 604220 602157 580456 523874 486583
38246D86583p572l0001n5085j8633K6429N844l9691l8160j7460l2967m8944j1104
$$ 486583 479011 449010 393925 375292 401721 407565 367874 329714 312254 279287 230343 219239
38234B19239L8351L0660j0795k2386q343o969r542N244J3143q403l0201k5504
$$ 219239 257590 288250 277455 255069 246726 239757 230215 235459 248602 240199 209998 184494
38222A84494j4971j2437N829L8153L9944O476q161J1170J2507k0187l2258l765
$$ 184494 169523 157086 162915 201068 241012 247488 239327 250497 263004 242817 210559 206794
38210B06794J1031q528o257L7247N1490m482o4442n9349j5942P747R077Q446l67
$$ 206794 217825 209297 203040 240287 291777 287295 222853 163504 147562 155309 164386 172832 172465
38197A72465j8550k1871q163o356j6555o949J6115R608k2706k7485O248L2202
$$ 172465 153915 132044 123881 117525 100970 94021 110136 119744 97038 69553 75801 108003
38185A08003L1000K7244K1228q492l5861j4123L0915L1360n365j2773R956K089
$$ 108003 139003 166247 187475 178983 143122 128999 159914 191274 185909 173136 183092 185181
38173A85181l5492l9431n583O890p367J376K4779P396l0883j3390N0578P2405
$$ 185181 149689 110258 104675 111565 104198 105574 130353 137749 106866 93476 144054 216459
38161B16459L5113O340L290j7500m0521q464M3823K6764l3616k5806M4385N5683
$$ 216459 251572 257912 261202 243702 203181 194717 238540 265304 231688 205882 250267 305950
38149C05950j1505m2125L445L0385j194j0430L1613M1757m824j5852M2387P5182
$$ 305950 294445 252320 255765 286150 284956 274526 306139 347896 343072 327220 369607 444789
38137D44789L1430j2410o041p942m8063o0263j9994k566l7888n0604p909J6415
$$ 444789 476219 463809 457768 449826 401763 341500 321506 318940 281052 230448 222539 238954
38125B38954j3466k9777P44J5100j2964j9951J3911K0030k0586l7380j0905o772
$$ 238954 225488 195711 196455 211555 198591 178640 192551 212581 191995 154615 143710 136938
38113A36938l3486k1158K7060K6938j6433p450M6190L2871m1147m2413L7074M6409
$$ 136938 103452 82294 109354 136292 119859 112409 158599 191470 150323 107910 144984 191393
38101A91393m7370q6937o929N1638N363l1397J7290M6038j1754m5376J5909O2356
$$ 191393 144023 57086 50157 101795 107158 75761 93051 139089 127335 81959 97868 160224
38089A60224J9268r009M6566P3632j473n6663J355N8721R454m8514q621M3049
$$ 160224 179492 170483 217049 290681 289208 232545 233900 292621 302075 253561 244940 287989
38077B87989M984m1780j58M8977P888m4617q778M1826Q380l9624n077M5268J4588
$$ 287989 292973 251193 251035 300012 307900 263283 254505 296331 304711 265087 260010 305278 319866
38064C19866l5364j0714L0910L33m6320k1696K5455J8568L003L4314M9824J204
$$ 319866 284502 273788 304698 305031 258711 237015 262470 281038 284041 318355 368179 369383
38052C69383k5763K7524O1398r00n9047j9573K9896m640m1183J1675O9958L6787
$$ 369383 343620 371144 432542 431642 372595 353022 382918 378278 337095 348770 418728 455515
38040D55515r442K8979Q0762N2753R256K8169L9299j7942m4845K8689Q3159K3383
$$ 455515 446073 475052 555814 608567 617823 645992 685291 667349 622504 651193 734352 757735
38028G57735k8733M7225J42675J20901O7865J24927K34893K63624K13646J25480
$$ 757735 729002 776227 918902 1039803 1107668 1232595 1467488 1731112 1944758 2070238
38018B070238m9886k83128l72997k34721q0377r5848j55222q7090R458k0904q5640
$$ 2070238 2020352 1737224 1364227 1129506 1049129 953281 798059 710969 720427 699523 613883
38007F13883m0029K2190l4460j00010k5608P5614L3594o1162m4328Q865l8958
$$ 613883 573854 596044 561584 461574 435966 511580 545174 484012 439684 448549 409591
37996D09591r0419p052R2247M4185m0880M742P3774K183q7596j4278R5735L6647
$$ 409591 319172 312120 404367 448552 407672 412414 486188 488371 400775 386497 482232 518879
37984E18879q1142m2105O3312K8294o2113j3974P3104J103j11604l7133J15002
$$ 518879 437737 395632 458944 487238 425125 411151 484255 485358 373754 336621 451623
37973D51623R2204k9618j0688Q4116L4911p7194k7592R3866N1766o2514n420J27525
$$ 451623 543827 514209 503521 587637 622548 545354 517762 611628 663394 600880 595460 722985
37961G22985P6505p0279m3624P9884L7280q6556k3227J26572O3848j19473r5463
$$ 722985 799490 729211 685587 765471 802751 716195 692968 819540 883388 763915 668452
37950F68452P9325Q3108m7940j4925J32937R5652o5488l4576J29453R9469p1513
$$ 668452 747777 830885 782945 768020 900957 996609 931121 896545 1025998 1125467 1053954
37939A053954n0286J15498R3101o5451k4771J48460R7990j06675q4059J11345
$$ 1053954 1003668 1119166 1212267 1146816 1122045 1270505 1368495 1261820 1177761 1289106
37929A289106R3443q6181m0394J64674J22497r1203m2234J91880J48419r4519
$$ 1289106 1382549 1296368 1255974 1420648 1543145 1451942 1409708 1601588 1750007 1655488
37919A655488l7323K53600K42759l0334j5310K62256K38627o0836m2140K79343
$$ 1655488 1618165 1871765 2114524 2084190 2068880 2331136 2569763 2508927 2466787 2746130
37909B746130K79237m0269k4096L41048L69304K9150L3212M27742M76719J34879
$$ 2746130 3025367 2985098 2961002 3302050 3671354 3700504 3733716 4161458 4638177 4773056
37899D773056J79439O53945P18976L16169L54111R27521J079935P02224Q21400
$$ 4773056 4952495 5606440 6325416 6641585 6995696 7923217 9003152 9705376 10526776
37890A0526776J572608J862733J555117J859896K961628L560905L453002M036426
$$ 10526776 12099384 13962117 15517234 17377130 20338758 23899663 27352665 31389091
37882C1389091N473294O168617O012446O935386R096531J0274870J0577172J3288917
$$ 31389091 36862385 43031002 49043448 55978834 65075365 75350235 85927407 99216324
37874I9216324J8913814K3867312K8364244L8270016N2005752N2435051K3985795
$$ 99216324 118130138 141997450 170361694 208631710 260637462 313072513 337058308
37867C37058308k3312426n8856958o3437246m6864368l0538195k2718227j7950564
$$ 337058308 313745882 254888924 191451678 144587310 114049115 91330888 73380324
37860G3380324j2360396q517461p770234p264963n419027m058077m072854l743973
$$ 73380324 61019928 52502467 44732233 37467270 32048243 27990166 23917312 20173339
37852B0173339k353202j498489j860026j989595j190276o79736j057847j224286
$$ 20173339 17820137 16321648 14461622 12472027 11281751 10602015 9544168 8319882
37844H319882o30750k73591o52047q45581l83829j11552m60322o31085k08712
$$ 8319882 7689132 7415541 6763494 5917913 5534084 5422532 4962210 4331125 4122413
37835D122413M9141k75735m86131j73144K9662k51414m12215r9710R7142j77784
$$ 4122413 4171554 3895819 3409688 3236544 3266206 3014792 2602577 2502867 2600009 2422225
37825B422225l61166q5841J26559r2039k66066m2009J37281o9431k47310o2619
$$ 2422225 2061059 1975218 2101777 2009738 1743672 1701663 1838944 1769513 1522203 1459584
37815A459584J03634o6268k21445o7519O6109q6063j98805k6745R7760o9740j97364
$$ 1459584 1563218 1496950 1275505 1207986 1274095 1188032 989227 962482 1060242 990502 793138
37804G93138l3037J05651l3433j49148J399J22515k5722j50703p336J20699j8990
$$ 793138 760101 865752 832319 683171 684570 807085 781363 630660 623324 744023 725033
37793G25033j58354l8986R6265m072j19971j9018Q7515j5176j14728p968Q5590
$$ 725033 566679 527693 623958 619886 499915 480897 568412 553236 438508 430540 516130
37782E16130l3977j35926p478J21156J8134j06531j7775R4972P180r7770n39J16378
$$ 516130 482153 346227 338749 459905 478039 371508 353733 448705 455885 358115 357576 473954
37770D73954K8252r2561j8757R2368J9365r0764k5392P1123r803j22893n2646
$$ 473954 502206 409645 390888 483256 502621 411857 386465 457588 447785 324892 272246
37759B72246O6209J5200q7921l3317P0118K0330p9280l0577P3011M1802m1865
$$ 272246 338455 353655 265734 232417 302535 322865 243585 213008 286019 327821 285956
37748B85956p971N7862K307p2083j1191O9562L704r3305m3015N0937J1865o1587
$$ 285956 277985 335847 338154 266071 254880 324442 328146 234841 191826 242763 254628 193041
37736A93041K721R9881M7345n3052m287J08793Q4088j5330N683J01737R2702J5534
$$ 193041 195762 295643 342988 289936 285649 394442 478530 463200 468883 570620 663322 678856
37724F78856L5173J17182J12456O6745J35032K74896L10620K17277Q7210p4893
$$ 678856 714029 831211 943667 1010412 1145444 1420340 1730960 1948237 2035447 1960554
37714A960554k72924l66560k59146j09457j01065j43909o7783M6568K1128q1508
$$ 1960554 1687630 1321070 1061924 952467 851402 707493 639710 686278 707406 625898
37704F25898p9666n783j4073p0101l6146L7365O024p7478o0002J5592J126n9834
$$ 625898 546232 540449 526376 456275 420129 457494 463518 386040 326038 341630 342756 282922
37692B82922j9181P3755N2694n2895p4147j0255L29m3025k9183J8331r606o7176
$$ 282922 263741 337496 390190 337295 263148 252893 253222 210197 181014 199345 189739 122563
37680A22563k6550O3638N3773k8537l5104K4461K1166l1802j6333M3670K9897
$$ 122563 96013 159651 213424 184887 149783 174244 195410 163608 147275 190945 220842
37669B20842k7946j1796L9743L931o8976l6710N5865N1383k2778j3446N3879K3133
$$ 220842 192896 181100 220843 224774 155798 119088 174953 226336 203558 190112 243991 267124
37657B67124p8765p7645K0892M1911k9611l1690N5070O9716k1534o7159j7076
$$ 267124 188359 110714 131606 173517 143906 112216 167286 237002 215468 148309 131233
37646A31233N800l7575l7660K5760L5134k7110l7007K7841M2656k1173m3349Q587
$$ 131233 137033 99458 61798 87558 122692 95582 58575 86416 129072 107899 64550 73137
37634G3137K4039k2054j9980M4240M4105m2141p2294N848O3406K6196j1723J3940
$$ 73137 97176 75122 55142 99382 143487 101346 29052 34900 98306 124502 112779 126719
37622A26719K9668q195k8643j882J111l2468j8632M8273O4615J2038n087L4388
$$ 126719 156387 148192 119549 117667 118778 86310 67678 115951 180566 192604 187517 221905
37610B21905K2334o1900r0217j1917N3066K4722j7824o710L063k6332l2684R116
$$ 221905 244239 182339 92122 80205 133271 157993 140169 133459 136522 110190 77506 86622
37598H6622K4989j2329k9066j471k388m3342l7360K5872M0854j9371m5993N824
$$ 86622 111611 99282 70216 68745 66357 23015 -14345 11527 52381 33010 -12983 -7159
37586g159L8848L276j6019K3417L6373j6156m2692K649K9501j4465m4532n216
$$ -7159 31689 34965 18946 42363 78736 62580 19888 22537 52038 37573 -6959 -12175
37574a2175K6473l270k3642J3174L6674L021j5115K4851M7430P297k2539J670
$$ -12175 14298 11028 -12614 560 37234 40255 25140 49991 97421 104718 82179 83849
37562H3849R073l5096m6649J7017O5450L8422R167L0460L3538j9916m3382R393
$$ 83849 92922 57826 11177 28194 93644 132066 141233 171693 205231 185315 141933 151326
37550A51326M1708j0007n2430q291L9316M542m5347k6957M923k0516m4788k61
$$ 151326 193034 183027 130597 122306 161622 166164 120817 93860 98783 78267 33479 33218
37538C3218M6525J6641k9351n110M2417L0044o115O066L0715L991l0718o596L0547
$$ 33218 79743 96384 67033 61923 104340 134384 128269 134335 165050 169041 138323 131727 162274
37525A62274O567l8315k4995J8351J5682j7736j9476k23l246o695K2486M1614
$$ 162274 168841 130526 105531 123882 139564 121828 102352 102129 98883 92188 114674 156288
37513A56288O645l2743j6478J6642N744j8579j645K7181J8130N6J2768J5830k9940
$$ 156288 162933 130190 113712 130354 136098 117519 115874 143055 161185 161241 174009 189839 159899
37500A59899o6409l1528K5819L1628J1266J9586K5773j6055n6160k8647K5944
$$ 159899 93490 61962 87781 119409 130675 150261 176034 159979 103819 75172 101116
37489A01116L3259J3048K0978L3215P185j2608K7326P1879M4330j0758r02N3123
$$ 101116 134375 147423 168401 201616 208801 196193 223519 295398 339728 328970 328068 381191
37477C81191N9883J4382j4861j6347l1647n5307n1364l6361m3346m3063O56M4797
$$ 381191 441074 455456 440595 424248 392601 337294 285930 249569 206223 163160 163816 208613
37465B08613L5182O478J3778K5916n032l3523R01M7192K2282l8947m4609o794
$$ 208613 243795 250273 264051 289967 284935 251412 252313 299505 321787 282840 238231 231437
37453B31437o040l7350k9652J2280J9866q277j3058Q529J2050O790L2605O2276
$$ 231437 225397 188047 158395 170675 190541 182264 169206 177735 189785 196575 229180 291456
37441B91456M1876l31k63J9906m212m7519l5389J3803J7909j8981j8410K5436
$$ 291456 333332 333001 332738 352644 348432 300913 265524 279327 297236 278255 259845 285281
37429B85281M1908J8460J1188K4838O467m0313n2990k4937j2426k7273k8229j4489
$$ 285281 327189 345649 356837 381675 388142 347829 294839 269902 257476 230203 201974 187485
37417A87485k2812l9938k2848O723m481l1485r425L6677K4385l6018n2628q925
$$ 187485 164673 124735 101887 108610 104129 72644 63219 99896 124281 88263 35635 26710
37405B6710K0003R764J3892L9376K6624k5542m0153M248L5355J2858j4514p742
$$ 26710 46713 56477 70369 109745 136369 110827 70674 74922 110277 123135 108621 100879
37393A00879O425O851J3298K6084J6348p249o197P482j1990m6683l3144J9625
$$ 100879 107304 114155 127453 153537 169885 162636 156439 163921 151931 105248 72104 91729
37381I1729L5363Q58j6487O582J5840j0542k5015o882M679l465M178K8349K4888
$$ 91729 127092 127950 111463 118045 133885 123343 98328 91446 96125 92660 96838 125187 150075
37368A50075l759l251K9259L4407L83j6589J72K096k1588j8656K2122M2944K1678
$$ 150075 146316 143065 172324 206731 207114 190525 190697 192793 171205 152549 174671 217615 239293
37355B39293P139K1156K1521p917k3456o712N688Q06P733J9916l907m4984l5177
$$ 239293 246432 267588 289109 281192 257736 251024 256712 257518 265251 285167 281260 236276 201099
37342B01099J8249K9267k0407m6807r117K7349J5996J087J3826Q213l8494o4085
$$ 201099 219348 248615 228208 181401 172284 199633 215629 216716 230542 238755 200261 136176
37330A36176k5857K4165L1237K0271K6504K6217k094k2081m029K0742J9040O394
$$ 136176 110319 134484 165721 185992 212496 238713 236619 214538 210509 231251 250291 256685
37318B56685J94j1411k3309q119J8703Q385k6890k1406K2200K4797k6918m6830
$$ 256685 256879 245468 222159 214040 232743 241128 214238 192832 215032 239829 212911 166081
37306A66081p36K9587q596m8409k8751J612j3552l3704p419K7875K0289l005j049
$$ 166081 165345 194932 186336 137927 109176 110788 97236 63532 56113 83988 104277 101272 100223
37293A00223j046l1890n0088j6503K1864J0259j8303p525K3434K6282J1479J1877
$$ 100223 99177 67287 17199 696 22560 32819 14516 6991 30425 56707 68186 80063
37281H0063J2044j1728l1597j7791K053l426r646R239K3400N843j1433N42J2036
$$ 80063 92107 80379 48782 30991 33044 29618 19972 29211 52611 58454 47021 47563 59599
37268E9599J68J733L7165N3797J5019k5642j4614Q633j0906m1923k9205M463Q059
$$ 59599 59767 61500 98665 152462 167481 141839 127225 135858 124952 83029 53824 58287 66346
37255F6346k076J4850L6917K2814m846m522J938k4515n6690m7488j6960j1381
$$ 66346 64270 79120 116037 138851 134005 129483 131421 106906 50216 2728 -14232 -25613
37243b5613j7593R28K4915J7458l16P789J7008r474l8411j9225K0635K0834o574
$$ -25613 -43206 -42278 -17363 95 -221 7568 24576 15102 -23309 -42534 -21899 -1065 -7639
37230g639n334K1589K3979l258k0258j4722l538J3566L7037L6548J408j7884J4075
$$ -7639 -12973 8616 32595 29337 9079 -5643 -9181 4385 41422 77970 79378 61494 75569
37217G5569M6111J9990k7924k8672K457L696j8623j1071K0948K4995j147j3380
$$ 75569 121680 141670 113746 85074 87531 91227 72604 61533 82481 107476 106329 92949
37205I2949m861l119k999J8617M1966L3259J0178P428R601q658j6760J6337M5285
$$ 92949 88088 84969 81970 100587 142553 175812 185990 193418 203019 194361 177601 193938 239223
37192B39223J7319k6231j6040K0148P268l8661l9333L592J5310j6466l0386j0834
$$ 239223 256542 230311 214271 234419 241687 203026 163693 167285 182595 166129 135743 124909
37180A24909n026k1005j7326L421l546k7703j3141L0703L5798L08k997M2073O3987
$$ 124909 119883 98878 81552 84973 81427 53724 40583 71286 107084 107392 104395 146468 210455
37167B10455K8116q354L655M0038O7869R3421J19637J28476J23529J21259R5708
$$ 210455 238571 230217 233872 273910 341779 435200 554837 683313 806842 928101 1023809
37156A023809R881r7350j42758j19635r6543r4951p0305k2824j5694n8579p9331
$$ 1023809 1033690 936340 793582 673947 577404 482453 412148 389324 373630 315051 235720
37145B35720m4534q843r654r949J5159K9035J2756M371J6790M685m2202o0695
$$ 235720 191186 182343 172689 162740 177899 206934 219690 224061 240851 245536 203334 142639
37133A42639j9305K1303O313l1907m3673l9461m3005l6754r682M785q350p735
$$ 142639 123334 144637 150950 119043 75370 35909 -7096 -43850 -53532 -48747 -57097 -64832
37121f4832K7884M9201J7771k3235j8824J2211K1358J0868J0062J3407P96j4291
$$ -64832 -36948 12253 30024 6789 -12035 176 21534 32402 42464 55871 56667 42376
37109D2376r334L380J804n240q99N102q63p361j130Q872J3149J6110J2782j0511
$$ 42376 33042 36422 38226 32986 32087 37189 36326 28965 27835 36707 49856 65966 78748 68237
37095F8237l8236l3465J807K3716J7729J5687K5405R660l7436o1103l0969P020
$$ 68237 30001 -3464 -1657 22059 39788 55475 80880 90540 53104 -7999 -38968 -31948
37083c1948O526r417j405J6623J1793o829j1017k513K168M243O002m671k4001
$$ -31948 -25422 -34839 -36244 -19621 -7828 -14657 -25674 -28187 -26019 -21776 -15774 -20445 -44446
37070d4446k3032M722K5438J8907P437P860K463j6384k2278l690J1649Q035P249
$$ -44446 -67478 -62756 -37318 -18411 -10974 -3114 -651 -17035 -39313 -43003 -31354 -23319 -16070
37057a6070J7841J4455n115k586K8769L7055m361m6131l9196n717R785O222M37
$$ -16070 1771 16226 11111 8525 37294 74349 69988 23857 -15339 -21056 -11271 -5049 -4612
37044d612j0451j9786M61M1678M7947N396k2533L026K8457L7m3627m0754p688
$$ -4612 -15063 -34849 -34388 7290 55237 60633 38100 41126 69583 69620 25993 -14761 -22449
37031b2449M010o17J1034K2692J056l1329l0659r343q243k0868j4560J461j250
$$ -22449 -18439 -19056 -8022 14670 15726 -15603 -46262 -55605 -63848 -84716 -99276 -97815 -99065
37018i9065p069J3636L6223J6504k5715l0653O876L6045L3936K5008K2303J1891
$$ -99065 -106134 -92498 -56275 -39771 -65486 -96139 -89263 -53218 -19282 5726 28029 39920
37006C9920m521o803K978L601n027o769n562j4558k0139l57L0445L6950J4225
$$ 39920 35399 28596 31574 35175 30148 23379 17817 3259 -16880 -17237 13208 50158 64383
36993F4383j2233k6117k7386j6291j589m254k3463k5476L834K9418K3195R118
$$ 64383 52150 26033 -1353 -17644 -19233 -23487 -46950 -72426 -68592 -39174 -15979 -6861
36981f861J2580J0544j8544m0977k2370N949j064k2168j0085K2844L0968J7007
$$ -6861 5719 16263 -2281 -43258 -65628 -59679 -60743 -82911 -92996 -70152 -39184 -22177
36969b2177J4067J4297p683k6018n33L8260K7703j7409k3997J5506L0860q184
$$ -22177 -8110 6187 -1496 -27514 -28047 10213 37916 20507 -3490 12016 42876 34692
36957C4692n1211o0149n7979n9887l5331K5298P2368O5590L0823J3561J7254J8087
$$ 34692 -16519 -76668 -134647 -194534 -229865 -204567 -132199 -66609 -35786 -22225 -4971 13116
36945A3116O732r664k0571j3229J3617L3730K1681n325j0548L153K166j4408j3088
$$ 13116 19848 10184 -10387 -23616 -9999 23731 45412 40087 29539 32692 34858 20450 7362
36932G362R716J7833N37p192J2601K8834J6175k889O97J4783R141j8248m2933
$$ 7362 17078 34911 35448 28256 40857 69691 85866 82977 83674 98457 107598 89350 46417
36919D6417m5608k5646K940J9143J1025j0875k5946k5703j3244P085K3739J8792
$$ 46417 809 -24837 -21897 -2754 8271 -2604 -28550 -54253 -67497 -60412 -36673 -17881
36907a7881m576j5250J385J6558N042r689M094K8575K6079L470m638J628m109
$$ -17881 -22457 -37707 -36322 -19764 -14722 -24411 -20317 8258 34337 37807 33169 34797 30688
36894C0688j7930j3348M490P335j431N093K1917J9851J703n086m121j8993l3853
$$ 30688 12758 -590 3900 11235 9804 14897 36814 56665 58368 53282 49161 30168 -3685
36881c685j0929L3760M1100J934k8203j9380n276j2413j6041N524K7450K0333
$$ -3685 -14614 19146 60246 62180 33977 14597 9321 -3092 -19133 -13609 13841 34174
36869C4174o429k7377l1140j3109K3719N0371L6179J66o438K3124M0811K0438
$$ 34174 27745 368 -30772 -43881 -20162 30209 66388 66554 60116 83240 124051 144489
36857A44489p499j3703j1499j8918k5464k0561j6241k0533k2268j7158j5521j5064
$$ 144489 136990 123287 111788 92870 67406 46845 30604 10071 -12197 -29355 -44876 -59940
36845e9940k259J3839R814o102j638K1128K4251j528k1722j8086j2154j6169j2143
$$ -59940 -62199 -48360 -38546 -44648 -46286 -25158 -907 -2435 -24157 -42243 -54397 -70566 -82709
36832h2709M833J2336N060N385J6190J2843n360p858J0321J8241Q106P372J8752
$$ -82709 -77876 -65540 -60480 -55095 -38905 -26062 -31422 -39280 -28959 -10718 -2612 4760 23512
36819B3512J0173j8344k3906P28O142k6882m7707k0035J9421K8840K6819M2469
$$ 23512 33685 15341 -8565 -7837 -1695 -28577 -76284 -96319 -76898 -48058 -21239 21230
36807B1230N5320L6565M679q746r279j3937j5324r625j7851m2211m7123k1112
$$ 21230 76550 113115 117794 109048 99769 85832 70508 60883 43032 821 -46302 -67414
36795f7414o926k7949l8856r70M5064M1618M526j2175m493n871j6320j0386N243
$$ -67414 -74340 -102289 -141145 -142115 -97051 -55433 -50907 -63082 -67575 -73446 -89766 -100152 -94909
36782i4909M741j986J3610L9264L6962R861j068J4075J9738m675l2965l2348n084
$$ -94909 -90168 -92154 -78544 -39280 -2318 7543 6475 20550 40288 35613 2648 -29700 -34784
36769c4784K1204K6159J2816l03k439m068j5625k0603K061L3394L2996N206k438
$$ -34784 -13580 12579 25395 25092 22653 18585 2960 -17643 -15582 17812 50808 56014 53576
36756E3576K1839L2375N422j8469o095J0584o284l2865k8268o460p123k4830k3026
$$ 53576 75415 107790 113212 94743 88648 99232 92948 60083 31815 25355 18232 -6598 -29624
36743b9624J605J8586J3670o64j0955p639J6568M6054M5746J1422j5195q971L6
$$ -29624 -28019 -9433 4237 3573 -7382 -15021 1547 47601 93347 104769 89574 80603 80639
36730H0639j6523l3504k0051K210j717j8364j5080p64n059k1914k3691j0015J726
$$ 80639 64116 30612 10561 12771 11054 -7310 -22390 -23154 -28213 -50127 -73818 -83833 -82107
36717h2107J1814K3538K0252k711j3994M941K1487N628j6790j2384k76r500j8519
$$ -82107 -70293 -46755 -26503 -29214 -43208 -38267 -16780 -11152 -27942 -40326 -40602 -50102 -68621
36704f8621J269K1507M008k3808j2376K2654L0703J5313J5190K1960K79k9030
$$ -68621 -67352 -45845 -41837 -65645 -78021 -55367 -24664 -9351 5839 27799 28078 -952
36692i52j3536L2637M1891K587k8235k3903j6818k0150l866L2850M2073N702l1451
$$ -952 -14488 18149 60040 62627 34392 10489 -6329 -26479 -30345 2505 44578 50280 18829
36679A8829l2021j2297K802J5748K6423J7649p829k0443j0268P16K048O815J4111
$$ 18829 -13192 -25489 -22687 -6939 19484 37133 29304 8861 -1407 -691 1357 8172 22283
36666B2283N938j2292j4642k245o60q964l284R444p99k3584j5428K1789L5466
$$ 22283 28221 15929 1287 -958 -1618 -10582 -13866 -4422 -5221 -28805 -44233 -22444 13022
36653A3022R072j1579J509J6784P567k946P394J8600J1910N790J5515K0738N612
$$ 13022 22094 10515 12024 28808 36375 33429 40823 59423 71333 77123 92638 113376 118988
36640A18988q265R26K1145L5723N0793O8922P0855M8633K5169J9565K2770K3003
$$ 118988 110723 111649 132794 168517 219310 288232 359087 407720 432889 452454 475224 498227
36628D98227K2250J5225j0494m0739m1781j4587J95j4673l0087k5541j8056j7474
$$ 498227 520477 535702 525208 484469 442688 428101 428296 413623 383536 357995 339939 322465
36616C22465m509K1726K5338o351l1539j6572J2965J8203L663p326j5278k5389
$$ 322465 317956 339682 365020 358669 327130 310558 323523 341726 345389 338063 322785 297396
36604B97396k1387K818J6931k010k8389k8174j2849j3494k4729j7365P810J9631
$$ 297396 276009 278827 295758 293748 265359 237185 224336 210842 186113 168748 176558 196189
36592A96189M769j5776j8306k837J2691J3143K926K791K0357L0657P754l1063
$$ 196189 200958 185182 166876 164039 176730 189873 192799 195590 215947 246604 254358 223295
36580B23295m4329k7006j4305k3016l0778k1472q330k47J2195K3040P009l3339
$$ 223295 178966 151960 137655 114639 83861 62389 54059 53812 66007 89047 96056 62717
36568F2717n8643m8991k7667j2789P558L1582K6590j4111m3357k4240J6970L5323
$$ 62717 4074 -44917 -72584 -85373 -77815 -46233 -19643 -33754 -77111 -101351 -84381 -49058
36556d9058K8253J9604J6488J3390R233m024l6245o3428m0867K4217O2946L8831
$$ -49058 -20805 -1201 15287 28677 37910 33886 -2359 -65787 -106654 -82437 -19491 19340
36544A9340J52NJ6799M001k7280l3190j0822Q540J3896J3116K385j6844j6933
$$ 19340 19492 19497 36296 40297 13017 -20173 -30995 -22455 -8559 4557 6942 -9902 -26835
36531b6835J3952L6659J5178k2616k8921j2403j4054l0575k3949O056K0153O352
$$ -26835 -12883 23776 38954 16338 -12583 -24986 -39040 -69615 -93564 -87508 -67355 -61003
36519f1003n728J863J4361J7826J3871K446j4321j7107N857K8233J7871j0569
$$ -61003 -66731 -64868 -50507 -32681 -18810 -16364 -30685 -47792 -41935 -13702 4169 -6400
36507f400j6696J144P911n722j0686O244J9813J0349m961j142J8137K7302R448
$$ -6400 -23096 -21952 -14041 -19763 -30449 -24205 -4392 5957 996 -146 17991 45293 54741
36494E4741k4977m3391k1284K4607M7875K9062o2n813o1j1361l2847l4981j5364
$$ 54741 29764 -13627 -34911 -10304 37571 66633 66571 60758 60697 49336 16489 -18492 -33856
36481c3856M26M28k401L284J4037K1409J8050K396j0664l17K7123L8859K3230
$$ -33856 -33430 -33002 -35403 -32119 -18082 3327 21377 23773 13109 12792 39915 78774 102004
36468A02004P789J2729K0191J2099J385j709j4429l9553m0605J99L9293L3252
$$ 102004 109793 122522 142713 154812 156197 154488 140059 100506 59901 60100 99393 132645
36456A32645M597m130l497k5471n2353m4051j3182n998k3092k2943M980K9557
$$ 132645 137242 133112 129615 104144 51791 7740 -5442 -11440 -34532 -57475 -52495 -22938
36444b2938L2641K1039m620m0512n4662k6319P664M119j1074J3266N6071N1044
$$ -22938 9703 30742 26122 -14390 -69052 -95371 -87707 -83588 -94662 -81396 -25325 25719
36432B5719O81k3532K127K2470L239j9158j1206P072J2175J4122J8581J1269P59
$$ 25719 26400 2868 4995 27465 30704 11546 340 7412 19587 33709 52290 63559 64318
36419F4318J6304M4819L6005q497k2883J6460M6003J6873k8479l1920q923m121
$$ 64318 80622 125441 161446 152949 130066 146526 192529 209402 180923 149003 140080 135959
36407A35959j1413k243Q568q811l4801k7910K524R526j6518l8384l3004j6351
$$ 135959 124546 122303 130871 122060 87259 59349 61873 71399 54881 16497 -16507 -32858
36395c2858o533J06J0381J8494J5386L18j6235j6039Q628L5503L1717M5k0815
$$ -32858 -39391 -39285 -28904 -10410 4976 5294 -10941 -26980 -18352 17151 48868 48913 28098
36382B8098j3998r939l3401n8049m5673o351J6541P427q847q540N688J9599K5043
$$ 28098 14100 4161 -29240 -87289 -132962 -139313 -122772 -115345 -124192 -132732 -127044 -107445 -82402
36369h2402K1153J1626J501q957k1342k7556j4109J5872L8770L6404J4459r668
$$ -82402 -61249 -49623 -48122 -57079 -78421 -105977 -120086 -104214 -65444 -29040 -14581 -24249
36357b4249k4028k3709j0597L879R123R335J3259J4968N099m992K581J7451J1916
$$ -24249 -48277 -71986 -82583 -78704 -69581 -60246 -46987 -32019 -26920 -31912 -29331 -11880 36
36344C6j3343k8658k4076k2290l4017l7188j5819J2590K5713K4983J9667Q281
$$ 36 -13307 -41965 -66041 -88331 -122348 -159536 -175355 -162765 -137052 -112069 -92402 -84121
36332h4121p651j3856k657J5133K6195K5781J2129q151j2524J0975L4470K2540
$$ -84121 -91772 -105628 -108285 -93152 -66957 -41176 -29047 -37198 -49722 -38747 -4277 18263
36320A8263j0804j9779O58R656q342k1790j3127n416q891L028L7849N6945L5598
$$ 18263 7459 -12320 -11662 -2006 -10348 -32138 -45265 -50681 -59572 -56544 -18695 38250 73848
36307G3848J892j5407k8551m6494m0808P56L3860K0303q505j833L0833M3229K6785
$$ 73848 75740 60333 31782 -14712 -55520 -54764 -20904 -601 -9106 -10939 19894 63123 89908
36294H9908Q769j971j6328k8086k2203p321j063J178P336J497k3753l2899N275
$$ 89908 98677 96706 80378 52292 30089 22768 21705 22883 30219 31716 7963 -24936 -19661
36281a9661N5044N2253l512m7069l6879K73J7961M022k1885l4911k3141J108J0310
$$ -19661 35383 87636 84124 37055 176 449 18410 22432 547 -34364 -57505 -56397 -46087
36268d6087k598j0933M308K0576Q536k0195l3149k6309j7586p985J1622K8514
$$ -46087 -48685 -59618 -55310 -34734 -26198 -46393 -79542 -105851 -123437 -131422 -119800 -91286
36256i1286K3592R250J1988K5244K0320j265q528O347J7059R334J26J599j151
$$ -91286 -67694 -58444 -46456 -21212 -892 -2157 -10685 -4338 12721 22055 22181 23780 22629
36243B2629k2531m9663n6476l2426P643L4218K7025l773k8204l3054l0114k2466
$$ 22629 98 -49565 -106041 -138467 -130824 -96606 -69581 -73354 -101558 -134612 -164726 -187192
36231a87192N910M8964O2998K4709k5002l3703r165L208o983j1944p94J0549J8186
$$ -187192 -181282 -132318 -69320 -44611 -69613 -103316 -112481 -109273 -116256 -128200 -128994 -118445 -100259
36218a00259L3802N0392M4516J4952j3491k4724k2906j5583j1403k3089m4600
$$ -100259 -66457 -16065 28451 43403 29912 5188 -17718 -33301 -44704 -67793 -112393
36207a12393m1894J109M6143M7438J5575o524j0153j4867j5846N248K8313J4732
$$ -112393 -154287 -153178 -107035 -59597 -44022 -50546 -60699 -75566 -91412 -86164 -57851 -43119
36195d3119k3554l4076n279J9738J6595R335J6041K0364J3599J4822L0242L6762
$$ -43119 -66673 -100749 -106028 -86290 -69695 -60360 -44319 -23955 -10356 4466 34708 71470
36183G1470K3358Q482K836m705j3334n684J1820Q791j6482k9683j8555j0610j8458
$$ 71470 94828 103310 106146 101441 88107 82423 94243 103034 86552 56869 38314 27704 9246
36170I246j8285j818K287j6615k5183l430K0191K1789K1917L7242L9773P361k6516
$$ 9246 -9039 -10857 -8570 -25185 -50368 -53798 -33607 -11818 10099 47341 87114 94475 67959
36157F7959k1160O151J1471o399j5875j0856j0702j5903r446M402L415j2150j6275
$$ 67959 46799 52950 64421 58022 42147 31291 20589 4686 -4760 -358 3057 -9093 -25368
36144b5368M247L2979M5618L1363j384k6309j8667J0846J8747j5369n4586n1217
$$ -25368 -21121 11858 57476 88839 87455 61146 42479 53325 72072 56703 2117 -49100
36132d9100j0715J9919J5833l573j1084k773Q201R644Q96m325Q333K9020K6732
$$ -49100 -59815 -39896 -24063 -27636 -38720 -41493 -33292 -23648 -22752 -27077 -18744 10276 37008
36119C7008r087m5579m4050p986K6102L5134K6006J3605L191p045k0036l4272
$$ 37008 27921 -17658 -61708 -69694 -43592 -8458 17548 31153 34344 27299 7263 -27009
36107b7009l7911j8882J1868K4146Q341o880N484L0919L6712K0605P853P274O92
$$ -27009 -64920 -83802 -71934 -47788 -39447 -46327 -40843 -9924 26788 47393 55246 62520 63212
36094F3212k1343l9165l0185l96K1426J5211j0720k9470k2855J424K0829K3014
$$ 63212 41869 2704 -27481 -27877 -6451 8760 -1960 -31430 -54285 -52861 -32032 -9018
36082i018J3882L972k064k436L006Q088M804n232j2788j3591r269o44O859j71
$$ -9018 4864 8836 6772 4336 7342 15430 20234 15002 2214 -11377 -20646 -21290 -14431 -14602
36068a4602k1343k7421L741M2214L4679j8385n4809l3508J3632L4273K4275J3869
$$ -14602 -35945 -63366 -59625 -17411 17268 -1117 -55926 -89434 -75802 -41529 -17254 -3385
36056c385J3402Q757m450j4555j5101q776L453J8603K5150J6818M017k889j0033
$$ -3385 10017 18774 14324 -231 -15332 -24108 -20655 -2052 23098 39916 43933 41044 31011
36043C1011k4302l4016k4125j520J2955J1970O138N404Q172O545l972j6687j6405
$$ 31011 6709 -27307 -51432 -52952 -39997 -28027 -21889 -16485 -8313 -1768 -5740 -22427 -38832
36030c8832P19J4384M694j4384j0897J5741L1025J6316p848j8517j7731j0625
$$ -38832 -38113 -23729 -19035 -33419 -44316 -28575 2450 18766 10918 -7599 -25330 -35955
36018c5955R259L4903L9654J7597j387J200L752j1737k3453j0453L858j0905l8198
$$ -35955 -26696 8207 47861 65458 64071 65271 69023 57286 33833 23380 27238 16333 -21865
36005b1865m1238k2859j4463j9929j4828O291K2446K2239J2360m823k8234l7758
$$ -21865 -63103 -85962 -100425 -120354 -135182 -128891 -106445 -84206 -71846 -76669 -104903 -142661
35993a42661j2368L2046N4708M0925J3808l459r487q956j757Q805J6779K2987
$$ -142661 -155029 -122983 -68275 -27350 -13542 -17001 -26488 -35444 -37201 -28396 -11617 11370
35981A1370K8826K6956J3780O51m340j0798k2966k2037K457K4146J5140q347j2147
$$ 11370 40196 67152 80932 81583 77243 66445 43479 21442 23899 48045 63185 54838 42691
35968D2691L40N01r788j154K8234M5539L3885J0201r937k6281l0136p781K5143
$$ 42691 43031 43532 33744 32590 60824 106363 140248 150449 140512 114231 84095 76314 101457
35955A01457L1731N786k0246k6993k9421l6798l2910j2863l89o725p744J3219
$$ 101457 133188 138974 118728 91735 62314 25516 -7394 -20257 -20646 -27371 -35115 -21896
35943b1896L2330K4077N143O474K1843J9397o802k9883l1825k3497j9247j3983
$$ -21896 10434 34511 39654 46128 67971 87368 80566 50683 18858 -4639 -23886 -37869
35931c7869L982K9194M0006K3192q003k5501j6676L455J3539J0034K221n602j2852
$$ -37869 -33887 -4693 35313 58505 50502 25001 8325 11780 25319 35353 37574 31972 19120
35918A9120j2462K77J4258J5627R264Q381Q504m845k4979k6748m388J7291J7341
$$ 19120 6658 6935 21193 36820 46084 54465 62969 58124 33145 6397 2009 19300 36641
35905C6641L835m484m195m006q326j4009j6155j1815l290J833n05n733j0430j8059
$$ 36641 40476 35992 31797 27791 19465 5456 -10699 -22514 -25804 -23971 -24476 -30209 -40639 -58698
35891e8698k5249j5744J5175M2791M0554J5198p677k0737l0222k6783K385L6724
$$ -58698 -83947 -99691 -84516 -41725 -1171 14027 6350 -14387 -44609 -71392 -69007 -32283
35879c2283L7198K705k4990k1380q444j0004j3047K989K4990K2720o195l1351
$$ -32283 4915 7620 -17370 -38750 -47194 -57198 -70245 -67256 -42266 -19546 -25741 -57092
35867e7092k5884N637L3178K9890k92k3595j3253J8017L5216K5863Q886J365r01
$$ -57092 -82976 -77339 -44161 -14271 -14563 -38158 -51411 -33394 1822 27685 36571 37936 37035
35854C7035n880r416n258L054O972J299j1992k0790j1406R000J1808j4382m0224
$$ 37035 31155 21739 16481 19535 26507 27806 15814 -4976 -16382 -7382 4426 -9956 -50180
35841e0180l3870o362J0051J2329J9087K6617J5534o160j1927m974j0541k1692
$$ -50180 -84050 -90412 -80361 -68032 -48945 -22328 -6794 -12954 -24881 -29855 -40396 -62088
35829f2088n972K8932L3801k624k8997r982K2810K8264J5394J0018N481j2514
$$ -62088 -68060 -39128 -5327 -7951 -36948 -46930 -24120 4144 19538 29556 35037 22523
35817B2523k7120j8138l66M528Q689L1949N7920N5070K3995j0896l8225n4523
$$ 22523 -4597 -22735 -23101 -18573 -9884 22065 79985 135055 159050 148154 109929 55406
35805E5406m3520l83L8844L3126o200l0258j8149O578J9261J9594J5061R967J2452
$$ 55406 11886 11503 50347 83473 77273 47015 28866 35444 54705 74299 89360 99327 111779
35792A11779K6751L8023K8003M839n046N938J9102J9405J2577R654J0719Q168
$$ 111779 138530 176553 204556 209395 204349 210287 229389 248794 261371 271025 281744 289912
35780B89912l177j9887k9571k2383o266N30m129l905N878P233j0091k9113l1385
$$ 289912 286735 266848 237277 214894 208628 209158 205029 201124 207002 214235 204144 175031 143646
35767A43646k1393j0385J435J0509L622j4479j4774J0750K6283L954k9542l3055
$$ 143646 122253 111868 113303 123812 127434 112955 98181 108931 135214 139168 109626 76571
35755G6571j2493k502p807o601K419J404o766k434J1980J6047R162O727N487p449
$$ 76571 64078 61576 53769 47168 49587 50991 44225 41791 53771 69818 78980 85707 91194 83745
35741H3745j8064k223K4806K2948p003k0529J211K6635K9211K0232J0720j1838
$$ 83745 65681 63458 88264 111212 104209 83680 84891 111526 140737 160969 171689 159851
35729A59851m5418n5365k4512J3060J8771J539o165J389O897L488m084j5278k6065
$$ 159851 114433 59068 34556 47616 66387 67926 61761 63150 70047 73535 69451 54173 28108
35716B8108k1645p1J3804J860j6540j2754P606J6637P167m079p268o089O7J4348
$$ 28108 6463 6392 20196 22056 5516 -7238 368 17005 24172 20093 12825 6736 6803 21151
35702B1151K6458K1924M331j1972k4956l8337m0498j8464J1266J7319J96o946
$$ 21151 47609 69533 73864 61892 36936 -1401 -41899 -60363 -49097 -31778 -31582 -38528
35690c8528R925K4648J3422j0036j8515p240J1044K6385K9916J2086j7773k8550
$$ -38528 -28603 -3955 9467 -569 -19084 -26324 -15280 11105 41021 53107 35334 6784
35678F784o162K0084J3585j9006l7323j9428J7245M0700L2293j575k9467k0024
$$ 6784 622 20706 34291 15285 -22038 -41466 -24221 16479 48772 47197 17730 -2294
35666b294J6580L2540Q716j1714J0565M3256L1890q603j7385J0314J9552m731
$$ -2294 14286 46826 55542 43828 54393 97649 129539 120936 103551 113865 133417 128686
35654A28686j3804J2538K8795Q230j0692k31P456p402l305M4090Q3991P3256N0426
$$ 128686 114882 127420 156215 164445 153753 153522 160978 153576 150271 194361 278352 351608 402034
35641D02034N9540O8673M2365K7091P3995J38715J54954J47157J69053J98832
$$ 402034 461574 530247 572612 599703 673698 812413 967367 1114524 1283577 1482409
35631A482409K09197K60859L89328M96484N36213O90480J074115J323767Q71012
$$ 1482409 1691606 1952465 2341793 2838277 3374490 4064970 5139085 6462852 7333864
35622G333864k64004j300142j534926j098564o32902m63367m17626l08263j96902
$$ 7333864 7069860 5769718 4234792 3136228 2503326 2039959 1622333 1314070 1117168
35613A117168j66153j53070j04493p7942r9627r4124l1378N526k9937o3747l5364
$$ 1117168 951015 797945 693452 615510 515883 421759 390381 395907 365970 302223 266859
35602B66859N103J219j7695j5022j7298m1813m6092j1712Q328j4721k8534R08
$$ 266859 271962 273181 255486 240464 223166 181353 135261 123549 131877 117156 88622 89530
35590H9530J9781j5207n0114k2348L2779M3189J1591r753r045r085j0973p123
$$ 89530 109311 94104 43990 21642 54421 97610 109201 99448 90403 81318 70345 63222
35578F3222j3960l5829l6009K456L0955Q081k6107j2834K7985L3101j202k2702
$$ 63222 49262 13433 -22576 -20120 10835 18916 -7191 -20025 7960 41061 39859 17157
35566A7157j1376K430j109r496j2360j1063j17K2044L4281J9850k868r688r344
$$ 17157 5781 8211 7102 -2394 -14754 -25817 -25934 -3890 30391 50241 47373 37685 28341
35553B8341j7505j8193O276L0881K1203p478j3038N550J2048m221j6853j0597
$$ 28341 10836 -7357 -1081 29800 51003 43525 30487 36037 48085 43864 27011 16414
35541A6414J815J1149K2433L2520K9200J4629L626q62q489k1618l3618m0110l6504
$$ 16414 18229 29378 51811 84331 113531 128160 131786 130924 122435 100817 67199 27089 -9415
35528i415j6944R298J8510N766m756N87L632o149n515J9248L7906K3128nN232
$$ -9415 -26359 -17061 1449 7215 2459 3046 6678 529 -4986 14262 52168 75296 75291 80523
35514H0523K5186K2583J502o171j173r787k7702k4799j544J0422L930M745K0764
$$ 80523 105709 128292 129794 123623 122450 112663 84961 60162 58618 69040 72970 77715 98479
35501I8479K6722P119k2246m1198m2307k1685J4027L4050J3715k2318k4791J0921
$$ 98479 125201 132320 110074 68876 26569 4884 18911 52961 66676 44358 19567 30488
35489C0488L8754K9096K665j1539j4651j9554k4948k4771k1463j6789o984M871
$$ 30488 69242 98338 101003 89464 74813 55259 30311 5540 -15923 -32712 -39696 -34825
35477c4825Q547L988K740Q973J4529J4162J0872O779K726M239J4269K4533K6131
$$ -34825 -26278 -22290 -19550 -10577 3952 18114 28986 35765 38491 42730 56999 81532 107663
35464A07663K1008J1906n544k7665l7074k7911j6620j0966M778L1041L2280r954
$$ 107663 128671 140577 135033 107368 70294 42383 25763 14797 19575 50616 82896 72942
35452G2942n3284m7546q077J1193j461j2762p829k017K762J8764L1683J3193k2851
$$ 72942 19658 -27888 -35965 -24772 -26233 -38995 -46824 -48841 -46079 -27315 4368 17561 -5290
35439e290k8533P014M2181M5366K6622J432k7912m6051l0346L204Q436j9968l1774
$$ -5290 -33823 -26809 15372 60738 87360 88792 60880 14829 -15517 -12313 -3877 -23845 -55619
35426e5619K227M5201N0912K3942l999k0757k8340k3359j1121j1858k7969l1078
$$ -55619 -53392 -8191 42721 66663 62664 41907 13567 -9792 -20913 -32771 -60740 -91818
35414i1818m599K6946L3724J9902M702r461k4350k5557m034J8731J4765j0949
$$ -91818 -96417 -69471 -35747 -15845 -11143 -20604 -44954 -70511 -74545 -55814 -41049 -51998
35402e1998k7022j5263J1813K7612J6566j1179k7087j4504J1908K9269L7557M4964
$$ -51998 -79020 -94283 -82470 -54858 -38292 -49471 -76558 -91062 -79154 -49885 -12328 32636
35390C2636L6868l545n0985n8545k4078Q137J5594J8282K3597Q376k3639k5410
$$ 32636 69504 65959 14974 -43571 -67649 -59512 -43918 -25636 -2039 6337 -17302 -42712
35378d2712J7637M8281J8754l3116m0567o178J3240k387j8532j1114L100M812
$$ -42712 -25075 23206 41960 8844 -31723 -37901 -24661 -27048 -45580 -56694 -53594 -48782
35366d8782k8O54O805J3770J8375J6182P654K368L507j074j6270k3063n728J8284
$$ -48782 -48810 -48156 -41351 -27581 -9206 6976 14630 16998 20505 19431 3161 -19902 -25630 -7346
35352g346K0853M500n849m086o491j6681j6744O46J4941M158k4655m1633k5942
$$ -7346 13507 18007 12158 8072 1581 -15100 -31844 -31198 -16257 -12099 -36754 -78387 -104329
35339a04329J3027M4906M8350L0668J3913O015k676j6411k5062k2224j5928j4189
$$ -104329 -91302 -46396 1954 32622 46535 52550 49874 33463 8401 -13823 -29751 -43940
35327d3940j3492q032J353J1209J7003J1398m693j3859m488N591n690k3131j3875
$$ -43940 -57432 -65464 -64111 -52902 -35899 -24501 -29194 -43053 -47541 -41950 -47640 -70771 -84646
35314h4646J4388J9196o919k1080p25J9429P275j5117j3691L188J0249J0899J7350
$$ -84646 -70258 -51062 -57981 -79061 -79786 -60357 -53082 -68199 -81890 -78702 -68453 -57554 -40204
35301d0204J5853n111j8261N263M2594M8738K3194J828l533r240j3003N200L3771
$$ -40204 -24351 -29462 -47723 -42460 134 48872 72066 73894 70361 61121 48118 53318 87089
35288H7089L0181j5973n9105n4111r879K8683L2533R681j2743j7817j3280j5926
$$ 87089 117270 101297 42192 -11919 -21798 6885 39418 49099 36356 18539 5259 -10667
35276a0667k2048r351K3822M3514K3529j5260l2208j7859N948K1212K3430J0823
$$ -10667 -32715 -42066 -18244 25270 48799 33539 1331 -16528 -10580 10632 34062 44885
35264D4885q913j3635N480K4121J7898j101q326p989j6323k2059m424K1869K3017
$$ 44885 35972 22337 27817 51938 69836 68735 60409 52420 36097 14038 9614 31483 54500
35251E4500Q12j2128q140j1083k5932k7552r427j293k0947m2360l2056O429M1454
$$ 54500 55312 43184 35044 23961 -1971 -29523 -38950 -40243 -61190 -103550 -135606 -129177 -87723
35238h7723M9272K9079l433k7998l4129k7167j6031l679L493m341j6095m46M4368
$$ -87723 -38451 -9372 -12805 -40803 -74932 -102099 -118130 -121809 -118316 -122657 -138752 -139198 -94830
35225i4830O8809L5816j8977l4966j1923M604L798J1366K0683l827m7626m5441
$$ -94830 -26021 9795 -9182 -44148 -56071 -51467 -47669 -36303 -15620 -19447 -67073 -112514
35213a12514J6788O7825N2949Q247q335l431j3072k7002j0782K3774L1730P393
$$ -112514 -95726 -27901 25048 33295 24960 21529 8457 -18545 -29327 -5553 26177 33570
35201C3570j0036j059R694q67k0749k5623j0763Q681J4882J978j6680j9489l633
$$ 33570 23534 22475 32169 31302 10553 -15070 -25833 -17152 -2270 -292 -16972 -36461 -40094
35188d0094Q143j063j6836j5038L063J6162J4611P321L099L802J2281K9293M4030
$$ -40094 -31951 -33014 -49850 -64888 -61825 -45663 -31052 -23731 -20632 -16830 -4549 24744 68774
35175F8774M3219K9483J7655J3373Q027m136j5689j6899r738o404j5913l3986
$$ 68774 111993 141476 159131 172504 180531 176395 160706 143807 134069 127665 111752 77766
35163G7766m6226m1353k0546N797K5789K9378J3400r729j8159n969O590M34j5743
$$ 77766 31540 -9813 -30359 -24562 1227 30605 44005 34276 16117 10148 16738 17172 1429
35150A429k2105j8547j6983j3806J980J9709J7711J649l25J6931K7969J9930R099
$$ 1429 -20676 -39223 -56206 -70012 -68032 -48323 -30612 -28963 -29288 -12357 15612 35542 44641
35137D4641N693k230j6372j5683N109J8454Q090k349Q321J8722K71l2118m1132
$$ 44641 50334 48104 31732 16049 21158 39612 47702 45353 53674 72396 72667 40549 -583
35124e83k1747K4R661J1329L684j5682k7916j1078J9733K4745l517k7626j9056
$$ -583 -22330 -22306 -12645 -1316 2368 -13314 -41230 -52308 -32575 -7830 -11347 -38973 -58029
35111e8029M688J2418M672L863J2600Q425j7773l8932k2735K1663M6667K2751
$$ -58029 -53341 -40923 -36251 -32388 -19788 -11363 -29136 -68068 -90803 -69140 -22473 278
35099B78k3362m2063k1347P356J7573J4247R787L846j488O366K5548K9378J984
$$ 278 -23084 -65147 -86494 -79138 -61565 -47318 -37531 -33685 -35173 -28807 -3259 26119 28103
35086B8103l3216m1800k0881O094K2484K5054J1394j3971k8924j3460K2520M9215
$$ 28103 -5113 -46913 -67794 -61700 -39216 -14162 -2768 -16739 -45663 -59123 -36603 12612
35074A2612N0923L5230J5845K720J583O555Q17j9562l3082k2004k031q76j8031
$$ 12612 63535 98765 114610 117330 118913 125468 126285 106723 73641 51637 49606 48730 30699
35061C0699l0355k8234j9103l411K1268L6481J8338k0307l7501k0056n41l741
$$ 30699 344 -27890 -46993 -50404 -29136 7345 25683 5376 -32125 -52181 -52722 -56463
35049e6463r867O803L0869K7978j785k3265j3917J2584L0439K9774J7688N764
$$ -56463 -66330 -59527 -28658 -680 -2465 -25730 -39647 -27063 3376 33150 50838 56602
35037E6602M72k256j2793l0656l6339j3634K2124L5298J3990j3688j7342m198
$$ 56602 57074 54818 42025 11369 -24970 -38604 -16480 18818 32808 19120 1778 -2420
35025b420m950k7836m6889l7011l456K9261M3760L7549J7522k884j1139j0809
$$ -2420 -7370 -35206 -82095 -119106 -122562 -93301 -49541 -11992 5530 2646 -8493 -19302
35013a9302j9557m0872m9815k3947K0809M6117L8391J8201M315o609j9315k3037
$$ -19302 -38859 -79731 -129546 -153493 -132684 -86567 -48176 -29975 -25660 -32269 -51584 -74621
35001g4621q319J5355L1436L4864K9702J9568R696Q107J4764J7255N410j5979
$$ -74621 -82940 -67585 -36149 -1285 28417 47985 57681 65788 80552 97807 103217 87238
34989H7238l4009l9918l1132j0721J0206J8167J0439l496j4312j8724j4787l006
$$ 87238 53229 13311 -17821 -28542 -18336 -169 10270 6774 -7538 -26262 -41049 -44055
34977d4055Q413J0803N850j562j3695k7052k0891J4614M7222L5202r570l0686
$$ -44055 -35642 -24839 -18989 -20551 -34246 -61298 -82189 -67575 -20353 14849 5279 -25407
34965b5407o402K2564K0361P822J8804M1616M1285J5805o812j1870o244L802J3912
$$ -25407 -31809 -9245 11116 18938 37742 79358 120643 136448 129636 117766 111522 115324 129236
34952A29236J2149n084j8756j3155k685p608j8271j2707L425O489m972j1914j0230
$$ 129236 141385 136301 117545 104390 101705 94097 75826 63119 66544 73033 68061 56147 45917
34939D5917j2767j9284j5027J063J3902J7134J5374M897j9819m2023l5469m517
$$ 45917 33150 13866 -1161 -98 13804 30938 46312 51209 31390 -10633 -46102 -50619
34927e0619J6485R440p555j2738p850k910M016J8006L2749L6882K7099R031q421
$$ -50619 -34134 -24694 -32249 -44987 -52837 -55747 -51731 -33725 -976 35906 63005 72036 63615
34914F3615j7878j8333j3899m348J4274L3694L3645J1337o181J362J4604L457
$$ 63615 45737 27404 13505 9157 23431 57125 90770 102107 95926 97288 111892 115349
34902A15349k4933l7534k6268j4524j5229j5210n148M189L590J75K874J0674J8590
$$ 115349 90416 52882 26614 12090 -3139 -18349 -23497 -19308 -15718 -15543 -12669 -1995 16595
34889A6595K0022O237j7974k5239K440L8239L7430j564l5303l6221k0182o578
$$ 16595 36617 42854 24880 -359 2081 40320 77750 76186 40883 4662 -15520 -22098
34877b2098J0377L2937L7342Q044k8030l1040j132K3101J4841j2404k8088k2002
$$ -22098 -11721 21216 58558 66602 38572 7532 6400 29501 44342 31938 3850 -18152
34865a8152j0947j2255j9989j5997r29L637r639j8007m184J3443J1089J145J0341
$$ -18152 -29099 -41354 -61343 -77340 -78269 -74632 -84271 -102278 -106462 -93019 -81930 -80785 -70444
34852g0444L0250K9581R464K253J2891Q129k2451l9260j1101L4866N1759L5538
$$ -70444 -40194 -10613 -1149 1104 13995 22124 -327 -39587 -50688 -15822 35937 71475
34840G1475J7492J2644Q089n363j9139k5158k7062k8603k4826j1993K69m408k6410
$$ 71475 88967 101611 109700 104337 85198 60040 32978 4375 -20451 -32444 -32175 -36583 -62993
34827f2993l9798j8323K5448M5867K1982r861m025K9844M1440J0783k9824m4688
$$ -62993 -102791 -121114 -95666 -49799 -27817 -37678 -41703 -11859 29581 40364 10540 -34148
34815c4148l2631j0718R658K1001J8965J2619J5232K0767J1494r362j8460q909
$$ -34148 -66779 -77497 -67839 -46838 -27873 -15254 -22 20745 32239 22877 4417 -4492
34803d492J796M905J1057K0148J2615j5048l4680k4129J963J6042J3572R589J4210
$$ -4492 -2696 2209 13266 33414 46029 30981 -3699 -27828 -25865 -9823 3749 13338 27548
34790B7548K4296K8892J7492o177k0284j0699N207K513j1540j1071K701O007r20
$$ 27548 51844 80736 98228 92051 71767 61068 66275 68788 57248 46177 48878 54885 53965
34777E3965N017J9005O114l7206o4522m3241R81K5487K2641R380l949j2346r855
$$ 53965 58982 77987 84101 46895 -17627 -60868 -59887 -34400 -11759 -2379 -6328 -18674 -28529
34764b8529k061j792l645Q376K3918J4814j3933k6181j5592j3466k3848j0219
$$ -28529 -30590 -32382 -36027 -27651 -3733 11081 -2852 -29033 -44625 -58091 -81939 -92158
34752i2158L1776N2001K8515Q876K6760M0215P221l4942l0673J180N963j3093
$$ -92158 -60382 -8381 20134 29010 55770 95985 103206 68264 37591 38771 44734 31641
34740C1641j3303L008k810k9149l6945k0164q890q149M672K5009K3308J742p045
$$ 31641 18338 21346 18536 -10613 -47558 -67722 -76612 -84761 -80089 -55080 -31772 -30030 -37075
34727c7075J449j36j5071j6158J234J1328Q041J2542K4722J7763q869j9617L54
$$ -37075 -35626 -35762 -50833 -66991 -65757 -54429 -46388 -33846 -9124 8639 -230 -19847 -19493
34714a9493K2248K1793J0007K102o169j6276j5749l932J117p252j4999j4962j4492
$$ -19493 2755 24548 34555 36657 30488 14212 -1537 -5469 -4352 -11604 -26603 -41565 -56057
34701e6057j1070P749L4160M1621K3552J957o439m662L441J5595J7164j000j5532
$$ -56057 -67127 -59378 -25218 16403 39955 41912 35473 30811 34252 49847 67011 66011 50479
34688E0479m01K2532J0489k5522k9642P797K8702k701m4830m4674j1001J3433
$$ 50479 50078 72610 83099 57577 27935 35732 64434 61733 16903 -27771 -38772 -25339
34676b5339J3365p12k1756l7849k4103K0813N3924L8954j210j6339K947K1562
$$ -25339 -11974 -12686 -34442 -72291 -96394 -75581 -21657 17297 16087 -252 2695 24257
34664B4257J3753j0333k7910k9243j9900j2019j2222j2802k577J2344J4662M938
$$ 24257 38010 27677 -233 -29476 -49376 -61395 -73617 -86419 -88996 -76652 -61990 -57052
34652e7052K579J2146J3917k134j9059k2345j9765j6582L18L1934M7986K6407
$$ -57052 -54473 -42327 -28410 -30544 -49603 -71948 -91713 -108295 -107977 -76043 -28057 -1650
34640a650q383j6389L596K0242J9599J7528K5147L0624K0793P52j5351k0628j7743
$$ -1650 -10033 -26422 -22826 -2584 17015 34543 59690 90314 111107 111859 96508 75880 58137
34627E8137j3763j5831k4909l1621k4018k572J6792J9337J0161R217K3846L4804
$$ 58137 44374 28543 3634 -27987 -52005 -54577 -37785 -18448 -8287 930 24776 59580
34615E9580K1605n195j6856r365o654j6407j5606N075J7724L643j0272L364K1284
$$ 59580 81185 75990 59134 49769 43115 26708 11102 16177 33901 37544 27272 30636 51920
34602E1920P780k0327j9130O759J0871j6013k9751m296L0344L6746J6917n025
$$ 51920 59700 39373 20243 27002 37873 21860 -7891 -12187 18157 54903 71820 66795
34590F6795j4757r692M317J0555j581j7694j9278j3803j5349j1563J1983L2475
$$ 66795 52038 42346 46663 57218 55637 37943 18665 4862 -10487 -22050 -10067 22408
34578B2408K1897Q86N939J9581j579m1325m1331r12K1246R876J1806L7754L6299
$$ 22408 44305 45191 51130 70711 69132 27807 -13524 -14436 6810 16686 28492 66246 102545
34565A02545o166k9977o579R110j8476l4461J0474O6482O1110J1403j5398p651
$$ 102545 96379 66402 59823 68933 50457 15996 26470 92952 154062 165465 150067 142416
34553A42416k844r500l018K2785N2793P8072Q8631O9647L6822L5304P3654J07900
$$ 142416 139572 130072 127054 149839 202632 280704 369335 438982 475804 511108 584762 692662
34541F92662J18357J39430J81908K02365J91448K08422K79066L52356M11515N16142
$$ 692662 811019 950449 1132357 1334722 1526170 1734592 2013658 2366014 2777529 3293671
34531C293671O72475Q08841R69107J321731J773722J771798Q41810o98549j899408
$$ 3293671 3966146 4774987 5744094 7065825 8839547 10611345 11453155 10754606 8855198
34522H855198k135375j654515j102529p92283o23745m75397l69405l18422k61600
$$ 8855198 6719823 5065308 3962779 3170496 2546751 2071354 1701949 1383527 1121927
34513A121927j81591j34726j40419j46490j19255q4612o9167o6038o3141n4054
$$ 1121927 940336 805610 665191 518701 399446 314834 245667 179629 116488 62434
34503F2434k6348J6417L6699J0732k6960l1282j2540o882j0177K498J6710j08
$$ 62434 36086 52503 89202 99934 72974 41692 29152 22270 12093 14591 31301 31193
34491C1193l3185l6706o789J7446J9528J9006K3068J6589J126l600O38p124k3733
$$ 31193 -1992 -38698 -45487 -28041 -8513 10493 33561 50150 51276 47676 48314 41190 17457
34478A7457k3250l732Q971P148R019J5958N987j9290k4631L237K7979J5937j4735
$$ 17457 -5793 -9525 -554 6594 15613 31571 37558 18268 -6363 -3126 24853 40790 26055
34465B6055k5167j2611m691j0448j0311N511J7532P562j0377q714J1945K1829
$$ 26055 888 -11723 -16414 -26862 -37173 -31662 -14130 -6568 -16945 -25659 -13714 8115
34453H115N681j5049j6609p882p329l651K3896N4618M1783j3674n0543k9015J5253
$$ 8115 13796 -1253 -17862 -25744 -33073 -36724 -12828 41790 83573 69899 19356 -9659 5594
34440E594K7656R200l074j650p863k0438j3113J5693L2136J6045j0192j5526p67
$$ 5594 33250 42450 39376 37726 29863 9425 -3688 12005 44141 60186 49994 34468 33701
34427C3701R798L762o801m719Q219J0495j2282m2399m4613j0201K8125L5449J5114
$$ 33701 43499 47261 40460 35741 43960 54455 42173 -226 -44839 -55040 -26915 8534 23648
34414B3648l696o503l492n506r059o557J128O540N688M112J0683K2398K2116J861
$$ 23648 19952 13449 9957 4451 -4608 -11165 -10037 -3497 2191 6303 16986 39384 61500 63361
34400F3361j9048j5983P246K7954M0682N4329N9111L7065Q748K0711O9176Q5732
$$ 63361 44313 28330 35576 63530 104212 158541 217652 254717 263465 284176 353352 439084
34388D39084K9843m9262q3100p5370p2331p6103n1909n835J2507j0787l0686j4577
$$ 439084 468927 419665 336565 261195 188864 112761 60852 55017 67524 56737 26051 11474
34376A1474J1811J1175j1361k5600j9110K88K2774L6056K4488j0423m0128l7645
$$ 11474 23285 34460 23099 -2501 -21611 -21323 1451 37507 61995 51572 11444 -26201
34364b6201r044J7060K5039K3903K5585K4455O330k4460l8169j2306L1913M5756
$$ -26201 -35245 -18185 6854 30757 56342 80797 87127 62667 24498 12192 44105 89861
34352H9861J2922k7212l0948m845J3056Q777n74m469r885j6795j5167r593j6618
$$ 89861 102783 75571 44623 39778 52834 61611 61037 56568 46683 29888 14721 5128 -11490
34339a1490l1441k7587l84J9028J0050l432J0889M2579N0972K0954j8521l1835
$$ -11490 -42931 -70518 -70902 -51874 -41824 -45256 -34367 8212 59184 80138 61617 29782
34327B9782j4571R063J4139l088k3057k1446L254K1883M774l8652o3192l9213
$$ 29782 15211 24274 38413 35325 12268 -9178 -5924 15959 20733 -17919 -81111 -120324
$$ [...]
##END NTUPLES=NMR SPECTRUM
##END=
