##TITLE=31Pdec_DE-64_oil
 CDCl3, 24 sc
 12.9.2024
##JCAMPDX= 6.0         $$ Bruker NMR JCAMP-DX V2.0
##DATA TYPE= NMR SPECTRUM
##DATA CLASS= NTUPLES
##ORIGIN= UXNMR, Bruker Analytische Messtechnik GmbH
##OWNER= root
$$ XWIN-NMR		Version 3.5
$$ Thu Sep 12 14:02:19 2024 Russian Standard Time (UT+4h)  she@DPX200
##.OBSERVE FREQUENCY= 81.013821
##.OBSERVE NUCLEUS= ^31P
##.ACQUISITION MODE= SIMULTANEOUS
##.ACQUISITION SCHEME= undefined
##.AVERAGES= 24
##.DIGITISER RES= 17
##SPECTROMETER/DATA SYSTEM= spect
##.PULSE SEQUENCE= zgpg30
##.SOLVENT NAME= CDCl3
##.SHIFT REFERENCE= (INTERNAL, CDCl3, 0, 198.062)
##AUDIT TRAIL= $$ (NUMBER, WHEN, WHO, WHERE, WHAT)
$$ ##TITLE= Audit trail, XWIN-NMR		Version 3.5
$$ ##JCAMPDX= 5.01
$$ ##ORIGIN= Bruker BioSpin GmbH
$$ ##OWNER= she
$$ F:/spectra/data/she/nmr/P31/2/pdata/1/auditp.txt
$$ ##AUDIT TRAIL=  $$ (NUMBER, WHEN, WHO, WHERE, WHAT)
(   1,<2024-09-12 14:01:07.90 +0400>,<she>,<DPX200>,
      <created by zg, POWCHK disabled, PULCHK disabled
       configuration hash MD5:
       00 E9 B6 7A A2 85 ED C7 34 08 36 98 17 FE 4E 26
       data hash MD5: 32K
       1F D5 DF C3 93 92 EA 11 34 A3 FE 79 E5 E4 B8 39>)
(   2,<2024-09-12 14:01:10.53 +0400>,<she>,<DPX200>,
      <Start of raw data processing
       efp BC_mod = 2 LB = 1.5 FT_mod = 6 PKNL = 1 PHC0 = 2715.781 PHC1 = 11.48747 SI = 64K 
       data hash MD5: 64K
       F2 16 44 2C 9F 94 01 E3 3E C2 4A 2A 96 DE 0F 44>)
(   3,<2024-09-12 14:01:34.39 +0400>,<she>,<DPX200>,
      <pk PHC0 = 12.09471 PHC1 = 8.6 
       data hash MD5: 64K
       1B F0 33 A4 DB 58 4A C7 E4 37 E4 1A 2D BC E2 D7>)
(   4,<2024-09-12 14:01:41.53 +0400>,<she>,<DPX200>,
      <abs ABSG = 5 
       data hash MD5: 64K
       0E D2 4D 04 72 E2 8B AC F2 21 90 AC 47 31 71 04>)
$$ ##END=
$$ 
$$ hash MD5
$$ 9D A1 ED E9 B3 4D C8 7C A4 A7 6C 74 D6 35 A3 A0
##$RELAX= 
##$RELAX= 
##$RELAX= 
##$RELAX= 
##$RELAX= 
##$RELAX= 
##$RELAX= 
##$RELAX= 
$$ Bruker specific parameters
$$ --------------------------
##$DU= <F:/spectra>
##$EXPNO= 2
##$NAME= <P31>
##$PROCNO= 1
##$TYPE= <nmr>
##$USER= <she>
##$AMP= (0..31)
100 100 100 100 100 100 100 100 100 100 100 100 100 100 100 100 100 100 
100 100 100 100 100 100 100 100 100 100 100 100 100 100 
##$AQSEQ= 0
##$AQ_mod= 1
##$AUNM= <au_zg>
##$AUTOPOS= <>
##$BF1= 81.014009
##$BF2= 200.13
##$BF3= 200.13
##$BF4= 200.13
##$BF5= 200.13
##$BF6= 200.13
##$BF7= 200.13
##$BF8= 200.13
##$BYTORDA= 1
##$CFDGTYP= 0
##$CFRGTYP= 5
##$CHEMSTR= <none>
##$CNST= (0..31)
1 1 145 1 1 1 1 1 1 1 1 1 1 1 1 1 1 1 1 1 1 1 1 1 1 1 1 1 1 1 1 1 
##$CPDPRG= <waltz16>
##$CPDPRG1= <>
##$CPDPRG2= <waltz16>
##$CPDPRG3= <>
##$CPDPRG4= <mlev>
##$CPDPRG5= <mlev>
##$CPDPRG6= <mlev>
##$CPDPRG7= <mlev>
##$CPDPRG8= <mlev>
##$CPDPRGB= <>
##$CPDPRGT= <>
##$D= (0..31)
0 1 0 0 0 0 0 0 0 0.06 0 0.03 2e-05 3e-06 0 0 0.0002 0 0 0 0 0 0 0 0 0 
0 0 0 0 0 0 
##$DATE= 1726135267
##$DBL= (0..7)
120 120 120 11 120 120 24 19 
##$DBP= (0..7)
150 150 150 150 150 150 150 150 
##$DBP07= 0
##$DBPNAM0= <>
##$DBPNAM1= <>
$$ [...]
##$SUBNAM3= <"">
##$SUBNAM4= <"">
##$SUBNAM5= <"">
##$SUBNAM6= <"">
##$SUBNAM7= <"">
##$SUBNAM8= <"">
##$SUBNAM9= <"">
##$SW= 400.765351723535
##$SWIBOX= (0..15)
0 1 3 0 0 0 0 0 0 0 0 0 0 0 0 0 
##$SW_h= 32467.5324675325
##$TD= 32768
##$TD0= 1
##$TE= 0
##$TE2= 300
##$TE3= 300
##$TEG= 300
##$TL= (0..7)
0 120 53 12 22 120 120 120 
##$TP= (0..7)
150 150 150 150 150 150 150 150 
##$TP07= 0
##$TPNAME0= <>
##$TPNAME1= <>
##$TPNAME2= <>
##$TPNAME3= <>
##$TPNAME4= <>
##$TPNAME5= <>
##$TPNAME6= <>
##$TPNAME7= <>
##$TPOAL= (0..7)
0.5 0.5 0.5 0.5 0.5 0.5 0.5 0.5 
##$TPOFFS= (0..7)
0 0 0 0 0 0 0 0 
##$TUNHIN= 0
##$TUNHOUT= 0
##$TUNXOUT= 0
##$USERA1= <user>
##$USERA2= <user>
##$USERA3= <user>
##$USERA4= <user>
##$USERA5= <user>
##$V9= 5
##$VALIST= <valist>
##$VCLIST= <CCCCCCCCCCCCCCC>
##$VD= 0
##$VDLIST= <DDDDDDDDDDDDDDD>
##$VPLIST= <PPPPPPPPPPPPPPP>
##$VTLIST= <TTTTTTTTTTTTTTT>
##$WBST= 1024
##$WBSW= 4
##$XGAIN= (0..3)
0 0 0 0 
##$XL= 0
##$YL= 0
##$YMAX_a= 61947
##$YMIN_a= -47343
##$ZGOPTNS= <>
##$ZL1= 120
##$ZL2= 120
##$ZL3= 120
##$ZL4= 120
##$ABSF1= 198.0616
##$ABSF2= -202.7028
##$ABSG= 5
##$ABSL= 3
##$ALPHA= 0
##$AQORDER= 0
##$ASSFAC= 0
##$ASSFACI= 0
##$ASSFACX= 0
##$ASSWID= 0
##$AUNMP= <proc_1d>
##$AZFE= 0.1
##$AZFW= 0.5
##$BCFW= 0
##$BC_mod= 2
##$BYTORDP= 0
##$COROFFS= 0
##$CY= -3
##$DATMOD= 1
##$DC= 0
##$DFILT= <>
##$DTYPP= 0
##$F1P= 0
##$F2P= 0
##$FCOR= 1
##$FTSIZE= 65536
##$FT_mod= 6
##$GAMMA= 0
##$GB= 0
##$INTBC= 1
##$INTSCL= 9.790993e-09
##$ISEN= 30
##$LB= 1.5
##$LEV0= 0
##$LPBIN= 0
##$MAXI= 10000
##$MC2= 0
##$MEAN= 0
##$ME_mod= 0
##$MI= 50
##$NCOEF= 0
##$NC_proc= -3
##$NLEV= 6
##$NOISF1= 182.463
##$NOISF2= 159.3651
##$NSP= 0
##$NTH_PI= 0
##$NZP= 0
##$OFFSET= 198.0616
##$PC= 4
##$PHC0= 2727.876
##$PHC1= 20.08747
##$PH_mod= 1
##$PKNL= yes
##$PPARMOD= 0
##$PSCAL= 0
##$PSIGN= 0
##$REVERSE= no
##$SF= 81.0140089999434
##$SI= 65536
##$SIGF1= 159.3651
##$SIGF2= -187.1042
##$SINO= 113.3802
##$SIOLD= 16384
##$SREGLST= <1H.CDCl3>
##$SSB= 0
##$STSI= 65536
##$STSR= 0
##$SW_p= 32467.5324675325
##$SYMM= 0
##$S_DEV= 0
##$TDeff= 32768
##$TDoff= 0
##$TI= <>
##$TILT= no
##$TM1= 0
##$TM2= 0
##$TOPLEV= 0
##$USERP1= <user>
##$USERP2= <user>
##$USERP3= <user>
##$USERP4= <user>
##$USERP5= <user>
##$WDW= 1
##$XDIM= 65536
##$YMAX_p= 393880200
##$YMIN_p= -1365537
$$ End of Bruker specific parameters
$$ ---------------------------------
##NTUPLES= NMR SPECTRUM
##VAR_NAME=  FREQUENCY,     SPECTRUM/REAL,   SPECTRUM/IMAG
##SYMBOL=    X,             R,               I
##VAR_TYPE=  INDEPENDENT,   DEPENDENT,       DEPENDENT
##VAR_FORM=  AFFN,          ASDF,            ASDF
##VAR_DIM=   65536,         65536,           65536
##UNITS=     HZ,            ARBITRARY UNITS, ARBITRARY UNITS
##FACTOR=    0.49542278885378, 1,            1
##FIRST=     16045.7642231865, 0,            0
##LAST=      -16421.768244346, 0,            0
##MIN=       -16421.768244346, -1365537,     0
##MAX=       16045.7642231865, 393880200,    0
$$ Real data points
##PAGE= N=1
##DATA TABLE= (X++(R..R)), XYDATA
$$ [...]
41318A874l8734m8763k3606L9428Q1765P2511M6632L2382J1104k0997k3576J3546
41306A43566L3622n86m5075n1710m5806o4219p3802k8994L1426K9360l3106p6882
41294a82206n7677n282M1391P0748O9726K3856m1309p0344m4818k870J5231O975
41282a76579r991k1339j7123K787K1009J9527j185l2848o8459q4738n2653M744
41270d16848J1671n5142j08567o4927K8619O5739M3393M5933Q4570P8208R227
41259b78124k8719J5008O0389L0430k7987l8792k4182l9554n3054m236O4803N8964
41247b65054r364k9451L4014Q8351N9264q927m0414l2648k2982j5531K975K0070
41235b19697J9627J1926M049k0072n2872m4097K1843P5405N2643j023M757O0734
$$ plain form
41318 1874 -36860 -85623 -109229 -69801 11964 84475 131107 163489 174593 153596 130020 143566
41306 143566 177188 176602 131527 79817 34011 -30208 -104010 -133004 -101578 -72218 -105324 -182206
41294 -182206 -239883 -245165 -203774 -133026 -63300 -39444 -80753 -151097 -195915 -198785 -183554 -176579
41282 -176579 -186570 -207909 -225032 -222245 -201236 -181709 -182894 -215742 -284201 -368939 -421592 -416848
41270 -416848 -405177 -460319 -568886 -633813 -605194 -539455 -496062 -450129 -365559 -287351 -278124
41259 -278124 -306843 -291835 -231446 -201016 -229003 -267795 -291977 -331531 -384585 -388821 -324018 -265054
41247 -265054 -274418 -303869 -269855 -181504 -122240 -131167 -171581 -204229 -227211 -242742 -239767 -219697
41235 -219697 -200070 -188144 -184095 -204167 -257039 -301136 -279293 -203888 -151245 -152268 -147511 -86777
41223h6777O8792j748o3255m4846P233J7811J358J7658N4537M2549k6602q0049
41211i3339p3172m5153l7212k1667L6927R7410Q6709J2132l7940j4305L0376K6942
41199c2292q848q282M0603P2651M0637j8562l8643j0310K2023K8485J7033k913
41187A01582l4402o2935n4952q041K9313J4844l2608o0350m4999n026K9994L7700
41175h9880J1699j9831q131M9590Q4523M2721k8736m2381J032J9883j5313m3838
41163c8662l0059k4952o2839p9002p503R6157J19668N1805j0728l394M0248O5463
41151A16202O3145M2362K015m2129n3147k5242j03n174j3873L457K3856M245n0761
41138F4853q8774p0933j0872M2575M8017N376m1498m5430p359K4336J2386k7455
$$ plain form
41223 -86777 -17985 -19733 -82988 -127834 -120601 -102790 -101432 -83774 -29237 13312 -13290 -93339
41211 -93339 -166511 -211664 -248876 -270543 -233616 -136206 -49497 -37365 -75305 -89610 -59234 -32292
41199 -32292 -41140 -49422 -8819 63832 104469 85907 47264 36954 58977 87462 104495 101582
41187 101582 67180 4245 -50707 -58748 -29435 -14591 -47199 -107549 -152548 -157574 -127580 -89880
41175 -89880 -78181 -98012 -106143 -56553 27970 70691 41955 -426 606 20489 5176 -38662
41163 -38662 -68721 -93673 -156512 -235514 -243017 -146860 -27192 24613 13885 10491 50739 116202
41151 116202 179347 221709 223724 181595 128448 103206 103103 97929 84056 87513 111369 115614 64853
41138 64853 -23921 -94854 -105726 -63151 -15134 -9758 -51256 -96686 -104045 -79709 -67323 -94778
41126i4778n3479n0415l7919l5418l6217j9435J8942N3271N3847K6664J2259L2529
41114a30149N6241M1960K582q248K6307N7981L4701l6102r8469j03254m4542L8430
41102a62562Q6857O9284J2947k5044j9697N981K3408K9023K8810K1274O483r204
41090F7560k3668l5058k9813j861K0996O719k5623k4339J5326L9154J6188j7247
41078H334j9336k021J108j5092l8405o1063o3436k0070M7567P2765L3987p289
41066f2951o51J8867N128j0775J7837N3278K6227m3083p1643m4421k2884k9799
41054a64870k3483P923K4737K4239N2542J00175Q5939q961q3486n5466K2239N4263
41042C5791L9209L0466K0678l4161j06027j11598l7371L4781L9823K127k0375
$$ plain form
41126 -94778 -148257 -198672 -236591 -272009 -308226 -327661 -308719 -255448 -201601 -174937 -162678 -130149
41114 -130149 -73908 -31948 -29366 -37614 -11307 46674 81375 45273 -53196 -156450 -200992 -162562
41102 -162562 -75705 -6421 6526 -18518 -38215 -32234 -8826 20197 49007 70281 76764 67560
41090 67560 43892 8834 -20979 -22840 -1844 4875 -20748 -45087 -29761 9393 25581 8334
41078 8334 -11002 -13023 -11915 -27007 -65412 -126475 -189911 -209981 -162414 -89649 -55662 -62951
41066 -62951 -63602 -44735 -39607 -50382 -32545 20733 46960 3877 -67766 -112187 -135071 -164870
41054 -164870 -188353 -180430 -155693 -131454 -78912 21263 107202 98241 14755 -40711 -18472 35791
41042 35791 75000 105466 126144 91983 -14044 -125642 -163013 -128232 -88409 -86282 -106657
41031a06657r510J6581L8167M2924K8403J1116J3279L3509M8153M0659J0878l5798
41019A31704q1358q7778l4807L5878N4902J1543l2745l0637q308j0859k3782L338
41007g2909O4330Q0378J085j10080j34857m3353O4680Q3432K8277n156J5256K3267
40995e650k9692r4272r7459m3369J1599M5178P1927Q6239O7440L2408K2487L7214
40983A04050L4518Q40k9754l2677k0257n363J1745J2038l0088q5777q1940l080
40971a25745O9716O0592m461m5683l6113j2065n141j3276k3846k4085j95M0217
40959a20085O0234L9693R898R042K6600L1492L0115M5577N8175K6357l8541p7675
40947A00882o8880n0372n1225n2392l3771j0024L478J7507L8399M9422M4358M0422
$$ plain form
41031 -106657 -116167 -99586 -61419 -18495 9908 21024 34303 67812 115965 156624 167502 131704
41019 131704 50346 -37432 -72239 -36361 18541 30084 -2661 -33298 -41606 -52465 -76247 -72909
41007 -72909 -8579 71799 72884 -37196 -172053 -215406 -150726 -67294 -39017 -44173 -28917 -5650
40995 -5650 -35342 -129614 -227073 -270442 -258843 -213665 -141738 -55499 11941 44349 66836 104050
40983 104050 138568 139408 109654 76977 56720 51357 63102 75140 45052 -40725 -122665 -125745
40971 -125745 -56029 4563 102 -45581 -81694 -93759 -98900 -112176 -136022 -160107 -160302 -120085
40959 -120085 -59851 -20158 -10260 -1218 25382 56874 86989 132566 190741 217098 178557 100882
40947 100882 32002 -18370 -69595 -121987 -155758 -165782 -162304 -144797 -106398 -56976 -12618 27804
40935B7804L6404L238n4110p3678j9821M9633N2810o653n4576n2114k8195j4032
40923a33290m969N808Q785Q503K6697N5384M9037q256o2008n0398J1385M7244
40911d6078J5986m1184n6306j5475L2387L9346J2188o035M183J8866J2364n723
40899c5481j1680o134o203j1168m831J1773J8264O760r191j9854k8723l3172k0463
40886a50103J0547M4486O8946P7647N7969P612l6473k7192K4277N2342K7393l629
40874A53822L586J7967j2875p0872q9848n4971k0529k5695m3748k9443K1101P4853
40862g6652R9186Q0712K8991k4896m7880l2784L0K5611K8164K949l4079m7701
40850A651k1596J0280J068m1273n6614j0487N9226Q5535M3674k8098o5014l4332
$$ plain form
40935 27804 64208 67446 13336 -60342 -80163 -30530 22280 15627 -38949 -91063 -119258 -133290
40923 -133290 -138259 -132451 -123666 -115163 -88466 -33082 15955 7699 -54309 -104707 -93322 -46078
40911 -46078 -30092 -71276 -127582 -143057 -110670 -71324 -59136 -65171 -60988 -42122 -29758 -35481
40899 -35481 -47161 -53295 -59498 -70666 -75497 -63724 -45460 -38700 -47891 -67745 -96468 -129640 -150103
40886 -150103 -139556 -95070 -26124 51523 109492 117104 80631 53439 77716 130058 157451 153822
40874 153822 157408 175375 162500 91628 1780 -53191 -73720 -99415 -143163 -172606 -151505 -76652
40862 -76652 22534 103246 132237 107341 59461 26677 26707 52318 80482 83431 49352 1651
40850 1651 -19945 -9665 -8597 -49870 -106484 -116971 -57745 27790 71464 43366 -21648 -55980
40838e5980K8027M9117O694l4497p956N5759O8192Q148n6870p3927n7366k6931
40826i7590K5874P8843O8828p335n5837j6103L9865J9962l7687l1314K9080L6266
40814E2852l2846p6965l7194J1684r485n8592m9098J4397N6340M6001K0675J4142
40802d8089K2099K8574K1527p551m3985m6932j183M8340N1752K1975N380P865
40790E9772J505j2196n449J4440P655k6980m1267j5063P687j3805n6509o9722
40778a49932l9876O800L9000L6373m4l2981j6547L8843O5589L1213r789K106L7783
40765H538K6362l1765o8533n5383l3861l1595j9735J9333M5615K5226p490m19
40753a23707L6474N0656K5693n485j3962j261J9468L2793J9093k1842n2093l5454
$$ plain form
40838 -55980 -27953 21164 27858 -6639 -14595 41164 109356 117504 60634 -13293 -70659 -97590
40826 -97590 -71716 7127 75955 68620 12783 -3320 36545 56507 18820 -12494 16586 52852
40814 52852 20006 -56959 -94153 -82469 -91954 -150546 -199644 -185247 -128907 -82906 -62231 -48089
40802 -48089 -25990 2584 24111 16560 -27425 -74357 -75540 -27200 24552 46527 51907 59772
40790 59772 61277 49081 43632 58072 65727 38747 -2520 -17583 -9896 -23701 -80210 -149932
40778 -149932 -189808 -183008 -144008 -107635 -107679 -140660 -157207 -118364 -52775 -21562 -31351 -29245 8538
40765 8538 34900 3135 -65398 -120781 -154642 -186237 -205972 -186639 -141024 -115798 -123288 -123707
40753 -123707 -87233 -36577 -10884 -16369 -30331 -31592 -12124 20669 39762 17920 -34173 -69627
40741f9627R176K9971J3540m743k135J369j5647m0747m8820l2757k643K3581K6063
40728a13419M879o372J9194N2921M4225P20j8662L084J6875m443k0987l917P902
40715a8000j8556l9741n034N0151N6077J8513l636n262l0302o9084n5619J6627
40703a03866O2680K5727l8199l9134K9827R5625R5074L0403m4223p2745m9909
40692h740k5612l5544m4558k953N9487O3724K663m5987l9584k0294k0311o169
40680a23878L8027N7736K0646j4479M724K7078j4354p5377o3255J1077M9329J7779
40668f4947j9401j7115k026M817K7290O7292P3639J6119o1628r5368o9422j5254
40656a56004K4062K0260j3981k6778P849M2392K4416j1168O286N6188M8611k3563
$$ plain form
40741 -69627 -60451 -30480 -16940 -21683 -23818 -22449 -38096 -78843 -127663 -160420 -163063 -139482 -113419
40728 -113419 -108540 -114912 -95718 -42797 1428 2148 -16514 -13430 3445 -998 -21985 -25902 -18000
40715 -18000 -36556 -76297 -81331 -31180 24897 43410 39774 34512 4210 -64874 -120493 -103866
40703 -103866 -41186 -15459 -53658 -92792 -62965 32660 127734 158137 113914 41169 -8740
40692 -8740 -34352 -69896 -114454 -117407 -57920 5804 8467 -37520 -77104 -97398 -117709 -123878
40680 -123878 -85851 -28115 -7469 -21948 -17224 9854 -4500 -79877 -143132 -132055 -82726 -64947
40668 -64947 -84348 -101463 -103489 -98672 -71382 -4090 69549 85668 24040 -71328 -140750 -156004
40656 -156004 -131942 -111682 -125663 -152441 -144592 -102200 -77784 -88952 -82666 -26478 22133 -1430
40644a430o2883k4715J5059L4r173M3801Q9439L7870o2990r2387m0035n218k7004
40631a39632l3294K4024Q5637P8926K2376j4045p501N435p176l2155l2078O485
40619d2998M8006M2075q670l8811m442M9228M8165j107k0818J9024N3105J7350
40607A60107n4965p4765j2724O5946Q2468L4066j2046o110K5534K5635q915k8176
40595A96055j5874k0237p0960j17816j01833m7605k1602k5552m949M5757O5232
40584a19384K6187j6005n819L4935M8729K3642l756m754J2040J8526r14l0549
40572a7122l7918j6599J648k215J569L7434O3089K3408n1421p5885l4754J790
40560a06976j892l7L4234N2087K0731j0610N66R117l4412q3038o4829p364O215
$$ plain form
40644 -1430 -64313 -89028 -73969 -73935 -83108 -39307 50132 88002 25012 -67375 -107410 -112628 -139632
40631 -139632 -172926 -148902 -63265 15661 38037 23992 16491 21926 14750 -17405 -49483 -42998
40619 -42998 5008 47083 38413 -398 -4840 44388 92553 91446 70628 89652 142757 160107
40607 160107 105142 30377 17653 83599 166067 200133 188087 181977 207511 233146 224231 196055
40595 196055 180181 159944 88984 -28832 -130665 -178270 -199872 -225424 -230373 -184616 -119384
40584 -119384 -93197 -109202 -115021 -80086 -31357 -7715 -11471 -16225 -4185 14341 13427 -17122
40572 -17122 -55040 -71639 -69991 -72206 -70637 -33203 29886 53294 1873 -74012 -108766 -106976
40560 -106976 -108868 -108905 -74671 -22584 -1853 -12463 -11897 -2780 -37192 -120230 -185059 -192423 -186208
40547a86208k4409k3024K9123O4866M5247J2035L990L5k1198l1927m781L9155
40535i7096O7583P8233P0633K2728o3023j27455j15765m8084J1926L8487N0450
40524a11383N2844K5724k3333m4594r212M3984N6115K5685L326J3776K3616J657
40512E8205k6160j7516J5673K5499P375M583K5861K0348l4721p7685m5049K8785
40500a4802N5192J2563l8280n1339m5008m5971l9528q75N7941R5603Q0708J7800
40488H4004m9593o7296k5510K2368K2595j0354k3735q812k032j0998j960K7527
40476d3796K6583k8027q0253o4992M350N8101N6804J9929j5286l0817l0421k7897
40464a55722l0193k4697L634L8469L9923j207m1616l6457O801M4000M8609L3433
$$ plain form
40547 -186208 -210617 -233641 -204518 -139652 -94405 -82370 -78380 -78345 -99543 -131470 -136251 -97096
40535 -97096 -29513 48720 119353 142081 79058 -48397 -164162 -212246 -200320 -161833 -111383
40524 -111383 -58539 -32815 -56148 -100742 -109954 -65970 -9855 15830 19156 32932 56548 58205
40512 58205 32045 14529 30202 55701 63076 67659 93520 113868 79147 1462 -43587 -14802
40500 -14802 40390 52953 14673 -36666 -81674 -127645 -167173 -168048 -110107 -14504 66204 84004
40488 84004 34411 -32885 -58395 -36027 -13432 -23786 -47521 -56333 -58365 -69363 -71323 -43796
40476 -43796 -17213 -45240 -125493 -190485 -186135 -128034 -71230 -51301 -66587 -97404 -127825 -155722
40464 -155722 -185915 -210612 -206978 -168509 -128586 -129793 -171409 -207866 -201065 -157065 -108456 -75023
40452g5023K8451M8491P4962O7714R987n9738q2478m5783P923L8509M2593L0263
40440H5871N586j9972k9890l0314m2616o0176n1444j6819K156j1847k3364o162
40428a98991J1202m956l7200m7549l3021j4498L213K5433M3558M6994M0509K8271
40416a37035M473k1945k3099P524M1006N4475N1317L1014j1401m3514j7405M3938
40404b0652N5702J010l1355J0014M8138N412o2567o0002p651P137j6426j3663
40392h4903P078k1404q5840r5896l2055K6955L5628K8942K4877n606m7301l2096
40380b81621M2765R0888O8401K9313J2886j6524o7422o8205J3748R3647Q7319
40369E195L0104L702J5736K6078K6846K1680j3008p2339q8660k7908L7790L0742
$$ plain form
40452 -75023 -46572 1919 76881 144595 154582 94844 12366 -33417 -25494 13015 55608 85871
40440 85871 91457 71485 41595 11281 -31335 -91511 -142955 -159774 -157618 -169465 -192829 -198991
40428 -198991 -187789 -192745 -229945 -277494 -310515 -325013 -321800 -296367 -252809 -205815 -165306 -137035
40416 -137035 -132562 -154507 -177606 -170082 -129076 -74601 -23284 7730 -3671 -47185 -64590 -20652
40404 -20652 35050 36060 4705 14719 62857 68269 5702 -54300 -61951 -54814 -71240 -84903
40392 -84903 -77825 -99229 -185069 -280965 -313020 -286065 -250437 -221495 -196618 -202224 -249525 -281621
40380 -281621 -238856 -147968 -79567 -50254 -37368 -53892 -121314 -189519 -175771 -82124 5195
40369 5195 35299 39001 54737 80815 107661 129341 116333 43994 -44666 -72574 -34784 -4042
40357d042j6537k7219m450Q81m195J8826M4832J7756m4649p2689n3715l0978j2957
40344a89136K4494O0239M7442N773J531L5497M1554K032k7038j8385j1545k7335
40332e4877k9577j471J7408M815k937J9684L8765K0685j2241k3558j5657q477
40320d7438m529j401k092N064L4618N8675K6380n0037q5399l0594N8131R5291
40308E6669O7245J9392j5571l1678k3539O981L3650L0476L559k2388l3593k7932
40296F3271p923J1537J0897o358j8039k1294l2063m0104j1723M3728O1056P242
40284F0227o0992p0109k6805M026n801k3819j7432O113K2963K4450J7684J1021
40272e8474M943n990j9537j8768P268M1112N6579N5021N3472M4494R056l1917
$$ plain form
40357 -4042 -20579 -47798 -52248 -51367 -55562 -36736 8096 25852 -18797 -91486 -145201 -176179 -189136
40344 -189136 -164642 -104403 -56961 -51188 -49657 -14160 27394 29426 2388 -15997 -27542 -54877
40332 -54877 -84454 -85925 -68517 -63702 -66639 -46955 -8190 12495 254 -23304 -38961 -47438
40320 -47438 -51967 -53368 -55460 -50396 -15778 42897 69277 19240 -66159 -96753 -38622 56669
40308 56669 123914 143306 127735 96057 72518 79499 113149 143625 147184 124796 91203 63271
40296 63271 55348 66885 77782 71424 53385 32091 28 -40076 -51799 -8071 52985 60227
40284 60227 -765 -70874 -97679 -93653 -99454 -123273 -140705 -134592 -111629 -87179 -69495 -58474
40272 -58474 -53531 -59521 -79058 -97826 -90558 -49446 7133 62154 115626 160120 169176 137259
40260A37259l0369J2754L6417O573l4394l4134j877J9494J3558j1416m7475p4534
40248h144n7565M848N7100M8051o832n2558n6498j9559L8186P4780M9423j8721
40236E2511n5843l1800m699k5225n2084k3672L5264N3903K7125P352Q580J081
40224g507j1264O712M1254L4063j9407n1279k5038Q161r413n6652o8573k4636
40212a83579L1164M3091o40n5181o1078j0899L8673L9925J4794R967K0617R763
40200a03383j7600k0603O322K8414L2439L4331K9310j183l2562j6214L6878O0826
40188C6975L4448M407n898l0196p3853p7534j4423M7687M0714l995j2057K2934
40176c0791M7244L2991j267l1016l7310k393N9073Q7857M6253k3149m8239j8194
$$ plain form
40260 137259 106890 119644 156061 162634 128240 94106 92229 111723 125281 113865 66390 -8144
40248 -8144 -65709 -60861 -3761 44290 37458 -15100 -71598 -91157 -52971 21809 71232 52511
40236 52511 -3332 -35132 -39831 -65056 -117140 -140812 -105548 -51645 -24520 -17168 -8588 -7507
40224 -7507 -18771 -12059 29195 63258 43851 -7428 -32466 -24305 -33718 -90370 -158943 -183579
40212 -183579 -152415 -109324 -109964 -165145 -226223 -237122 -198449 -158524 -143730 -133763 -113146 -103383
40200 -103383 -120983 -141586 -135264 -106850 -74411 -40080 -10770 -11953 -44515 -60729 -23851 36975
40188 36975 71423 75830 69932 39736 -34117 -111651 -126074 -78387 -37673 -41668 -53725 -30791
40176 -30791 16453 49444 48177 17161 -20149 -22542 36531 124388 170641 147492 99253 81059
40164H1059J7834K3508L640k5135n0146n7601m4494k6258j0101J8516N9400P8094
40152F8316N3705J4232r786k9162n2667m4409J5805O7108L7133m3872p5832k8795
40140b8224K6008K9492M675n038j989r126k7101m5068n9816o5698n6031m3489
40128b81405m5083m3486m924N8834R2023O8185J8043k2733m4563l6008J5312P6110
40116a49695Q3376L3364n897L2L504k5406k7523M5291J22728J04031J6196j9173
40104A80828L3295P7656L7324m2176p7414n8291k7102m408J0377N597k1630l8706
40092G5350k1281j968k4759o5716n5622J6468P5943N8291q462m5907k4226J4093
40080g796J9832n564k5429j9875m571j384p098k170J6439K7924J6915n412j9599
$$ plain form
40164 81059 98893 122401 126041 100906 50760 -6841 -51335 -77593 -87694 -69178 -9778 68316
40152 68316 122021 136253 126467 97305 44638 229 16034 83142 120275 76403 571 -28224
40140 -28224 -2216 27276 31951 26913 24924 15798 -11303 -56371 -116187 -181885 -237916 -281405
40128 -281405 -326488 -369974 -374898 -316064 -224041 -155856 -137813 -160546 -205109 -241117 -225805 -149695
40116 -149695 -66319 -32955 -38852 -38820 -35316 -60722 -88245 -42954 79774 183805 200001 180828
40104 180828 214123 291779 329103 286927 209513 151222 124120 119712 130089 135686 114056 75350
40092 75350 54069 52101 27342 -38374 -93996 -77528 -1585 56706 48244 2337 -21889 -7796
40080 -7796 12036 6472 -18957 -38832 -43403 -44787 -51885 -54055 -37616 -9692 7223 1811 -17788
40067a7788k3532k4528j8033K849K2337J4069j7602l4248j2203K6391M4306L1777
40055f205M663j9292k4656m41L6992M2878j220m6087k9270L4366O4159K5476j9073
40042F2290Q88O1949P9942K5896m0077n4260k6487r916k0103j9013K0629O5483
40030A47221N9215l89n2050m7743j1286L398r454r205J9450M1773K9898L919m325
40017A70422L956R810R083M487r592k7942k5582K504J9240q37k1891L415N5593
40004A92666P4964N4765M4277N7479M7580n814m8671l1465J4835L0201J4000O859
39992D51676J1489n714m3362n7809l4826j2976j5954j1688K8108O7562N1640j0788
39980D17358n8398o5097o5711q4778q9055m1457L2123P0533N4838J8661r127k9150
$$ plain form
40067 -17788 -41320 -65848 -83881 -81032 -58695 -44626 -62228 -96476 -108679 -82288 -37982 -6205
40055 -6205 -1542 -20834 -45490 -45931 -8939 33939 32719 -13368 -42638 -8272 55887 81363 62290
40042 62290 63178 125127 205069 230965 190888 136628 110141 100225 80122 61109 81738 147221
40030 147221 206436 206047 153997 106254 94968 98366 88912 79707 99157 140930 170828 174747 170422
40017 170422 174378 184188 193271 197758 188166 160224 134642 137146 156386 155549 133658 137073 192666
40004 192666 267630 322395 366672 424151 471731 465917 417246 385781 400616 430817 444817 451676
39992 451676 463165 457451 414089 356280 321454 308478 292524 280836 308944 376506 428146 417358
39980 417358 358960 293863 228152 143374 54319 12862 44985 115518 170356 189017 179890 150740
39968A50740l8966k1354J9465M6785L6519M149k8740n9447p6186m9252J4550M9881
39956D8144J4183m2387m5329n791O642j8413k4687J675O149k9136m3073j478L5454
39943i8047J3009j9910R235O9974P2131P584m2261l2486k105J0253J6379K3812
39931B7568N366m2174o8096l6520J8902M4773L4462J3148m900r478J7203O5099
39919F5353Q1892L7398k4828m3704k2571p797j0639o832L586l65m192K7244P2980
39906A67525O4314r048o8208n5421j4156j1699l6250l3896p269j799j3648P726
39894a1829O2160Q0969L0636l1142m1961k4884m0840q6391r9449n5728k727J1616
39882b09570n13J042K2237L3599J8029p097j6260n112J2905K5462K5810Q241k2865
$$ plain form
39968 150740 111774 90420 109885 156670 193189 197338 168598 109151 32965 -16287 -1737 48144
39956 48144 62327 19940 -25389 -31180 -24538 -42951 -67638 -65963 -59814 -88950 -132023 -133501 -98047
39943 -98047 -85038 -104948 -95713 -25739 46392 53976 11715 -20771 -22876 -12623 3756 27568
39931 27568 32934 -9240 -77336 -113856 -94954 -50181 -15719 -2571 -7471 -16949 254 65353
39919 65353 147245 184643 159815 116111 93540 85743 75104 68272 71858 71493 67301 94545 167525
39906 167525 231839 222791 154583 99162 85006 73307 37057 3161 -4108 -5907 -19555 -11829
39894 -11829 50331 131300 161936 130794 88833 63949 23109 -63282 -162731 -218459 -221186 -209570
39882 -209570 -210083 -209041 -186804 -153205 -135176 -142273 -158533 -163645 -150740 -125278 -99468 -91227 -114092
39869a14092m0925j6803L7919O7075L1960l3360n5691r808N4760P7398M9081K199
39857D9713l2966m1213j5449L3249O6901M9199j3280p2324q2789m0375J9010M8615
39845c1709K6825k4234n8005m7458o403L2228M5887K8492j0602m1363k8306K7839
39833h6809P7859P5380L1600j164O555L2688L4643n406o1645q3261m4334J7206
39821f688L2010j4886n6969k9261M6702R3218P1974J3965k9544k8770J6745P1295
39809A79791P5837J0158o7851q8251o0719m7446n6988l4703L4648Q6853O7424
39798I8753K644m8056n9453l2387K6535P9993O7411j5016q4016o8703m295K4904
39786a1686L117j5633k168J4888O814j7381l5566l5944j3325K5928N5553N3313
$$ plain form
39869 -114092 -155017 -171820 -133901 -66826 -34866 -68226 -123917 -133725 -78965 -1567 47514 49713
39857 49713 16747 -24466 -39915 -6666 60235 109434 96154 23830 -58959 -99334 -80324 -31709
39845 -31709 -4884 -29118 -87123 -134581 -140984 -108756 -62869 -34377 -44979 -86342 -114648 -86809
39833 -86809 -8950 66430 98030 96866 103421 136109 170752 165346 103701 20440 -23894 -6688
39821 -6688 25322 10436 -46533 -75794 -29092 64126 136100 150065 120521 91751 108496 179791
39809 179791 255628 265786 197935 109684 48965 1519 -55469 -90172 -55524 31329 98753
39798 98753 101397 53341 -6112 -38499 -11964 68029 135440 120424 36408 -32295 -36590 -11686
39786 -11686 -8569 -24202 -26370 -11482 -4668 -22049 -57615 -93559 -106884 -80956 -25403 27910
39774B7910K8961M759j8862m8753o5671m3442O042M2884M9038L5895J1360k3277
39762F844n0025m7682k7416j7612j4463J2643O3696R5943P9154L0655j3052l1136
39750H7549k0789M710J5609o700l8131l8209q494J0633L564j404J5024L3313L3332
39737I0007K2258N583k9834p8653r9973o9132j7295J3193K7073N2955Q1830P2400
39725G0412J5335m3489n2768r678M1285N1692J1344m2888o1355l1804Q496J6831
39713b6587n591j8411O057M5909N1246L579n4436o2808j6490K9573L5220K1946
39701I207K1703J6822k1566o2908n0417K974K2602j4404m4505k0653K0293L2880
39689h7972L9754P4379R9199N4436l8112r0466n9699J2104O3181O7235K9133k4514
$$ plain form
39774 27910 56871 61630 42768 -5985 -71656 -115098 -109056 -66172 -17134 18761 30121 6844
39762 6844 -43181 -90863 -118279 -135891 -150354 -137711 -74015 21928 101082 131737 118685 87549
39750 87549 66760 71470 87079 80379 42248 4039 -4455 6178 9742 8338 23362 56675 90007
39737 90007 112265 117848 88014 9361 -90612 -159744 -177039 -163846 -136773 -83818 -1988 70412
39725 70412 85747 42258 -10510 -20188 21097 72789 84133 41245 -20110 -51914 -43418 -26587
39713 -26587 -32178 -50589 -44532 1377 52623 56202 1766 -61042 -77532 -47959 -12739 9207
39701 9207 30910 47732 26166 -36742 -87159 -84185 -61583 -75987 -120492 -141145 -120852 -87972
39689 -87972 -48218 26161 125360 179796 141684 51218 -8481 3623 66804 134039 163172 138658
39677A38658n0884l1156l184j2491l9634k8686J6844L0538j3105n5240m0526O809
39665h2057L1836K7694K1097J5364j350j3237N563L8890M2255J1063p789J5307
39653A04636M8183M2698P05l2419k8927o485O440Q007R832K355l6545r3235j09126
39640h3881m6975M8243Q9339M8658j2861k7434J578K3383J1883j7884m6626o6345
39628g8922o4853l2194J2015K9237J1239p113K682K4502K5661K449k3119l6024
39616a34440l5450k1712N79J4856J1061M643J4283K9147K5752R542N204R187n439
39603g2787l1099k1777L2386P5223O5150M2769O7461J18032J18945N2442j9869
39592D26876m9870n5184o2839o0340l6089k0966m4269p7119o7163j7728J0960
$$ plain form
39677 138658 87774 56618 53434 40943 1309 -27377 -10533 20005 6900 -48340 -88866 -82057
39665 -82057 -50221 -22527 -1430 13934 12584 -653 4910 43800 86055 97118 89329 104636
39653 104636 152819 195517 196222 163803 134876 128391 134831 142838 152670 155025 118480 25245 -83881
39640 -83881 -130856 -82613 6726 55384 42523 15089 16667 40050 51933 34049 -12577 -78922
39628 -78922 -143775 -175969 -163954 -134717 -123478 -130591 -127909 -103407 -77746 -75297 -98416 -134440
39616 -134440 -169890 -191602 -191023 -176167 -165106 -160463 -146180 -117033 -91281 -81739 -76535 -67348 -72787
39603 -72787 -103886 -125663 -93277 -18054 47096 89865 157326 275358 394303 446745 426876
39592 426876 377006 321822 258983 198643 162554 141588 97319 20200 -46963 -64691 -53731
39581e3731j7589o7274p4124k1886M1899O1133L0737o754j8742j6044j9062j6784
39569a78221R137L6885K6277j4539l3835j7118j0384l8902n5032r114O7304J00879
39557a16663P5572M0180K8372K1958l858m0516o2410n6471k8206L876J9765J8437
39545i9964J9904L2807L6462J6215m816r56R603m726k6904j1697L3916M6705j497
39532D5052n7439n8285j2496K2949K0345J887m871m32q07j1866k4447k8607k5716
39519a34733k2807j8686p730J222j0070l4777l5645M920N2174O4374M8743L6980
39507e6035K7262k079l6192l7072q733R401J5211M3644Q2257O2981k6208r2135
39495a7698n6389K9030N4369M184l8630k5015J731j0328m4763n3874l0851q762
$$ plain form
39581 -53731 -71320 -138594 -212718 -234604 -192705 -131572 -100835 -107589 -126331 -142375 -161437 -178221
39569 -178221 -169084 -132199 -105922 -120461 -154296 -171414 -181798 -220700 -275732 -284846 -217542 -116663
39557 -116663 -41091 -911 27461 49419 45561 5045 -57365 -113836 -142042 -138166 -118401 -99964
39545 -99964 -80060 -47253 -10791 5424 608 -348 9255 4529 -22375 -34072 -156 46549 45052
39532 45052 -12387 -70672 -83168 -60219 -39874 -37987 -42858 -43290 -44097 -55963 -80410 -109017 -134733
39519 -134733 -157540 -176226 -183956 -182734 -192804 -227581 -263226 -258306 -206132 -141758 -93015 -56035
39507 -56035 -28773 -30852 -67044 -104116 -112849 -103448 -88237 -44593 37664 100645 74437 -17698
39495 -17698 -74087 -45057 9312 13496 -25134 -50149 -48418 -58746 -103509 -157383 -188234 -196996
39483a96996n969l886J9748N3167N9393K3775k1385l6184k5608k1916k0546J6375
39471a60032P8787R1139J9165n7283m3484L1635N4345r365p2251n9028p9L9013
39459h7438N0446N8841N8322L2674K455m026k317k2857n1345n1599l1791k9787
39447g8422m1356k6017J3455K4424o151k2189R046L7124J0387l4302k8521J6363
39435a26159K9303m735k6895o547J3631k514k5610j8041L959J0059J3897M0237
39423i9415O6106M9590j183l8629m2479k7988o13M2410P0094L8766l3489o9724
39411d6554l4649J5640J3865k9466n3775l3905L126K8256L6922L2651J9942J5486
39399c2461L7015P1453P5033K1010o0154j03161p5251j2781K0761Q572q652N41
$$ plain form
39483 -196996 -202965 -206851 -187103 -133936 -74543 -50768 -72153 -108337 -133945 -155861 -176407 -160032
39471 -160032 -81245 9894 29059 -28224 -71708 -40073 14272 4907 -67344 -126372 -126451 -87438
39459 -87438 -36992 21849 80171 112845 115300 111274 108957 86100 34755 -16844 -48635 -78422
39447 -78422 -119778 -145795 -132340 -107916 -114067 -136256 -127210 -90086 -79699 -114001 -142522 -126159
39435 -126159 -96856 -101591 -128486 -135033 -121402 -123916 -149526 -167567 -163608 -153549 -139652 -99415
39423 -99415 -33309 16281 15098 -23531 -66010 -93998 -94611 -52201 17893 56659 23170 -46554
39411 -46554 -81203 -65563 -51698 -81164 -134939 -168844 -165718 -137462 -100540 -67889 -47947 -32461
39399 -32461 4554 76007 151040 172050 111896 8735 -66516 -79297 -58536 -49964 -58616 -58075
39387e8075J2807n016l4433l0288Q251L8938M3640M4720N1049L9546M577k2587
39375I3129k2995j4559q609J0147L7040L3437p363l2207q436J8450M75k6442J543
39362G3610O7667R5641O1346J2476j5239l3304n2011n9495n4381m5436k0093K9745
39350F0526N7829J2438o2028n7063M3418J23510R4650J4837j2631R550N509l4581
39338B55964m2898Q028N9754N5257R455k9608m3282m1200l2257k3246k5188l8105
39326A12674m1359j6788K4139M8779L8823J1485J400J8844L1644L196n1555p2327
39314A08955k9389L0969M2843M954k5281j3128J7200L1321L0476L0704K7070O239
39302B62933k1624l0707j5149K593j769l1917p1650r5886q4725m0168J1433M3515
$$ plain form
39387 -58075 -45268 -50284 -84717 -115005 -106754 -67816 -24176 20544 71593 111139 115716 93129
39375 93129 70134 55575 46966 57113 94153 127590 120227 88020 79584 98034 98509 72067 73610
39362 73610 141277 236918 298264 310740 295501 262197 210186 150691 96310 50874 30781 60526
39350 60526 118355 130793 68765 11702 55120 178630 273280 288117 275486 285036 290545 255964
39338 255964 213066 221094 280848 336105 345560 315952 272670 231470 199213 175967 150779 112674
39326 112674 71315 54527 78666 127445 166268 177753 179153 197997 229641 232837 181282 108955
39314 108955 79566 110535 153378 158332 133051 119923 137123 168444 198920 229624 256694 262933
39302 262933 241309 210602 195453 198046 196277 164360 92710 -3176 -87901 -128069 -116636 -73121
39290g3121N3286N2359M2226J8578m519k971J7787K0326j0040l4877j5584K4205
39278H7655K8814o547l0033j5474n64j9699m4091l0145M099L983l2339m4167M476
39265i4032P3253R9183O7739J1030l4378m4886j3586L2661M0845p652n7597m1372
39253C1208K4493N0541o475q1674q9127l3515J1085J1485N594K1975L1377N562
39241a7471k5919k1305N835J5150J1622L0731O2194N3518k361m5229l5972j1478
39229A9315j8614m1712l7582n029K4956L9560M1942K5030q869k6332o198J7798
39217B4265N421k2550k0070K419k196k8438k3278J6798L0227q515m2589j9989
39205h8495L2527O0964N9409N2071M1283J7097j0567k7184l6965m2022k6410J0847
$$ plain form
39290 -73121 -19835 32524 74750 93328 88809 85838 103625 123951 113911 79034 63450 87655
39278 87655 116469 109922 79889 64415 63851 44152 61 -30084 -25985 -22002 -54341 -98508 -94032
39265 -94032 -20779 78404 146143 157173 122795 77909 64323 96984 137829 130177 72580 31208
39253 31208 55701 106242 99767 18093 -71034 -104549 -93464 -81979 -76385 -54410 -23033 -17471
39241 -17471 -43390 -64695 -58860 -43710 -32088 -1357 60837 114355 111994 66765 30793 19315
39229 19315 701 -41011 -78593 -83622 -58666 -19106 22836 47866 38997 12665 6467 24265
39217 24265 29686 7136 -12934 -10515 -12711 -41149 -64427 -47629 -17402 -25917 -68506 -88495
39205 -88495 -55968 4996 64405 116476 157759 174856 164289 137105 100140 58118 31708 42555
39193D2555L7778L4844K6914L9140N5375N5078N4042O6160O2607K1653j4810K604
39181D83940M3283L6429j4298l2935P976M5709K8956q189j1988P260P070j0041
39169E83172o538K0271K9671K60l7372m2744j6460N973L47k0572k7803j2131J0175
39156D86249K3712K8780K3879m530n3862q3531n3261K0607P8172Q6550O5800M0838
39144F59403P508l4769n4448k7263J7776K9331L83l1056m1958m6776n6323n4097
39132C67711l1850j6286l2075n9720o2078l9387k2858j9268k021L5603N8098L9240
39120B15109L885r588l322m219j4796j8317j9266l4887n0723l1290J8428M7248
39108I8262K9154q44m257N476m188k6965k9691o089J4463N945k7278n5067m1896
$$ plain form
39193 42555 80333 115177 142091 181231 236606 291684 345726 411886 474493 496146 481336 483940
39181 483940 527223 563652 549354 516419 524395 570104 599060 590871 578883 586143 593213 583172
39169 583172 576634 596905 626576 626836 589464 546720 530260 536233 536580 516008 488205 476074 486249
39156 486249 509961 538741 562620 558090 504228 420697 367436 388043 466215 552765 618565 659403
39144 659403 666911 632142 577694 550431 568207 597538 597921 566865 524907 478131 421808 367711
39132 367711 335861 319575 287500 227780 165702 126315 103457 84189 82168 117771 175869 215109
39120 215109 218994 209406 206084 201865 187069 168752 149486 114599 63876 32586 51014 98262
39108 98262 127416 126572 122315 127791 123603 96638 66947 60858 75321 81266 53988 -1079 -42975
39095d2975J9515Q2494Q0832R425n7264n3862k369L1158K7429J4853L013k5431
39083H6818o0235n8379o479N4010P8029O0073J8264k8341n5728m5445j6477j5222
39071A0888n5539r6150r4165n3383k457M3850P6979P6965L6977j0372k4166n852
39059i6425Q391Q60r253j132J9389L4735M0103M1148L7415K0576j1337m3489n0385
39046i404j6331M3360Q2006N6497k2845q3363n5761M1231J06275P0268j4264l9022
39034A58647J4713N3936J0936o0901p2348k7514l38j1633j0472K3304L8699J700
39022A18729m2100l5689M721K0498l491k9367k5735L203L7572N6178L9014j0953
39010A32580n2831m7568j2249j733l1217n2143k2409K9290L9553l589m4950l5499
$$ plain form
39095 -42975 -23460 59034 139866 149291 92027 38165 35796 66954 94383 109236 112249 86818
39083 86818 26583 -31796 -38275 15735 93764 153837 172101 143760 88032 42587 26110 10888
39071 10888 -44651 -140801 -234966 -288349 -290806 -246956 -169977 -93012 -56035 -66407 -90573 -96425
39059 -96425 -88034 -87174 -96427 -97559 -78170 -43435 -3332 37816 75231 95807 84470 40981 -9404
39046 -9404 -25735 17625 99631 156128 133283 49920 -5841 35390 141665 211933 197669 158647
39034 158647 173360 227296 238232 177331 104983 77469 77131 65498 55026 78330 117029 118729
39022 118729 76629 40940 45661 66159 62668 33301 7566 10769 48341 104519 143533 132580
39010 132580 79749 32181 19932 18199 -13018 -65161 -87570 -58280 -18727 -22316 -67266 -102765
38998a02765Q384L5194K6986J1759J5246K9447L4232K4871N727k1910m8503n1499
38986c2831k4290L995K839j4985j0737K2491M8843M0321J2490M58J8568N3194
38974A20356Q0536Q2752N7595J9393j5013m0996o0269o7765n8918m4524l9947
38963C3200m1226l0038k596K3359L1818K4623J4133J1718K0381K7633J3485k1014
38951A05476m4312l0358Q136M0426N4603N1018K1996k6410n2440k4585K1122J9789
38939A44461k9145n9477l4791M593O928k3490m5023l0843J3811N7870O1207J6445
38927H2546k6432j6672K0488J5072m1677q6178q2576n9643l2036K8826J09017
38916h9265J27292N7105p187J6026O6586M1810l3153m9178L971K3997l1695p9642
$$ plain form
38998 -102765 -94381 -59187 -32201 -20442 -5196 24251 58483 83354 89081 67171 18668 -32831
38986 -32831 -57121 -53126 -50287 -65272 -76009 -53518 -4675 35646 48136 48594 67162 120356
38974 120356 200892 283644 341239 360632 345619 304623 244354 176589 117671 73147 33200
38963 33200 -8026 -38064 -40660 -17301 14517 39140 53273 64991 85372 113005 126490 105476
38951 105476 61164 30806 38942 79368 133971 184989 206985 180575 128135 103550 124672 144461
38939 144461 115316 55839 21048 25641 32569 9079 -35944 -66787 -52976 4894 66101 82546
38927 82546 56114 39442 59930 75002 33325 -52853 -135429 -195072 -227108 -198282 -89265
38916 -89265 38027 95132 87945 103971 170557 212367 179214 130036 134007 158004 126309 46667
38904D6667n0016Q625J9611l126O926O0179J03587R5636L8373m4902j17685j31994
38892C1881p1196J1689M2594J8088N578L7695N4102j0080j09997j29168l2363
38881a51177Q4285J21160R1339O0677L0470l7557j11561j08443k8886K4463n105
38870c0335m9911l2799K0384M3932L7407L4599K4869j3496m4392k2504J9812J7498
38858E064j7518j6170L0892O1327M5425K2333K2939K8411K0005Q354o43j5079
38846A95340k4022p575J7340J5523m117m841M183j8170n7622n3399n697J3882
38834G0825j6111k6296K0705N5569J3022n6683o2408m597M3333M6873K8175r31
38822A11476m7019q4982o7685O490Q1410J03486O3954r329o7085n8808J8251R3747
$$ plain form
38904 46667 -3349 5276 24887 21761 28687 88866 192453 288089 326462 281560 163875 31881
38892 31881 -39315 -27626 14968 33056 38634 76329 130431 120351 10354 -118814 -151177
38881 -151177 -66892 54268 145607 206284 236754 199197 87636 -20807 -49693 -25230 -30335
38870 -30335 -80246 -113045 -92661 -48729 -11322 23277 48146 34650 -9742 -32246 -12434 5064
38858 5064 -12454 -28624 2268 63595 109020 131353 154292 182703 202708 211062 210419 195340
38846 195340 171318 163743 181083 196606 192489 187648 191831 173661 116039 62640 56943 70825
38834 70825 54714 28418 49123 104692 117714 61031 -1377 -5974 37359 84232 112407 111476
38822 111476 64457 -20525 -88210 -81720 -310 103176 167130 157801 90716 31908 50159 143906
38810A43906Q9362J1704n6267n9467k7249j4201k3132j6691J5268L8271K7741
38799A29245J0431K5652N7643M4611l2747j07973j06852m3914K929M13j0936K839
38787b8659J8093O008j2277j81L5009N4643M3679K1263O176k74P94J4671L8505
38774A97450M8254J5368n3089j00210p3473R35L5172q183o3716n8479j2003J5176
38762e6798K5609N5343P3993J8511q0085j11949m5115L5626O8535Q4823J02913
38751A71406P0955j9792p2690k5002L9983J8215n2260o0740J161M5486L0630q441
38739A38911m4741p1536n2569L5017J19241R8668r291q1618n7759j763J5111L93
38727H8064j5725l6554o1164n8545j8582K1469L0247J8798O451n012j0350M91
$$ plain form
38810 143906 233268 244972 188705 129238 101989 87788 64656 47965 63233 101504 129245
38799 129245 139676 165328 222971 267582 234835 126862 20010 -23904 -20975 -20562 -31498 -28659
38787 -28659 -10566 -4558 -16835 -17016 17993 72636 116315 137578 143754 143480 144274 158945 197450
38774 197450 245704 261072 207983 107773 34300 35235 70407 62224 -1492 -59971 -71974 -56798
38762 -56798 -31189 24154 98147 116658 36573 -75376 -120491 -84865 -16330 68493 171406
38751 171406 242361 222569 149879 124877 164860 183075 130815 70075 71236 116722 147352 138911
38739 138911 94170 22634 -29935 5082 124323 222991 213700 132082 74323 72560 87671 88064
38727 88064 72339 35785 -25379 -83924 -102506 -81037 -50790 -31992 -25541 -30553 -40903 -40412
38715d0412J4637J2321R348K9895M4531N931n5779n8650j435K3662j9690m7588
38703h3229O543Q0898Q5992M2298K8761M6164K7597m1015j00061j08217p9575
38692i3844l1269L3681Q4345P2380P317l4783q048M1573M5485Q377q551J7599
38680A34262M1648K2079j6492j9148K0834N2818L6883j0178m7324n9358n4844
38669A01180l8556j4942l153j7154l9186m1169k3705n655J2988M2437O6511N5981
38657I5577J7683r033p694k49n339j6965k4952j9875J7532Q6525J31091R1855
38645C56156k823o0339m9890l5643o1265p8605l7981J9752K7433j520k565L4257
38633A06967N7887L9607J187l1435m7864l3657J5908O4375O5340K6553j202J086
$$ plain form
38715 -40412 -25775 -13454 -4106 25789 70320 76251 20472 -38178 -39613 -15951 -35641 -83229
38703 -83229 -76686 4212 90204 132502 161263 207427 235024 194009 93948 -14269 -93844
38692 -93844 -125113 -91432 -7087 65293 72610 37827 29779 71352 116837 125214 116663 134262
38680 134262 175910 197989 181497 162349 183183 236001 272884 262706 215382 156024 101180
38669 101180 62624 47682 44529 27375 -11811 -52980 -76685 -82340 -69352 -26915 39596 95577
38657 95577 113260 104227 96533 96284 90945 73980 49028 29153 46685 133210 264301 356156
38645 356156 353333 292994 243104 207461 146196 67591 29610 49362 76795 75275 72710 106967
38633 106967 164854 204461 205648 174213 126349 92692 108600 172975 238315 264868 263666 264752
38621B64752L729j0516j8759o054M474o352j8385p910Q799N52k6619l6179j5250
38608A36282Q721J1042L483R537K5251K9029K0289J6453J1107k3724p5570p7454
38596I4446O63Q2650P3146m637l7158J0191M2710r457p4965n0336L8984P9861
38584B46098M1962P385K8766N1614J1923n9051p9728k9713L2791M9667K1153j1024
38572C11843j2648J3959L6668K7685m626k3431p727J9789J8939j8882n9226o3188
38560B39155k8964R444J9414n71k4342k2640J2632N6033O2574J4031m5805n0192
38548B40769L415L8950K090n9080n8987M824N4588M5663J3387K348J1458K4442
38536C23867L5692K5177l2985j09028j23166m8950M2932Q2611Q5883R3941Q8461
$$ plain form
38621 264752 268481 257965 239206 233152 237626 231274 212889 204979 213778 214330 187711 151532 136282
38608 136282 145003 156045 159528 169065 194316 223345 243634 260087 271194 247470 171900 94446
38596 94446 95109 177759 250905 246268 209110 219301 262011 252554 177589 127253 166237 246098
38584 246098 288060 295445 324211 375825 387748 328697 248969 219256 252047 301714 322867 311843
38572 311843 299195 313154 349822 377507 372881 349450 341723 361512 380451 361569 302343 239155
38560 239155 210191 219635 239049 238478 214136 191496 204128 260161 322735 336766 290961 240769
38548 240769 244184 283134 285224 226144 167157 171981 226569 272232 285619 287967 299425 323867
38536 323867 359559 384736 351751 242723 119557 70607 113539 196150 282033 375974 464435
38525D64435L5347l0617m2750k308K7885J6188j3218l6234m9129m1616p742K2069
38513C42310J4081j0750o245K0677K1104j1860l4795l1407l1859m4003l0849K1183
38501B17587O8010O8768L5653j04k9641n1809n6876m7463m1945m0469k2495R553
38489A08769K4927J7091J6693L3305L2511p81k3140L534M5380L9465j7568o5629
38477B14557n7193n420M0696M7908K5915J2055K5531M0802K2294k2218n0938m5692
38465B48297k4449O41L1270M4873N190o8383r7582m7102J7160J5544l6258n4306
38453C4895K50Q0454J14063O9729k5343j04203j08922m5996J9673M1828L7942
38442A14370L8618L2759K158k5025r505L0056L7822K059l4740m3077l4154j8973
$$ plain form
38525 464435 499782 469165 426415 424107 451992 468180 454962 418728 369599 327983 320241 342310
38513 342310 356391 345641 339396 360073 381177 369317 334522 303115 271256 227253 196404 217587
38501 217587 285597 354365 390018 389914 360273 308464 251588 204125 162180 121711 99216 108769
38489 108769 133696 150787 167480 200785 233296 232515 209375 212909 258289 297754 280186 214557
38477 214557 157364 151944 192640 240548 266463 278518 304049 344851 367145 344927 293989 248297
38465 248297 223848 224489 255759 300632 305822 237439 139857 92755 109915 125459 89201 34895
38453 34895 35145 115599 229662 299391 274048 169845 60923 14927 34600 76428 114370
38442 114370 152988 185747 187905 162880 153375 183431 221253 223312 188572 145495 111341 92368
38430I2368R652M2018M3552L722l9529m6979k6879j5669k5839l3518j3373K6638
38418A6164M8828K5935k3090m9992l5745j2809j3426j8845R404O2738Q9101O1935
38406A60198R614k9367m7027m9637l1397J2652O2218Q0680M8202j8479p5832q6046
38394C5779m9597l838J8352K0596K2986K4699R981j6891l0879k1111k905O491
38382A3663L434q915j9924q757K8371N2036J9516m4304o0159L002P9396Q8798
38370A46157L2996k4999m8257m8179l8526j8494J18m161k2568j8684J3779L2150
38358A332P739k3316o582N1244Q8538P0345K5894k265q995n511J8761P3730J24076
38345D14990J15088M8805q680j4225k502k3337n9600n5252n335L8420M9665N7243
$$ plain form
38430 92368 102020 144038 187590 191312 151783 104804 77925 62256 36417 2899 -10474 16164
38418 16164 64992 90927 67837 17845 -17900 -30709 -44135 -62980 -53576 9162 98263 160198
38406 160198 169812 140445 93418 43781 12384 25036 87254 167934 216136 197657 121825 35779
38394 35779 -13818 -17656 696 21292 44278 68977 78958 62067 31188 10077 7172 13663
38382 13663 17097 8182 -11742 -20499 7872 59908 79424 35120 -25039 -22037 57359 146157
38370 146157 179153 154154 105897 57718 19192 698 816 -3345 -25913 -44597 -30818 1332
38358 1332 9071 -14245 -20827 30417 118955 189300 215194 212929 203934 198423 217184 290914 414990
38345 414990 530078 578883 570203 555978 553476 530139 470539 415287 409952 448372 498037 555280
38333E55280P8994Q1882M0925n468j792N0206J04087J35435J56156J77173J97020
38322A569898K20045K53515K96232L56108M56880N99031P58248R72316J352183
38313F834456J868521K150123J700226M44120j037753j968611k051736j614576
38305F324770j150243q67056o86259n05165l39072k55783k68474l11032k97873
38296A643813k10496j20840j04258j39544j40064p9859k7806m2061r0998j08501
38286E79386p7856k8911M603m418o3382j25763j16185k6252N8795O7103K7338
38275B94458N479N280r260l3285l1748o042J4458L0003N8814Q2290O3121J0679
38263D84247k7912l6019l3677k4378N788L7609K6602k9721q0864q8116o0219k2459
$$ plain form
38333 555280 634274 716156 757081 751613 749821 800027 904114 1039549 1195705 1372878 1569898
38322 1569898 1789943 2043458 2339690 2695798 3152678 3751709 4509957 5482273 6834456
38313 6834456 8702977 10853100 12553326 12997446 11959693 9991082 7939346 6324770
38305 6324770 5174527 4307471 3621212 3116047 2776975 2521192 2252718 1941686 1643813
38296 1643813 1433317 1312477 1208219 1068675 928611 848752 820946 778885 687887 579386
38286 579386 501530 472619 477222 472804 409422 283659 167474 141222 200017 267120 294458
38275 294458 299937 305217 295957 262672 230924 224882 239340 269343 328157 410447 473568 484247
38263 484247 456335 420316 386639 362261 368049 405658 432260 402539 321675 233559 173340 150881
38251A50881Q577J8700N031q277J116J6170R202o201K431K7096L3444J9553N948
38238B83671j5208n6595p8855l4147M1611O2980K1714p668M980Q122k1659l2303
38226A76643K162K5212m482l9865k8427L318R907O893K5468M3216K6962k444j1610
38213B32953j6881m2411n8238k6652K4512M0024J8867l751k5084n8614p4183k7508
38201a6966N7760J02137O9311N561k4678p907J5766l136p0421j28363j10881k8732
38189a40549L6374L7394J4481J9629M4571N8098N8566M8017J2153k7908r448O8261
38177B19639J02867K6199q0663r7443l3343J4090K0510L9389P4069O8986K5214
38166C79514Q114K7239J7041l8507o3386j0371O0739P0681K0011l9298p5097q1876
$$ plain form
38251 150881 159458 178158 183189 174912 176028 192198 201400 195199 197630 224726 258170 277723 283671
38238 283671 268463 211868 133013 98866 140477 203457 225171 217503 222483 230605 208946 176643
38226 176643 178805 204017 199535 159670 131243 134561 144468 151361 176829 220045 247007 244563 232953
38213 232953 216072 173661 115423 88771 113283 153307 172174 168423 143339 84725 10542 -16966
38201 -16966 40794 142931 212242 217803 193125 185218 200984 197848 127427 -936 -111817 -140549
38189 -140549 -104175 -66781 -52300 -32671 11900 69998 128564 176581 188734 160826 151378 219639
38177 219639 322506 348705 268042 170599 137256 151346 171856 211245 285314 354300 379514
38166 379514 387628 414867 431908 393401 330015 319644 380383 451064 471075 431777 356680 274804
38154B74804o4480m4651m2958l7867R083P4730Q0172l31r1497j09362n5725Q619
38142E37M1510L8530J1049k1035l6189l1633j9639n32L0591N0565K4546l4926
38130E3374o8157m2644J0729M8926O4435O6083N3353L3333K9441M6688N2765J8324
38118C66650l9637p3673n6627o944L1073L1077J2059J2262L2392L0028j4365n7379
38106B66916m6764J1341O9751R7297Q7382M2566j1749l1813j3708r546m4213o5462
38094C51998l1643P948l795k2023K9026J12632J18427L1801m3382l5719J6559
38083E31829N0021M9738K4932j0970k5017J464K5340q48l8107j3960M9171O0705
38071G04298J0950j7433P794K9340K0610K8711O8246Q3168N2372L1335N1275P5940
$$ plain form
38154 274804 210324 165673 122715 84848 93931 168661 248833 248502 157005 47643 -8082 537
38142 537 42047 80577 91626 70591 34402 2769 -16870 -17402 13189 63754 88300 53374
38130 53374 -14783 -57427 -46698 2228 66663 132746 186099 219432 248873 295561 348326 366650
38118 366650 327013 253340 196713 189769 220842 251919 263978 276240 308632 338660 324295 266916
38106 266916 220152 231493 301244 398541 485923 528489 516740 484927 471219 461673 417460 351998
38094 351998 320355 328303 324508 302485 331511 444143 562570 594371 550989 515270 531829
38083 531829 581850 631588 656520 645550 620533 621997 647337 646489 608382 594422 643593 704298
38071 704298 715248 697815 705609 734949 755559 784270 852516 935684 988056 1019391 1070666 1146606
38059A146606R4179J51596K46882K97373K55743J67442P0415o0134k16714l12678
38049A840710k95130k19862j58141j11780o9758n8952q2448r0737o5637n1355
38039F36910o1046m5361L390J7916k3920n0425k0507J0443M415P015L9126M1546
38027E59502l084j5800L3312N1922j2671o6113k5770L5775K2997k0800j0401K4911
38015E73780J3501j9332j3880K628j7811l3771P220N5762M5940J6923K9358M0410
38003G00728j0903p0316n2120J1626L3397J6799J8067K7884J1566k292J1594k23
37991F95807o2241q1145N890R4719P0949J032O258M7551J8767l4319R541J13766
37979H86575J29448L6666m6270o4131o0906m5868P606N8212M9592L1914Q0896
$$ plain form
38059 1146606 1240785 1392381 1639263 1936636 2192379 2359821 2430236 2370102 2153388 1840710
38049 1840710 1545580 1325718 1167577 1055797 986039 927087 844639 753902 688265 636910
38039 636910 575864 530503 533893 551809 527889 477464 456957 467400 471815 478830 517956 559502
38027 559502 556418 540618 573930 625852 613181 547068 521298 557073 580070 559270 548869 573780
38015 573780 587281 567949 554069 556697 538886 505115 512335 568097 614037 630960 660318 700728
38003 700728 689825 619509 567389 579015 612412 629211 647278 675162 686728 684436 696030 695807
37991 695807 633566 552421 558311 653030 723979 725011 731269 778820 797587 763268 772809 886575
37979 886575 1016023 1052689 1006419 942288 881382 835514 843120 901332 950924 982838 1063734
37968A063734J45041J27863O3981N2442P8556O8305M9302Q3185J13377O2071k073
37957A905784J9102O1555K4799j6086N2016J40259J04483K6217P5037J88825J85631
37946B767622J06915J34041K33943K19594J13032J11218K24184K79937K57366
37937D447852K81279L26660K73215K07265L07947M87769N27026M95244O22048
37928G976305Q30107Q64427Q12102R77895J305160J481953J570432J915368K467092
37919B0200841K872533L218425L946234N042429O127525P322354R083285J1214165
37911F9027791J3181673J5401782J8844234K3442694K8826498L6518304M7840058
37904B53083034N7677282N4057111K9062773r951820m4070740n9047865n5744974
$$ plain form
37968 1063734 1208775 1336638 1400619 1453061 1531617 1599922 1649224 1732409 1845786 1907857 1905784
37957 1905784 1924886 1986441 2011240 1995154 2047170 2187429 2291912 2318129 2393166 2581991 2767622
37946 2767622 2874537 3008578 3242521 3462115 3575147 3686365 3910549 4190486 4447852
37937 4447852 4729131 5055791 5329006 5536271 5844218 6331987 6859013 7354257 7976305
37928 7976305 8806412 9670839 10482941 11460836 12765996 14247949 15818381 17733749 20200841
37919 20200841 23073374 26291799 30238033 35280462 41407987 48730341 57813626 69027791
37911 69027791 82209464 97611246 116455480 139898174 168724672 205242976 253083034
37904 253083034 310760316 364817427 393880200 383928380 339857640 280809775 225064801
37897B25064801m4635398l4054163k5979283j9766749j5325742j2531655j0529976
37890F2241835q742517p343883o367887n378990m261089l419376k988340k603184
37882B1136569k104797j766251j675399j534866j224860r91267r34529q35876
37874A0068724o24123n24546o04256o21044m67816l54820m06835m57745l87201
37865E620338l14434l19924k94202j95582j62279k41238k78215j94333j15749
37856C504382j23187j22186o3165m5079r6413r1158P568M7080n6714j71714j76210
37845B613204j36871j45050j59835j32329j17740j46406j35456m1524L6443J2204
37835A646640n5167p7925o9161o7811m9124K500L2269L882l9431o0315q0667j03458
$$ plain form
37897 225064801 180429403 146375240 120395957 100629208 85303466 72771811 62241835
37890 62241835 53499318 46155435 39787548 34408558 30147469 26728093 23739753 21136569
37882 21136569 19031772 17265521 15590122 14055256 12830396 11839129 10904600 10068724
37874 10068724 9444601 8920055 8315799 7694755 7226939 6872119 6465284 6007539 5620338
37865 5620338 5305904 4985980 4691778 4496196 4333917 4092679 3814464 3620131 3504382
37856 3504382 3381195 3259009 3195844 3150765 3054352 2963194 2970762 3017842 2961128 2789414 2613204
37845 2613204 2476333 2331283 2171448 2039119 1921379 1774973 1639517 1597993 1634436 1646640
37835 1646640 1591473 1513548 1444387 1376576 1327452 1329952 1362221 1366103 1326672 1266357 1185690 1082232
37823A082232q2174j4117L5268M0417M6528O2310L5010l3575o4858l6639k0048
37812A050354m2411l5761K8991P8011O1452L0519K8896J6545l6043p9226p2831
37801A028496n3134n6055n9377m8205n2027p5543p8010n3138m0068l4591O161
37790D84509N3916K8529m7245n1418L6550Q5676K5205m2430k2170K4714J5380
37779E91216l160M0160R3192P0833P531r732N513k1285q1374r6138m6498J0205
37767E60463L3212L0366J8635J4720L7120O8921N9857R609p194N1441J27194J58530
37755A162874J75517K28488K88148K93761K42417J54932J4795j71602l08435l03116
37745A777779j95194j07764r5793j18073j30359j25485r8185m4335J0378L4286
$$ plain form
37823 1082232 1000058 985941 1021209 1061626 1108154 1170464 1205474 1171899 1107041 1070402 1050354
37812 1050354 1007943 972182 1001173 1079184 1140636 1171155 1200051 1216596 1180553 1101327 1028496
37801 1028496 975362 919307 859930 811725 759698 684155 606145 553007 512939 478348 484509
37790 484509 538425 566954 519709 468291 504841 590517 615722 573292 551122 575836 591216
37779 591216 588056 628216 721408 792241 799772 790040 795553 774268 692894 596756 550258 560463
37767 560463 593675 624041 642676 657396 694516 763437 823294 832903 825709 877150 1004344 1162874
37755 1162874 1338391 1566879 1855027 2148788 2391205 2546137 2560932 2389330 2080895 1777779
37745 1777779 1582585 1474821 1379028 1260955 1130596 1005111 906926 862591 872969 907255
37735I07255L0519J6230r233l7001l2662N408J9010k5353p4901p2954m9580n9757
37723F16981q2183o2309j5645j78j4313j0122J1348N747k2610j9464K3723M6621
37711D77596P059o3731j04723q4454j6558M9561O1953K1562j2630l422J1316j4793
37699C28736n4538m7625N119M7689M9077K1776k0116o3668p3669k4512N1487R5036
37687C14792Q9428N9463K1479j9657m4549m0006l0259m3511o5214o4757m4815
37676A32394k4402l729J2449l728m8113n5942R221Q1460P9631K7532M272J1310
37664B22355j2587o3428o5596N73N9937N2825Q100j6634n499K3113M2249K5106
37652B70514k4444n2414j6967M0899M9418J3860j180J4348P503k9731l7791L810
$$ plain form
37735 907255 937774 954004 944771 907770 875108 880516 899526 874173 799272 726318 676738 616981
37723 616981 534798 472489 456844 456666 442353 432231 443579 449326 426716 407252 430975 477596
37711 477596 484655 420924 316201 231747 215189 264750 326703 348265 335635 332213 343529 328736
37699 328736 274198 226573 231692 279381 328458 350234 330118 266450 192781 168269 219756 314792
37687 314792 404220 463683 485162 465505 420956 380950 350691 307180 241966 177209 132394
37676 132394 107992 104263 116712 112984 64871 8929 18150 99610 179241 206773 211045 222355
37664 222355 209768 146340 80744 81317 141254 194079 202179 185545 180046 203159 245408 270514
37652 270514 246070 193656 176689 217588 267006 280866 279686 294034 301537 271806 234015 237825
37640B37825L5084J5167j4013m848K2747L0725K8118L8182M5140K1559k0866m5931
37628C88889l7593o717K5160L4870J4959j0865j5835j1042k3636m2949l5761q561
37616B70919J898k428J5032M9539N2767J6509j3995k5492n6122j03747r9865k0202
37604H4813N5817N4404J1772N727L7589N1427K9397k021l1343o0261o2021p048
37592A68252P4477J09029O3464k1532q0189p9499l6949j025k801j6451P888O3883
37580B48547Q4131L6447k4825m0050k7572l5232n2206l4410R630K7756Q857m861
37568A96212J0461L2776M2196M4690L9429J1093l0007m2175q004L4481L7541R73
37556C69666l2267k4926J9169N9852N9244K2949m945J928J8456J0976p803l047
$$ plain form
37640 237825 272909 288076 274063 269215 291962 322687 350805 388987 434127 455686 434820 388889
37628 388889 351296 344579 369739 404609 419568 408703 392868 381826 358190 315241 279480 270919
37616 270919 272817 270389 285421 334960 387727 404236 390241 364749 308627 204880 105015 84813
37604 84813 140630 195034 206806 212533 250122 301549 330946 328925 297582 237321 175300 168252
37592 168252 242729 351758 415222 393690 313501 234002 197053 196028 193227 176776 184664 248547
37580 248547 332678 369125 344300 304250 276678 241446 189240 154830 164460 192216 201073 196212
37568 196212 206673 239449 281645 326335 365764 376857 346850 304675 296671 331152 368693 369666
37556 369666 337399 312473 331642 391494 450738 473687 468742 470670 489126 500102 492299 489252
37544D89252J8145J5498j2328j7836J6564M0539J0284l8915m1312J816K7165P209
37532E16081j1849J3267N4478N5630J5479j5674j1450K062k229j1890k674K3720
37520F24951N0752P1649Q0900O5362L1216J7149M5713P9601O8720K9322K4913
37509A190248O6118Q5838L8031k5816k0256N9996J34067J37147R0245N8426O8585
37498A882629R3322J06791J25188J74789K39563K74389K69293K62562K77115K84184
37488C989825K58568K31879K46642K85104K96551K78470K73493K93154L04490
37479F458176K94261K85840K81863K51882J98345J74948K05126K33591K02327
37470H586359J35925J04446J28256J67575J92547K17233K60017L02612L04096
$$ plain form
37544 489252 507397 522895 510567 492731 509295 549834 560118 521203 479891 481707 508872 516081
37532 516081 504232 517499 571977 627607 643086 627412 615962 618024 615795 603905 601231 624951
37520 624951 675703 747352 828252 893614 924830 941979 987692 1067293 1136013 1165335 1190248
37509 1190248 1256366 1342204 1380235 1354419 1334163 1394159 1528226 1665373 1755618 1814044 1882629
37498 1882629 1975951 2082742 2207930 2382719 2622282 2896671 3165964 3428526 3705641 3989825
37488 3989825 4248393 4480272 4726914 5012018 5308569 5587039 5860532 6153686 6458176
37479 6458176 6752437 7038277 7320140 7572022 7770367 7945315 8150441 8384032 8586359
37470 8586359 8722284 8826730 8954986 9122561 9315108 9532341 9792358 10094970 10399066
37461A0399066K46690J57849Q1265K6282m0046j43402k68064l90591n15980o43551
37451H909518p27465p26022o71066o27779o00835n48706m77327m34948m15024
37442C680346l59075k70450k24894k38654k30535j61871j08745j28714j57433
37433A799975j24134p7803r3747j31236j03684l4911j9302o0937p8361n2147m3365
37422I80348o5717n9536r803J9811q43k0177m113M420l1640p6202q2373o2054
37410E92121m9605m5848l7564l0435k7897j3308J7613L8170K7553m96j9869j6990
37398D33445R584M3243M6872M533m2041m2679j1364M115P050L4968P0633N7286
37386F15645M842j3482J4163J5148l8337p8077n9638l2028l2126j1542N6279R2107
$$ plain form
37461 10399066 10645756 10803605 10884870 10911152 10871106 10727704 10459640 10069049 9553069 8909518
37451 8909518 8182053 7456031 6784965 6157186 5556351 5007645 4530318 4095370 3680346
37442 3680346 3321271 3050821 2825927 2587273 2356738 2194867 2086122 1957408 1799975
37433 1799975 1675841 1598038 1504291 1373055 1269371 1234460 1215158 1154221 1075860 1023713 980348
37422 980348 914631 855095 845292 865103 864260 844083 839970 844390 812750 736548 654175 592121
37410 592121 542516 496668 459104 428669 400772 387464 405077 443247 470800 470304 450435 433445
37398 433445 443029 486272 533144 537677 495636 452957 441593 445708 452758 487726 558359 615645
37386 615645 620487 607005 621168 636316 597979 519902 460264 428236 396110 384568 440847 532954
37374E32954K9455o1576p4166k5576p668k8352k3185P316k045n1392o4165j4794
37362B16806L5816M7095M4982M4678K3041p993M632N4645O2514M547l5035K713
37350D98441N2123K9665l3488n2443k6658k1009m2621l5780R467L5336J2288k0984
37338D04337l1426l6466n0010m6373j3230J1645j551k1469p215J9011M775m4023
37326A88005o4408k8038K0019L1622K1789L2219N6646M7370o461m9558l1141K1607
37314B39671L5979o539m3065j8682L1990L1602k7905p0710m2327J9157M4796K8901
37302B22868J8792L3581M3326K5219m437k1752k3254j3877J600P987p212k3760
37290B59081q532K5926K7605j2529l5331l818L1671R737m2099n0427j4219l291
$$ plain form
37374 532954 562409 500833 426667 401091 393423 365071 341886 349202 347157 295765 231600 216806
37362 216806 252622 299717 344699 389377 412418 404425 409057 463702 526216 530763 495728 498441
37350 498441 550564 580229 546741 494298 467640 446631 404010 368230 377697 413033 425321 404337
37338 404337 372911 336445 286435 240062 226832 238477 236926 215457 208242 227253 232028 188005
37326 188005 123597 95559 115578 147200 168989 201208 257854 305224 298763 249205 218064 239671
37314 239671 275650 269111 226046 207364 239354 270956 243051 172341 130014 149171 193967 222868
37302 222868 241660 275241 318567 343786 339349 317597 294343 280466 282066 290053 282841 259081
37290 259081 250549 276475 304080 291551 256220 252402 284073 293810 251711 201284 187065 183774
37278A83774m0910o5127k8521K9038M4116J7875k400L187J5471J8639J4729N549
37266A95420o692o317J7998M3286K9095k7899p7517o8256o658M7769M6482K777
37254A89488k7198j2786J3920M91n3480q8828n9655O046M0271K2310L769L4689
37242F9037Q8889R5079L7018j8837j4027K2569K6078l174j0125J4000J5045k4008
37230B97544m2000l0M3547J9693m1555o0968l3377k0278l9356m5011j6324J3319
37218G5204K1499K1493J3719j7115m5921k3130L4896M8439m230m6068k1943J6021
37206G2864l99m5638n0268j1221J9568K3020K1724K3194J5211K409l825j5748
37194E0891m2911n6510k9640P531O747k0878k2737J1073L8956L9295L4253L7959
$$ plain form
37278 183774 142864 77737 49216 78254 122370 140245 137845 141032 156503 175142 189871 195420
37266 195420 188728 182411 200409 243695 272790 244891 167374 99118 92460 140229 186711 189488
37254 189488 162290 149504 163424 163915 110435 21607 -38048 -32002 8269 30579 34348 69037
37242 69037 157926 253005 290023 271186 257159 279728 305806 302632 292507 306507 321552 297544
37230 297544 255544 255514 299061 318754 277199 216231 182854 162576 123220 78209 61885 75204
37218 75204 96703 118196 131915 114800 68879 45749 80645 129084 124854 78786 56843 72864
37206 72864 72465 26827 -23441 -34662 -15094 7926 29650 52844 68055 70464 66639 50891
37194 50891 7980 -48530 -78170 -70639 -63892 -84770 -107507 -96434 -57478 -18183 16070 54029
37182E4029L2589Q001j5902j9231m468J6742L2898L0017O931j2044p403L319m303
37169A21175j4738J760K8174J6032l8988q5568q6155n3120j0104L5347O8666O4282
37157D6763K5633p196r390M12j19k626N721J1622k497k4816k5116Q660N5431P4673
37143A57155L6878m2547j03560r9207m9433j0135L555K2365N1918N0175k656n7399
37131d2891n5126m073L8532M2800K9581K6955L5138L6923K2636l71j3680k819
37119A13605K7165N0718M0099j0865p3780r7216n0289L2731P1608K7455m5447
37108H5784o3910j6457L7301N4374M5191K3407k2184q3480j10366o9976J316M0780
37096g8220L4741J9259K0297K6888K1036O546P1P401J7782J9728J5953J5101J1060
$$ plain form
37182 54029 86618 94619 78717 59486 55018 71760 104658 134675 141606 129562 122159 125478 121175
37169 121175 106437 108197 136371 152403 113415 27847 -58308 -111428 -121532 -86185 -17519 46763
37157 46763 72396 65200 55810 56222 56103 53477 59198 70820 68323 43507 18391 27051 82482 157155
37143 157155 194033 151486 47926 -51281 -100714 -110849 -107294 -84929 -33011 17164 14508 -42891
37131 -42891 -98017 -102090 -63558 -20758 8823 35778 70916 107839 130475 130104 116424 113605
37119 113605 140770 191488 231587 220722 146942 49726 -563 32168 103776 131231 85784
37108 85784 21874 5417 42718 97092 142283 165690 143506 60026 -50340 -120316 -119000 -78220
37096 -78220 -43479 -24220 -3923 22965 44001 50547 50618 58019 75801 95529 111482 126583 137643
37083A37643j0401l6308k5166L3267Q0982N5072k4918p8325o7192l0084j0602
37072B3968o401m542j4882l9301m8511k2271J6798L7326M0333M0762L4744J3790
37060G1813r331j5685o441N112J2168J1732K724k374J1907L2179K4195j5584m9133
37047G3282n0799l5891k0777K444K9862L1158J904j5334J14K878m5137r7564p8927
37034b02787Q074Q7618J06073P0706J1246m1377m9155K155O6414P9959M1727P238
37022A87891O506J5667J0115m105j8967l8043n0662l5298j489J2060l650j0061
37010F9964J8380N1710M8193J2264j9509l0966l5690m3620m5607l3398j5570l750
36998b7599P115K8996N0611L8484j2877n0469j9722N2718Q0729L4146j9208j4373
$$ plain form
37083 137643 127242 90934 65768 99035 180017 235089 210171 131846 64654 34570 23968
37072 23968 17567 13025 -1857 -41158 -89669 -111940 -95142 -57816 -17483 23279 58023 71813
37060 71813 62482 46797 40356 45468 57636 69368 72092 69718 81625 113804 137999 122415 73282
37047 73282 22483 -13408 -34185 -31741 -1879 29279 31183 15849 15963 18841 -26296 -123860 -202787
37034 -202787 -194713 -107095 -1022 69684 80930 39553 -9602 -7447 58967 138926 180653 187891
37022 187891 194397 210064 220179 216074 197107 159064 108402 73104 71615 83675 80025 69964
37010 69964 88344 140054 188247 200511 181002 150036 114346 70726 25119 -8279 -23849 -27599
36998 -27599 -20484 8512 59123 97607 84730 34261 14539 67257 147986 182132 162924 148551
36986A48551J8966J1369l9210p1703n0845J494M9815P2231N6924J6314p143R842
36974B16605L3825K6926R053J6457K9726R888k0907j4200R309r209m9336k9671
36962B28466M6638P5102J1590n5899m9064j3101j8495l8132j1409L6697L7861
36951B50254l460k9686l3279m7714n7506j3504O4957R3498M2188k3929m2983k7929
36939A70907j6112q651N049R437j1259l8190m1104j7628J2874L6518M6863L6393
36927A85097O496k3418l2740k2667j4714k7273n2359n3902k075P7797J07422L5957
36915A83621q6505j48787r9024K714O2911N6799L0302K2938K5466J4541m165r072
36903E1739k384o329j8338k544N3259R8693P6309M556l8880j8756J8926K2693
$$ plain form
36986 148551 167517 178886 139676 67973 17128 18622 68437 140668 197592 213906 206763 216605
36974 216605 250430 277356 286409 302866 332592 342480 321573 307373 316682 307473 258137 228466
36962 228466 275104 350206 361796 305897 256833 243732 225237 187105 175696 212393 250254
36951 250254 246794 217108 183829 136115 78609 65105 130062 223560 265748 241819 198836 170907
36939 170907 154795 146144 151193 160630 149371 111181 70077 52449 65323 101841 148704 185097
36927 185097 191593 168175 135435 112768 98054 70781 18422 -35480 -37555 40242 147664 183621
36915 183621 97116 -51671 -150695 -147981 -85070 -28271 2031 24969 50435 64976 60811 51739
36903 51739 49355 43026 24688 22144 75403 174096 250405 254961 216081 197325 216251 238944
36891B38944M80j9353m3435q2214r8166m5866M8345J03303Q1852K5013j7843m4973
36879A46087p1162q3022n7048k364M1555M5100J4961j4985j6075N254J3557q923
36867A2935l1802j4317L3794N9668L7690P41j0774k573q517l7327o0893n0422
36855g1797q247L5756N1414L3195K427j5664j5591r308n922k686P403K8229N7045
36842H6254P9388P3873L4555j6467n0720o1708n9998n0519l1882r683Q436K2744
36830B4273K8443P714l8558o6727l7433K0432L8521M698k0017M649L8480K7364
36818C1839j2453k2654R031L6730K3836j8667n9901p8179n9281k748N6214O2417
36806c3816L484n9376n0105L5154J19878J29714O7255l409l1734k2308p330l074
$$ plain form
36891 238944 239424 220071 176636 94422 -3744 -49610 -1265 102038 183890 208903 191060 146087
36879 146087 74925 -8097 -65145 -67509 -25954 19146 34107 19122 3047 8301 21858 12935
36867 12935 -18867 -33184 610 60278 97968 98709 87935 85362 76845 39518 -21375 -71797
36855 -71797 -80044 -44288 7126 40321 42748 27084 11493 2185 -3737 -6423 980 29209 86254
36842 86254 165642 239515 274070 257603 206883 145175 85177 34658 2776 -6907 1529 24273
36830 24273 52716 60430 21872 -44855 -82288 -61856 -23335 -18637 -38654 -34005 4475 31839
36818 31839 19386 -3268 5763 42493 66329 47662 -12239 -90418 -149699 -152447 -96233 -33816
36806 -33816 -30332 -89708 -139813 -104659 15219 144933 212188 208779 177045 154737 147407 144333
36794A44333n798j3401k8748m4123m1447j3793K3347M7190M8202L3899J7629O304
36782A73594k460j1610j7033j6989k5301n6003q9711p9947j1427O7650R6547P1239
36770I8549L5325J4485m121k9231m1981k9917j6528l3595p3485q6857l3793O3139
36758a38010J25199R4303L740n4967m3383j5340k4314m2902k2501J3461R278j8705
36746a14141m171N0718P0627L1431k222R654K0960o272l0663j1090J7163J1329
36734D3323m77J7941L0871m625m6790l3156N811m005m7555m3716J2228L9479J1088
36721a9583l953L7698Q4959Q0589L7839o547m2087n3474j5522M1532L8627l2145
36709A47933p0610j1774O7366O0222j3159n2053l0796r148j3279r575O539n237
$$ plain form
36794 144333 138535 125134 96386 52263 10816 -2977 20370 67560 115762 149661 167290 173594
36782 173594 171134 159524 142491 125502 100201 44198 -45513 -125460 -136887 -69237 27310 98549
36770 98549 133874 148359 144238 115007 73026 43109 26581 -7014 -80499 -167356 -201149 -138010
36758 -138010 -12811 81492 85232 30265 -13118 -28458 -52772 -95674 -118175 -104714 -95436 -114141
36746 -114141 -118312 -67594 3033 34464 32242 41896 62856 56584 25921 14831 31994 43323
36734 43323 42846 60787 91658 87033 40243 7087 12898 8893 -38662 -82378 -70150 -30671 -19583
36721 -19583 -23536 14162 99121 179710 217549 211002 168915 115441 99919 141451 180078 147933
36709 147933 77323 65549 132915 193137 179978 127925 97129 87981 74702 65127 71666 66429
36697F6429m1074l7978K0962O5059M3284N508J9613N9696M6479k7358q2101n9847
36685G8672Q628N8198O6010N2132L5381J8022J932m274N245K6912M7285M4398
36673D38541K483o0218q9882m8301L4164Q1368N4989o164m0087k9811J62K9413
36661C66657N2704O2184N4175M5327M6784L0047l7598j23195j45158p7960O749
36650B80716L2032Q501j283K2452M4372L7654J2697j2418k9564k7952K39L5554
36638D03000M1811R738l0564m5552k8784N068L6432M8691L8370K0580J0491L096
36626E12377j1177j8635K471M0184N2648K1158k6724n6744o6195p0001p1083o2194
36614B46085m2954k1011o765j3463m5246p6913o8735j8201K4867J9171r532k825
$$ plain form
36697 66429 25355 -12623 8339 73398 116682 122190 141803 201499 247978 220620 138519 78672
36685 78672 87300 145498 211508 263640 299021 317043 318975 314701 319946 346858 394143 438541
36673 438541 441024 380806 290924 242623 276787 358155 413144 406980 366893 337082 337244 366657
36661 366657 419361 481545 535720 581047 627831 657878 620280 497085 351927 273967 280716
36650 280716 312748 321249 319966 342418 386790 424444 437141 424723 395159 367207 367446 403000
36638 403000 444811 454549 423985 378433 349649 354717 391149 439840 478210 498790 509281 512377
36626 512377 501200 482565 485036 525220 577868 599026 572302 515558 449363 379362 308279 246085
36614 246085 203131 182120 175355 161892 116646 39733 -29002 -47203 -22336 -3165 -12697 -15522
36602a5522M5360P5475M2330k3694n6529l5549P0J0349j645j2355j9151l6580
36590b7441o0546o1947k3271L3808O7136N2633o6n7855q2539n4355O303M8722
36578a59418M0536K882j7341m717J3655J1616m554j4264j1564k444J2665L5186
36566i7762N1334L7564q321n1675n2144j2463J9506R727j5629o926L4582N6463
36554c5744L5147J2252K5683M5364K1318l2645n7403l6811j0454o01J3563L8233
36542A7902M1634J3869l827J3538K4073j6927p6128q0379k0325L6119L2488j6200
36530c4163n6514n5391j8546K2520L3789J0247j0297J5881Q2343J30926J13435
36519B34230M1576l0690o3482o1959n6182n8216m8157r980L0075K7688j4483m0101
$$ plain form
36602 -15522 29838 105313 147643 123949 67420 31871 31941 42290 40645 28290 9139 -27441
36590 -27441 -87987 -149934 -173205 -139397 -72261 -19628 -19694 -77549 -160088 -214443 -208140 -159418
36578 -159418 -118882 -116000 -133341 -138058 -124403 -112787 -117341 -131605 -143169 -145613 -132948 -97762
36566 -97762 -46428 -8864 -17185 -68860 -121004 -133467 -113961 -104234 -119863 -126789 -92207 -35744
36554 -35744 -597 11655 37338 82702 104020 71375 13972 -22839 -33293 -33894 -20331 17902
36542 17902 59536 73405 69578 83116 107189 90262 14134 -66245 -86570 -50451 -17963 -34163
36530 -34163 -90677 -146068 -164614 -142094 -108305 -98058 -108355 -92474 -10131 120795 234230
36519 234230 275806 245116 181634 119675 63493 5277 -42880 -52860 -22785 4903 -9580 -49681
36507d9681j5159K4150L0696K0510L8712P2404O1325j346m2701j1574M4121M3285
36495B14742j6811o2149m3316Q352L1091O647l1383m4931k9156o716J635n196
36483B2809j4862j6143n805R954J6184J870j9992j8161J5658M4012K5679k6020
36471C5183n4915l2864J0019L2937L2444K7573K4063J7792J5774K6086L5186K0860
36459A90138j3550l9102l7145j6740P777L7585P4757R9095Q0344J8869l9242m3207
36447C19579N417M8914L3768l2494r2136r7847n3986m680Q105j9729n0228m1494
36435B3189J135K5552q59m4568n2351k6224j1350j8511j0722K5777N1744M0198
36423C010K2512L3107M8465K5945k6135o3823p0342n6712k1661L3439O5195K9934
$$ plain form
36507 -49681 -64840 -40690 -9994 10516 49228 121632 182957 181611 138910 127336 171457 214742
36495 214742 197931 135782 92466 100818 131909 138556 107173 62242 33086 26370 28005 22809
36483 22809 7947 -8196 -14001 -4047 12137 14007 -5985 -24146 -8488 35524 61203 35183
36471 35183 -19732 -52596 -42577 -9640 22804 50377 74440 92232 108006 134092 169278 190138
36459 190138 176588 137486 100341 83601 91378 128963 203720 302815 383159 402028 362786 319579
36447 319579 324996 373910 407678 375184 283048 185201 131215 126535 134640 114911 64683 23189
36435 23189 24324 49876 49017 4449 -47902 -74126 -85476 -103987 -114709 -88932 -37188 3010
36423 3010 25522 58629 107094 133039 106904 43081 -27261 -83973 -105634 -72195 -7000 22934
36411B2934l5428m3499J7485N6990J4314m8401l9523K6050N5053J4484l3143l3042
36399b5726q025l709j7261j5263R929L5838M3813L0947J888k8319l5693j4650
36387b6231N886l593l1221l9296j5436J7557L8523M4906L2534o265n2856o4752
36375a00244l0456N710K176j9256p254L9552P0563N9955M0737M7044O0482M2199
36363B11208n439m2043m4412k9038j9757j8401j5884j3689j9355k8537k7360j4501
36351f7208p947j9048k6777L321O7812J10525P8477j2226q5563q3824k3436L0220
36339c5674L1218q235l7190j7814L7221P7274O6725K1112j4683j4424J3971M7004
36327A66505O0144L6032j4604m7652l2065K694N35m2373p5135p2195o3997o9959
$$ plain form
36411 22934 -12494 -55993 -38508 18482 32796 -15605 -55128 -29078 25975 40459 7316 -25726
36399 -25726 -33751 -37460 -54721 -69984 -60055 -24217 19596 50543 52431 24112 -11581 -26231
36387 -26231 -20345 -23938 -55159 -94455 -109891 -92334 -53811 -8905 23629 17364 -35492 -100244
36375 -100244 -130700 -124990 -122814 -142070 -149324 -109772 -39209 20746 61483 108527 169009 211208
36363 211208 205769 163726 119314 90276 70519 52118 36234 22545 3190 -25347 -52707 -67208
36351 -67208 -75155 -94203 -120980 -117659 -49847 60678 139155 126929 41366 -42458 -65894 -35674
36339 -35674 -4456 -12691 -49881 -67695 -30474 46800 113525 134637 119954 105530 119501 166505
36327 166505 226649 262681 248077 200425 168360 171054 171589 129216 54081 -18114 -82111 -152070
36315a52070n6034M301P2567R5668P9364O2394M7561J5056j8230j6877M813k433
36303A36080l8353m8270j4941R052j3106m2763l0805M853J4869k030q406J169
36291c2651p065m2489o5838m3309N901L5260K7370P477P213K8645M7149M3708
36279A1371K6135J4106J0639J393j8951l6600m0864l9780m1769l6684j3837J0135
36267a54706N423k6766m5889j9879L2745O4370N4330K5027M000o503j2662n465
36255h5975K2274M9164M5552J7107j541L132J2283J6818L0032M4199K0181m7982
36243A25244r7643p1311Q38L9549J9180j7018l1903l2179l2453k9824k1155r477
36231a58152P753K5247J7404j8854k8349L3999J12259J05298J6321m1244r349
$$ plain form
36315 -152070 -208104 -203803 -131236 -35568 43796 106190 153751 168807 150577 133700 138513 136080
36303 136080 97727 49457 34516 43568 30462 -12301 -43106 -38253 -23384 -25414 -33820 -32651
36291 -32651 -39716 -82205 -148043 -191352 -185451 -150191 -122821 -115344 -108131 -79486 -32337 11371
36279 11371 37506 51612 62251 63644 44693 8093 -32771 -72551 -114320 -151004 -164841 -154706
36267 -154706 -149283 -176049 -221938 -241817 -209072 -144702 -90372 -65345 -61345 -67848 -80510 -85975
36255 -85975 -63701 -14537 31015 48122 46581 49713 61996 78814 108846 153045 173226 125244
36243 125244 27601 -43710 -42872 -3323 15857 -1161 -33064 -65243 -97696 -127520 -148675 -158152
36231 -158152 -150399 -125152 -107748 -126602 -154951 -120952 -8693 96605 112926 71682 62333
36220F2333L6045J6638k8025k2570J6502K3367P76L31J7158Q89m1356m6133j354
36207C4601L1601J7568o432o412l487k1324m0339l7918k6005j6968M148M1575
36195b9392O3789N0547K9122K9655L7309K4513J46j2047j7831l4095m8227l9812
36183E3677k5926l6441n3031k5531M5368R1277O1631j2006o2506o8681n9698n7683
36171a49550n2051k8811M116K8764L5857K3691o534m3745o6126n9312l0306N001
36159c39006M0216P2794Q8686P2313L2795J791j547J0013J3858N506l605l346
36147i532J0194L4854N5766N0579J6963j3721q941K0584K6437k1990r6674j32835
36135f8316r2102l390O2632O4013K6229J321L10q459l7837n6298l8310o634K189
$$ plain form
36220 62333 98378 115016 86991 64421 80923 104290 105066 105397 122555 123444 82088 35955 34601
36207 34601 66202 83770 77338 70926 67439 46115 5776 -32142 -58147 -75115 -70967 -29392
36195 -29392 34397 84944 114066 143721 181030 205543 205689 193642 175811 141716 93489 53677
36183 53677 27751 -8690 -61721 -87252 -41884 49393 111024 99018 36512 -32169 -91867 -149550
36171 -149550 -201601 -230412 -226296 -197532 -161675 -137984 -144518 -188263 -254389 -313701 -344007 -339006
36159 -339006 -298790 -225996 -137310 -64997 -32202 -30411 -31958 -21945 -8087 -2581 -6186 -9532
36147 -9532 662 35516 91282 141861 158824 145103 136162 156746 183183 161193 64519 -68316
36135 -68316 -160418 -163808 -101176 -37163 -10934 -9613 -9303 -17762 -55599 -111897 -150207 -156841 -154652
36122a54652r424j1835L806J9316K0696R320q380j9008l011L6966O3365M8993
36110c848J9467J5017K5366R070k8851l3173J6419O5989N8101N653l3503l0621
36098H5086o592O106l358k3408l5839l2576k1514j3369p339L37K402o666j1952
36085f8682L785K8721L6570K9026L1050M3181L5892J106k7030k0740J885P321
36073A02085o082j2614L814L3736N3191M2753P326k0987j5414J1751K7879K6278
36061B53716K4721K3233K877l0173m2047k4139q590j6685l1304l5861l8299l7366
36049D0083j0940L4959N0003P441m9132o2680l3341J577K3245K9679J3184j8170
36037B5908k6434N910L8366K6688j2851l5708l5315l1089k2386p217j5027n9361
$$ plain form
36122 -154652 -164076 -175911 -172105 -152789 -132093 -122773 -131153 -150161 -153172 -116206 -52841 -3848
36110 -3848 15619 30636 56002 65072 36221 3048 19467 85456 143557 149210 115707 85086
36098 85086 78494 84600 81242 57834 21995 -10581 -32095 -45464 -52803 -52466 -50064 -56730 -68682
36085 -68682 -64897 -36176 394 29420 60470 103651 139543 140649 113619 92879 94764 102085
36073 102085 96003 83389 87203 120939 174130 216883 224209 203222 187808 199559 227438 253716
36061 253716 278437 301670 304547 274374 232327 208188 199598 182913 151609 115748 77449 40083
36049 40083 29143 64102 114105 121546 72414 9734 -23607 -22030 1215 30894 44078 25908
36037 25908 -526 5384 43750 70438 57587 21879 -13436 -44525 -66911 -74128 -89155 -148516
36025a48516q5974l8869M2250O7587K9222M906K9631N0790K9943O134K1631N2651
36013F1386N6377L3752O599k0476l9390k6124J3794L1625N949j6844N506M3027
36001A55181M7050L0300L2600L9203M936n5103p2984k9985J6066K2836K1489M9679
35989B61268P6348M3562l9469r4453o8568L520M4521K0529l3760o4483n4051k5775
35977F9189r288j2871k3606k2654j080K9977M5509L2327P890K542K2636M3443
35965A84014M0849J7422p439k1159k4858k5454k7156k5223p063L1268O9240P6088
35953B80529M5586M344j9925k5196k3418j8094q496m935j8579l6036k4404K6305
35941A77681P7237P5948J8695m0635n3421l0172j2521r814N76J7406R030k5520
$$ plain form
36025 -148516 -234490 -273359 -231109 -163522 -134300 -129394 -99763 -48973 -19030 -12896 8735 61386
36013 61386 117763 151515 158114 137638 98248 72124 85918 117543 123492 106648 112154 155181
36001 155181 202231 232531 265131 304334 309270 254167 181183 151198 167264 190100 211589 261268
35989 261268 337616 381178 341709 247256 178688 182208 226729 247258 213498 149015 94964 69189
35977 69189 59901 47030 23424 770 -310 29667 75176 107503 115393 117935 140571 184014
35965 184014 224863 242285 234846 213687 188829 163375 136219 110996 103933 135201 204441 280529
35953 280529 326115 330459 310534 285338 261920 243826 235330 230395 211816 175780 151376 177681
35941 177681 254918 330866 349561 308926 255505 225333 212812 202998 203574 220980 230010 204490
35929B04490l9570j1428J3509m691l0019j0305K8306K0297k5890l7800j995J1579
35917A16483k9707o1364k6288L3404M6812J9801N486J1756P516o907m622P815
35905A20185P13j5634j868L5665M4489J1560j2123L885J7140j6140o1584n2661
35893G3627M994L2314j5430q6416j00776m9786P984L4876N3975R0249J13663P7945
35881B37219l937o6611p2153m2888j0752K1283M9877M7121L5n3652o5648l7104
35869B790p982l8K71J1411L4915N6164M8907m936p8902j07955o1646Q285L0141
35856f8575N405l989K8444O1612N5969K7459J3211J6867J1517k0443o5885r0384
35844b8792o6939o964M3528N6024N5645P7895J03158P7680m97o4428o2165j6954
$$ plain form
35929 204490 164920 153492 167001 162310 132291 121986 150292 170589 144699 106899 104904 116483
35917 116483 86776 25412 -876 32528 79340 99141 104627 116383 123899 116992 112370 120185
35905 120185 120898 105264 103396 139061 183550 195110 182987 186872 204012 187872 126288 73627
35893 73627 78621 110935 95505 9089 -91687 -141473 -133489 -98613 -44638 45611 159274 237219
35881 237219 233282 166671 94518 51630 40878 62161 112038 159159 159194 105542 39894 2790
35869 2790 -5192 -5230 -4959 6452 41367 97531 146438 141502 62600 -45355 -107001 -98716 -68575
35856 -68575 -63170 -67159 -38715 22897 78866 106325 119536 136403 147920 127477 61592 -28792
35844 -28792 -95731 -102695 -59167 -3143 52502 130397 233555 311235 310738 246310 184145 167191
35832A67191J8362L1228M3239N9243N8222K9528n557j2424K0872O3005O2176O584
35820E41669m6633l3221L0139N9244J1768n9890q3980n4585j1646K3800N1429
35809D28094N8191L3906O389J2465L8225L3733r664m0767k0691K3196L6510N102
35797F04689l9865o6895o9697n4074k2975J6232M0389K4431k3505n2255j6985
35786C39490N8498R6343N6174j5267m9975m5290m5298n7928m6381j380L5035L2493
35774C56514R834r441k9610m4827k2346L5418O3724K7757l773M5735J23752J06056
35762F58793j1471q6251k7764P6647R8719M9392L1424O6989Q1500M3742J6031
35751I97751M5414R1247R9595Q6817J04213J60710K20999K54812K60308K59738
$$ plain form
35832 167191 185553 216781 260020 319263 377485 407013 401456 389032 409904 472909 535085 541669
35820 541669 495036 461815 491954 551198 562966 503076 419096 364511 352865 376665 428094
35809 428094 486285 520191 526580 539045 577270 611003 601339 560572 539881 563077 599587 604689
35797 604689 564824 497929 428232 374158 351183 367415 407804 432235 408730 356475 339490
35786 339490 397988 494331 550505 535238 485263 439973 394675 336747 290366 288986 324021 356514
35774 356514 366348 356907 327297 282470 260124 295542 359266 387023 383250 428985 552737 658793
35762 658793 647322 561071 533307 609954 708673 758065 789489 856478 937978 981720 997751
35751 997751 1043165 1134412 1234007 1320824 1425037 1585747 1806746 2061558 2321866 2581604
35741B581604K85531L41227L70326L11243J97021J39119J80214K29756J99499
35732D835540J37964J47969K17301K35737J67017R7192R5036J21099J14390Q6231
35722F255476P0661M4357l7011j61267k79813l77290m63426n18263n09114m55026
35712C569284m14789m05504l84165l19956k37194j70487j22107q8084q6102j21903
35702A218993j56226j45495j01176p2268p7196q9552q8154q1908p7775o2355l3102
35691B33786j5424k3894l3149j6784P810R390o81J3072M3237M2428L1l5345l0644
35678A93833j7898l5325n9409m3072L107K1167q472m0093l0777K544J3282j0043
35666a1156l0638j1134L6377N5438Q435o9322j00113n4130J7662N4944N8574O1354
$$ plain form
35741 2581604 2867135 3208362 3578688 3889931 4086952 4226071 4406285 4636041 4835540
35732 4835540 4973504 5121473 5338774 5574511 5741528 5838720 5933756 6054855 6169245 6255476
35722 6255476 6326137 6370494 6333483 6172216 5892403 5515113 5051687 4533424 4024310 3569284
35712 3569284 3154495 2748991 2364826 2044870 1807676 1637189 1515082 1426998 1340896 1218993
35702 1218993 1062767 917272 816096 743828 666632 577080 488926 407018 329243 266888 233786
35691 233786 218362 194468 161319 144535 152345 161735 161054 174126 217363 259791 259822 224477 193833
35678 193833 175935 140610 81201 38129 41236 62403 53931 13838 -16939 -14395 -1113 -11156
35666 -11156 -41794 -52928 -16551 38887 47322 -22000 -122113 -176243 -158581 -103637 -45063 16291
35654A6291O2437L9171O143P030M6920Q1201Q0845O7038O8308Q1628R3664J07997
35642G58673J29648J47460J54959J73279K31333L23422L92147L56347J73561j04978
35632B735851l51434m59327m25107l22582k18318j39102r5502q5880q2192n8110
35622D98297l1520l8510p0179q1895o1985m0580l2205k5462k8830o1961r5492
35611g0322p1573p5M1089K5842J9286N9904Q7510M7297j1045j4131J6279J0382
35599A40443k8118l7067o809J0387p399k5861k1143q938m176m051j0935k6879
35587c0546l1412q252J7397J3071n850n007L190j8466n6045n4048j054N1284O0270
35574f5468L5830R701K212J6645L0398O850m5417n5932J0156P4259M1085n5213
$$ plain form
35654 16291 78728 117899 124042 131072 177992 259193 340038 407076 475384 557012 650676 758673
35642 758673 888321 1035781 1190740 1364019 1595352 1918774 2310921 2667268 2840829 2735851
35632 2735851 2384417 1925090 1499983 1177401 959083 819981 724479 638599 556407 498297
35622 498297 466777 428267 358088 276193 214208 173628 141423 115961 87131 25170 -70322
35611 -70322 -141895 -141970 -100881 -75039 -55753 4151 91661 138958 127913 113782 130061 140443
35599 140443 112325 75258 68449 78836 71437 45576 24433 15495 11319 7268 -3667 -30546
35587 -30546 -61958 -70210 -52813 -39742 -45592 -50599 -47409 -65875 -121920 -175968 -177022 -125738 -65468
35574 -65468 -29638 -19937 -17725 -1080 29318 36168 -9249 -65181 -55025 19234 60319 5106
35562E106r5240n0065o835j4816j8675K4918O9546O6399M0775K8250J3397j2508
35550E0252p561M4418P9380M1286k9882o0846m4460j6168J5118M6329M1889j0898
35538A48857n2972l5616q181l9877r2624p1070K0243P4826M3737j410J0768N3163
35526D9844O2903L6465J3767R314M423j3123l3309l8049j7216J9105M2438L5286
35514A71848J4808Q266J4687J5684J0571P612m922l6277n3409j7206M2073M4871
35502B18606k6389r0414o9740J2722P2485O5450J6555k9010m7277l9202k1313
35491F2473j0955q527k049N900m180l2350m3647j1125M0000N6080J8791l4526
35479C5885n5460l5211n028O599P158K4596O3735R4110Q7252M9439N395l1364
$$ plain form
35562 5106 -90134 -140199 -147034 -161850 -180525 -155607 -86061 -19662 21113 49363 62760 50252
35550 50252 42691 87109 166489 207775 177893 117047 72587 56419 71537 117866 159755 148857
35538 148857 95885 60269 52088 12211 -80413 -151483 -131240 -56414 -12677 -14087 -3319 49844
35526 49844 112747 149212 162979 172293 176716 163593 130284 92235 75019 94124 136562 171848
35514 171848 186656 194922 209609 225293 235864 243476 238554 202277 148868 131662 173735 218606
35502 218606 192217 101803 32063 44785 117270 182720 199275 170265 122988 83786 62473
35491 62473 51518 42991 40942 46842 42662 10312 -33335 -44460 -4460 51620 70411 35885
35479 35885 -19575 -54786 -59814 -53215 -46057 -21461 42274 136384 223636 273075 278470 247106
35467B47106n3035m4925j0676O949k6934p8134p6302j2815M2807L8124R78j6936
35455A6207j3241j3591j4557K416K0052Q80m7900p0967l8545J0154J7262j9791
35443a51621m7924k8134J4927K6474k744j9679J7149P0223O6093j552n8262m9207
35431a64257o298J1912M062O485K1280J8231l853j0275J3905M5594O5359P6278
35419G8423P4330M2480j0884m5567m1523k5237k4435k7884j4295P488J5862J1758
35407D0516Q235M091m480n127P872J1084j2647l2441m670N7506R2008O5009J958
35394B28914n7391r2144q5975l0680L8335N6740R526m2346m1958p291J1072P460
35382e738J1185K3715J7238j1613l1390k0799R032L6415M5156K4712j5092l6137
$$ plain form
35467 247106 194071 149146 138470 145419 118485 40351 -35951 -48766 -5959 32165 33143 16207
35455 16207 2966 -10625 -25182 -22766 -2714 -1834 -49734 -120701 -159246 -149092 -131830 -151621
35443 -151621 -199545 -227679 -212752 -186278 -189022 -208701 -191552 -121329 -55236 -56788 -115050 -164257
35431 -164257 -170555 -158643 -154581 -148096 -126816 -108585 -112438 -122713 -108808 -63214 2145 78423
35419 78423 152753 195233 184349 138782 97259 72022 47587 19703 5408 12896 28758 40516
35407 40516 48751 52842 48362 43235 51107 62191 49544 17103 12433 69939 161947 226956 228914
35394 228914 171523 79379 -6596 -37276 1059 57799 67325 24979 -16979 -24270 -13198 -5738
35382 -5738 5447 29162 46400 34787 3397 -17402 -8370 28045 73201 97913 82821 46684
35370D6684j1770L0083L6719r56m2335n1535k2430L7145R8608J02092J5557r4085
35358A43777j18038m8055J0390p137l6164M28O4967P1043K2552m915O577O22m4192
35345F1855p4972n0910J781M3780O9638P4521L3487m6078r7876p0936k382K9310
35333b8782O716j4763P835M9382N7533K1852j7494k1250N116K3835J3729n873
35321I7836n705J0259R248k2823n6523n3642j9019n26k9357p0769n7361K0178
35309a78204Q2223N1841l7581p4114j1401P1973Q1399K3797k5787l2874k1649
35298g0377j0896M440J6430P777p528O77K2765K1891L357J0243M0298L4746k3374
35285E0449o4112k7048M8560Q1252N6037K0548N30j9419l9912l0327J8998O7531
$$ plain form
35370 46684 34914 64997 101716 100760 58425 6890 -15540 21605 120213 222305 237862 143777
35358 143777 25739 -22316 -11926 -19063 -55227 -54799 10168 81211 103763 98848 105425 106047 61855
35345 61855 -13117 -64027 -62246 -18466 51172 125693 159180 113102 15226 -55710 -58092 -28782
35333 -28782 -22066 -36829 -28994 20388 77921 99773 82279 61029 66145 89980 103709 97836
35321 97836 92131 102390 111638 88815 32292 -21350 -40369 -40895 -70252 -141021 -198382 -178204
35309 -178204 -95981 -44140 -81721 -155835 -167236 -95263 -13864 9933 -15854 -48728 -70377
35298 -70377 -81273 -76833 -60403 -52626 -60154 -59477 -36712 -14821 -11464 -1221 39077 73823 50449
35285 50449 -13663 -40711 7849 89101 145138 165686 166216 146797 106885 76558 95556 163087
35273A63087O6697J2576n4077q8300p5925l7688m924P880N885k229r528o191Q543
35260a4194J2150j6032n4254n6230j6538J9438K4208K4356M4382N8013L3090j0917
35248D7472l4674l9783m9504n2607k2965J7765J8005k0795l6186N945O3213P9680
35236b4434N6032K9945J8034Q333q379k6972l8698l6550j8981O28J501j6172k5919
35223h1632j1654O763L500j1736o802K4290N2046N3417L9293L0345K5820J3766
35211A37416j450n187j447j0255l1454l6879j3535P717r214n2573p5934n6554
35199a49349j2203L3990P0043P5705K9126m9160r4255o6792k187L5411K9089J3019
35187h7563J7000L7225N4762N6982M2091K0719J0951J9672L4580M2273M0878K6883
$$ plain form
35273 163087 229784 242360 188283 99983 24058 -13630 -18554 -10674 -4789 -7018 -16546 -22737 -14194
35260 -14194 -2044 -18076 -72330 -128560 -145098 -125660 -101452 -77096 -32714 25299 58389 47472
35248 47472 12798 -26985 -76489 -129096 -152061 -134296 -116291 -137086 -173272 -167327 -104114 -24434
35236 -24434 31598 61543 79577 87910 79531 52559 13861 -22689 -41670 -41042 -39541 -55713 -81632
35223 -81632 -93286 -86523 -83023 -94759 -101561 -77271 -25225 28192 67485 97830 123650 137416
35211 137416 135966 130779 129332 119077 87623 50744 37209 44926 35712 -16861 -92795 -149349
35199 -149349 -161552 -127562 -57519 18186 47312 -1848 -96103 -162895 -165082 -129671 -100582 -87563
35187 -87563 -70563 -33338 21424 78406 120497 141216 152167 171839 206419 248692 289570 316453
35175C16453q173n2349o9612m4999j0870j553n926J624P833j6347n4630n9534
35163A917k5214M272N404M487K1541L1169O361l3073m6593k6285J378J2147K216
35150d0273j7308k7204j2788J6485L0846J4633j4720l0976k8111j4912L738K5774
35138i4816M2664M4656L0156N020j7802j6912J9538O6346P3347K2317m3900o8129
35126F2485m3026r031J308p445j6739j9580j4841L150L3346N6736N3211K7226
35114A26800K444r684k0072l5219l8822j6626J4124K4118J3946R262J6924J9445
35102A06640J6849L3016O3960O2618O787n4798o5616m0317l1674m3253l4994m691
35090A4527K295k8074n0723l1723N285K6712L6394M6442M1647P746l4440n4720
$$ plain form
35175 316453 308280 255931 186319 141320 130450 128897 122971 124595 132428 116081 61451 1917
35163 1917 -23297 -19025 -13621 -9134 12407 43576 49937 16864 -29729 -56014 -54636 -42489 -40273
35150 -40273 -57581 -84785 -97573 -81088 -50242 -35609 -50329 -81305 -109416 -124328 -120590 -94816
35138 -94816 -52152 -7496 22660 27680 9878 -7034 12504 78850 152197 174514 130614 62485
35126 62485 19459 10428 11736 4291 -12448 -32028 -46869 -43719 -10373 46363 99574 126800
35114 126800 129244 119560 99488 64269 25447 8821 22945 47063 61009 70271 87195 106640
35102 106640 123489 156505 220465 283083 289870 235072 169456 129139 97465 54212 19218 14527
35090 14527 16822 -11252 -61975 -93698 -88413 -61701 -25307 21135 62782 70528 36088 -18632
35078a8632m9595k8906L784L1098J6750m1591q3477n5099J2659M3823K1744K92
35066a47150J2566K7144J4337L939L6549Q7936R1066K8242m2168o2614m4045l1699
35054b5897l1725j5142J5062J5659k1550l8143P706O6654O1849K067l3710j5342
35042a2512N708q873k7835j5492R662J9269K4354L6790K9448j4574n2676l7710
35030d4441Q662L2139K7092K3715J9815p164l5948k2718J5211J0735m6209q3336
35018a02447n1584P575L4654L5936M9876P3316P2989M3993Q069k8932p0497r1063
35006a8115n6049J3199M1810o035o8637n7104K7879R0157O0092j3536k8922L0135
34994A4874P4273L7999k6558k8080L0785O2621K5488k4619k5402Q484K5793J4955
$$ plain form
35078 -18632 -68227 -97133 -93349 -62251 -45501 -87092 -170569 -225668 -213009 -169186 -147442 -147150
35066 -147150 -134584 -107440 -93103 -89164 -52615 35321 126387 154629 112461 49847 5802 -25897
35054 -25897 -57622 -72764 -57702 -42043 -63593 -101736 -94030 -27376 34473 36540 2830 -12512
35042 -12512 -6804 -15677 -43512 -59004 -49342 -30073 -5719 31071 60519 45945 -6731 -44441
35030 -44441 -35779 -3640 23452 47167 66982 59818 23870 1152 16363 27098 -19111 -102447
35018 -102447 -154031 -146456 -111802 -75866 -25990 47326 120315 164308 172377 143445 72948 -18115
35006 -18115 -74164 -60965 -19155 -25190 -93827 -150931 -123052 -32895 27197 13661 -15261 14874
34994 14874 89147 127146 100588 72508 103293 165914 191402 166783 141381 149865 175658 190613
34982A90613k177j9163l9814m3901p887M4090N4818P593m9598o5584m3455k1394
34970D141j9708k7510k7924j5200Q313L4470M7932L5830L465k6741l4897j7355
34958c5184J8048N8546Q2347O2755k855p0521q1457k9526K2370J4763l2747m8150
34946d1611n985L7847K5335k3256m1616j1786J6296K182k8402k5572J3831M8771
34934c3966N4728M7672M5542L7795R094k8016m5779l6593j6719p34Q594P571r445
34921C9744l1961l2044N053N5902P6543M6269j0873m9728m7910k3599p450l056
34909A6890J1405M2611O4202N1173J3687k1215m5179o3416o9452n4154k9584j2833
34897i5865N386M1577P6740P4780M2434K5186L8144M8051L3992J5748N884j2616
$$ plain form
34982 190613 188436 169273 129459 85558 77671 121761 176579 184172 134574 68990 25535 4141
34970 4141 -15567 -43077 -71001 -86201 -77888 -43418 4514 40344 43809 17068 -17829 -35184
34958 -35184 -17136 41410 123757 186512 183657 113136 31679 2153 24523 39286 6539 -41611
34946 -41611 -47596 -9749 15586 -7670 -49286 -61072 -44776 -42594 -70996 -96568 -82737 -33966
34934 -33966 20762 68434 113976 151771 160865 132849 87070 50477 33758 33024 41618 49189 39744
34921 39744 7783 -24261 -19208 36694 113237 159506 148633 98905 50995 27396 19946 16890
34909 16890 28295 70906 135108 186281 199968 178753 133574 70158 706 -53448 -83032 -95865
34897 -95865 -90479 -48902 27838 102618 145052 170238 208382 256433 290425 306173 312057 299441
34885B99441l7673l3462K583J5141k2552n2288j6224N0357P5875N9485M8525M4267
34873D33475J2878l1312l9485j6255j0542k2766p688K8089K5835j2442r269N5927
34861D06445R5180M6445k4501k4608L2435O7886N9898M4727L4824J4934l464M255
34849G54456K3238K2759J4908K6769L3405r407p6624r6191o1495m1570o3819o7803
34837D58626j1953M6129L2147l3128o8528m9348k4734k8683l6653k3121j0815
34826B49939l0555o1452n1410O882N5568M2200j2008l9879j3883K7438M1130L2450
34814B46420K7072K2074p89l0349l5309j6499j2455m3405p9002p7004l4838J0861
34802b3223K3567k603m0004n0325k2847Q713L343l2983n1847k5459J9906M4617
$$ plain form
34885 299441 261768 228306 230889 246030 223478 171190 154966 205323 281198 340683 389208 433475
34873 433475 446353 415041 375556 359301 348759 325993 318305 346394 372229 359787 350518 406445
34861 406445 501625 548070 523569 498961 531396 599282 659180 703907 738731 753665 750201 754456
34849 754456 777694 800453 815361 842130 875535 866128 789504 693313 631818 590248 526429 458626
34837 458626 446673 492802 524949 491821 423293 373945 349211 320528 283875 260754 249939
34826 249939 219384 157932 106522 113404 168972 211172 199164 159285 145402 172840 213970 246420
34814 246420 273492 295566 294777 264428 229119 212620 200165 156760 77758 754 -34084 -23223
34802 -23223 344 -2259 -42263 -92588 -115435 -106722 -103379 -136362 -188209 -213668 -193762 -149145
34790a49145M4919M3645N2020O2109O2872M4543K328m3678n1021p052L6599K0805
34778A18944l6097n6108j1261L4216J7055l3745m2379M861M8197M2452N535k4731
34766F6939l4156j9092K3389O6143N4333k2946r2074p3161J4908P5457N7842J1840
34754A29422O030L6196M4869N079n0605p6341n9473j9216J8330L4226K0926j0045
34742G9398k6885k389M9540P5728M1217k2840n4461m1227l0186m9611o4655l8420
34730h4791L727J5475M970J3203L4576K2485k6613n7933m0793r115K695J1227
34718a10887L9602O7141O3721M1646L2387L3820J8780j7255m8825n3441l0288
34707C6401M754K8123K6067J2948J2869J7975k837m3450n2315r100L4941L0321
$$ plain form
34790 -149145 -104226 -60581 -8561 53548 116420 160963 163291 119613 68592 61540 98139 118944
34778 118944 82847 26739 15478 49694 66749 33004 -9375 -4514 43683 86135 91670 66939
34766 66939 32783 13691 37080 103223 157556 134610 42536 -30625 -15717 59740 117582 129422
34754 129422 135452 171648 216517 221596 170991 94650 35177 15961 34291 68517 89443 79398
34742 79398 52513 50124 99664 175392 216609 193769 139308 98081 67895 18284 -46371 -84791
34730 -84791 -81064 -65589 -60619 -47416 -12840 9645 -16968 -74901 -115694 -124809 -122114 -110887
34718 -110887 -71285 -4144 59577 101223 133610 167430 186210 168955 120130 66689 36401
34707 36401 41155 69278 95345 108293 121162 139137 136300 92850 40535 31435 66376 96697
34695I6697L049P234L6118L6924l334m3123n1409l7916j9562j183Q536J623o397
34682B7257N503K2659Q840l5255o4972n1044j2937J6536L0660M0887N2264N8343
34670I8741M7657J3488l0326n0387k8671J1890L6473M0829M0284L1495n59m4895
34658A66019o9239o1992m0750k1439n794N550J3964K9063M8794M8187J8434l320
34646A27477J6300M7317L6162j0924m0970l9241l6487l5209j871N5468P3590K4624
34634B16236l9852o3370m9714k8248r126j012j7906l7347q572O3007R9305N9073
34622A82474J778r337l598l3402o6968m0132K2181L4496j3149m3331j9103P772
34610A9681l339j8872m397J2253J025o588K6304O5260N1731K603q847L1818N4074
$$ plain form
34695 96697 99746 106980 143098 180022 176688 133565 82156 44240 24678 23495 32031 33654 27257
34682 27257 32760 55419 64259 29004 -35968 -87012 -99949 -83413 -52753 -11866 40398 98741
34670 98741 146398 159886 129560 79173 50502 62392 98865 139694 179978 211473 210914 166019
34658 166019 96780 34788 -5962 -27401 -33195 -27645 -13681 15382 64176 112363 130797 127477
34646 127477 143777 191094 227256 216332 175362 136121 99634 64425 62554 118022 191612 216236
34634 216236 176384 113014 63300 35052 25926 24914 7008 -30339 -38911 24096 123401 182474
34622 182474 184252 174915 171317 137915 70947 30815 52996 87492 74343 31012 11909 19681
34610 19681 16342 -2530 -6927 5326 6351 -237 26067 91327 143058 145661 136814 168632 222706
34597B22706J0895m7127m5881O951M2326L1605J0595P753P733m90N704L4881N0257
34584C37908K4022j3758k2108j2044j4975j8390R559N2708O6492N2334M8954N7745
34572E68447M4527J3426P272K9889M1644M0134O4580J04593R4525L0070o30N1089
34560A089566J18154J31398J26621J67319K35005K77668L06021L59388M30109
34551C241249N02646O14619P96937J007561J207304J439388J750651K123058K586997
34542A5270410L250483L975603M111980K922170M38979k303692m083496m461530
34534A9120907l889937l060413k357411j837110j441471j119437q53583o61069
$$ plain form
34597 222706 233601 186474 140593 147544 189870 221475 232070 239823 247556 247066 252770 287651 337908
34584 337908 361930 348172 326064 314020 299045 280655 290214 342922 409414 461748 510702 568447
34572 568447 612974 626400 633672 663561 705205 745339 809919 914512 1009037 1039107 1038477 1089566
34560 1089566 1207720 1339118 1465739 1633058 1868063 2145731 2451752 2811140 3241249
34551 3241249 3743895 4358514 5155451 6163012 7370316 8809704 10560355 12683413 15270410
34542 15270410 18520893 22496496 26608476 29530646 29969625 27665933 23582437 19120907
34534 19120907 15230970 12170557 9813146 7976036 6534565 5415128 4561545 3900476
$$ [...]
##END NTUPLES=NMR SPECTRUM
##END=
