##TITLE=31Pdec_DE-64_EXT3
 CDCl3, 24 sc
 13.9.2024
##JCAMPDX= 6.0         $$ Bruker NMR JCAMP-DX V2.0
##DATA TYPE= NMR SPECTRUM
##DATA CLASS= NTUPLES
##ORIGIN= UXNMR, Bruker Analytische Messtechnik GmbH
##OWNER= root
$$ XWIN-NMR		Version 3.5
$$ Fri Sep 13 14:20:47 2024 Russian Standard Time (UT+4h)  she@DPX200
##.OBSERVE FREQUENCY= 81.013821
##.OBSERVE NUCLEUS= ^31P
##.ACQUISITION MODE= SIMULTANEOUS
##.ACQUISITION SCHEME= undefined
##.AVERAGES= 24
##.DIGITISER RES= 17
##SPECTROMETER/DATA SYSTEM= spect
##.PULSE SEQUENCE= zgpg30
##.SOLVENT NAME= CDCl3
##.SHIFT REFERENCE= (INTERNAL, CDCl3, 0, 198.062)
##AUDIT TRAIL= $$ (NUMBER, WHEN, WHO, WHERE, WHAT)
$$ ##TITLE= Audit trail, XWIN-NMR		Version 3.5
$$ ##JCAMPDX= 5.01
$$ ##ORIGIN= Bruker BioSpin GmbH
$$ ##OWNER= she
$$ F:/spectra/data/she/nmr/P31/2/pdata/1/auditp.txt
$$ ##AUDIT TRAIL=  $$ (NUMBER, WHEN, WHO, WHERE, WHAT)
(   1,<2024-09-13 14:19:41.76 +0400>,<she>,<DPX200>,
      <created by zg, POWCHK disabled, PULCHK disabled
       configuration hash MD5:
       00 E9 B6 7A A2 85 ED C7 34 08 36 98 17 FE 4E 26
       data hash MD5: 32K
       A5 66 FF C2 9D 2A 39 BF 4E AF FA DF AE F0 D2 AB>)
(   2,<2024-09-13 14:19:44.81 +0400>,<she>,<DPX200>,
      <Start of raw data processing
       efp BC_mod = 2 LB = 1.5 FT_mod = 6 PKNL = 1 PHC0 = 2727.876 PHC1 = 20.08747 SI = 64K 
       data hash MD5: 64K
       CD 35 91 26 2E 6E A5 5F BA 73 F7 83 7D 5B 09 D2>)
(   3,<2024-09-13 14:20:03.85 +0400>,<she>,<DPX200>,
      <pk PHC0 = 2.673548 PHC1 = 2 
       data hash MD5: 64K
       5B 94 E4 51 9B 29 BC 3B 70 47 4F 41 CC AD C8 B0>)
(   4,<2024-09-13 14:20:10.54 +0400>,<she>,<DPX200>,
      <abs ABSG = 5 
       data hash MD5: 64K
       46 7A 3C F3 2D 77 B0 04 CD 66 44 1A 43 F9 9B 95>)
$$ ##END=
$$ 
$$ hash MD5
$$ AB B7 77 29 09 4B A0 12 C2 8E 47 B4 62 C3 3B C9
##$RELAX= 
##$RELAX= 
##$RELAX= 
##$RELAX= 
##$RELAX= 
##$RELAX= 
##$RELAX= 
##$RELAX= 
$$ Bruker specific parameters
$$ --------------------------
##$DU= <F:/spectra>
##$EXPNO= 2
##$NAME= <P31>
##$PROCNO= 1
##$TYPE= <nmr>
##$USER= <she>
##$AMP= (0..31)
100 100 100 100 100 100 100 100 100 100 100 100 100 100 100 100 100 100 
100 100 100 100 100 100 100 100 100 100 100 100 100 100 
##$AQSEQ= 0
##$AQ_mod= 1
##$AUNM= <au_zg>
##$AUTOPOS= <>
##$BF1= 81.014009
##$BF2= 200.13
##$BF3= 200.13
##$BF4= 200.13
##$BF5= 200.13
##$BF6= 200.13
##$BF7= 200.13
##$BF8= 200.13
##$BYTORDA= 1
##$CFDGTYP= 0
##$CFRGTYP= 5
##$CHEMSTR= <none>
##$CNST= (0..31)
1 1 145 1 1 1 1 1 1 1 1 1 1 1 1 1 1 1 1 1 1 1 1 1 1 1 1 1 1 1 1 1 
##$CPDPRG= <waltz16>
##$CPDPRG1= <>
##$CPDPRG2= <waltz16>
##$CPDPRG3= <>
##$CPDPRG4= <mlev>
##$CPDPRG5= <mlev>
##$CPDPRG6= <mlev>
##$CPDPRG7= <mlev>
##$CPDPRG8= <mlev>
##$CPDPRGB= <>
##$CPDPRGT= <>
##$D= (0..31)
0 1 0 0 0 0 0 0 0 0.06 0 0.03 2e-05 3e-06 0 0 0.0002 0 0 0 0 0 0 0 0 0 
0 0 0 0 0 0 
##$DATE= 1726222781
##$DBL= (0..7)
120 120 120 11 120 120 24 19 
##$DBP= (0..7)
150 150 150 150 150 150 150 150 
##$DBP07= 0
##$DBPNAM0= <>
##$DBPNAM1= <>
$$ [...]
##$SUBNAM3= <"">
##$SUBNAM4= <"">
##$SUBNAM5= <"">
##$SUBNAM6= <"">
##$SUBNAM7= <"">
##$SUBNAM8= <"">
##$SUBNAM9= <"">
##$SW= 400.765351723535
##$SWIBOX= (0..15)
0 1 3 0 0 0 0 0 0 0 0 0 0 0 0 0 
##$SW_h= 32467.5324675325
##$TD= 32768
##$TD0= 1
##$TE= 0
##$TE2= 300
##$TE3= 300
##$TEG= 300
##$TL= (0..7)
0 120 53 12 22 120 120 120 
##$TP= (0..7)
150 150 150 150 150 150 150 150 
##$TP07= 0
##$TPNAME0= <>
##$TPNAME1= <>
##$TPNAME2= <>
##$TPNAME3= <>
##$TPNAME4= <>
##$TPNAME5= <>
##$TPNAME6= <>
##$TPNAME7= <>
##$TPOAL= (0..7)
0.5 0.5 0.5 0.5 0.5 0.5 0.5 0.5 
##$TPOFFS= (0..7)
0 0 0 0 0 0 0 0 
##$TUNHIN= 0
##$TUNHOUT= 0
##$TUNXOUT= 0
##$USERA1= <user>
##$USERA2= <user>
##$USERA3= <user>
##$USERA4= <user>
##$USERA5= <user>
##$V9= 5
##$VALIST= <valist>
##$VCLIST= <CCCCCCCCCCCCCCC>
##$VD= 0
##$VDLIST= <DDDDDDDDDDDDDDD>
##$VPLIST= <PPPPPPPPPPPPPPP>
##$VTLIST= <TTTTTTTTTTTTTTT>
##$WBST= 1024
##$WBSW= 4
##$XGAIN= (0..3)
0 0 0 0 
##$XL= 0
##$YL= 0
##$YMAX_a= 38303
##$YMIN_a= -27652
##$ZGOPTNS= <>
##$ZL1= 120
##$ZL2= 120
##$ZL3= 120
##$ZL4= 120
##$ABSF1= 198.0616
##$ABSF2= -202.7028
##$ABSG= 5
##$ABSL= 3
##$ALPHA= 0
##$AQORDER= 0
##$ASSFAC= 0
##$ASSFACI= 0
##$ASSFACX= 0
##$ASSWID= 0
##$AUNMP= <proc_1d>
##$AZFE= 0.1
##$AZFW= 0.5
##$BCFW= 0
##$BC_mod= 2
##$BYTORDP= 0
##$COROFFS= 0
##$CY= -3
##$DATMOD= 1
##$DC= 0
##$DFILT= <>
##$DTYPP= 0
##$F1P= 0
##$F2P= 0
##$FCOR= 1
##$FTSIZE= 65536
##$FT_mod= 6
##$GAMMA= 0
##$GB= 0
##$INTBC= 1
##$INTSCL= 9.790993e-09
##$ISEN= 30
##$LB= 1.5
##$LEV0= 0
##$LPBIN= 0
##$MAXI= 10000
##$MC2= 0
##$MEAN= 0
##$ME_mod= 0
##$MI= 50
##$NCOEF= 0
##$NC_proc= -6
##$NLEV= 6
##$NOISF1= 182.463
##$NOISF2= 159.3651
##$NSP= 0
##$NTH_PI= 0
##$NZP= 0
##$OFFSET= 198.0616
##$PC= 4
##$PHC0= 2730.55
##$PHC1= 22.08747
##$PH_mod= 1
##$PKNL= yes
##$PPARMOD= 0
##$PSCAL= 0
##$PSIGN= 0
##$REVERSE= no
##$SF= 81.0140089999434
##$SI= 65536
##$SIGF1= 159.3651
##$SIGF2= -187.1042
##$SINO= 113.3802
##$SIOLD= 16384
##$SREGLST= <1H.CDCl3>
##$SSB= 0
##$STSI= 65536
##$STSR= 0
##$SW_p= 32467.5324675325
##$SYMM= 0
##$S_DEV= 0
##$TDeff= 32768
##$TDoff= 0
##$TI= <>
##$TILT= no
##$TM1= 0
##$TM2= 0
##$TOPLEV= 0
##$USERP1= <user>
##$USERP2= <user>
##$USERP3= <user>
##$USERP4= <user>
##$USERP5= <user>
##$WDW= 1
##$XDIM= 65536
##$YMAX_p= 514304397
##$YMIN_p= -13057462
$$ End of Bruker specific parameters
$$ ---------------------------------
##NTUPLES= NMR SPECTRUM
##VAR_NAME=  FREQUENCY,     SPECTRUM/REAL,   SPECTRUM/IMAG
##SYMBOL=    X,             R,               I
##VAR_TYPE=  INDEPENDENT,   DEPENDENT,       DEPENDENT
##VAR_FORM=  AFFN,          ASDF,            ASDF
##VAR_DIM=   65536,         65536,           65536
##UNITS=     HZ,            ARBITRARY UNITS, ARBITRARY UNITS
##FACTOR=    0.49542278885378, 1,            1
##FIRST=     16045.7642231865, 0,            0
##LAST=      -16421.768244346, 0,            0
##MIN=       -16421.768244346, -13057462,    0
##MAX=       16045.7642231865, 514304397,    0
$$ Real data points
##PAGE= N=1
##DATA TABLE= (X++(R..R)), XYDATA
$$ [...]
$$ plain form
40428 -794526 -833817 -382944 118628 352492 442602 629467 873154 960315 819549 531754
40418 531754 188027 -65351 -29443 244887 340213 -18901 -484501 -492963 -71637 189518
40408 189518 -18959 -354240 -411515 -275904 -248682 -320997 -214367 187129 665001 882730
40398 882730 683130 244744 -21894 151335 591544 876578 813578 580647 438250 506969
40388 506969 788382 1140499 1245024 903765 393527 203293 375427 479582 325232 248647
40378 248647 469265 610853 256076 -342799 -579004 -355410 -163505 -309373 -470956 -161675
40368 -161675 611385 1317401 1450260 1019582 489998 242806 175400 -50934 -457174 -710246
40358 -710246 -652330 -528067 -543404 -529032 -290739 -22059 -54299 -375747 -695230 -832688
$$ packed form
40428g94526l9291M50873N01572K33864R0110J86865K43687Q7161j40766k87795
40418E31754l43727k53378L5908K74330R5326l59114m65600q462M21326K61155
40408A89518k08477l35281n7275J35611K7222p2315J06630M01496M77872K17729
40398H82730j99600m38386k66638J73229M40209K85034o3000k32931j42397O8719
40388E06969K81413L52117J04525l41259n10238j90234J72134J04155j54350p6585
40378B48647K20618J41588l54777n98875k36205K23594J91905j45868j61583L09281
40368a61675P73060P06016J32859m30678n29584k47192o7406k26334m06240k53072
40358g10246N7916J24263j5337J4372K38293K68680l2240l21448l19483j37458
$$ plain form
40348 -832688 -762457 -437497 76590 397760 143050 -547248 -1111983 -1210878 -988273 -703643
40338 -703643 -428229 -190604 -116843 -236844 -329189 -154123 215124 432502 284990 13680
40328 13680 129722 798995 1477561 1411064 549324 -341553 -640836 -600001 -791742 -1163092
40318 -1163092 -1168722 -715507 -370172 -518329 -832387 -833249 -603084 -603846 -999364 -1486939 -1740190
40307 -1740190 -1766543 -1785260 -1885384 -1887889 -1556829 -918364 -282049 96948 258327 352004
40297 352004 379760 304583 260900 383333 521868 436870 230267 241594 503743 662432
40287 662432 523651 335108 369279 536349 624422 676889 875517 1191069 1372599 1220296
40277 1220296 744408 144839 -272275 -280471 49057 402702 561858 569268 520089 374692
$$ packed form
40348h32688P0231L24960N14087L21170k54710o90298n64735r8895K22605K84630
40338g03643K75414K37625P3761j20001r2345J75066L69247K17378j47512k71310
40328A3680J16042O69273O78566o6497q61740q90877k99283M0835j91741l71350
40318a163092n630M53215L45335j48157l14058q62K30165p62l95518m87575k53251
40307a740190k6353j8717j00124k505L31060O38465O36315L78997J61379R3677
40297C52004K7756p5177m3683J22433J38535q4998k06603J1327K62149J58689
40287F62432j38781j88543L4171J67070Q8073N2467J98628L15552J81530j52303
40277A220296m75888n99569m17114q196L29528L53645J59156P410m9179j45397
$$ plain form
40267 374692 94188 -192382 -303977 -215053 -67002 -49196 -286849 -705644 -977824 -782597
40257 -782597 -193513 348138 503535 323096 44158 -169792 -224248 -85134 92447 41178
40247 41178 -277696 -600642 -728808 -734477 -684996 -447841 23254 456598 568401 428010
40237 428010 312582 375488 640247 1096429 1573168 1740328 1492438 1130253 929036 793993
40227 793993 628341 697328 1161510 1519971 1127249 184712 -376235 -42577 776949 1458971
40217 1458971 1807408 1819523 1396511 655502 100050 42222 124827 -172874 -754772 -1054456
40207 -1054456 -852512 -524092 -463624 -641768 -841326 -1018196 -1216408 -1309900 -1084331 -553892
40197 -553892 -10663 289915 362728 331096 154003 -298914 -913548 -1287092 -1132211 -589624
$$ packed form
40267C74692k80504k86570j11595Q8924J48051J7806k37653m18795k72180J95227
40257g82597N89084N41651J55397j80439k78938k13950n4456J39114J77581n1269
40247D1178l18874l22946j28166n669M9481K37155M71095M33344J11803j40391
40237D28010j15428O2906K64759M56182M76739J67160k47890l62185k01217j35043
40227G93993j65652O8987M64182L58461l92722r42537n60947L33658Q19526O82022
40217A458971L48437J2115m23012p41009n55452n7828Q2605k97701n81898k99684
40207a054456K01944L28420O0468j78144j99558j76870j98212r3492K25569N30439
40197e53892N43229L00578P2813l1632j77093m52917o14634l73544J54881N42587
$$ plain form
40187 -589624 -7719 472820 953562 1488677 1956238 2194601 2114788 1714846 1139738 680771
40177 680771 529639 552903 489112 338743 346504 603409 900719 1016669 925845 664323
40167 664323 210315 -388350 -927177 -1186869 -1070249 -607348 1195 361489 167710 -421366
40157 -421366 -911545 -1040265 -966171 -836345 -509016 102914 720645 1009165 979547 807397
40147 807397 452220 -208144 -982335 -1453231 -1456870 -1221340 -1036850 -1002747 -1072619 -1118301
40137 -1118301 -947634 -478520 67363 314123 109916 -352712 -751185 -824683 -441649 270646
40127 270646 855674 838160 211911 -519077 -846373 -694714 -352353 -128508 -124739 -201076
40117 -201076 -106363 254576 660411 799305 665255 570405 715606 916237 865147 559331
$$ packed form
40187e89624N81905M80539M80742N35115M67561K38363p9813l99942n75108m58967
40177F80771j51132K3264o3791j50369P761K56905K97310J15950r0824k61522
40167F64323m54008n98665n38827k59692J16620M62901O08543L60294j93779n89076
40157d21366m90179j28720P4094J29826L27329O11930O17731K88520k9618j72150
40147H07397l55177o60364p74191m70896l639K35530J84490L4103o9872m5682
40137a118301J70667M69114N45883K46760k04207m62628l98473p3498L83034P12295
40127B70646N85028j7514o26249p30988l27296J51659L42361K23845L769p6337
40117b01076R4713L60939M05835J38894j34050r4850J45201K00631n1090l05816
$$ plain form
40107 559331 337331 511462 1017299 1427666 1341611 808524 308033 211524 342095 241493
40097 241493 -183840 -542397 -525319 -323207 -322137 -589950 -872850 -966462 -851361 -518810
40087 -518810 78802 837149 1442012 1635805 1478874 1251834 1139255 1110755 1092813 1097364
40077 1097364 1095734 922741 519326 197635 363862 915734 1226689 906417 292591 -75311
40067 -75311 -202251 -479564 -971462 -1323329 -1319692 -1078686 -701976 -213016 112349 -107441
40057 -107441 -716822 -1047435 -836221 -615789 -853085 -1189690 -1004413 -340503 250902 501672
40047 501672 541158 469055 352231 432635 767282 848623 218503 -670343 -912589 -438237
40037 -438237 -92217 -342903 -691598 -608263 -303404 -177923 -165612 -112058 -244345 -696046
$$ packed form
40107E59331k22000J74131N05837M10367q6055n33087n00491r6509J30571j00602
40097B41493m25333l58557J7078K02112J070k67813k82900r3612J15101L32551
40087e18810N97612P58347O04863J93793j56931k27040j12579k8500j7942M551
40077A097364j630j72993m03415l21691J66227N51872L10955l20272o13826l67902
40067g5311j26940k77313m91898l51867L637K41006L76710M88960L25365k19790
40057a07441o09381l30613K11214K20432k37296l36605J85277O63910N91405K50770
40047E01672L9486p2103j16824Q0404L34647Q1341o30120q88846k42246M74352
40037d38237L46020k50686l48695Q3335L04859J25481J2311N3554j32287m51701
$$ plain form
40027 -696046 -1004104 -678464 33056 500014 574871 581877 677178 754333 797322 805400 547516
40016 547516 -68486 -559419 -400431 129405 279551 -59198 -272971 -82198 72165 -115853
40006 -115853 -306900 -206904 -138003 -466877 -949544 -1117728 -937468 -638224 -244821 233147
39996 233147 451906 124928 -415999 -578835 -333929 -193241 -436039 -856770 -1280907 -1797099
39986 -1797099 -2332924 -2475449 -1999389 -1269135 -823413 -742369 -681905 -414656 -79389 87689
39976 87689 60705 -7133 -16300 -25224 -123028 -262489 -286922 -128255 84881 153995 16511
39965 16511 -177507 -150263 296807 1028635 1538982 1357823 562185 -287862 -777352 -972271
39955 -972271 -1038659 -864001 -352292 154071 168820 -286291 -695036 -721064 -545406 -497504
$$ packed form
40027f96046l08058L25640P11520M66958P4857P006R5301P7155M2989Q078k57884
40016E47516o16002m90933J58988N29836J50146l38749k13773J90773J54363j88018
40006a15853j91047R9996O8901l28874m82667j68184J80260K99244L93403M77968
39996B33147K18759l26978n40927j62836K44906J40688k42798m20731m24137n16192
39986a797099n35825j42525M76060P30254M45722Q1044O0464K67249L35267J67078
39976H7689k6984o7838r167q924r7804j39461k4433J58667K13136O9114j37484
39965A6511j94018K7244M47070P31828N10347j81159p95638q50047m89490j94919
39955i72271o6388J74658N11709N06363J4749m55111m08745k6028J75658M7902
$$ plain form
39945 -497504 -663397 -938860 -1186881 -1236666 -984176 -617824 -509953 -747998 -990975 -935955
39935 -935955 -707206 -600241 -643517 -648838 -549586 -427278 -278370 -16282 294583 435480
39925 435480 331898 205252 347366 824291 1439091 1897165 1965199 1581414 946019 486119
39915 486119 576432 1178972 1804126 1943393 1543157 959227 482242 104147 -211685 -306840
39905 -306840 -82863 221596 296641 191567 179874 280402 271724 157239 189547 341420
39895 341420 203046 -351947 -794949 -613630 -89094 36612 -445798 -975246 -976357 -476202
39885 -476202 119390 540861 773652 887532 964839 1102158 1303093 1391256 1164427 662431
39875 662431 193014 21969 62822 -39565 -478278 -1022096 -1292471 -1251383 -1240779 -1505797
$$ packed form
39945d97504j65893k75463k48021m9785K52490L66352J07871k38045k42977N5020
39935i35955K28749J06965m3276n321R9252J22308J48908K62088L10865J40897
39925D35480j03582j26646J42114M76925O14800M58074O8034l83785o35395m59900
39915D86119R0313O02540O25154J39267m00236n83930m76985l78095l15832r5155
39905c06840K23977L04459P5045j05074j1693J00528q678j14485L2308J51873
39895C41420j38374n54993m43002J81319N24536J25706m82410n29448j111N00155
39885d76202N95592M21471K32791J13880P7307J37319K00935Q8163k26829n01996
39875F62431m69417j71045M0853j02387m38713n43818k70375M1088J0604k65018
$$ plain form
39865 -1505797 -1852824 -1882827 -1441878 -736589 -112098 175264 77750 -200243 -333908 -174321
39855 -174321 120597 311163 337895 289069 254197 336439 648949 1100018 1312139 1007554
39845 1007554 409192 4572 -54447 -49449 -203186 -405867 -523676 -675760 -992677 -1297086
39835 -1297086 -1280335 -925569 -540857 -376071 -379933 -380026 -358285 -419700 -525586 -416275 79165
39824 79165 703911 919094 471512 -301964 -850851 -990742 -959838 -995513 -1089164 -1163292
39814 -1163292 -1252431 -1404970 -1561150 -1629381 -1562201 -1281500 -692404 84504 638215 650543
39804 650543 315205 149194 347348 537098 297062 -258671 -632648 -599173 -437417 -468621
39794 -468621 -633035 -696631 -656860 -666223 -676329 -493696 -182112 -71661 -273586 -479712
$$ packed form
39865a505797l47027l0003M40949P05289O24491K87362r7514k77993j33665J59587
39855a74321K94918J90566K6732m8826l4872Q2242L12510M51069K12121l04585
39845A007554n98362m04620n9019M998j53737k02681j17809j52084l16917l04409
39835a297086J6751L54766L84712J64786l862r3K1741o1415j05886J09311M95440
39824G9165O24746K15183m47582p73476n48887j39891L0904l5675r3651p4128
39814a163292q9139j52539j56180o8231O7180K80701N89096P76908N53711J2328
39804F50543l35338j66011J98154J89750k40036n55733l73977L3475J61756l1204
39794d68621j64414o3596L9771r363j0106J82633L11584J10451k01925k06126
$$ plain form
39784 -479712 -391367 -100160 119686 169762 110072 17536 51555 415819 1028993 1480841
39774 1480841 1567405 1588097 1797092 1891396 1513624 982313 904605 1206348 1238525 849856
39764 849856 624080 886771 1199532 1175770 1132741 1426292 1669468 1245309 277621 -524029
39754 -524029 -803239 -776125 -640116 -358123 -53383 -75020 -490530 -874359 -783543 -225042
39744 -225042 436877 835660 821724 538542 323759 354613 395366 100871 -458374 -839417
39734 -839417 -806797 -583010 -459451 -457103 -514246 -737108 -1216028 -1729741 -1884816 -1560485
39724 -1560485 -1075205 -854576 -965307 -1028693 -660093 10773 399737 137293 -477648 -859303
39714 -859303 -814834 -590618 -373561 -123789 92276 10271 -420207 -833121 -875280 -631878
$$ packed form
39784d79712Q8345K91207K19846N0076n9690r2536L4019L64264O13174M51848
39774A480841Q6564K0692K08995R4304l77772n31311p7708L01743L2177l88669
39764H49856k25776K62691L12761k3762m3029K93551K43176m24159r67688q01650
39754e24029k79210K7114J36009K81993L04740k1637m15510l83829R0816N58501
39744b25042O61919L98783j3936k83182k14783L0854M0753k94495n59245l81043
39734h39417L2620K23787J23559K348n7143k22862m78920n13713j55075L24331
39724a560485M85280K20629j10731o3386L68600O70866L88964k62444o14941l81655
39714h59303M4469K24216K17057K49772K16065q2005m30478m12914m2159K43402
$$ plain form
39704 -631878 -417030 -313333 -151124 157808 488688 681204 698515 614475 520364 416976
39694 416976 184284 -235054 -605164 -548727 -50469 372957 207836 -446299 -989137 -991814
39684 -991814 -593805 -258412 -279583 -539836 -675878 -492750 -225573 -280712 -678376 -945272
39674 -945272 -697923 -133600 284704 460612 666058 1001507 1228218 1182279 1023961 958229
39664 958229 980092 1030332 1141704 1257270 1154096 784103 486070 572824 850708 865392
39654 865392 539838 216326 76222 -82587 -358081 -407386 101424 909665 1380433 1240793
39644 1240793 836550 641746 770403 1049390 1340856 1602059 1727073 1545417 1050739
39635 1050739 544938 428463 770023 1130425 970221 302315 -222151 -52463 560397
$$ packed form
39704f31878K14848J03697J62209L08932L30880J92516J7311q4040r4111j03388
39694D16976k32692m19338l70110N6437M98258M23426j65121o54135n42838k677
39684i91814L98009L35393k1171k60253j36042J83128K67177n5139l97664k66896
39674i45272K47349N64323M18304J75908K05446L35449K26711m5939j58318o5732
39664I58229K1863N0240J11372J15566j03174l69993k98033Q6754K77884J4684
39654H65392l25554l23512j40104j58809k75494m9305N08810Q08241M70768j39640
39644A240793m04243j94804J28657K78987K91466K61203J25014j81656m94678
39635A050739n05801j16475L41560L60402j60204o67906n24466J69688O12860
$$ plain form
39626 560397 866421 573106 154384 117864 335332 374047 219124 261880 653241 1063366
39616 1063366 1152266 978580 816894 793172 844639 874792 799422 560135 242864 106756
39606 106756 349993 865402 1321771 1474487 1339353 1104736 963749 1023970 1275370 1563710
39596 1563710 1618913 1232770 524322 -14375 79524 719056 1303506 1381788 1109750 890148
39586 890148 779613 566601 285474 211450 340213 340175 168887 284532 948317 1681247
39576 1681247 1816785 1368312 931363 853411 921049 834349 583580 290975 23141 -116801
39566 -116801 17790 381549 684270 704467 519584 337325 237367 170925 100624 52040
39556 52040 91325 277088 564771 793943 887751 995409 1248068 1451130 1316897 1000714
$$ packed form
39626E60397L06024k93315m18722l6520K17468L8715j54923M2756L91361M10125
39616A063366Q8900j73686j61686k3722N1467L0153p5370k39287l17271j36108
39606A06756K43237N15409M56369J52716j35134k34617j40987O0221K51400K88340
39596A563710N5203l86143p08448n38697R3899O39532N84450P8282k72038k19602
39586H90148j10535k13012k81127p4024J28763l8j71288J15645O63785P32930
39576A681247J35538m48473m36949p7952O7638q6700k50769k92605k67834j39942
39566a16801J34591L63759L02721K0197j84883j82259r9958o6442p0301m8584
39556E2040L9285J85763K87683K29172R3808J07658K52659K03062j34233l16183
$$ plain form
39546 1000714 1033208 1576298 2084754 1955834 1266749 593716 302554 333896 544883 880999
39536 880999 1193591 1194918 721002 -74878 -812642 -1106621 -811725 -214500 126371 -63436
39526 -63436 -465951 -623867 -543156 -516987 -494955 -134640 480353 733154 344649 -114235
39516 -114235 16442 539262 684332 159506 -556124 -900308 -760146 -305711 262810 668436
39506 668436 627714 187465 -235962 -323844 -173238 -31079 44214 71032 -69290 -454449
39496 -454449 -851219 -896637 -519295 15604 437806 656253 656829 449429 158047 -15229
39486 -15229 13334 156688 325695 526315 747802 870913 762473 413023 -43280 -399952
39476 -399952 -490530 -324784 -117774 -89023 -215930 -267879 -90999 226643 465446 437020
$$ packed form
39546A000714L2494N43090N08456j28920o89085o73033k91162L1342K10987L36116
39536H80999L12592J327m73916p95880p37764k93979K94896N97225L40871j89807
39526f3436m02515j57916Q0711K6169K2032L60315O14993K52801l88505m58884
39516a14235J30677N22820J45070n24826p15630l44184J40162M54435N68521M05626
39506F68436m0722m40249m23427q7882J50606J42159P5293K6818j40322l85159
39496d54449l96770m5418L77342N34899M22202K18447N76k07400k91382j73276
39486a5229K8563J43354J69007K00620K21487J23111j08440l49450m56303l56672
39476c99952r0578J65746K07010K8751j26907n1949J76880L17642K38803k8426
$$ plain form
39466 437020 42934 -660056 -1374593 -1682271 -1396566 -764563 -223748 21017 102474 200233
39456 200233 268845 142244 -133825 -221708 143190 773613 1190889 1180564 996257 940122
39446 940122 978396 953657 946525 1117133 1326647 1281557 1009596 821969 793812 676223 399285
39435 399285 246877 363061 475880 347744 142208 63971 -14693 -221621 -315055 -90340
39425 -90340 115412 -138603 -609067 -599850 33722 671771 813294 653465 597819 672040
39415 672040 691623 642009 565831 350668 -33638 -276084 -36305 570608 1065012 1136588
39405 1136588 900278 680884 715152 1009917 1329187 1355060 1000065 541487 347697 495351
39395 495351 717006 677009 263814 -302147 -616462 -461934 -60886 195721 286762 576433
$$ packed form
39466D37020l94086p02990p14537l07678K85705O32003N40815K44765Q1457R7759
39456B00233O8612j26601k76069q7883L64898O30423M17276j0325j84307n6135
39446I40122L8274k4739p132J70608K09514m5090k71961j87627k8157j17589k76938
39435C99285j52408J16184J12819j28136k05536p8237p8664k06928r3434K24715
39425i0340K05752k54015m70464R217O33572O38049J41523j59829n5646P4221
39415F72040J9583m9614p6178k15163l84306k42446K39779O06913M94404P1576
39405A136588k36310k19394L4268K94765L19270K5873l54995m58578j93790J47654
39395D95351K21655l9997m13195n65961l14315J54528M01048K56607R1041K89671
$$ plain form
39385 576433 1186760 1654409 1476570 798681 241850 139175 241647 148404 -250899 -780270
39375 -780270 -1173006 -1196414 -775168 -92883 515299 809317 749360 442304 110787 24230
39365 24230 254900 520494 458213 58463 -349358 -543869 -646686 -864937 -1174751 -1346351
39355 -1346351 -1180153 -675887 -63366 318725 279538 -69756 -485739 -858173 -1181649 -1348116
39345 -1348116 -1188275 -719255 -157360 319827 640242 706993 475794 188425 222139 590681
39335 590681 864204 735066 414458 286631 405091 562113 664106 765022 839411 781628
39325 781628 590323 368059 182350 60255 24307 -6100 -212361 -597716 -859480 -760286
39315 -760286 -479719 -331851 -280437 -79513 203717 234479 -2328 -101835 125369 307127
$$ packed form
39385E76433O10327M67649j77839o77889n56831j02675J02472r3243l99303n29371
39375g80270l92736k3408M21246O82285O08182K94018n9957l07056l31517q6557
39365B4230K30670K65594o2281l99750m07821j94511j02817k18251l09814j71600
39355a346351J66198N04266O12521L82091l9187l49294m15983l72434l23476j66467
39345a348116J59841M69020N61895M77187L20415O6751k31199k87369L3714L68542
39335E90681K73523j29138l20608j27827J18460J57022J01993J00916P4389n7783
39325G81628j91305k22264j85709j22095l5948l0407k06261l85355k61764R9194
39315g60286K80567J47868N1414K00924K83230L0762k36807r9507K27204J81758
$$ plain form
39305 307127 49416 -468986 -740162 -586942 -294307 -179801 -283540 -445074 -482921 -298535
39295 -298535 54047 389866 548735 494071 241560 -172700 -586238 -754806 -643405 -508766
39285 -508766 -530721 -551200 -405377 -306922 -548263 -928221 -909266 -384821 114002 122232 -193413
39274 -193413 -380850 -321473 -223644 -195072 -128503 61212 321848 538783 549237 171218
39264 171218 -565726 -1278238 -1550026 -1385353 -1136037 -986904 -755792 -267676 294601 562958
39254 562958 402893 36182 -228081 -325543 -481714 -881151 -1294594 -1214674 -515884 202077
39244 202077 237625 -318695 -681637 -393462 154472 372922 239755 108603 73188 -58718
39234 -58718 -315725 -500241 -531536 -503776 -423666 -228712 -70812 -223894 -635433 -901847
$$ packed form
39305C07127k57711n18402k71176J53220K92635J14506j03739j61534l7847J84386
39295b98535L52582L35819J58869n4664k52511m14260m13538j68568J11401J34639
39285e08766k1955k0479J45823R8455k41341l79958J8955N24445M98823Q230l15645
39274a93413j87437N9377R7829K8572O6569J89715K60636K16935J0454l78019
39264A71218p36944p12512k71788J64673K49316J49133K31112M88116N62277K68357
39254E62958j60065l66711k64263r7462j56171l99437m13443P9920O98790P17961
39244B02077L5548n56320l62942K88175N47934K18450j33167j31152l5415j31906
39234e8718k57007j84516l1295K7760Q0110J94954J57900j53082m11539k66414
$$ plain form
39224 -901847 -806779 -578178 -474856 -440455 -371721 -404919 -606955 -617066 -22878 958065
39214 958065 1561949 1332452 620858 118313 100804 298013 373943 325690 381812 632238
39204 632238 872119 832982 496378 91767 -186533 -330032 -371582 -270195 -54256 68128
39194 68128 -68656 -309249 -289078 183496 968808 1767833 2303940 2377466 1945452 1210166
39184 1210166 508516 59013 -130520 -155024 -151356 -312183 -757415 -1327832 -1656880 -1530898
39174 -1530898 -1082923 -593889 -228092 -14914 51798 3689 -84849 -136831 -87074 125318
39164 125318 459804 689720 603161 315456 164755 231116 208992 -119396 -559443 -858026
39154 -858026 -1104176 -1456267 -1686117 -1422493 -777051 -297865 -259413 -383276 -350668 -205037
$$ packed form
39224i01847R5068K28601J03322L4401O8734l3198k02036j0111N94188R80943
39214I58065O03884k29497p11594n02545j7509J97209P5930m8253N6122K50426
39204F32238K39881l9137l36604m04611k78300j43499m1550J01387K15939J22384
39194F8128j36784k40593K0171M72574P85312P99025N36107P3526m32014p35286
39184A210166p01650m49503j89533k4504L668j60827m45232n70417l29048J25982
39174a530898M47975M89034L65797K13178O6712m8109q8538n1982M9757K12392
39164A25318L34486K29916q6559k87705j50701O6361k2124l28388m40047k98583
39154h58026k46150l52091k29850K63624O45442M79186L8452j23863L2608J45631
$$ plain form
39144 -205037 -77732 114311 416103 558155 268368 -297924 -740380 -900540 -870936 -650973
39134 -650973 -186092 271460 275382 -191588 -558921 -378159 63419 142856 -240245 -554422
39124 -554422 -365273 156493 556465 661316 635446 646046 707672 800030 916701 975749
39114 975749 868591 668205 639929 937112 1378584 1629238 1533890 1188958 772075 425752
39104 425752 252121 279549 435997 640918 881870 1109334 1147214 877216 455257 145582
39094 145582 -25355 -218240 -403029 -334570 16935 315227 301991 141075 138457 358811
39084 358811 720426 1208025 1723247 1978163 1877143 1780473 1991602 2197832 1929450 1420400
39074 1420400 1364969 1805456 1972549 1452811 830708 756409 973923 864936 510782 485077
$$ packed form
39144b05037J27305J92043L01792J42052k89787n66292m42456j60160K9604K19963
39134f50973M64881M57552L922m66970l67333J80762M41578P9437l83101l14177
39124e54422J89149N21766L99972J04851k5870J0600O1626R2358J16671N9048
39114I75749j07158k00386k8276K97183M41472K50654r5348l44932m16883l46323
39104D25752j73631K7428J56448K04921K40952K27464L7880k69998m21959l09675
39094A45582j70937j92885j84789O8459L51505K98292j3236j60916k618K20354
39084C58811L61615M87599N15222K54916j01020r6670K11129K06230k68382n09050
39074A420400n5431M40487J67093n19738o22103p4299K17514j08987l54154k5705
$$ plain form
39064 485077 802843 822982 218646 -585911 -1071722 -1185467 -1077621 -778233 -392470 -212061
39054 -212061 -320866 -388835 -152327 161835 201420 54188 96311 413004 723113 826120
39044 826120 797048 728180 578873 372143 316285 593105 1123286 1615662 1794411 1581287
39034 1581287 1149615 800440 686978 658319 464226 92201 -216673 -269650 -93771 199347
39024 199347 544239 852852 984866 924106 882475 1067492 1372157 1434893 1042236 395272
39014 395272 -62942 -58963 267874 491853 279372 -293863 -783617 -795205 -404513 -111589
39004 -111589 -307275 -824628 -1124645 -917098 -439043 -47073 270595 737910 1242854 1306699
38994 1306699 732662 -15089 -364744 -391648 -649517 -1275273 -1673816 -1275804 -303898 506027
$$ packed form
39064D85077L17766K0139o04336q04557m85811j13745J07846K99388L85763J80409
39054b12061j08805o7969K36508L14162L9585j47232M2123L16693L10109J03007
39044H26120k9072o8868j49307k06730n5858K76820N30181M92376J78749k13124
39034A581287m31672l49175j13462k8659j94093l72025l08874n2977J75879K93118
39024A99347L44892L08613J32014o0760m1631J85017L04665O2736l92657o46964
39014C95272m58214L979L26837K23979k12481n73235m89754j1588L90692K92924
39004a11589j95686n17353l00017K07547M78055L91970L17668M67315N04944O3845
38994A306699n74037p47751l49655k6904k57869o25756l98543L98012R71906Q09925
$$ plain form
38984 506027 771789 729203 712450 745720 733716 731923 815844 881825 804533 662270 584124
38973 584124 486714 231994 -14254 100760 601346 1082010 1223893 1137198 1047068 927365
38963 927365 684316 463550 462953 588003 599496 488102 382485 190262 -283314 -885442
38953 -885442 -1190165 -1078894 -865528 -748201 -527048 -34700 515818 840027 942382 957308
38943 957308 920582 899346 1017739 1115339 759044 -78958 -744082 -725669 -388879 -350724
38933 -350724 -478014 -213037 320724 385514 -172883 -628180 -499011 -215144 -289831 -491044
38923 -491044 -344249 42904 208643 33490 -298547 -722619 -1154705 -1197356 -561419 361140
38913 361140 886416 916174 918879 1115456 1259504 1257641 1409008 1818960 2057745 1705404
$$ packed form
38984E06027K65762m2586j6753L3270j2004j793Q3921O5981p7292j42263p8146
38973E84124r7410k54720k46248J15014N00586M80664J41883q6695r0130j19703
38963I27365k43049k20766n97J25050J1493j11394j05617j92223m73576o02128
38953h85442l04723J11271K13366J17327K21153M92348N50518L24209J02355J4926
38943I57308l6726k1236J18393R7600l56295q38002o65124J8413L36790L8155
38933c50724j27290K64977N33761O4790n58397m55297J29169K83867p4687k01213
38923d91044J46795L87153J65739j75153l32037m24072m32086m2651O35937R22559
38913C61140N25276K9758K705J96577J44048j863J51367M09952K38785l52341
$$ plain form
38903 1705404 921305 208911 -143888 -165993 28512 319923 560074 666961 670309 578234
38893 578234 341017 28047 -152933 -144188 -164252 -388566 -662465 -705700 -475241 -154836
38883 -154836 106612 277675 356033 357014 322372 225369 -20661 -332417 -399992 -73849 325344
38872 325344 360093 66527 -123712 -52348 -70822 -473206 -1005523 -1203464 -1031695 -877225
38862 -877225 -968323 -1109784 -1052644 -853600 -697790 -550780 -229767 242893 600642 672325
38852 672325 541338 288993 -183191 -876560 -1413192 -1332546 -658845 82822 464144 542038
38842 542038 580064 637057 615448 530707 479709 415912 199061 -123610 -287090 -119785 250728
38831 250728 559911 667081 605285 480168 397698 416070 483281 466488 318495 179850
$$ packed form
38903A705404p84099p12394l52799k2105J94505K91411K40151J06887L348r2075
38893E78234k37217l12970j80980Q745k0064k24314k73899m3235K30459L20405
38883a54836K61448J71063P8358R81l4642r7003k46030l11756o7575L26143L99193
38872C25344L4749k93566j90239P1364j8474m02384n32317j97941J71769J54470
38862h77225r1098j41461N7140J99044J55810J47010L21013M72660L57749P1683
38852F72325j30987k52345m72184o93369n36632Q0646O73701P41667L81322P7894
38842E42038L8026N6993k1609q4741n0998o3797k16851l22671j63480J67305L70513
38831B50728L09183J07170o1796j25117q2470J8372O7211j6793j47993j38645
$$ plain form
38821 179850 230547 450378 616246 565802 392145 319531 428942 582844 618567 543067
38811 543067 500162 582277 712148 710704 495912 243012 298623 822572 1516982 1875124
38801 1875124 1778632 1678647 2021328 2630816 2900512 2532282 1816484 1177778 741094 444162
38791 444162 296905 326390 444390 571370 767042 1065588 1316111 1382238 1374938 1463817
38781 1463817 1572294 1536276 1492964 1775185 2384966 2898541 3020856 2951494 3001316 3072427
38771 3072427 2799108 2109410 1375526 991198 1000355 1200374 1453926 1782571 2213537 2644177
38761 2644177 2891873 2857094 2613931 2327741 2093913 1881885 1628230 1337383 1076390 911504
38751 911504 865945 896370 896945 789431 643729 639705 847147 1103902 1195753 1107148 985375
$$ packed form
38821A79850N0697K19831J65868n0444j73657p2614J09411J53902L5723p5500
38811E43067m2905Q2115J29871j444k14792k52900N5611N23949O94410L58142
38801A875124r6492r9985L42681O09488K69696l68230p15798o38706m36684k96932
38791D44162j47257K9485J18000J26980J95672K98546K50523O6127p300Q8879
38781A463817J08477l6018m3312K82221O09781N13575J22315o9362M9822P1111
38771C072427k73319o89698p33884l84328R157K00019K53552L28645M30966M30640
38761B644177K47696l4779k43163k86190k33828k12028k53655k90847k60993j64886
38751I11504m5559L0425N75j07514j45702m024K07442K56755R1851q8605j21773
$$ plain form
38740 985375 895372 771109 637004 695101 1059635 1518878 1735350 1645815 1499961 1506862
38730 1506862 1610332 1646716 1557173 1372226 1140421 961763 930031 925996 657862 96701
38720 96701 -312638 -154681 370407 702591 694431 718520 973486 1150321 989208 744656
38710 744656 758328 889287 790476 556535 638902 1163957 1732557 1919350 1644390 1037097
38700 1037097 280427 -336457 -542803 -406441 -279321 -307788 -252998 66734 428323 512816
38690 512816 351431 215633 203979 198243 163715 237978 485300 734293 744301 482092 192751
38679 192751 178402 472921 763085 716916 364570 26051 -108444 -121080 -77096 121148
38669 121148 445811 574327 275692 -185882 -324922 -59419 200693 95424 -281916 -569909
$$ packed form
38740I85375r0003j24263j34105N8097L64534M59243K16472q9535j45854O901
38730A506862J03470L6384q9543j84947k31805j78658l1732m035k68134n61161
38720I6701m09339J57957N25088L32184q160K4089K54966J76835j61113k44552
38710G44656J3672J30959r8811k33941Q2367N25055N68600J86793k74960o07293
38700A037097p56670o16884k06346J36362J27120k8467N4790L19732L61589Q4493
38690E12816j61385j35798j1654n736l4528P4263K47322K48993J0008k62209k89341
38679A92751j4349K94519K90164m6169l52346l38519j34495j2636M3984J98244
38669A21148L24663J28516k98635m61574j39040K65503K60112j05269l77340k87993
$$ plain form
38659 -569909 -541517 -246532 109343 335744 384471 377667 477355 693329 843405 726978
38649 726978 351248 2094 42998 535512 1065688 1113501 659486 243452 291847 575542
38639 575542 557747 139693 -243449 -236362 45754 319258 544143 849915 1223269 1492691
38629 1492691 1580701 1601444 1688621 1838549 1966082 2034057 2039568 1893059 1435078 664800
38619 664800 -119634 -561780 -630579 -603149 -623348 -472713 84232 882626 1476400 1597880
38609 1597880 1340095 962327 689121 632108 710176 674264 388062 46982 -66677 8979
38599 8979 -7042 -177316 -254095 -107577 50869 29297 -3740 238377 728167 1165442 1368348
38588 1368348 1395141 1302215 1028972 618021 356873 484948 796039 762581 171077 -528893
$$ packed form
38659e69909K8392K94985L55875K26401M8727o804R9688K15974J50076j16427
38649G26978l75730l49154M0904M92514N30176M7813m54015m16034M8395K83695
38639E75542j7795m18054l83142P087K82116K73504K24885L05772L73354K69422
38629A492691Q8010K0743Q7177J49928J27533O7975N511j46509m57981p70278
38619F64800p84434m42146o8799K7430k0199J50635N56945P98394N93774J21480
38609A597880k57785l77768k73206n7013P8068l5912k86202l41080j13659P5656
38599H979j6021j70274p6779J46518J58446k1572l3037K42117M89790M37275K02906
38588A368348K6793r2926k73243m10951k61148J28075L11091l3458n91504o99970
$$ plain form
38578 -528893 -710457 -308744 185585 421206 501713 527089 278045 -319166 -772461 -546577
38568 -546577 169145 684775 704727 528367 416358 292063 135286 147776 360565 534873
38558 534873 640141 977951 1597645 2038019 1956201 1611621 1389197 1228952 922257 618564
38548 618564 572434 658483 615172 554167 740359 1038414 1083616 887518 770559 772679 653156
38537 653156 449756 492352 790267 914697 633112 225418 16683 -7967 27663 114140
38527 114140 173494 29271 -240925 -283900 -27132 99898 -218258 -669767 -765176 -554151
38517 -554151 -506438 -813073 -1180017 -1289862 -1156027 -965692 -793851 -578923 -288843 -21992
38507 -21992 86517 59206 94603 304851 536270 610677 623504 747014 859038 754087
$$ packed form
38578e28893j81564M01713M94329K35621Q0507K5376k49044n97211m53295K25884
38568e46577P15722N15630J9952j76360j12009j24295j56777J2490K12789J74308
38558E34873J05268L37810O19694M40374q1818l44580k22424j60245l06695l03693
38548F18564m6130Q6049m3311o1005J86192K98055M5202j96098j16959K120j19523
38537F53156k03400M2596K97915J24430k81585m07694k08735k4650L5630Q6477
38527A14140N9354j44223k70196m2975K56768J27030l18156m51509r5409K11025
38517e54151M7713l06635l66944j09845J33835J90335J71841K14928K90080K66851
38507b1992J08509k7311L5397K10248K31419P4407J2827J23510J12024j04951
$$ plain form
38497 754087 672386 1107109 1967643 2462282 2096463 1341606 953570 1012843 1065287 898349
38487 898349 694891 623692 738466 1126107 1705695 2006497 1601750 694124 -130863 -625087
38477 -625087 -925512 -1036958 -833725 -539501 -592808 -926608 -941764 -378122 301195 619459
38467 619459 691251 831509 1009257 1052206 1034242 1071031 1006888 686645 326989 256226 441785
38456 441785 586105 536611 321741 -26352 -366717 -355597 176023 880429 1278003 1354143
38446 1354143 1405655 1445017 1241009 902329 870027 1195012 1304627 753799 -126306 -608398
38436 -608398 -366449 350264 1128714 1683652 1850661 1598676 1112517 717353 650722 918756
38426 918756 1334401 1653782 1716247 1507867 1122625 732300 618622 1060885 1984164 2807264
$$ packed form
38497G54087q1701M34723Q60534M94639l65819p54857l88036N9273N2444j66938
38487H98349k03458p1199J14774L87641N79588L00802m04747r07626q24987m94224
38477f25087l00425j11446K03233K94224n3307l33800j5156N63642O79317L18264
38467F19459P1792J40258J77748M2949j7964L6789o4143l20243l59656p0763J85559
38456D41785J44320m9494k14870l48093l40365J1120N31620P04406L97574P6140
38446A354143N1512L9362k04008l38680l2302L24985J09615n50828q80105m82092
38436f08398K41949P16713P78450N54938J67009k51985m86159l95164o6631K68034
38426I18756M15645L19381O2465k08380l85242l90325j13678M42263R23279Q23100
$$ plain form
38416 2807264 2916736 2315215 1571451 1125861 930953 812806 812242 980859 1165937 1273248
38406 1273248 1495604 1977600 2454339 2562442 2372896 2263803 2344718 2358679 2122555 1718788
38396 1718788 1246235 727949 313294 225623 403656 498316 336175 87537 -132055 -463463
38386 -463463 -905652 -1085122 -759282 -280769 -167618 -380587 -440452 -183103 27783 -122887
38376 -122887 -482391 -697864 -619343 -313882 89991 442911 639350 747691 928677 1172109
38366 1172109 1298994 1271111 1263187 1338937 1312231 1074904 814972 726932 749885 811916 1066270
38355 1066270 1568385 1957118 1887768 1649629 1858434 2530759 2965681 2686799 2045200 1637131
38345 1637131 1514754 1328161 971202 671155 567028 582925 681478 899059 1104179 1032298
$$ packed form
38416B807264J09472o01521p43764m45590j94908j18147n64J68617J85078J07311
38406A273248K22356M81996M76739J08103j89546j09093Q0915J3961k36124m03767
38396A718788m72553n18286m14655q7671J78033R4660j62141k48638k19592l31408
38386d63463m42189j79470L25840M78513J13151k12969n9865K57349K10886j50670
38376a22887l59504k15473P8521L05461M03873L52920J96439J08341J80986K43432
38366A172109J26885k7883p924P5750k6706k37327k59932q8040K2953O2031K54354
38355A066270N02115L88733o9350k38139K08805O72325M34922k78882o41599m08069
38345A637131j22377j86593l56959l00047j04127J5897R8553K17581K05120p1881
$$ plain form
38335 1032298 665316 353205 434584 876456 1380638 1729264 1928420 2074796 2164312 2058539
38325 2058539 1678290 1223079 1053373 1259404 1507760 1482275 1297856 1215813 1130685 754767
38315 754767 240671 107804 454057 761153 725747 781152 1381890 2176655 2441291 2096959
38305 2096959 1717137 1630894 1621308 1540868 1619611 1958922 2223959 2140648 1914463 1830973 1759303
38294 1759303 1427432 969760 806944 1085282 1568600 2010113 2309669 2351278 2034857 1522694
38284 1522694 1169285 1114804 1164348 1131800 1061674 1004682 826648 450304 117548 146059
38274 146059 470848 672006 507890 231118 260470 659091 1091634 1260166 1223129 1240456
38264 1240456 1431989 1689863 1854697 1857929 1714696 1488954 1272862 1116265 980247 841006
$$ packed form
38335A032298l66982l12111Q1379M41872N04182L48626J99156J46376Q9516j05773
38325B058539l80249m55211j69706K06031K48356k5485j84419q2043q5128l75918
38315G54767n14096j32867L46253L07096l5406N5405O00738P94765K64636l44332
38305B096959l79822q6243r586q0440P8743L39311K65037q3311k26185q3490p1670
38294A759303l31871m57672j62816K78338M83318M41513K99556M1609l16421n12163
38284A522694l53409n4481M9544l2548p0126n6992j78034l76344l32756K8511
38274A46059L24789K01158j64116k76772K9352L98621M32543J68532l7037J7327
38264A240456J91533K57874J64834L232j43233k25742k16092j56597j36018j39241
$$ plain form
38254 841006 806031 995838 1317695 1515086 1478420 1360485 1339762 1428380 1579395 1808655
38244 1808655 2096831 2321114 2420519 2520431 2786685 3269662 3962250 4824182 5641574 6121689
38234 6121689 6356905 6955023 8349299 10077965 11100136 10826311 9575183 8067610 6798468
38225 6798468 5904407 5269577 4610794 3711137 2712108 1994843 1694207 1542594 1295865
38216 1295865 1107207 1333405 2097131 3138424 4002537 4350174 4222998 4022984 4089815
38207 4089815 4321568 4380437 4188694 3951907 3769967 3598974 3576293 3913281 4362808 4282855
38197 4282855 3458311 2436141 1797328 1533558 1430609 1545724 1827700 1737725 923853
38188 923853 -199 -73088 708574 1390684 1389262 1141063 1265012 1700119 2011210 2099937
$$ packed form
38254H41006l4975J89807L21857J97391l6666j17935k0723Q8618J51015K29260
38244A808655K88176K24283R9405R9912K66254M82977O92588Q61932Q17392M80115
38234F121689K35216N98118J394276J728666J022171k73825j251128j507573j269142
38225F798468q94061o34830o58783q99657r99029p17265l00636j51613k46729
38216A295865j88658K26198P63726J041293Q64113L47637j27176k00014O6831
38207D089815K31753N8869j91743k36787j81940j70993k2681L36988M49527p9953
38197D282855q24544j022170o38813k63770j02949J15115K81976q9975q13872
38188I23853r24052p2889P81662O82110j422k48199J23949M35107L11091Q8727
$$ plain form
38178 2099937 2217647 2515508 2884088 3094973 2930455 2344259 1618081 1162161 1064282 1069167
38168 1069167 1075051 1306076 1806653 2120720 1809829 1071478 497199 347010 398405 447301
38158 447301 607577 1038225 1610411 1979205 1911791 1500296 1083362 932613 978730 911373
38148 911373 596291 282742 295458 624308 970374 1144635 1255995 1489677 1822224 2010882
38138 2010882 1822196 1252623 546746 2072 -246145 -244129 -81995 167207 383407 412519
38128 412519 220581 -33091 -136318 5777 358093 822206 1253210 1481728 1422597 1179012
38118 1179012 994508 1053625 1302124 1497815 1509402 1528991 1844226 2404311 2832477 2925691
38108 2925691 2847339 2674061 2135858 1167399 381656 440361 1112376 1555812 1487147 1428671
$$ packed form
38178B099937J17710K97861L68580K10885j64518n86196p26178m55920r7879M885
38168A069167N884K31025N00577L14067l10891p38351n74279j50189N1395M8896
38158D47301J60276M30648N72186L68794o7414m11495m16934j50749M6117o7357
38148I11373l15082l13549J2716L28850L46066J74261J11360K33682L32547J88658
38138B010882j88686n69573p05877n44674k48217K016J62134K49202K16200K9112
38128D12519j91938k53672j03227J42095L52316M64113M31004K28518n9131k43585
38118A179012j84504N9117K48499J95691J1587J9589L15235N60085M28166R3214
38108B925691p8352j73278n38203r68459p85743N8705O72015M43436o8665n8476
$$ plain form
38098 1428671 1739104 2105583 2235543 2373713 2732238 2990124 2849774 2597649 2562406 2447041
38088 2447041 1840030 1077475 903755 1425529 2033364 2271959 2196558 1944437 1583671 1395330
38078 1395330 1683769 2208146 2356129 1991260 1594358 1464590 1378223 1222637 1325733 1804107
38068 1804107 2151348 1953514 1587077 1677192 2155662 2398211 2135897 1712606 1475777 1373865
38058 1373865 1242565 1143372 1248285 1543180 1762019 1604238 1059472 538140 536994 1081153
38048 1081153 1650769 1779127 1539669 1272047 1038053 643720 96825 -284574 -258565 69280
38038 69280 421018 635186 717788 715281 623297 422901 193359 123116 296891 501952 436015
38027 436015 142170 11514 254914 610780 737573 659449 600014 593272 546850 520145 613816
$$ packed form
38098A428671L10433L66479J29960J38170L58525K57886j40350k52125l5243j15365
38088B447041o07011p62555j73720N21774O07835K38595p5401k52121l60766j88341
38078A395330K88439N24377J47983l64869l96902j29768q6367j55586J03096M78374
38068A804107L47241j97834l66437R0115M78470K42549k62314m23291k36829j01912
38058A373865j31300r9193J04913K94895K18839j57781n44766n21332j146N44159
38048A081153N69616J28358k39458k67622k33994l94333n46895l81399K6009L27845
38038F9280L51738K14168Q2602k507r1984k00396k29542p0243J73775K05061o5937
38027D36015k93845j30656K43400L55866J26793p8124n9435o742m6422k6705R3671
$$ plain form
38016 613816 703842 634366 594600 915339 1493342 1812736 1617684 1198226 880925 603301
38006 603301 223045 -59483 76715 570165 991749 1025635 734183 384169 194114 234404
37996 234404 400799 455055 216281 -232975 -578535 -525965 -8002 799753 1593782 2096120
37986 2096120 2178374 1887143 1388982 930604 785302 1062929 1512591 1670367 1332157 782260
37976 782260 436515 376327 397391 397368 459329 588344 660186 707969 999771 1672972 2471252
37965 2471252 3010804 3171412 3073006 2818481 2465069 2136878 1935933 1807037 1698004 1756426
37955 1756426 2090677 2408134 2262314 1710451 1353226 1563854 2002847 2121173 1870442
37946 1870442 1638725 1686944 1939957 2197107 2284661 2118813 1859123 1858784 2205253 2478642
$$ packed form
38016F13816R0026o9476l9766L20739N78003L19394j95052m19458l17301k77624
38006F03301l80256k82528J36198M93450M21584L3886k91452l50014j90055M0290
37996B34404J66395N4256k38774m49256l45560N2570N17963Q07755P94029N02338
37986B096120Q2254k91231m98161m58378j45302K77627M49662J57776l38210n49897
37976G82260l45745o0188K1064k3O1961J29015P1842M7783K91802O73201P98280
37965B471252N39552J60608r8406k54525l53412l28191k00945j28896j09033N8422
37955A756426L34251L17457j45820n51863l57225K10628M38993J18326k50731
37946A870442k31717M8219K53013K57150Q7554j65848k59690l39L46469K73389
$$ plain form
37936 2478642 2286997 1882635 1844051 2237195 2544296 2427355 2109149 1909850 1826915 1726772
37926 1726772 1597358 1449783 1276928 1235441 1548368 2109210 2523143 2646675 2688252 2663134
37916 2663134 2277429 1612901 1363930 1940369 2789098 3139204 3044134 3078806 3308326 3280019
37906 3280019 2913020 2654503 2686570 2632237 2235917 1802457 1720349 1956797 2244296 2433326
37896 2433326 2487884 2450851 2559168 3057424 3740388 4026390 3672577 3079401 2678400 2385152
37886 2385152 1964173 1610348 1742477 2364374 3010197 3285879 3177271 2847146 2402221
37877 2402221 1916220 1491331 1196898 1012946 888406 857029 1079815 1685554 2483621 2959134
37867 2959134 2786558 2302979 2171684 2538960 2865221 2729143 2441761 2571904 3110570
$$ packed form
37936B478642j91645m04362l8584L93144L07101j16941l18206j99299q2935j00143
37926A726772j29414j47575j72855m1487L12927N60842M13933J23532M1577k5118
37916B663134l85705o64528k48971N76439Q48729L50106r5070L4672K29520k8307
37906C280019l66999k58517L2067n4333l96320m33460q2108K36448K87499J89030
37896B433326N4558l7033J08317M98256O82964K86002l53813n93176m01001k93248
37886B385152m20979l53825J32129O21897O45823K75682j08608l30125m44925
37877B402221m86001m24889k94433j83952j24540l1377K22786O05739P98067M75513
37867B959134j72576m83579j31295L67276L26261j36078k87382J30143N38666
$$ plain form
37858 3110570 3472161 3243533 2630540 2163804 2174105 2561769 2919915 2875882 2423115 1915649
37848 1915649 1687714 1749985 1908511 2048013 2187004 2367092 2614431 2936319 3277003 3563274
37838 3563274 3810659 4012649 3919127 3231896 2144010 1343471 1238581 1487365 1590753
37829 1590753 1616611 1900329 2313461 2424074 2271980 2348764 2753668 2986804 2774068 2521102
37819 2521102 2617672 2789104 2597240 2217789 2171632 2479992 2653419 2489949 2353142 2545210
37809 2545210 2858144 2958798 2849478 2667230 2335954 1798031 1393242 1539814 2056465
37800 2056465 2261776 1882319 1447258 1519678 1899753 2002066 1777982 1721829 2002693 2161300
37790 2161300 1852308 1414568 1381445 1756853 2145282 2372773 2585205 2858800 3110530 3367283
$$ packed form
37858C110570L61591k28628o12993m66736J0301L87664L58146m4033m52767n07466
37848A915649k27935O2271J58526J39502J38991J80088K47339L21888L40684K86271
37838C563274K47385K01990r3522o87231j087886q00539j04890K48784J03388
37829A590753K5858K83718M13132J10613j52094P6784M04904K33136k12736k52966
37819B521102R6570J71432j91864l79451m6157L08360J73427j63470j36807J92068
37809B545210L12934J00654j09320j82248l31276n37923m04789J46572N16651
37800B056465K05311l79457m35061P2420L80075J02313k24084n6153K80864J58607
37790B161300l08992m37740l3123L75408L88429K27491K12432K73595K51730K56753
$$ plain form
37780 3367283 3759703 4195539 4340712 4028107 3473777 3008819 2772326 2714264 2706093 2578167
37770 2578167 2229616 1796687 1573368 1680985 1924856 2024869 1864971 1486097 1008799
37761 1008799 657994 706548 1226106 1934117 2400935 2419507 2147937 1922701 1952843 2155796
37751 2155796 2266357 2123298 1847470 1729240 1969793 2531583 3166771 3581385 3687697
37742 3687697 3719454 3934871 4176291 4001488 3391193 2978858 3249605 3802132 3879259 3449151
37732 3449151 3179646 3370094 3558502 3380027 3221374 3629266 4471776 5131104 5298890
37723 5298890 5180723 5046827 4940075 4789467 4545843 4206042 3854092 3628339 3552374 3517010
37713 3517010 3515079 3705618 4118584 4510282 4680433 4724615 4800155 4883783 4971776 5248749
$$ packed form
37780C367283L92420M35836J45173l12605n54330m64958k36493n8062q171j27926
37770B578167l48551m32929k23319J07617K43871J00013j59898l78874m77298
37761A008799l50805M8554N19558P08011M66818J8572k71570k25236L0142K02953
37751B155796J10561j43059k75828j18230K40553N61790O35188M14614J06312
37742C687697L1757K15417K41420j74803o10295m12335K70747N52527P7127m30108
37732C449151k69505J90448J88408j78475j58653M07892Q42510O59328J67786
37723E298890j18167j33896j06752j50608k43624l39801l51950k25753p5965l5364
37713C517010j931J90539M12966L91698J70151M4182P5540Q3628Q7993K76973
$$ plain form
37703 5248749 5767691 6203098 6256698 6107042 6109649 6251836 6298218 6288638 6421282 6560338
37693 6560338 6376382 5952767 5740128 5856368 5924787 5717173 5480676 5452491 5497038 5462834
37683 5462834 5502706 5742400 5944746 5826559 5504628 5352380 5560757 6046901 6650073 7239621
37673 7239621 7754109 8243915 8728185 8989502 8797856 8408630 8457488 9163870 9987887 10313281
37663 10313281 10122187 9730494 9265820 8812288 8705309 9141806 9705061 9801529 9441594
37654 9441594 9099542 8934357 8704411 8397920 8351521 8663220 9011303 9179498 9292085 9405818
37644 9405818 9345361 9104442 8942194 8888342 8621504 8070727 7655841 7627445 7642934 7388618
37634 7388618 7186344 7497885 8171338 8703361 8983965 9235336 9417795 9292570 8985878
$$ packed form
37703E248749N18942M35407N3600j49656K607J42187M6382r580J32644J39056
37693F560338j83956m23615k12639J16240O8419k07614k36497k8185M4547l4204
37683E462834L9872K39694K02346j18187l21931j52248K08377M86144O03172N89548
37673G239621N14488M89806M84270K61317j91646l89226M8858P06382Q24017L25394
37663A0313281j91094l91693m64674m53532j06979M36497N63255R6468l59935
37654I441594l42052j65185k29946l06491m6399L11699L48083J68195J12587J13733
37644I405818o0457k40919j62248n3852k66838n50777m14886k8396J5489k54316
37634G388618k02274L11541O73453N32023K80604K51371J82459j25225l06692
$$ plain form
37625 8985878 8916511 9167030 9442741 9648238 9952754 10240199 10108559 9605817 9388967 9835433
37615 9835433 10481095 10722857 10666350 10815546 11228692 11509545 11491964 11428238 11509247 11636938
37605 11636938 11750889 12006548 12461481 12852310 12905271 12744183 12798059 13323935 14142011 14860874
37595 14860874 15278486 15492783 15662977 15806393 15898528 16026235 16268676 16524941 16688839
37586 16688839 16926807 17482640 18222982 18755301 19077315 19673284 20738424 21732891 22085994
37577 22085994 22009598 22141410 22619218 23059566 23345464 23829500 24669294 25501195 26011504
37568 26011504 26443592 27257178 28525019 29900528 31020268 31772794 32321768 33012082 34138100
37559 34138100 35693764 37420272 39099699 40669245 42099642 43398866 44730234 46270573
$$ packed form
37625H985878o9367K50519K75711K05497L04516K87445j31640n02742k16850M46466
37615I835433O45662K41762n6507J49196M13146K80853j7581o3726Q1009J27691
37605A1636938J13951K55659M54933L90829N2961j61088N3876N25876Q18076P18863
37595A4860874M17612K14297J70194J43416R2135J27707K42441K56265J63898
37586A6688839K37968N55833P40342N32319L22014N95969J065140R94467L53103
37577B2085994p6396J31812M77808M40348K85898M84036Q39794Q31901N10309
37568B6011504M32088Q13586J267841J375509J119740P52526N48974O90314J126018
37559C4138100J555664J726508J679427J569546J430397J299224J331368J540339
$$ plain form
37551 46270573 47955230 49652465 51564822 54054830 57006724 59802669 62096940 64200341
37543 64200341 66518893 69087859 71934427 75380517 79538769 83948359 88259287 92930044
37535 92930044 98631478 105225224 112023523 118905277 126421004 134805052 143677773 152915006
37527 152915006 163080482 174636069 187316967 200735897 215140842 231062481 248512968
37520 248512968 267032974 286368081 306668638 328101672 350599042 373898517 397510290
37513 397510290 420689908 442705998 463064589 481225325 496231609 506999682 512993086
37506 512993086 514304397 511036373 502943170 489870024 472360399 451650052 429134163
37499 429134163 405897908 382579382 359438551 336514241 313859543 291764224 270757371
$$ packed form
37551D6270573J684657J697235J912357K490008K951894K795945K294271K103401
37543F4200341K318552K568966K846568L446090M158252M409590M310928M670757
37535I2930044N701434O593746O798299O881754P515727Q384048Q872721R237233
37527A52915006J0165476J1555587J2680898J3418930J4404945J5921639J7450487
37520B48512968J8520006J9335107K0300557K1433034K2497370K3299475K3611773
37513C97510290K3179618K2016090K0358591J8160736J5006284J0768073N993404
37506E12993086J311311l268024q093203j3073146j7509625k0710347k2515889
37499D29134163k3236255k3318526k3140831k2924310k2654698k2095319k1006853
$$ plain form
37492 270757371 251302674 233443564 216835751 201218684 186749326 173699489 161928421
37485 161928421 150972798 140691916 131457354 123502277 116390890 109452065 102550180 96086779
37477 96086779 90357028 85268589 80653108 76462521 72572089 68724519 64849831 61228178
37469 61228178 58157140 55579081 53165218 50677031 48149576 45786991 43741153 41952845
37461 41952845 40216820 38464703 36906777 35745697 34830237 33824692 32678336 31623051
37453 31623051 30677746 29520897 28021848 26573305 25631941 25164812 24824513 24445569 24016593
37444 24016593 23337954 22173111 20748333 19673211 19221540 19011838 18568216 17908490 17346061
37435 17346061 16953238 16550907 16125520 15904966 15961731 16006292 15723084 15158649 14610600 14203849
$$ packed form
37492B70757371j9454697j7859110j6607813j5617067j4469358j3049837j1771068
37485A61928421j0955623j0280882r234562p955077p111387o938825o901885o463401
37477I6086779n729751n088439m615481m190587l890432l847570l874688l621653
37469F1228178l071038k578059k413863k488187k527455k362585k045838j788308
37461D1952845j736025j752117j557926j161080r15460j005545j146356j055285
37453C1623051r45305j156849j499049j448543r41364m67129l40299l78944m28976
37444B4016593o78639j164843j424778j075122m51671k09702m43622o59726n62429
37435A7346061l92823m02331m25387k20554N6765M4561k83208n64435n48049m06751
$$ plain form
37425 14203849 13751051 13054420 12215112 11563395 11341660 11526348 11912035 12266575 12411524
37416 12411524 12280266 11978727 11728576 11668619 11733550 11780419 11794799 11897850 12173359 12568410
37406 12568410 12956847 13220275 13266621 13063283 12689902 12296788 11980676 11747532 11590898
37397 11590898 11505265 11395216 11110079 10679679 10410991 10575623 11021559 11264570 10998437
37388 10998437 10370261 9712268 9189483 8830027 8700337 8787873 8803376 8432523 7841717 7622536
37378 7622536 8061771 8719378 8972520 8771360 8537793 8464287 8332570 8018690 7729589 7590842
37368 7590842 7392693 6990990 6628944 6542996 6525111 6276360 6006490 6210106 6891766 7471504
37358 7471504 7527434 7234308 6959053 6812621 6779609 6919425 7161001 7176917 6772893 6217092
$$ packed form
37425A4203849m52798o96631q39308o51717k21735J84688L85687L54540J44949
37416A2411524j31258l01539k50151n9957O4931M6869J4380J03051K75509L95051
37406A2568410L88437K63428M6346k03338l73381l93114l16112k33144j56634
37397A1590898q5633j10049k85137m30400k68688J64632M45936K43011k66133
37388A0998437o28176o57993n22785l59456j29690Q7536J5503l70853n90806k19181
37378G622536M39235O57607K53142k01160k33567p3506j31717l13880k89101j38747
37368G590842j98149m01703l62046q5948j7885k48751k69870K03616O81660N79738
37358G471504N5930k93126k75255j46432l3012J39816K41576J5916m04024n55801
$$ plain form
37348 6217092 5902870 5850877 5827023 5781417 5817149 5829390 5578838 5138038 4890824 4985567
37338 4985567 5103525 4922216 4544394 4268899 4143200 3993917 3792318 3720740 3850882 3956158
37328 3956158 3764630 3328375 3015422 3093161 3392746 3488734 3195697 2749431 2458424 2350382
37318 2350382 2287566 2255222 2301824 2291259 1999781 1470891 1028859 887292 947892 1031713
37308 1031713 1096552 1160613 1225646 1363408 1668911 2027567 2150278 1977086 1828958 1976554
37298 1976554 2246741 2274939 2012104 1765384 1829962 2262578 2910280 3463240 3574812 3149922
37288 3149922 2475383 1910765 1539406 1281806 1191215 1360496 1631327 1714522 1592922 1525031
37278 1525031 1643309 1831166 2017757 2276657 2542628 2540823 2166447 1693838 1425586 1331769
$$ packed form
37348F217092l14222n1993k3854m5606L5732J2241k50552m40800k47214R4743
37338D985567J17958j81309l77822k75495j25699j49283k01599p1578J30142J05276
37328C956158j91528m36255l12953P7739K99585R5988k93037m46266k91007j08042
37318B350382o2816l2344M6602j0565k91478n28890m42032j41567O0600Q3821
37308A031713O4839O4061O5033J37762L05503L58656J22711j73192j48128J47596
37298A976554K70187K8198k62835k46720O4578M32616O47702N52960J11572m24890
37288C149922o74539n64618l71359k57600r0591J69281K70831Q3195j21600o7891
37278A525031J18278J87857J86591K58900K65971j805l74376m72609k68252r3817
$$ plain form
37268 1331769 1219611 1072136 994313 959899 858907 740458 793515 1084882 1458864 1686861
37258 1686861 1615777 1229246 702864 357149 398497 705504 992661 1166681 1377278 1717618
37248 1717618 2045996 2166788 2049106 1772869 1368618 841862 306285 -43653 -114061 13107
37238 13107 201893 391197 584945 790503 1009547 1223562 1334092 1194162 801358 414804
37228 414804 348816 637169 1002946 1171322 1106816 930858 739399 560836 396033 249671
37218 249671 186850 322338 603299 665590 206414 -454543 -560950 130870 935762 1085055
37208 1085055 688197 450655 684166 1106376 1480407 1863650 2191862 2171849 1745772 1224277
37198 1224277 821462 486605 313682 592178 1204626 1486783 1056953 367443 43411
$$ packed form
37268A331769j12158j47475p7823l4414j00992j18449N3057K91367L73982K27997
37258A686861p1084l86531n26382l45715M1348L07007K87157J74020K10597L40340
37248A717618L28378J20792j17682k76237m04251n26756n35577l49938p0408J27168
37238A3107J88786J89304J93748K05558K19044K14015J10530j39930l92804l86554
37228D14804o5988K88353L65777J68376o4506j75958j91459j78563j64803j46362
37218B49671o2821J35488K80961O2291m59176o60957j06407O91820Q04892J49293
37208A085055l96858k37542K33511M22210L74031L83243L28212k0013m26077n21495
37198A224277m02815l34857j72923K78496O12448K82157m29830o89510l24032
$$ plain form
37189 43411 72753 101634 153331 480215 949873 1180993 1168120 1212727 1313104 1188431 885821
37178 885821 778251 893942 823941 450287 213156 400690 669628 618050 429330 527526
37168 527526 868479 1017336 806421 529672 504899 738172 1044962 1284563 1421723 1484889
37158 1484889 1506046 1463277 1317016 1128380 1045433 1110584 1183227 1134528 1029547 1034480 1219595
37147 1219595 1517521 1789023 1864904 1617300 1082923 483068 89619 92406 527506 1203817
37137 1203817 1749874 1918999 1836731 1767117 1695245 1419979 1028575 892542 1102811 1308108
37127 1308108 1290520 1291541 1489960 1563734 1191399 675696 557275 792578 851407 555773
37117 555773 279177 277407 342675 267642 196188 290256 418885 437941 493141 784047 1242835
$$ packed form
37189D3411K9342K8881N1697L26884M69658K31120j2873M4607J00377j24673l02610
37178H85821j07570J15691p0001l73654k37131J87534K68938n1578j88720R8196
37168E27526L40953J48857k10915k76749k4773K33273L06790K39601J37160O3166
37158A484889K1157m2769j46261j88636q2947O5151P2643m8699j04981M933J85115
37147A219595K97926K71502P5881k47604n34377n99855l93449K787M35100O76311
37137A203817N46057J69125q2268o9614p1872k75266l91404j36033K10269K05297
37127A308108j7588J021J98419P3774l72335n15703j18421K35303N8829k95634
37117E55773k76596j770O5268p5033p1454R4068J28629J9056N5200K90906M58788
$$ plain form
37106 1242835 1674680 2017685 2245837 2217566 1876201 1445690 1176252 1024472 826178 646436
37096 646436 665090 805597 800885 621393 548306 787850 1264093 1825993 2392049 2817108
37086 2817108 2890051 2614261 2284777 2134676 2083388 1984780 1926508 2063617 2298975 2381860
37076 2381860 2251944 2050204 1836169 1540798 1191063 924283 731248 426208 -33665
37067 -33665 -413110 -507576 -399181 -257243 -60254 285396 673730 866156 773241 486496
37057 486496 90778 -351781 -675462 -713936 -560892 -504553 -627969 -679717 -460431 -153023
37047 -153023 -81227 -242305 -286633 40843 594264 1003029 1053702 844144 629153 595263
37037 595263 773920 1083792 1387658 1543548 1505643 1405261 1439208 1619379 1724123 1583542
$$ packed form
37106A242835M31845L43005K28152k8271l41365m30511k69438j51780j98294j79742
37096F46436J8654J40507m712j79492p3087K39544M76243N61900N66056M25059
37086B817108P2943k75790l29484j50101n1288r8608n8272J37109K35358Q2885
37076B381860j29916k01740k14035k95371l49735k66780j93035l05040m59873
37067c3665l79445r4466J08395J41938J96989L45650L88334J92426r2915k86745
37057D86496l95718m42559l23681l8474J53044N6339j23416n1748K19286L07408
37047a53023P1796j61078m4328L27476N53421M08765N0673k09558k14991l3890
37037E95263J78657L09872L03866J55890l7905j00382L3947J80171J04744j40581
$$ plain form
37027 1583542 1318383 1168687 1166261 1145782 1032621 919871 856778 761625 592240 426430
37017 426430 313696 213637 145625 228543 493361 824555 1160279 1541827 1852786 1764110
37007 1764110 1172323 510063 331578 670510 1069310 1190086 1120135 1078636 1117615 1210612
36997 1210612 1401449 1704261 1988768 2104685 2038580 1840355 1483050 949783 439399 307030
36987 307030 679326 1198681 1326103 963500 625037 823076 1376842 1583292 1080756 257548
36977 257548 -297771 -448537 -399807 -228671 104548 430719 488825 374307 481348 893253
36967 893253 1160038 858123 130620 -507485 -710259 -481626 -12289 439325 628499 525387
36957 525387 399370 524370 822104 950489 732110 353570 137504 238926 565713 858868
$$ packed form
37027A583542k65159j49696k426k0479j13161j12750o3093r5153j69385j65810
37017D26430j12734j00059o8012Q2918K64818L31194L35724L81548L10959q8676
37007A764110n91787o62260j78485L38932L98800J20776o9951m1499L8979R2997
36997A210612J90837L02812K84507J15917o6105j98225l57305n33267n10384j32369
36987C07030L72296N19355J27422l62603l38463J98039N53766K06450n02536q23208
36977B57548n55319j50766M8730J71136L33219L26171N8106j14518J07041M11905
36967H93253K66785l01915p27503o38105k02774K28633M69337M51614J89174j03112
36957E25387j26017J25000K97734J28385k18379l78540k16066J01422L26787K93155
$$ plain form
36947 858868 811981 252995 -665301 -1492450 -1814402 -1612634 -1257400 -1106659 -1135713 -1020811
36937 -1020811 -579001 -22375 286466 244032 59740 -37943 11865 202686 548078 967160
36927 967160 1228253 1170980 934009 813891 897337 963368 795241 485568 333466 471205
36917 471205 697543 720305 493815 234975 132446 145935 119672 -11288 -206640 -432827
36907 -432827 -670634 -832067 -782049 -474186 -12509 428134 700418 722146 495489 127895
36897 127895 -187798 -255382 -7589 372877 514548 192821 -370774 -706712 -644174 -456261
36887 -456261 -367165 -196697 258334 737909 804843 507929 335339 488534 597194 261867
36877 261867 -450262 -1173435 -1603825 -1570196 -1075925 -468780 -279899 -647784 -1106726 -1139780
$$ packed form
36947H58868m6887n58986r18296q27149l21952K01768L55234J50741k9054J14902
36937a020811M41810N56626L08841m2434j84292r7683M9808J90821L45392M19082
36927I67160K61093n7273k36971j20118Q3446O6031j68127l09673j52102J37739
36917D71205K26338K2762k26490k58840j02529J3489k6263j30960j95352k26187
36907d32827k37807j61433N0018L07863M61677M40643K72284K1728k26657l67594
36897A27895l15693o7584K47793L80466J41671l21727n63595l35938O2538J87913
36887d56261Q9096J70468M55031M79575O6934k96914j72590J53195J08660l35327
36877B61867p12129p23173m30390L3629M94271O07145J88881l67885m58942l3054
$$ plain form
36867 -1139780 -718843 -123895 460771 883161 864560 334626 -238429 -298950 59175 204750
36857 204750 -169131 -662829 -722035 -262225 360767 749957 717960 331108 -170167 -573867
36847 -573867 -832782 -936715 -784439 -384778 -44479 -35445 -141087 104116 735899 1316595
36837 1316595 1600760 1780672 1924020 1666945 805570 -180643 -617156 -428323 -66358
36828 -66358 175283 375343 604307 730363 636285 353930 -36594 -436432 -698173 -775152
36818 -775152 -824781 -940033 -904594 -517810 -39054 93736 -63499 -33624 288055 403111
36808 403111 -51644 -780831 -1299364 -1522546 -1567438 -1331704 -699926 58793 523715 623637
36798 623637 558181 381545 55498 -220996 -180130 73364 210936 224119 372587 622164
$$ packed form
36867a139780M20937N94948N84666M22390j8601n29934n73055o0521L58125J45575
36857B04750l73881m93698n9206M59810O22992L89190l1997l86852n01275m03700
36847e73867k58915j03933J52276L99661L40299R034j05642K45203O31783N80696
36837A316595K84165J79912J43348k57075q61375r86213m36513J88833L61965
36828f6358K41641K00060K28964J26056r4078k82355l90524l99838k61741p6979
36818g75152m9629j15252L5439L86784M78756J32790j57235K9875L21679J15056
36808D03111m54755p29187n18533k23182m4892K35734O31778P58719M64922R9922
36798F23637o5456j76636l26047k76494M0866K53494J37572J3183J48468K49577
$$ plain form
36788 622164 661311 532193 666464 1111478 1307734 962422 603801 803280 1288189 1395334
36778 1395334 1097332 947402 1150335 1308810 1088888 587348 -25671 -716174 -1301436
36769 -1301436 -1421909 -1023178 -516317 -240102 -59967 281124 682615 817929 576789
36760 576789 158090 -162267 -197033 101981 610535 1115625 1493674 1712214 1677010 1301561
36750 1301561 771280 475679 558864 762257 826610 801502 811814 787973 651656 556043
36740 556043 695849 1024009 1355357 1598031 1699012 1546148 1150221 767182 616189 621133
36730 621133 629396 689630 863361 969881 840124 658626 696046 829595 729830 465706
36720 465706 501236 1042701 1746930 2161278 2155680 1851302 1425038 1092184 1011039 1064549
$$ packed form
36788F22164L9147j29118J34271M45014J96256l45312l58621J99479M84909J07145
36778A395334k98002j49930K02933J58475k19922n01540o13019o90503n85262
36769a301436j20473L98731N06861K76215J80135L41091M01491J35314k41140
36760E76789m18699l20357l4766K99014N08554N05090L78049K18540l5204l75449
36750A301561n30281k95601Q3185K03393O4353k5108J0312k3841j36317r5613
36740E56043J39806L28160L31348K42674J00981j52864l95927l83039j50993M944
36730F21133Q263O0234J73731J06520j29757j81498L7420J33549r9765k64124
36720D65706L5530N41465P04229M14348n598l04378m26264l32854q1145N3510
$$ plain form
36710 1064549 941514 550635 179091 149009 476950 939164 1306931 1454723 1399375 1300369
36700 1300369 1293811 1307826 1184809 965802 859693 937849 1072179 1172950 1254699 1267115
36690 1267115 1131089 973481 1038444 1295051 1408684 1185796 780559 393599 78383 -61604
36680 -61604 141390 541090 641345 229585 -224915 -124289 497632 1066488 1163237 837873
36670 837873 354899 -68914 -318357 -412151 -465500 -483691 -301121 119263 489678 529781
36660 529781 358899 292037 345003 240498 -115883 -442491 -420694 -54544 347547 453356
36650 453356 195016 -148441 -242826 -133800 -203187 -568734 -797374 -486976 98011 342505
36640 342505 82808 -316839 -601408 -877426 -1210185 -1429376 -1462480 -1462477 -1435648 -1116786 -447877
$$ packed form
36710A064549j23035l90879l71544l0082L27941M62214L67767J47792n5348r9006
36700A300369o558J4015j23017k19007j06109P8156J34330J00771Q1749J2416
36690A267115j36026j57608O4963K56607J13633k22888m05237l86960l15216j39987
36680f1604K02994L99700J00255m11760m54500J00626O21921N68856R6749l25364
36670H37873m82974m23813k49443r3794n3349j8191J82570M20384L70415M0103
36660E29781j70882o6862N2966j04505l56381l26608K1797L66150M02091J05809
36650D53356k58340l43457r4385J09026o9387l65547k28640L10398N84987K44494
36640C42505k59697l99647k84569k76018l32759k19191l3104LK6829L18862O68909
$$ plain form
36629 -447877 143408 241874 2781 -74704 217549 639962 859697 724198 282511 -234120
36619 -234120 -523331 -508550 -450336 -561857 -623640 -269911 380006 712348 331807 -491123
36609 -491123 -1222449 -1651163 -1844854 -1745851 -1208870 -447056 -60877 -399823 -1088916 -1431276
36599 -1431276 -1181578 -673845 -240443 164338 653327 1016362 918523 382379 -181549 -422742
36589 -422742 -340550 -113043 175109 543743 968401 1334047 1532698 1573246 1584482 1683368
36579 1683368 1832368 1889637 1831543 1826014 1998753 2222508 2273765 2138645 2012616 2024812
36569 2024812 2112396 2164771 2154038 2108315 2066371 2062999 2069217 1979241 1760771 1557122 1503020
36558 1503020 1515186 1443948 1345133 1358469 1388815 1231099 998512 1035958 1320588 1370153 958631
$$ packed form
36629d47877N91285R8466k39093p7485K92253M22413K19735j35499m41687n16631
36619b34120k89211J4781N8214j11521o1783L53729O49917L32342l80541q22930
36609d91123p31326m28714j93691R9003N36981P61814L86179l38946o89093l42360
36599a431276K49698N07733M33402M04781M88989L63035r7839n36144n63928k41193
36589d22742Q2192K27507K88152L68634M24658L65646J98651M0548J1236R8886
36579A683368J49000N7269n8094n529J72739K23755N1257j35120j26029J2196
36569B024812Q7584N2375j0733m5723m1944l372O218q9976k18470k03649n4102
36558A503020J2166p1238r8815J3336L0346j57716k32587L7446K84630M9565m11522
$$ plain form
36547 958631 516043 482338 626137 482684 221007 465208 1269101 1870272 1672356 1008982
36537 1008982 617930 693306 851017 845543 880219 1178728 1591482 1795586 1720820 1608570
36527 1608570 1686514 1898324 1988210 1808353 1475662 1192738 985176 740253 492480 479927
36517 479927 806713 1199397 1278548 994635 617887 369288 287686 419985 836112 1370804
36507 1370804 1635062 1460761 1118971 906231 726134 336128 -168002 -442197 -385767 -219063
36497 -219063 -101053 7335 91867 36637 -104770 -111386 26714 37593 -198357 -449679
36487 -449679 -520708 -516526 -525459 -374073 19468 341895 269832 -66549 -321856 -405554 -375414
36476 -375414 -123285 396285 834684 845734 668203 779313 1073639 1001267 518701 229305
$$ packed form
36547I58631m42588l3705J43799j43453k61677K44201Q03893O01171j97916o63374
36537A008982l91052P5376J57711n474L4676K98509M12754K04104p4766j12250
36527A608570P7944K11810Q9886j79857l32691k82924k07562k44923k47773j2553
36517D79927L26786L92684P9151k83913l76748k48599q1602J32299M16127N34692
36507A370804K64258j74301l41790k12740j80097l90006n04130k74195N6430J66704
36497b19063J18010J08388Q4532n5230j41407o616J38100J0879k35950k51322
36487d49679p1029M182q933J51386L93541L22427p2063l36381k55307q3698L0140
36476c75414K52129N19570M38399J1050j77531J11110K94326p2372m82566k89396
$$ plain form
36466 229305 423968 632524 427401 103367 153338 515638 786170 846964 854731 860010 837225
36455 837225 888705 1066229 1190199 1163520 1213373 1463093 1553427 1164718 687393 802184
36445 802184 1483158 1989346 1868295 1429520 1121811 960238 785578 657600 692591 801568
36435 801568 863512 942138 1084084 1081643 699425 51090 -463592 -573663 -356387 -69108
36425 -69108 129884 277817 464456 636196 635408 474080 403445 548143 636295 376820 -7538
36414 -7538 -16683 352104 515760 165859 -192283 109200 974454 1643126 1592498 1004787
36404 1004787 394612 109211 239548 714862 1293678 1599137 1367847 707907 47509
36395 47509 -235091 -155974 -71892 -249840 -554725 -661701 -502637 -305158 -203407 -77141
$$ packed form
36466B29305J94663K08556k05123l24034M9971L62300K70532O0794P767N279k2785
36455H37225N1480J77524J23970k6679M9853K49720R0334l88709m77325J14791
36445H02184O80974N06188j21051m38775l07709j61573j74660j27978L4991J08977
36435H01568O1944P8626J41946k441l82218o48335n14682j10071K17276K87279
36425f9108J98992J47933J86639J71740p88j61328p0635J44698Q8152k59475l84358
36414g538r145L68787J63656l49901l58142L01483Q65254O68672n0628n87711
36404A004787o10175k85401J30337M75314N78816L05459k31290o59940o60398
36395D7509k82600P9117Q4082j77948l04885j06976J59064J97479J01751J26266
$$ plain form
36385 -77141 125602 178666 -91925 -463445 -573545 -406895 -241812 -173089 -43 384627
36375 384627 797548 1069228 1291973 1588896 1828897 1797826 1548010 1342893 1282146 1203693
36365 1203693 989696 753042 606618 430011 71516 -306916 -344883 11878 348869 269449
36355 269449 -109848 -344822 -258910 -117936 -192240 -364803 -306321 65709 441825 439073
36345 439073 14261 -467415 -612884 -452501 -397951 -671708 -953602 -830448 -466634 -434285
36335 -434285 -838261 -1055580 -589841 184819 517129 269180 -49701 -123521 -181166 -438523
36325 -438523 -680481 -646328 -473474 -430578 -437324 -210684 208688 429176 243047 -79392
36315 -79392 -130787 171648 563935 745764 611549 270073 -46929 -141397 -20513 99774
$$ packed form
36385g7141K02743N3064k70591l71520j10100J66650J65083O8723J73046L84670
36375C84627M12921K71680K22745K96923K40001l1071k49816k05117o0747p8453
36365A203693k13997k36654j46424j76607l58495l78432l7967L56761L36991p9420
36355B69449l79297k34974Q5912J40974p4304j72563N8482L72030L76116k752
36345D39073m24812m81676j45469J60383N4550k73757k81894J23154L63814L2349
36335d34285m03976k17319M65739P74660L32310k47949l18881p3820n7645k57357
36325d38523k41958L4153J72854M2896o746K26640M19372K20488j86129l22439
36315g9392n1395L02435L92287J81829j34215l41476l17002r4468J20884J20287
$$ plain form
36305 99774 45095 -74903 24774 426792 846415 931988 674578 409292 422267 672000
36295 672000 918665 992929 855453 523512 113284 -92491 173197 841213 1502388 1815848
36285 1815848 1829486 1803711 1815022 1694921 1349943 981609 901939 1192818 1617338 1842263
36275 1842263 1701877 1275118 784025 449191 401508 665442 1176654 1792749 2304111 2505816
36265 2505816 2346738 2024181 1850283 1951576 2139329 2155207 2005239 1926157 2028546 2148944
36255 2148944 2130658 2071422 2129690 2233303 2229735 2250640 2605548 3254833 3702327 3594739
36245 3594739 3186635 2961548 2968242 2850149 2463594 2121149 2146867 2458545 2731431 2792705
36235 2792705 2699777 2550245 2377067 2191012 2014902 1872964 1769690 1644271 1373510 937706
$$ packed form
36305I9774n4679j19998R9677M02018M19623Q5573k57410k65286J2975K49733
36295F72000K46665P4264j37476l31941m10228k05775K65688O68016O61175L13460
36285A815848J3638k5775J1311j20101l44978l68334p9670K90879M24520K24925
36275A842263j40386m26759m91093l34834m7683K63934N11212O16095N11362K01705
36265B505816j59078l22557j73898J01293J87753J5878j49968p9082J02389J20398
36255B148944j8286n9236N8268J03613l568K0905L54908O49285M47494j07588
36245C594739m08104k25087O694j18093l86555l42445K5718L11678K72886O1274
36235B792705r2928j49532j73178j86055j76110j41938j03274j25419k70761m35804
$$ plain form
36225 937706 577382 600233 960383 1213662 1023720 559492 230571 167064 163625 37877
36215 37877 -189376 -428324 -605988 -616632 -392799 -52140 205058 361271 550824 732241
36205 732241 621725 80998 -583516 -857523 -496654 294041 1070781 1484670 1496967 1332363
36195 1332363 1185741 1004763 661417 267937 104034 220539 356245 315692 185382 65166
36185 65166 -158036 -583537 -1055696 -1363421 -1509364 -1560098 -1391121 -851167 -93414 502281
36175 502281 694171 492782 21692 -513756 -816958 -713767 -337332 83154 504035 919996
36165 919996 1115371 911016 543699 399074 435843 328982 154489 359413 917382 1114828
36155 1114828 518363 -336557 -667190 -466327 -290884 -333824 -335492 -289034 -545319 -1098363
$$ packed form
36225I37706l60324K2851L60150K53279j89942m64228l28921o3507l439j25748
36215C7877k27253k38948j77664j0644K23833L40659K57198J56213J89553J81417
36205G32241j10516n40727o64514k74007L60869P90695P76740M13889J2297j64604
36195A332363j46622j80978l43346l93480j63903J16505J35706m0553j30310j20216
36185F5166k23202m25501m72159l07725j45943n0734J68977N39954P57753N95695
36175E02281J91890k01389m71090n35448l03202J03191L76435M20486M20881M15961
36165I19996J95375k04355l67317j44625L6769j06861j74493K04924N57969J97446
36155A114828n96465q54920l30633K00863J75443m2940j668M6458k56285n53044
$$ plain form
36145 -1098363 -1366409 -988806 -416987 -336157 -760521 -1087474 -914791 -427569 6854 272766
36135 272766 418895 405643 167063 -166074 -305186 -98357 299856 573232 521171 218014
36125 218014 -45078 -13554 250529 383987 146412 -207044 -180311 307376 778407 843323
36115 843323 715668 812807 1070752 1064973 726879 471416 528760 587354 323224 -65355
36105 -65355 -152946 126638 508226 837685 1143287 1355883 1319699 1114016 1057977 1274263
36095 1274263 1457373 1232609 639178 110393 -9119 175265 272139 76303 -236882 -438976
36085 -438976 -623656 -1043855 -1619790 -1893517 -1566179 -840156 -99357 499313 929161 1063754
36075 1063754 869923 664055 801242 1154069 1246230 926115 590114 655383 1079061 1514564
$$ packed form
36145a098363k68046L77603N71819Q0830m24364l26953J72683M87222M34423K65912
36135B72766J46129j3252k38580l33137j39112K06829L98213K73376n2061l03157
36125B18014k63092L1524K64083J33458k37575l53456K6733M87687M71031O4916
36115H43323j27655R7139K57945n779l38094k55463N7344N8594k64130l88579
36105f5355q7591K79584L81588L29459L05602K12596l6184k05683n6039K16286
36095A274263J83110k24764n93431n28785j19512J84384R6874j95836l13185k02094
36085d38976j84680m20199n75935k73727L27338P26023P40799N98670M29848J34593
36075A063754j93831k05868J37187L52827R2161l20115l36001O5269M23678M35503
$$ plain form
36065 1514564 1722965 1690112 1498141 1228966 925568 585662 260850 147909 431365 1009957
36055 1009957 1536787 1785163 1845245 1924394 2096524 2290145 2385351 2294793 2098649 2096899
36045 2096899 2501468 3032927 3104638 2554457 1932760 1840106 2201691 2497728 2551142 2694409
36035 2694409 3161930 3705443 3968171 3967343 3991536 4194105 4522856 4958573 5575268 6357131
36025 6357131 7147469 7809485 8268766 8371926 7931954 7039212 6122995 5499257 5000583
36016 5000583 4283291 3362354 2526753 1810524 968115 35930 -521297 -444329 -96447 56317
36006 56317 92573 401152 1011025 1560455 1821506 1856976 1703364 1295869 747293 360028
35996 360028 279341 392026 599416 918055 1277396 1501301 1545724 1500433 1341406 986035
$$ packed form
36065A514564K08401l2853j91971k69175l03398l39906l24812j12941K83456N78592
36055A009957N26830K48376O0082P9149J72130J93621R5206r0558j96144j750
36045B096899M04569N31459P1711n50181o21697r2654L61585K96037N3414J43267
36035B694409M67521N43513K62728q28K4193K02569L28751M35717O16695P81863
36025F357131P90338O62016M59281J03160m39972q92742r16217o23738m98674
36016E000583p17292r20937q35601p16229q42409r32185n57227P6968L47882J52764
36006E6317L6256L08579O09873N49430K61051L5470j53612m07495n48576l87265
35996C60028q0687J12685K07390L18639L59341K23905M4423m5291j59027l55371
$$ plain form
35986 986035 617885 588154 887527 1071056 868439 548563 498203 739228 1055562 1303859
35976 1303859 1383569 1186843 827721 667791 862961 1123269 1166467 1141733 1301722 1503638
35966 1503638 1403290 984398 549256 296105 204123 217143 257635 191421 54740 150940
35956 150940 622906 1125821 1275150 1207586 1272002 1375862 1186224 851352 874860 1234798
35946 1234798 1268974 625144 -219200 -618933 -458906 50720 777470 1526483 1928602 1864264
35936 1864264 1672698 1595570 1378817 832376 395152 575117 1088907 1203511 824414 575010
35926 575010 748181 846286 412074 -233953 -476394 -257821 -23063 -14542 -32000 160508
35916 160508 515091 816134 892138 675342 223708 -259275 -535278 -507770 -243457 149032
$$ packed form
35986I86035l68150k9731K99373J83529k02617l19876n0360K41025L16334K48297
35976A303859P9710j96726l59122j59930J95170K60308M3198k4734J59989K01916
35966A503638j00348m18892m35142k53151r1982J3020M0492o6214j36681R6200
35956A50940M71966N02915J49329o7564O4416J03860j89638l34872K3508L59938
35946A234798L4176o43830q44344l99733J60027N09626P26750P49013M02119o4338
35936A864264j91566p7128k16753n46441m37224J79965N13790J14604l79097k49404
35926E75010J73171R8105m34212o46027k42441K18573K34758Q521j7458J92508
35916A60508L54583L01043P6004k16796m51634m82983k76003K7508K64313L92489
$$ plain form
35906 149032 568556 878717 952101 805368 618008 576615 728948 976098 1146111 1092219
35896 1092219 808270 460349 234993 163548 180468 312795 630473 977964 990634 552347
35886 552347 74878 77120 547588 970362 986449 783442 753324 979603 1208561 1198112
35876 1198112 955073 692574 636306 807586 958690 828222 489297 286974 383015 581044
35866 581044 712536 926241 1354560 1720436 1623776 1106919 582600 262247 43963 -36868
35856 -36868 284409 969928 1470593 1366860 947741 809621 1067924 1349068 1470157 1691966
35846 1691966 2203856 2702718 2698620 2066436 1126668 311252 -95542 -23971 333330 573672
35836 573672 417723 38254 -136646 -11570 17977 -336868 -722360 -515764 352280 1300765
$$ packed form
35906A49032M19524L10161P3384j46733j87360m1393J52333K47150J70013n3892
35896A092219k83949l47921k25356p1445J6920J32327L17678L47491J2670m38287
35886E52347m77469K242M70468M22774J6087k03007l0118K26279K28958j0449
35876A198112k43039k62499n6268J71280J51104j30468l38925k02323R6041J98029
35866E81044J31492K13705M28319L65876r6660n16857n24319l20353k18284q0831
35856c6868L21277O85519N00665j03733m19119j38120K58303K81144J21089K21809
35846A691966N11890M98862m098o32184r39768q15416m06794P1571L57301K40342
35836E73672j55949l79469j74900J25076K9547l54845l85492K06596Q68044R48485
$$ plain form
35826 1300765 1847425 2088588 2298016 2421342 2270204 1962210 1790015 1762798 1624698 1293770
35816 1293770 978918 863932 938772 1132040 1352149 1425261 1282002 1187818 1465984 1987194
35806 1987194 2285087 2204147 2034895 1941646 1728510 1354262 1196800 1492459 1921294 2117236
35796 2117236 2225839 2534236 2876502 2906352 2713462 2632748 2620101 2389480 2063585 2075493
35786 2075493 2424177 2637067 2557785 2569577 2872226 3146400 3221244 3500629 4302377 5230125
35776 5230125 5689276 5689958 5644346 5645544 5494657 5265914 5256051 5395138 5248007 4689247 4119289
35765 4119289 3869666 3792255 3622978 3400049 3270961 3151231 2867954 2500603 2318315 2422553
35755 2422553 2626629 2671679 2465199 2152933 2024492 2269049 2740780 3035117 2872193 2349219
$$ packed form
35826A300765N46660K41163K09428J23326j51138l07994j72195k7217j38100l30928
35816A293770l14852j14986P4840J93268K20109P3112j43259r4184K78166N21210
35806A987194K97893q0940j69252r3249k13136l74248j57462K95659M28835J95942
35796B117236J08603L08397L42266K9850j92890q0714j2647k30621l25895J1908
35786B075493L48684K12890p9282J1792L02649K74174P4844K79385Q01748R27748
35776E230125M59151O82m5612J198j50887k28743r863J39087j47131n58760n69958
35765D119289k49623p7411j69277k22929j29088j19730k83277l67351j82288J04238
35755B422553K04076M5050k06480l12266j28441K44557M71731K94337j62924n22974
$$ plain form
35745 2349219 1785354 1428177 1354774 1498018 1652946 1598753 1374097 1326186 1701419 2243669
35735 2243669 2390060 1877299 1028082 436570 461897 981789 1508210 1572313 1139382 645586
35725 645586 524740 758318 1038571 1273661 1647543 2174276 2527237 2471266 2204451 2035069
35715 2035069 1898260 1484631 791839 267219 321983 851708 1326617 1318081 915767 622377
35705 622377 783858 1140942 1106502 541193 14953 98936 613204 913140 807325 757363
35695 757363 1108878 1558552 1628376 1355770 1173292 1263355 1382736 1303127 1117450 1020936
35685 1020936 1004180 916718 745790 687884 915386 1326893 1593440 1487218 1126900 825880
35675 825880 723597 682198 550441 372106 267230 261439 346030 570404 926253 1249523
$$ packed form
35745B349219n63865l57177p3403J43244J54928n4193k24656m7911L75233N42250
35735B243669J46391n12761q49217n91512K5327N19892N26421O4103m32931m93796
35725F45586j20846K33578K80253K35090L73882N26733L52961n5971k66815j69382
35715B035069j36809m13629o92792n24620N4764N29725M74909q536m02314k93390
35705F22377J61481L57084l4440n65309n26240Q3983N14268K99936j05815m9962
35695G57363L51515M49674O9824k72606j82478R0063J19381p9609j85677r6514
35685A020936j6756q7462j70928n7906K27502M11507K66547j06222l60318l01020
35675H25880j02283m1399j31757j78335j04876n791Q4591K24374L55849L23270
$$ plain form
35665 1249523 1404762 1479230 1612138 1707216 1535879 1104294 698041 536718 573761 670148
35655 670148 777201 892834 1012721 1193842 1509092 1876680 2096970 2121404 2104528 2114284
35645 2114284 2007915 1731219 1523736 1610899 1838141 1836734 1463508 888563 359289 88196
35635 88196 243312 753997 1184617 1119254 686740 410635 512373 694164 698205 708875
35625 708875 974226 1326919 1394898 1123972 811790 735616 981459 1500152 2051696 2220828
35615 2220828 1833903 1308741 1237361 1631726 1961461 1966083 1968971 2218411 2396238 2146039
35605 2146039 1728805 1668395 1941500 2038734 1775937 1518905 1514871 1508255 1273450 1114912
35595 1114912 1440181 2064280 2365761 2087106 1627814 1500123 1774912 2159601 2396958
$$ packed form
35665A249523J55239P4468J32908R5078j71337m31585m06253j61323L7043R6387
35655F70148J07053J15633J19887J81121L15250L67588K20290K4434j6876R756
35645B114284j06369k76696k07483Q7163K27242j407l73226n74945n29274k71093
35635H8196J55116N10685M30620o5363m32514k76105J01738J81791M041J0670
35625G08875K65351L52693O7979k70926l12182p6174K45843N18693N51544J69132
35615B220828l86925n25162p1380L94365L29735M622K888K49440J77827k50199
35605B146039m17234o0410K73105R7234k62797k57032m034o616k34805j58538
35595A114912L25269O24099L01481k78655m59292j27691K74789L84689K37357
$$ plain form
35586 2396958 2434610 2328260 2130682 1858758 1520737 1196592 1046656 1109404 1109144 691214
35576 691214 -45438 -467675 -87955 787307 1345917 1183472 684595 463745 682651 1047622
35566 1047622 1272107 1329638 1338591 1392346 1505403 1621237 1680457 1730758 1900976 2202631
35556 2202631 2467449 2591007 2712461 2979130 3237701 3197262 2865823 2577691 2561435 2710544
35546 2710544 2837012 2918687 2987674 2982428 2868655 2765820 2804257 2952037 3091321 3165327
35536 3165327 3160974 3068513 2952651 2925854 2944196 2786517 2379560 1992139 1925800 2133787
35526 2133787 2339860 2435148 2544493 2752479 2964568 3037778 2922378 2708502 2620808 2857686
35516 2857686 3304596 3540243 3308429 2862911 2637369 2688033 2704898 2486406 2138061 1847527
$$ packed form
35586B396958L7652j06350j97578k71924l38021l24145j49936O2748k60m17930
35576F91214p36652m22237L79720Q75262N58610j62445m98877k20850K18906L64971
35566A047622K24485N7531Q953N3755J13057J15834N9220N0301J70218L01655
35556B202631K64818J23558J21454K66669K58571m0439l31439k88132j6256J49109
35546B710544J26468Q1675O8987n246j13773j02835L8437J47780J39284P4006
35536C165327m353r2461j15862k6797J8342j57679m06957l87421o6339K07987
35526B133787K06073R5288J09345K07986K12089P3210j15400k13876q7694K36878
35516B857686M46910K35647k31814m45518k25542N0664J6865k18492l48345k90534
$$ plain form
35506 1847527 1718631 1806101 2080580 2372690 2544818 2656203 2764951 2710803 2385298 2073307
35496 2073307 2138041 2451880 2581283 2508140 2665451 3182219 3613569 3628742 3519170 3742286
35486 3742286 4302865 4855531 5137342 5067987 4698983 4281549 4112920 4128722 3961990 3589838
35476 3589838 3515170 4014665 4623139 4783383 4660068 4796950 5198664 5313982 4865800 4205744
35466 4205744 3806654 3780796 3961837 4175787 4362276 4593291 4953422 5301497 5319813 4968004
35456 4968004 4648276 4665463 4795118 4745949 4780990 5371272 6363310 7030876 6972454 6508738
35446 6508738 6151815 6098040 6299046 6609741 6739522 6419759 5784986 5325367 5340089 5652655
35436 5652655 5923245 6011252 5986540 6013224 6258250 6709198 7090024 7160236 7028642 6931760
$$ packed form
35506A847527j28896Q7470K74479K92110J72128J11385J08748n4148l25505l11991
35496B073307O4734L13839J29403p3143J57311N16768M31350J5173j09572K23116
35486C742286N60579N52666K81811o9355l69004m17434j68629J5802j66732l72152
35476C589838p4668M99495O08474J60244j23315J36882M01714J15318m48182o60056
35466D205744l99090k5858J81041K13950J86489K31015L60131L48075J8316l51809
35456D968004l19728J7187J29655m9169L5041N90282R92038O67566n8422m63716
35446F508738l56923n3775K01006L10695J29781l19763o34773m59619J4722L12566
35436E652655K70590Q8007k4712K6684K45026M50948L80826P0212j31594r6882
$$ plain form
35426 6931760 6831949 6570587 6291879 6281173 6446230 6438758 6288878 6405030 6872194 7279684
35416 7279684 7405141 7555719 7976485 8369621 8331615 7955022 7703208 7907016 8564167 9384315
35406 9384315 9894692 9799885 9384447 9260522 9605121 9997991 10115547 10140324 10305037 10511954
35396 10511954 10674636 10972676 11430956 11682868 11541579 11405745 11667220 12089104 12258457
35387 12258457 12327159 12739580 13436249 13900781 13919857 13811272 13926092 14322005 14892168 15468685
35377 15468685 15853410 16055062 16391326 17039906 17640523 17729788 17456410 17450377 18045193 19026246
35367 19026246 20089841 21116012 21977830 22515749 22818617 23212370 23859672 24604406 25267323
35358 25267323 25882108 26606911 27574526 28802243 30089480 31114360 31845056 32707267 34062466
$$ packed form
35426F931760r9811k61362k78708j0706J65057p472j49880J16152M67164M07490
35416G279684J25457J50578M20766L93136l8006l76593k51814K03808O57151Q20148
35406I384315N10377r4807m15438j23925L44599L92870J17556K4777J64713K06917
35396A0511954J62682K98040M58280K51912j41289j35834K61475M21884J69353
35387A2258457O8702M12421O96669M64532J9076j08585J14820L95913N70163N76517
35377A5468685L84725K01652L36264O48580O00617Q9265k73378o033N94816R81053
35367A9026246J063595J026171Q61818N37919L02868L93753O47302P44734O62917
35358B5267323O14785P24803R67615J227717J287237J024880P30696Q62211J355199
$$ plain form
35349 34062466 35668588 37003906 38008130 39110271 40590864 42333947 44195062 46179911
35341 46179911 48192876 50014084 51673398 53547315 55943531 58794671 61825145 64830424
35333 64830424 67788577 70889668 74396745 78260540 82009633 85336254 88634150 92525564
35325 92525564 96959694 101287742 105191971 108953119 112720782 116160088 119096561 121958454
35317 121958454 125156162 128376390 130898996 132399524 133119282 133417743 133432584 133052122 132018019
35308 132018019 130173613 127732597 125127107 122493152 119540702 116042234 112162056 108137064
35300 108137064 103934471 99468399 94908898 90512100 86328254 82306841 78503744 74941187
35292 74941187 71420753 67725306 63917303 60272909 57042521 54397471 52404735 50853776
$$ packed form
35349C4062466J606122J335318J004224J102141J480593J743083J861115J984849
35341D6179911K012965J821208J659314J873917K396216K851140L030474L005279
35333F4830424K958153L101091L507077L863795L749093L326621L297896L891414
35325I2525564M434130M328048L904229L761148L767663L439306K936473K861893
35317A21958454L197708L220228K522606J500528P19758K98461J4841l80462j034103
35308A32018019j844406k441016k605490k633955k952450l498468l880178m024992
35300A08137064m202593m466072m559501m396798m183846m021413l803097l562557
35292G4941187l520434l695447l808003l644394l230388k645050j992736j550959
$$ plain form
35284 50853776 49279201 47364622 45200877 43014104 40854126 38734489 36821842 35192843
35276 35192843 33591675 31755166 29860701 28334996 27294600 26478214 25673433 24885364
35268 24885364 24088599 23151353 22098690 21173041 20486649 19823902 18965999 18058320 17424101
35259 17424101 17054722 16528779 15544388 14369915 13566989 13315141 13237894 12934680 12432927
35250 12432927 11977410 11624037 11291351 11021150 10872236 10679574 10256397 9748926 9424666
35241 9424666 9165776 8589977 7690103 6927268 6606900 6556573 6508008 6384465 6104256 5558209
35231 5558209 4957147 4741735 4918145 4942643 4546568 4202465 4395203 4868205 5058556 4921097
35221 4921097 4803489 4777127 4645465 4456593 4470805 4666730 4726075 4495450 4105470 3682248
$$ packed form
35284E0853776j574575j914579k163745k186773k159978k119637j912647j628999
35276C5192843j601168j836509j894465j525705j040396q16386q04781p88069
35268B4885364p96765r37246j052663r25649o86392o62747q57903r07679o34219
35259A7424101l69379n25943r84391j174473q02926k51848p7247l03214n01753
35250A2432927m55517l53373l32686k70201j48914j92662m23177n07471l24260
35241I424666k58890n75799q99874p62835l20368n0327m8565j23543k80209n46047
35231E558209o01062k15412J76410K4498l96075l44103J92738M73002J90351j37459
35221D921097j17608k6362j31662j88872J4212J95925N9345k30625l89980m23222
$$ plain form
35211 3682248 3285917 3076182 3191340 3491260 3709164 3788636 3795968 3638038 3221985 2783321
35201 2783321 2653858 2747620 2663406 2291374 1951423 1902836 2046706 2158767 2137054 1991699
35191 1991699 1835638 1877421 2185053 2498531 2521292 2324278 2196278 2201658 2206869 2236145 2408424
35180 2408424 2568270 2395214 1916673 1552383 1593917 1938599 2344891 2640785 2697262 2540296
35170 2540296 2483902 2795084 3224739 3237471 2708707 2011947 1430757 939180 598063 653066
35160 653066 1080477 1487760 1657122 1785291 2011469 2146724 2108945 2193756 2584558 2940513
35150 2940513 2831122 2328958 1839428 1542634 1313236 1039680 744170 492209 390752
35141 390752 555724 907981 1145341 1089851 924522 932452 1149237 1416574 1613106 1670563
$$ packed form
35211C682248l96331k09735J15158K99920K17904P9472P332j57930m16053m38664
35201B783321j29463R3762q4214l72032l39951m8587J43870J12061k1713j45355
35191A991699j56061M1783L07632L13478K2761j97014j28000N380N211K9276J72279
35180B408424J59846j73056m78541l64290M1534L44682M06292K95894N6477j56966
35170B540296n6394L11182M29655J2732n28764o96760n81190m91577l41117N5003
35160F53066M27411M07283J69362J28169K26178J35255l7779Q4811L90802L55955
35150B940513j09391n02164m89530k96794k29398k73556k95510k51961j01457
35141C90752J64972L52257K37360n5490j65329P930K16785K67337J96532N7457
$$ plain form
35131 1670563 1515543 1169740 803518 567079 467917 473137 571008 665299 599052 371641
35121 371641 159218 62502 29167 57835 231929 504507 721219 901673 1181626 1420436
35111 1420436 1251859 653693 73235 -189024 -319626 -506983 -554876 -294892 10507 61958
35101 61958 3495 118570 324780 378134 344691 454432 677858 848524 1025912 1318718
35091 1318718 1496357 1218869 590455 105495 85821 470176 1039949 1509357 1521289 959193
35081 959193 212330 -222152 -332842 -446335 -604148 -525447 -153293 213901 382875 461955
35071 461955 540876 553351 532678 629846 766866 630288 167656 -225666 -213728 33198
35061 33198 116189 -27406 -45671 381286 1128196 1681302 1637014 1148442 746036 666012
$$ packed form
35131A670563j55020l45803l66222k36439r9162N220R7871R4291o6247k27411
35121C71641k12423r6716l3335K8668J74094K72578K16712J80454K79953K38810
35111A420436j68577n98166n80458k62259j30602j87357m7893K59984L05399N1451
35101F1958n8463J15075K06210N3354l3443J09741K23426J70666J77388K92806
35091A318718J77639k77488o28414m84960j9674L84355N69773M69408J1932n62096
35081I59193p46863m34482j10690j13493j57813P8701L72154L67194J68974P9080
35071D61955P8921J2475k0673R7168J37020j36578m62632l93322J1938K46926
35061C3198Q2991j43595j8265M26957P46910N53106m4288m88572m02406q0024
$$ plain form
35051 666012 596294 246081 -147212 -214307 -83031 -132432 -279744 -71582 527198 983978
35041 983978 928733 540901 86301 -430700 -955908 -1207881 -1100450 -952618 -981898 -940651
35031 -940651 -566794 -59880 252050 429775 700689 942700 843201 469577 244456 342858
35021 342858 479739 371879 116588 -16643 27962 59573 -98117 -413741 -685356 -720106
35011 -720106 -483393 -98592 262166 469452 487694 411266 387930 412908 294779 -30724
35001 -30724 -285028 -180328 159676 448331 794012 1509878 2328981 2412555 1437733 175159
34991 175159 -441764 -422082 -392160 -512832 -393434 30930 245908 -58418 -489945 -512741
34981 -512741 -142110 184220 167799 -171841 -681752 -1166428 -1383664 -1187422 -700939 -244572
$$ packed form
35051F66012o9718l50213l93293o7095J31276m9401j47312K08162N98780M56780
35041I83978n5245l87832m54600n17001n25208k51973J07431J47832k9280M1247
35031i40651L73857N06914L11930J77725K70914K42011r9499l73624k25121R8402
35021C42858J36881j07860k55291j33231M4605L1611j57690l15624k71615l4750
35011g20106K36713L84801L60758K07286J8242p6428k3336K4978j18129l25503
35001c0724k54304J04700L40004K88655L45681P15866Q19103Q3574r74822j262574
34991A75159o16923J9682K9922j20672J19398M24364K14978l04326m31527k2796
34981e12741L70631L26330j6421l39640n09911m84676k17236J96242M86483M56367
$$ plain form
34971 -244572 -70863 -171647 -283550 -79639 540032 1305296 1797088 1835650 1590415 1344769
34961 1344769 1277878 1437686 1725041 1874626 1667433 1251326 1053137 1252332 1536483 1543955
34951 1543955 1362292 1348528 1579894 1768838 1697144 1468731 1291213 1227615 1228987 1220520 1082821
34940 1082821 736830 341437 219101 457830 760441 833858 739606 660020 521905 175418
34930 175418 -173817 -124372 294595 555061 339885 -37282 -168268 -188504 -500444 -1045847
34920 -1045847 -1307861 -1044443 -618356 -465999 -551322 -550127 -351663 -122924 16747 139145
34910 139145 332024 558480 719598 737621 564015 230462 -73543 -106557 151017 421228
34900 421228 438777 275880 230994 439796 763579 1055219 1318735 1532284 1548221 1348473
$$ packed form
34971b44572J73709j00784j11903K03911O19671P65264M91792L8562k45235k45646
34961A344769o6891J59808K87355J49585k07193m16107j98189J99195K84151P472
34951A543955j81663j3764K31366J88944p1694k28413j77518o3598J372q467j37699
34940A082821l45991l95393j22336K38729L02611P3417r4252p9586j38115l46487
34930A75418l49235M9445M18967K60466k15176l77167j30986k0236l11940n45403
34920a045847k62014K63418M26087J52357q5323J195J98464K28739J39671J22398
34910A39145J92879K26456J61118J8023j73606l33553l04005l3014K57574K70211
34900D21228J7549j62897m4886K08802L23783K91640K63516K13549J5937j99748
$$ plain form
34890 1348473 1207755 1352325 1587762 1556121 1278379 1105469 1151886 1149103 921638 633154
34880 633154 427450 192376 -118445 -273395 -133184 66400 85002 46062 125953 174655
34870 174655 34266 -43198 217071 508837 285916 -375690 -824533 -755146 -517132 -400337
34860 -400337 -181548 361901 953373 1170915 990514 681245 403544 167826 -26506 -246190
34850 -246190 -615976 -1047419 -1200776 -949246 -649515 -662355 -800732 -601006 -30294 445450
34840 445450 495440 287957 125247 -8910 -333776 -834122 -1164187 -1021841 -480375 140812
34830 140812 636976 991828 1146312 961288 512503 176105 221810 507275 773026 1002069
34820 1002069 1201077 1092374 477441 -247149 -453783 -123833 176838 147279 27334 -9900
$$ packed form
34890A348473j40718J44570K35437l1641k77742j72910M6417k783k27465k88484
34880F33154k05704k35074l10821j54950J40211J99584J8602l8940P9891M8702
34870A74655j40389p7464K60269K91766k22921o61606m48843O9387K38014J16795
34860d00337K18789N43449N91472K17542j80401l09269k77701k35718j94332k19684
34850b46190l69786m31443j53357K51530K99731j2840j38377J99726N70712M75744
34840D45450M9990k07483j62710j34157l24866n00346l30065J42346N41466O21187
34830A40812M96164L54852J54484j85024m48785l36398M5705K85465K65751K29043
34820A002069J99008j08703o14933p24590k06634L29950L00671k9559j19945l7234
$$ plain form
34810 -9900 -108957 -203901 116771 888140 1465452 1342562 814354 431192 253565 96977
34800 96977 64647 274564 404816 118991 -283246 -222979 311351 827437 1107580 1352250
34790 1352250 1605015 1607677 1287890 914091 669640 457430 208721 54855 112414 339240
34780 339240 609077 736258 551335 206406 201211 742675 1294033 1230925 760222 611800
34770 611800 927947 1125735 885030 574584 523757 538112 445866 532457 1004634 1481542
34760 1481542 1503822 1244029 1240131 1600975 1895743 1755488 1251124 698829 342253 238660
34750 238660 303834 451156 716119 1166832 1696015 2071408 2222034 2272862 2251056 2005547
34740 2005547 1518456 1044551 783010 622227 388460 170299 197462 507402 898235 1147551
$$ packed form
34810i900r9057r4944L20672P71369N77312j22890n28208l83162j77627j56588
34800I6977l2330K09917J30252k85825m02237O0267N34330N16086K80143K44670
34790A352250K52765K662l19787l73799k44451k12210k48709j53866N7559K26826
34780C39240K69837J27181j84923l44929n195N41464N51358o3108m70703j48422
34770F11800L16147J97788k40705l10446n0827J4355r2246Q6591M72177M76908
34760A481542K2280k59793l898L60844K94768j40255n04364n52295l56576j03593
34750B38660O5174J47322K64963M50713N29183L75393J50626N0828k1806k45509
34740B005547m87091m73905k61541j60783k33767k18161K7163L09940L90833K49316
$$ plain form
34730 1147551 1177408 1077749 1035412 1162650 1366260 1474770 1468959 1437663 1344185 1054520 606093
34719 606093 231011 92976 206465 588081 1201689 1742830 1815763 1429675 1040699 1007576
34709 1007576 1276209 1668173 2138969 2602767 2819684 2661871 2265440 1785519 1253086
34700 1253086 783949 616446 775759 995100 1138116 1392699 1862294 2293319 2439545
34691 2439545 2391003 2301561 2107908 1799531 1656316 1876353 2211637 2310355 2213015 2181657
34681 2181657 2226946 2147715 1917714 1744519 1831066 2257189 2934186 3537676 3751742 3747679
34671 3747679 4074527 4851152 5487799 5534506 5346152 5449847 5700429 5658012 5424218 5392256
34661 5392256 5435486 5140517 4724558 4889606 5715454 6473803 6697249 6716988 6920051 7172557
$$ packed form
34730A147551K9857r9659m2337J27238K03610J08510n811l1296r3478k89665m48427
34719F06093l75082j38035J13489L81616O13608N41141P2933l86088l88976l3123
34709A007576K68633L91964M70796M63798K16917j57813l96431m79921n32433
34700A253086m69137j67503J59313K19341J43016K54583M69595M31025J46226
34691B439545m8542q9442j93653l08377j43215K20037L35284R8718r7340l1358
34681B181657M5289p9231k30001j73195Q6547M26123O76997O03490K14066m063
34671C747679L26848P76625O36647M6707j88354J03695K50582m2417k33794l1962
34661E392256M3230k94969m15959J65048Q25848P58349K23446J9739K03063K52506
$$ plain form
34651 7172557 7320096 7641665 8359646 9161778 9658438 9968829 10448217 11123244 11780014
34642 11780014 12370952 12974814 13552983 14076921 14723843 15637632 16651019 17532478 18351263
34633 18351263 19294619 20256039 20934453 21290090 21621758 22211818 23117872 24270422 25526487
34624 25526487 26616897 27272168 27490594 27566977 27802153 28240773 28681896 28857187 28588826
34615 28588826 27859475 26805158 25665212 24696817 24018006 23463738 22707403 21645784 20544124
$$ packed form
34651G172557J47539L21569P17981Q02132M96660L10391M79388O75027O56770
34642A1780014N90938O03862N78169N23938O46922R13789J013387Q81459Q18785
34633A8351263R43356R61420O78414L55637L31668N90060R06054J152550J256065
34624B5526487J090410O55271K18426P6383K35176M38620M41123J75291k68361
34615B8588826p29351j054317j139946r68395o78811n54268p56335j061619j101660
$$ [...]
##END NTUPLES=NMR SPECTRUM
##END=
