##TITLE=31Pdec_DE-64_EXT2
 CDCl3, 24 sc
 13.9.2024
##JCAMPDX= 6.0         $$ Bruker NMR JCAMP-DX V2.0
##DATA TYPE= NMR SPECTRUM
##DATA CLASS= NTUPLES
##ORIGIN= UXNMR, Bruker Analytische Messtechnik GmbH
##OWNER= root
$$ XWIN-NMR		Version 3.5
$$ Fri Sep 13 14:32:26 2024 Russian Standard Time (UT+4h)  she@DPX200
##.OBSERVE FREQUENCY= 81.013821
##.OBSERVE NUCLEUS= ^31P
##.ACQUISITION MODE= SIMULTANEOUS
##.ACQUISITION SCHEME= undefined
##.AVERAGES= 24
##.DIGITISER RES= 17
##SPECTROMETER/DATA SYSTEM= spect
##.PULSE SEQUENCE= zgpg30
##.SOLVENT NAME= CDCl3
##.SHIFT REFERENCE= (INTERNAL, CDCl3, 0, 198.062)
##AUDIT TRAIL= $$ (NUMBER, WHEN, WHO, WHERE, WHAT)
$$ ##TITLE= Audit trail, XWIN-NMR		Version 3.5
$$ ##JCAMPDX= 5.01
$$ ##ORIGIN= Bruker BioSpin GmbH
$$ ##OWNER= she
$$ F:/spectra/data/she/nmr/P31/2/pdata/1/auditp.txt
$$ ##AUDIT TRAIL=  $$ (NUMBER, WHEN, WHO, WHERE, WHAT)
(   1,<2024-09-13 14:31:24.79 +0400>,<she>,<DPX200>,
      <created by zg, POWCHK disabled, PULCHK disabled
       configuration hash MD5:
       00 E9 B6 7A A2 85 ED C7 34 08 36 98 17 FE 4E 26
       data hash MD5: 32K
       FB 33 5D 95 B6 F2 1A AA E7 07 26 AC 69 FF E6 FC>)
(   2,<2024-09-13 14:31:27.20 +0400>,<she>,<DPX200>,
      <Start of raw data processing
       efp BC_mod = 2 LB = 1.5 FT_mod = 6 PKNL = 1 PHC0 = 2730.55 PHC1 = 22.08747 SI = 64K 
       data hash MD5: 64K
       45 75 E5 C9 B5 1E 26 30 B8 F9 FC C2 8C 88 3A 6E>)
(   3,<2024-09-13 14:31:47.37 +0400>,<she>,<DPX200>,
      <pk PHC0 = -14.79307 PHC1 = 35.39999 
       data hash MD5: 64K
       1D 2B 7B 51 0C 0A 75 22 83 13 FD 85 9E 41 0D 48>)
(   4,<2024-09-13 14:31:51.35 +0400>,<she>,<DPX200>,
      <abs ABSG = 5 
       data hash MD5: 64K
       3E 08 94 36 69 25 74 59 0D C1 05 EA 49 FA FB 0B>)
$$ ##END=
$$ 
$$ hash MD5
$$ 2A 0D D6 7C F1 2D 20 33 DD A3 47 4A 50 07 95 82
##$RELAX= 
##$RELAX= 
##$RELAX= 
##$RELAX= 
##$RELAX= 
##$RELAX= 
##$RELAX= 
##$RELAX= 
$$ Bruker specific parameters
$$ --------------------------
##$DU= <F:/spectra>
##$EXPNO= 2
##$NAME= <P31>
##$PROCNO= 1
##$TYPE= <nmr>
##$USER= <she>
##$AMP= (0..31)
100 100 100 100 100 100 100 100 100 100 100 100 100 100 100 100 100 100 
100 100 100 100 100 100 100 100 100 100 100 100 100 100 
##$AQSEQ= 0
##$AQ_mod= 1
##$AUNM= <au_zg>
##$AUTOPOS= <>
##$BF1= 81.014009
##$BF2= 200.13
##$BF3= 200.13
##$BF4= 200.13
##$BF5= 200.13
##$BF6= 200.13
##$BF7= 200.13
##$BF8= 200.13
##$BYTORDA= 1
##$CFDGTYP= 0
##$CFRGTYP= 5
##$CHEMSTR= <none>
##$CNST= (0..31)
1 1 145 1 1 1 1 1 1 1 1 1 1 1 1 1 1 1 1 1 1 1 1 1 1 1 1 1 1 1 1 1 
##$CPDPRG= <waltz16>
##$CPDPRG1= <>
##$CPDPRG2= <waltz16>
##$CPDPRG3= <>
##$CPDPRG4= <mlev>
##$CPDPRG5= <mlev>
##$CPDPRG6= <mlev>
##$CPDPRG7= <mlev>
##$CPDPRG8= <mlev>
##$CPDPRGB= <>
##$CPDPRGT= <>
##$D= (0..31)
0 1 0 0 0 0 0 0 0 0.06 0 0.03 2e-05 3e-06 0 0 0.0002 0 0 0 0 0 0 0 0 0 
0 0 0 0 0 0 
##$DATE= 1726223484
##$DBL= (0..7)
120 120 120 11 120 120 24 19 
##$DBP= (0..7)
150 150 150 150 150 150 150 150 
##$DBP07= 0
##$DBPNAM0= <>
##$DBPNAM1= <>
$$ [...]
##$SUBNAM3= <"">
##$SUBNAM4= <"">
##$SUBNAM5= <"">
##$SUBNAM6= <"">
##$SUBNAM7= <"">
##$SUBNAM8= <"">
##$SUBNAM9= <"">
##$SW= 400.765351723535
##$SWIBOX= (0..15)
0 1 3 0 0 0 0 0 0 0 0 0 0 0 0 0 
##$SW_h= 32467.5324675325
##$TD= 32768
##$TD0= 1
##$TE= 0
##$TE2= 300
##$TE3= 300
##$TEG= 300
##$TL= (0..7)
0 120 53 12 22 120 120 120 
##$TP= (0..7)
150 150 150 150 150 150 150 150 
##$TP07= 0
##$TPNAME0= <>
##$TPNAME1= <>
##$TPNAME2= <>
##$TPNAME3= <>
##$TPNAME4= <>
##$TPNAME5= <>
##$TPNAME6= <>
##$TPNAME7= <>
##$TPOAL= (0..7)
0.5 0.5 0.5 0.5 0.5 0.5 0.5 0.5 
##$TPOFFS= (0..7)
0 0 0 0 0 0 0 0 
##$TUNHIN= 0
##$TUNHOUT= 0
##$TUNXOUT= 0
##$USERA1= <user>
##$USERA2= <user>
##$USERA3= <user>
##$USERA4= <user>
##$USERA5= <user>
##$V9= 5
##$VALIST= <valist>
##$VCLIST= <CCCCCCCCCCCCCCC>
##$VD= 0
##$VDLIST= <DDDDDDDDDDDDDDD>
##$VPLIST= <PPPPPPPPPPPPPPP>
##$VTLIST= <TTTTTTTTTTTTTTT>
##$WBST= 1024
##$WBSW= 4
##$XGAIN= (0..3)
0 0 0 0 
##$XL= 0
##$YL= 0
##$YMAX_a= 29103
##$YMIN_a= -21243
##$ZGOPTNS= <>
##$ZL1= 120
##$ZL2= 120
##$ZL3= 120
##$ZL4= 120
##$ABSF1= 198.0616
##$ABSF2= -202.7028
##$ABSG= 5
##$ABSL= 3
##$ALPHA= 0
##$AQORDER= 0
##$ASSFAC= 0
##$ASSFACI= 0
##$ASSFACX= 0
##$ASSWID= 0
##$AUNMP= <proc_1d>
##$AZFE= 0.1
##$AZFW= 0.5
##$BCFW= 0
##$BC_mod= 2
##$BYTORDP= 0
##$COROFFS= 0
##$CY= -3
##$DATMOD= 1
##$DC= 0
##$DFILT= <>
##$DTYPP= 0
##$F1P= 0
##$F2P= 0
##$FCOR= 1
##$FTSIZE= 65536
##$FT_mod= 6
##$GAMMA= 0
##$GB= 0
##$INTBC= 1
##$INTSCL= 9.790993e-09
##$ISEN= 30
##$LB= 1.5
##$LEV0= 0
##$LPBIN= 0
##$MAXI= 10000
##$MC2= 0
##$MEAN= 0
##$ME_mod= 0
##$MI= 50
##$NCOEF= 0
##$NC_proc= -6
##$NLEV= 6
##$NOISF1= 182.463
##$NOISF2= 159.3651
##$NSP= 0
##$NTH_PI= 0
##$NZP= 0
##$OFFSET= 198.0616
##$PC= 4
##$PHC0= 2715.757
##$PHC1= 57.48746
##$PH_mod= 1
##$PKNL= yes
##$PPARMOD= 0
##$PSCAL= 0
##$PSIGN= 0
##$REVERSE= no
##$SF= 81.0140089999434
##$SI= 65536
##$SIGF1= 159.3651
##$SIGF2= -187.1042
##$SINO= 113.3802
##$SIOLD= 16384
##$SREGLST= <1H.CDCl3>
##$SSB= 0
##$STSI= 65536
##$STSR= 0
##$SW_p= 32467.5324675325
##$SYMM= 0
##$S_DEV= 0
##$TDeff= 32768
##$TDoff= 0
##$TI= <>
##$TILT= no
##$TM1= 0
##$TM2= 0
##$TOPLEV= 0
##$USERP1= <user>
##$USERP2= <user>
##$USERP3= <user>
##$USERP4= <user>
##$USERP5= <user>
##$WDW= 1
##$XDIM= 65536
##$YMAX_p= 511775548
##$YMIN_p= -3760241
$$ End of Bruker specific parameters
$$ ---------------------------------
##NTUPLES= NMR SPECTRUM
##VAR_NAME=  FREQUENCY,     SPECTRUM/REAL,   SPECTRUM/IMAG
##SYMBOL=    X,             R,               I
##VAR_TYPE=  INDEPENDENT,   DEPENDENT,       DEPENDENT
##VAR_FORM=  AFFN,          ASDF,            ASDF
##VAR_DIM=   65536,         65536,           65536
##UNITS=     HZ,            ARBITRARY UNITS, ARBITRARY UNITS
##FACTOR=    0.49542278885378, 1,            1
##FIRST=     16045.7642231865, 0,            0
##LAST=      -16421.768244346, 0,            0
##MIN=       -16421.768244346, -3760241,     0
##MAX=       16045.7642231865, 511775548,    0
$$ Real data points
##PAGE= N=1
##DATA TABLE= (X++(R..R)), XYDATA
$$ [...]
39925D364936L59841N65871J216511J567010Q60250n85181j645162j666817j022260
39916D014999l91322L5204M33405P77450P78467L51022j54438l08571o0349K70603
39906E746470L57651J00825l94951q74436j018176p20373k96792j75440l57070
39897B367708m61799l39173k51141l31886l15885n8275J22864p166j40221J5087
39887F00113J26874j92281n52400k81851M30756P21543L52211k5495k2752n8588
39877A098130m41100p13493m17655J23132L41784K57827K14995J94353l0161l39885
39867B87927m29268l18880k28745j27346J19644L18892J66052k01262l40737j57692
39857i11415J4846j7928q3303k2629Q1210J63350L45237O83293R55408Q58162
$$ y = [4364936, 4724777, 5290648, 6507159, 8074169, 8934419, 8349238, 6704076, 5037259, 4014999, 3623677, 3658881, 4092286, 4869736, 5648203, 5999225, 5844787, 5536216, 5475867, 5746470, 6104121, 6204946, 5809995, 4935559, 3917383, 3197010, 2900218, 2724778, 2367708, 1905909, 1566736, 1315595, 983709, 667824, 609549, 732413, 725247, 585026, 600113, 726987, 534706, -17694, -299545, 131211, 852754, 1204965, 1179470, 1156718, 1098130, 657030, -56463, -474118, -350986, -9202, 248625, 463620, 657973, 627812, 287927, -141341, -460221, -688966, -816312, -696668, -377776, -211724, -412986, -753723, -911415, -896569, -914497, -997800, -1020429, -939219, -775869, -430632, 252661, 1208069, 2066231]
39847B066231L44430k93200o38406m85052k8346L10594K88615J1114k67082l42479
39837I66419j02304L44404N52459J47809n29969o51099q687N86933M26031q7879
39827A644117j44475J69122R4905m36831o09175m2008N34165L62134k22272l42803
39817A006879J34570N17426L55677j2306r3324O3312J08304M4570J99165N75765
39807B900038P07338L99839K21254P34107J446215J242042l6996j196642j267649
39798E149546p83110q08132j249981j101429j61522N52007L11018l12543m01280
39789A194574K6204K79028R3869j66262k17005j85223k36422k95365k44646j46633
39779A02119j48919k78330l87081k74866J06117N36939O93282M78376J41297K0614
$$ y = [2066231, 2410661, 2117461, 1479055, 994003, 965657, 1276251, 1564866, 1575980, 1308898, 966419, 864115, 1208519, 1760978, 1908787, 1378818, 727719, 719032, 1305965, 1731996, 1644117, 1499642, 1668764, 1763669, 1326838, 717663, 675655, 1209820, 1571954, 1349682, 1006879, 1141449, 1658875, 2014552, 2002246, 1908922, 1972234, 2080538, 2125108, 2324273, 2900038, 3607376, 4007215, 4228469, 4962576, 6408791, 7650833, 7613837, 6417195, 5149546, 4366436, 3558304, 2308323, 1206894, 1045372, 1597379, 1908397, 1595854, 1194574, 1220778, 1499806, 1593675, 1427413, 1210408, 1025185, 788763, 493398, 248752, 102119, -46800, -325130, -712211, -987077, -880960, -344021, 349261, 827637, 968934, 989548]
39769I89548K10043M82206M89102O4089n88605j026314r73302n63704j29772J35318
39759i11391K07036J08296l8469r635K06579K61207o7689m10588k64784J99651
39749g19787L32853K914k03004P4891M29014M01684J97091K23593L47633J53740
39739A240622l00702n44960m12297k05916j54177j36521k7896N0914k1420j25372
39729f37725p6540R6023J88344Q3316j13124j97175j03120K0135J7017k8975J10450
39718f41374M47948O67997M60350j26967p13073q72648m27970L53513Q51228O46781
39708F45785O3070j36494K85063O95546M50582k19327n46251k48954K17307L89498
39698A595825L49007M27210O73387Q38713P65133N98553N94109P86340R24439
$$ y = [989548, 1199591, 1681797, 2170899, 2234988, 1646383, 620069, -353233, -916937, -1046709, -911391, -704355, -596059, -634528, -644163, -437584, -176377, -244066, -654654, -919438, -719787, -386934, -384020, -587024, -512133, -83119, 318565, 515656, 739249, 1086882, 1240622, 939920, 394960, -17337, -223253, -377430, -513951, -541847, -490933, -512353, -637725, -714265, -618242, -429898, -346582, -459706, -656881, -760001, -739866, -722849, -751824, -641374, -193426, 474571, 934921, 807954, 94881, -777767, -1205737, -852224, -996, 645785, 708855, 572361, 857424, 1552970, 2003552, 1784225, 1237974, 989020, 1206327, 1595825, 1944832, 2372042, 3045429, 3884142, 4649275, 5247828, 5841937, 6628277, 7552716]
39689G552716P72218M22765K19624L90134Q73382J460397J902474J911290J371021
39680A6876021O58520M35058Q89436J414691J283435M60462n08807j232393j753640
39671A8522783k177518k379918k197920j717032j242597j014137r70399q26229
39663E997033m52835j21891j83840n34105o91566m63482j93054k02746l45573
39654B807941l38041k02747q8261M3064K13269K02405r7820l58868k50857K7325
39644A957410Q4783k2174J8784J38476O467l13416m14305k37929j45316k54789
39634H17991k70752p8211L1737r8074k07940q0597J35050K47600K79870K35097
39624A011771O438l03012l67869j30874R3086J73190L65517P31530Q46585M33942
$$ y = [7552716, 8324934, 8747699, 8967323, 9357457, 10230839, 11691236, 13593710, 15505000, 16876021, 17534541, 17969599, 18859035, 20273726, 21557161, 22017623, 21508816, 20276423, 18522783, 16345265, 13965347, 11767427, 10050395, 8807798, 7793661, 6823262, 5997033, 5544198, 5422307, 5238467, 4704362, 4012796, 3549314, 3356260, 3153514, 2807941, 2469900, 2267153, 2178892, 2221956, 2435225, 2637630, 2539810, 2180942, 1930085, 1957410, 2042193, 2020019, 2038803, 2177279, 2183746, 1870330, 1456025, 1218096, 1072780, 817991, 547239, 469028, 500765, 402691, 194751, 114154, 249204, 496804, 776674, 1011771, 1018209, 715197, 347328, 216454, 309540, 482730, 848247, 1579777, 2426362, 2860304]
39614B860304j39643l93458l79913l83713l31617j0202L69966L59141p3394m91369
39604A386102n50279k79386R5657L02971J23550l39090o12749l92371K7355J82166
39594e6074J03680J36488K70062J89220o9896r5931J82441L12098N3885j86072
39584H39901J6704M31909N29986K70450J02936K57157M33454K93587k2481p3122
39574C080481K86232O68047N71483m7162p16055r48338p09623l64821k58081m07750
39564A154413n44986l89842N4070M41839M07487k0720m31463m92373k62753j1333
39554i5661P6802o5378l92762o34168m35712J53001N85186M90250J85063J52265
39544A8886K76372J23837j88483r0873M11967N24382j96947j055513j069885k44228
$$ y = [2860304, 2720661, 2327203, 1947290, 1563577, 1231960, 1221758, 1591724, 1950865, 1877471, 1386102, 835823, 556437, 652094, 955065, 1078615, 739525, 126776, -265595, -238240, -56074, 47606, 184094, 454156, 643376, 573480, 477549, 659990, 972088, 1025973, 839901, 856605, 1288514, 1818500, 2088950, 2191886, 2449043, 2882497, 3176084, 3153603, 3080481, 3366713, 4034760, 4606243, 4559081, 3843026, 2894688, 2185065, 1820244, 1562163, 1154413, 609427, 219585, 273655, 715494, 1122981, 1102261, 670798, 178425, -84328, -95661, -18859, -84237, -476999, -1111167, -1546879, -1393878, -808692, -318442, -133379, 18886, 295258, 419095, 230612, 139739, 551706, 1076088, 879141, -176372, -1246257, -1490485]
39534a490485N59390P93377O80587N51349L35653p9318m43665m48275j92266m705
39524B61642P1573K63947N61612O07416K48369j23544o8625K60904L41738O2391
39514B487423j29212O7350L56957L29230O6637l5057J52762M03610M92893L54991
39504D547584K285m23306o26115m84161k95298l77338n51962m32600j24233j12248
39494A122608m28185n03569n2335M37543M33208J39007J13958M14628N97257M11863
39484B685983M5655k64304m65386n31147m07215j72804m811O1623J26996J75859
39474A250449P0248j63322k79878j56529n179j03869m14957o02313m10179M8296
39464g67233M02171M16402K38146J79179K76921K43404p4282l88427l29946K6237
$$ y = [-1490485, -931095, -137718, 542869, 1094218, 1429871, 1350553, 906888, 458613, 266347, 261642, 333215, 597162, 1158774, 1766190, 2014559, 1891015, 1822390, 2083294, 2425032, 2487423, 2358211, 2425561, 2782518, 3111748, 3178385, 3143328, 3296090, 3699700, 4192593, 4547584, 4549869, 4126563, 3500448, 3016287, 2720989, 2343651, 1791689, 1359089, 1234856, 1122608, 694423, 190854, 138519, 576062, 1009270, 1148277, 1262235, 1676863, 2274120, 2685983, 2731638, 2467334, 2001948, 1470801, 1063586, 890782, 885971, 947594, 1074590, 1250449, 1320697, 1157375, 877497, 720968, 715789, 611920, 196963, -405350, -815529, -767233, -365062, 51340, 289486, 468665, 745586, 988990, 914708, 526281, 196335, 222572]
39454B22572K66161K08637O9528L1057k6600k12603l21961j12976K58126L78796
39444G60737J38709j24007j13426J7645o7753l54690m53450j28607L56921N40789
39434E72868K83317j36791l67913k85408J669K74135L25665J15985j54032k37272
39424C92223j41335j05734k39741l43380j92737J27519L25342K69326J09180L5588
39414B36251M0820k4624j99040k95378j22187J88924K40341j14307m59456k86554
39404g95210K83878N82522K58716k67628l94821q4810K40267L23582K74987K55459
39394F76942K66601K44530J43589p2415l61410n53297n08841k84156k5668K04261
39384b69864L76900M16980L40514L16085L86195L04836q6117m97954n47194l20010
$$ y = [222572, 488733, 697370, 766898, 797955, 771355, 558752, 236791, 123815, 381941, 760737, 899446, 775439, 662013, 679658, 611905, 257215, -196235, -324842, 32079, 572868, 856185, 719394, 351481, 66073, 67742, 341877, 667542, 783527, 629495, 392223, 250888, 145154, -94587, -437967, -630704, -503185, -177843, 91483, 200663, 236251, 277071, 252447, 53407, -241971, -364158, -175234, 65107, -49200, -508656, -795210, -511332, 71190, 329906, 62278, -332543, -417353, -177086, 146496, 421483, 676942, 943543, 1188073, 1331662, 1259247, 897837, 344540, -164301, -448457, -474125, -269864, 107036, 524016, 864530, 1180615, 1566810, 1871646, 1785529, 1287575, 740381, 420371]
39374D20371j92461k00591o6902J73148J22187k73378n01314k39164J19586O6342
39364e72176k44507k67889Q4581L39809J73538j70388k59102j881L28638M66187
39354a23190M21600M04515N19787N92513L68201j34318n94924p28879n18866j18022
39344H8417K77404M30348K00343j99386l21680k8332K99796K72692j6788k36032
39334G66782l12273l70563l45910n4304L85176N73823L55831L5537l7395J08747
39324A105451J81023K1753k21970k83944q4758J56796J72492j777q7795l6581
39314I20690j65117o06658r06726n70931J40093M59773J59986j68813l1805K71916
39304d97592J92404k02645l52490l1924L77800M50443K12745j1715l5256M5102
$$ y = [420371, 227910, 27319, -39583, 133565, 255752, -17626, -518940, -758104, -638518, -572176, -816683, -1084572, -999991, -660182, -486644, -657032, -916134, -918015, -589377, -123190, 298410, 702925, 1222712, 1815225, 2183426, 2049108, 1454184, 725305, 206439, 88417, 365821, 796169, 996512, 797126, 475446, 447114, 746910, 1019602, 1002814, 766782, 454509, 83946, -261964, -316268, 68908, 642731, 998562, 1034099, 996704, 1105451, 1286474, 1308227, 1086257, 802313, 717555, 874351, 1046843, 1045066, 957271, 920690, 755573, 148915, -757811, -1328742, -1188649, -728876, -568890, -737703, -769508, -497592, -305188, -507833, -860323, -892247, -514447, -64004, 148741, 137026, 101770, 146872]
39294A46872L0889j42625l44227m01452k97558j52262j4918J83198M14346M71228
39284a06509K54578O36j90J73039J89745j2342j22547M9472K66632K36980N9866
39273I89360L1828J63639K26055K17171L85928O95813O67470L8689p09585q82826
39263A823542m81833j44914k12034l34314j55975R1013J1354k75208l25272p4795
39253g8436J02957J1646j19432p8936K468o1503j80589j52919J5563J56179J97038
39242a85964K10517K58086L12000L06393K03390M5174m0923L3471J71292J66296
39232A479732n0279l38608n31030n57624l97250q5059J97278K41610R7533L4291
39222I0594J30885J44442o3632k31582q3877J91804J90456r3215k59202j17013
$$ y = [146872, 177761, 35136, -309091, -710543, -1008101, -1160363, -1175281, -992083, -577737, -106509, 148069, 148705, 148515, 321554, 511299, 498957, 376410, 425882, 692514, 929494, 989360, 1021188, 1184827, 1410882, 1628053, 2013981, 2709794, 3377264, 3415953, 2706368, 1823542, 1341709, 1196795, 984761, 650447, 494472, 585485, 596839, 321631, -3641, -78436, 24521, 36167, -83265, -162201, -159733, -221236, -401825, -554744, -539181, -383002, -185964, 24553, 282639, 594639, 901032, 1104422, 1149596, 1108673, 1142144, 1313436, 1479732, 1429453, 1090845, 559815, 2191, -395059, -480118, -282840, -41230, 56303, 90594, 221479, 365921, 302289, 70707, -13170, 178634, 369090, 275875, 16673, -100340]
39212a00340M9764m6762k49886j85994K15660O34121P34638M91803J45466p4063
39202A614407j59839k86102n40167p32112n80547j10612K74612K33415r6943k78412
39192f62300j27533J06168J65197J66047L53318N97193M55278j80637p67818o80175
39182e75262J7767O09354N32168n8677n70175o20617l00640P8132L21062M25318
39172a41570M23228K68850m8521l41592l59748j38832o941j02905j26754J72157
39162d02628M87975L49057j11146k82007P994K46545P7648j39305O5950N32702
39152H32785P33739M86685K0067m19570o48942m77191K5632L69822J74251k90574
39142H06704m85548l59560k67549k84945j51519J40581K61209J14607l603O2957
$$ y = [-100340, -50576, -97338, -347224, -533218, -317558, 316563, 1051201, 1543004, 1688470, 1614407, 1454568, 1168466, 628299, -103813, -684360, -794972, -520360, -286945, -383888, -662300, -789833, -683665, -518468, -352421, 897, 598090, 1053368, 872731, 104913, -575262, -557495, 51859, 584027, 525350, -44825, -665442, -966082, -887950, -566888, -141570, 281658, 550508, 501987, 160395, -199353, -338185, -345126, -448031, -574785, -402628, 85347, 434404, 323258, 41251, 49245, 295790, 373438, 234133, 300083, 832785, 1566524, 2053209, 2073276, 1653706, 1004764, 527573, 553205, 923027, 1097278, 806704, 321156, -38404, -305953, -590898, -742417, -601836, -340627, -226020, -229623, -166666]
39132a66666J02350k1943j26335p5424n590l503P7439K97721M60243M25613K89017
39121A252922J21180j17859k97147j60543J95469L34736J59382Q7504L06374L84528
39111B266546m770m91194o04540m89573m79632l99808L6851M80804L59960j36705
39101E37939k64292J31444M26065K51489m3Q5991L30367L79448K46530J23053
39091B247991L3885m1673k6572M5464j9909k22364k71023l5749K18338K41561
39081B169949J27429L1498r8408k75944k99922j03172L6316p1949j99347j24104
39071A192346o4903k86730n61519m97139j90203l9620o1501N6477K94738K98758
39061A40704P3129N6934L31842L61540j44695o37463m75967J13014L87807J71095
$$ y = [-166666, -64316, -86259, -212594, -288018, -293608, -297111, -219672, 78049, 538292, 963905, 1252922, 1374102, 1256243, 959096, 798553, 994022, 1328758, 1488140, 1575644, 1882018, 2266546, 2261776, 1770582, 1166042, 676469, 196837, -202971, -166120, 314684, 674644, 537939, 273647, 405091, 831156, 1082645, 1082602, 1168593, 1498960, 1878408, 2124938, 2247991, 2281876, 2240203, 2213631, 2259095, 2239186, 2016822, 1745799, 1710050, 1928388, 2169949, 2297378, 2328876, 2230468, 1954524, 1654602, 1551430, 1587746, 1515797, 1316450, 1192346, 1127443, 840713, 279194, -217945, -408148, -447768, -509269, -452792, -158054, 140704, 213833, 270767, 602609, 964149, 819454, 181991, -293976, -180962, 206845, 377940]
39051C77940l9302K6375M0452k36042m74016l27881m0113l5174j74902M2974O14357
39040b25332R04282N26821j05811l75738k52097j45038k11905k36662j20242o5249
39030c06971j94562l18283k30538k785J78773K85371L77230L91617K04370j21672
39020B62550l09781j49530K46762N21644M35585J30724n0455j3294j1623k08193
39010H54389l56800j71259J60278J98192p3063k16636m6626Q5310j02149l32652
39000a016k10722J47314K91245P6961k16860l22327k35465q1636L1794N9194P9844
38989c81674K33106M50510M28833P8287k14925q1882K50278K52470j43451m92981
38979C78571n10768l57208k15688k5798K22705L20113J71160J012J9983J30030
$$ y = [377940, 338638, 365013, 405465, 169423, -304593, -632474, -672587, -707761, -882663, -839689, -225332, 678950, 1205771, 1099960, 724222, 472125, 327087, 115182, -121480, -241722, -306971, -501533, -819816, -1050354, -1053139, -874366, -588995, -211765, 179852, 384222, 262550, -47231, -196761, 50001, 571645, 1007230, 1137954, 1087499, 1074205, 1062582, 854389, 497589, 326330, 486608, 684800, 611737, 395101, 348475, 433785, 331636, -1016, -211738, -64424, 226821, 303782, 86922, -235405, -470870, -552506, -520712, -461518, -381674, -148568, 301942, 730775, 809062, 594137, 512255, 762533, 1015003, 871552, 378571, -132197, -489405, -705093, -730891, -508186, -188073, -16913, -15901, 4082, 134112]
38969A34112J55281J25935J25183O9953j21239l03521k72398m0250K28168M24506
38959E25730M74179K68108j58684m98980m66254j57113Q7803J33300J45302K56448
38949F09839L52376K46621o6964l89527m80685k55565J15118L37775K98525J72848
38939I40361J54071J75259M9860j90870l09071k10326q3932j24837k69043l14234
38929a82762k07180q4230n4437n8234J9537J64930K40424J68640L3641l9988m8361
38918d8020q7827k20704m23010o01285n83043j98506M65335R74084R35848M63065
38908F75937J6400j92886l48989n52110n75131k81249N7523J44391R9639J96842
38898g59633L67193L38705J40780Q0010K49189M12491L89956K45736P2789j12408
$$ y = [134112, 289393, 415328, 540511, 610464, 489225, 185704, -86694, -126944, 101224, 525730, 999909, 1268017, 1109333, 610353, 144099, -13014, 74789, 208089, 353391, 609839, 962215, 1208836, 1141872, 752345, 271660, 16095, 131213, 468988, 767513, 940361, 1094432, 1269691, 1319551, 1128681, 819610, 609284, 525352, 400515, 131472, -182762, -389942, -474172, -528609, -586843, -567306, -402376, -161952, 6688, 40329, 341, -48020, -135847, -356551, -779561, -1380846, -1963889, -2162395, -1697060, -722976, 212872, 675937, 692337, 499451, 150462, -401648, -976779, -1258028, -1200505, -1056114, -956475, -759633, -392440, -53735, 87045, 167055, 416244, 828735, 1218691, 1464427, 1537216, 1424808]
38888A424808k22936j38636M2681M5121k23818n60194p25682n97343j10797O01007
38878d65789J026109O81515j78139p08087n29150j74988j91625k94850N5730O24872
38868a54402O52450L0034m79050l27069J10292J99641m6772j41906Q7308L30559
38858B61085L24668J64282L8108m6353j46565j94815j01299M6466O6582m4428
38848C67731q7425L2121J26437k941k25137k32504j1749R5420j19670m33148n29132
38837a019997m02555j98049J16521N61600P88068L88433l94813p41633k44757
38828a147182N36407P89038M21728r288j20840k9625N1542J08525J52840J05149
38818H58294j5969n2529J5657p118j88322k84374r9886J78047K48081J32339O8126
$$ y = [1424808, 1201872, 1063236, 1105917, 1151038, 927220, 367026, -358656, -955999, -1066796, -465789, 560320, 1241835, 1063696, 355609, -173541, -348529, -540154, -835004, -779274, -154402, 498048, 528082, 49032, -278037, -167745, 31896, -14876, -156782, -69474, 261085, 585753, 750035, 788143, 741790, 595225, 400410, 299111, 345577, 412159, 367731, 280306, 312427, 438864, 435923, 210786, -21718, -33467, 61953, -57717, -490865, -1019997, -1422552, -1620601, -1504080, -942480, -154412, 234021, -160792, -902425, -1147182, -610775, 178263, 599991, 590703, 469863, 440238, 491780, 600305, 753145, 858294, 842325, 789796, 805453, 798335, 610013, 325639, 225753, 403800, 651881, 784220, 852346]
38807H52346Q9583M5684k9629N6276K26947J36261k52750m70934k03074J71946
38797F22656R5146l19978m27375m450M24623L61992N699j37855n631L9119j58057
38786D95889l16678j75504J21508K34286N8909j90833k61141j08674J02007J77915
38776A37684P1670q7280j23722J5995K23774L41769L01175J63254M5187R779K8447
38765A127732N2297Q5441J43079J66777P1564j10227k28839k07181j46161j75937
38755G78545k74616l09289j97508M1099L23258N10127M62435K10543N235M9830
38745A599659K16125J92088q9528l48568l32163j27557m727p1107k01711k33318
38735E99193j10872J10017K93859K85606N3350k21620k91924j12754J02049J24728
$$ y = [852346, 941929, 987613, 957984, 1014260, 1241207, 1377468, 1124718, 653784, 450710, 622656, 717802, 397824, -29551, -34001, 390622, 752614, 758313, 620458, 614827, 653946, 495889, 179211, 3707, 125215, 359501, 418410, 227577, -33564, -142238, -40231, 137684, 209354, 122074, -1648, 14347, 238121, 579890, 881065, 1044319, 1089506, 1099285, 1127732, 1180029, 1265470, 1408549, 1575326, 1646890, 1536663, 1307824, 1100643, 954482, 778545, 503929, 194640, -2868, 38231, 361489, 871616, 1334051, 1544594, 1549829, 1599659, 1815784, 2007872, 1918344, 1569776, 1237613, 1110056, 1105329, 1034222, 832511, 599193, 488321, 598338, 892197, 1177803, 1231153, 1009533, 717609, 604855, 706904, 831632]
38725H31632m4178k24296k95214l06048l45480l83623l03485o7375K01587L18977
38715f17503K10373m739r2372R2450M42066O67875N81015K68270m9249k50100
38705A248086l16340k17185J7255J67599L1275k28224k31408L2672J05608k57887
38695C51451o39270n24388o3903J71561M3745n3834O9827J11290j29313l40056
38685a002890j80693J79045L46181K85883K63355L55507L70261K08309J7420l6499
38675H05879L5633R3290j3k40710m00787k14986K15239L87252n624n87225o88242
38664f00294j39475N95995J003402R26018M68270j21138m38599j97854L47871
38655A844196N90903L36565N7451J81598M80337M87462K33153J24296K52831K97928
$$ y = [831632, 787454, 563158, 267944, -38104, -383584, -767207, -1070692, -1138067, -936480, -617503, -407130, -411869, -504241, -411791, 30275, 698150, 1279165, 1547435, 1498186, 1248086, 931746, 714561, 731816, 899415, 930690, 702466, 471058, 503730, 609338, 351451, -287819, -812207, -876110, -704549, -660804, -714638, -644811, -533521, -662834, -1002890, -1183583, -1004538, -658357, -372474, -109119, 246388, 616649, 824958, 842378, 805879, 841512, 934802, 934789, 694079, 293292, 78306, 293545, 680797, 675173, 87948, -600294, -739769, -143774, 859628, 1785646, 2253916, 2132778, 1694179, 1496325, 1844196, 2435099, 2771664, 2829115, 3010713, 3491050, 3978512, 4211665, 4335961, 4588792, 4886720]
38645D886720J00955j13993j89097k92561n34164o67881m68789j66362j62042
38636B392786m37542n84074l92381r0685N6557Q5773J31916J36229k7780k79626
38626I91173m04238l33916j72872Q838K10849L48589K69774k6742l44631n12655
38616C4169n18379l88129j03452K84244O04520P25131O34519L21529k16268p32206
38606F45678p68719k05372M17500M65971J3736k88619j17618J69536J73326J784
38596E07203o8262j04131l05176n18465m16883o7465J25286N7657O8676L22970
38586c98590M74661K06334k29318l56886j56031j1176r0071j60266k4252K15686
38576e29909L93841M75713M26786J81619j33049k33550j00053p7306l45352n72571
$$ y = [4886720, 4987675, 4873682, 4684585, 4392024, 3857860, 3189979, 2721190, 2554828, 2392786, 1955244, 1371170, 978789, 888104, 944661, 1030434, 1162350, 1298579, 1270799, 991173, 586935, 253019, 80147, 88985, 299834, 648423, 918197, 891455, 546824, 34169, -484210, -872339, -975791, -691547, -87027, 638104, 1272623, 1594152, 1377884, 645678, -123041, -328413, 89087, 555058, 568794, 280175, 162557, 332093, 505419, 507203, 438941, 334810, 29634, -488831, -905714, -973179, -847893, -790236, -721560, -398590, 76071, 282405, 53087, -303799, -459830, -471006, -561077, -721343, -745595, -529909, -136068, 339645, 766431, 948050, 815001, 581451, 481398, 404092, 58740, -513831]
38566e13831l80943Q5767L96949M39668M01794L02487l963l93872m98575k29523
38556c94042R8355K38728K57027K43320J57476M3386J9816j8748k70218n16107
38546a41007k73232L69932O63852K62878k26373k19245o7486l41921p21601m68167
38536a162370K78761O24519K89610n3965N0438K00342k6626l31182k52944P6154
38526c07263K33221J72259J23947J01525n7807l10135m08257k18197J59891M82563
38516b8253M82167R0054l79031n04309k73422k3443J34119L74545N76271K81742
38506G30440m84635r60045o42770k4681J92903J15830K36793M25365J64360m10417
38496f56857n69150j08451L54976L52731J47266J24468K08176J86824J34951J70704
$$ y = [-513831, -894774, -809007, -412058, 27610, 429404, 731891, 727928, 334056, -164519, -394042, -295687, -56959, 200068, 443388, 600864, 644250, 664066, 645318, 375100, -141007, -414239, -44307, 619545, 882423, 656050, 436805, 369319, 27398, -694203, -1162370, -883609, -259090, 30520, -23445, 26993, 227335, 200709, -130473, -383417, -307263, -74042, 98217, 222164, 323689, 265882, -44253, -452510, -670707, -510816, -28253, 453914, 543968, 164937, -339372, -612794, -636237, -502118, -127573, 448698, 730440, 245805, -714240, -1357010, -1381691, -1188788, -1072958, -836165, -410800, -246440, -656857, -1226007, -1334458, -979482, -626751, -479485, -355017, -146841, 39983, 174934, 345638]
38486C45638J66338J3444j27040j16211j02496k30757l35904j94310J21522L78803
38476h0973M92583M89569L58606J54296O1854J34342J47368m8559k21200r3413
38466A394473J65470J36747k09512m26851k06066K13441L83443J93242j03114
38457A541273k88835l96450m99520m84826k06123J86737L03080M506l46417l39047
38447e25622p7117R579j51906j77306J13912L55373K02237j01448r6696J76762
38437b72232K81962J00507k5246R3422J92109M5912j32567p2986Q4433O9046R623
38426C73983K25432N66756M85491j13566n79768l82154J11176J62222k64811n06166
38416G8595k31879J02726K9812k01029n4143M23956O27703K22721m21777p01673
$$ y = [345638, 511976, 525420, 398380, 282169, 179673, -51084, -386988, -581298, -459776, -80973, 411610, 901179, 1259785, 1414081, 1475935, 1610277, 1757645, 1709086, 1487886, 1394473, 1559943, 1696690, 1487178, 1060327, 854261, 1067702, 1451145, 1644387, 1541273, 1252438, 855988, 356468, -128358, -334481, -147744, 155336, 159842, -186575, -525622, -602739, -593160, -745066, -922372, -808460, -453087, -250850, -352298, -448994, -272232, 9730, 110237, 84991, 178413, 370522, 416434, 283867, 210881, 295314, 364360, 373983, 599415, 1166171, 1651662, 1538096, 958328, 576174, 687350, 849572, 584761, 78595, -153284, -50558, -20746, -221775, -275918, 148038, 775741, 998462, 576685, -124988]
38406a24988m39050K1345K32018O2779k45457l80475k67527l9619K18361N06660
38396d55953O93997N41190Q3285k57581j66453J43756K57863J41623R0887J99170
38386A271784K29789L6142k01363k55737j47535m4885k4334m8782r8625k13223
38376E03231l88974m81238k96569J39790M93137M66621J84350k6j7339p5465j69075
38365C58443n6799J96863J94631q6301j45962J73334L13341m6092l16513O4485
38355F49430O30201O30113K66604K34971M30909K10180k93553k91174K46316M67720
38345C181717Q0272k13422K3168L28425L22404L21433N69880P79675Q29086J029099
38335G251737J357024J373763J191706J433340J966467K060744K163155L646697
$$ y = [-124988, -564038, -542693, -310675, -247896, -493353, -873828, -1141355, -1180974, -962613, -455953, 238044, 779234, 862519, 604938, 438485, 582241, 840104, 981727, 1072614, 1271784, 1501573, 1537715, 1336352, 1080615, 933080, 888195, 863861, 815079, 716454, 503231, 114257, -366981, -663550, -523760, -30623, 435998, 620348, 620322, 602983, 527518, 358443, 301644, 498507, 693138, 606837, 460875, 634209, 947550, 901458, 584945, 649430, 1279631, 1909744, 2176348, 2411319, 2842228, 3052408, 2758855, 2467681, 2713997, 3181717, 3261989, 3048567, 3071735, 3400160, 3722564, 4043997, 4613877, 5393552, 6222638, 7251737, 8608761, 9982524, 11174230, 12607570, 14574037, 16634781, 18797936, 22444633]
38327B2444633N834715N356426L97514n882372q519041o551309l386523j874153
38319G819890j559526r96469k53629p4925l13645m25587m48478n66497n36819
38310B644315k50444j08842k96847m20495k88039k40527l28788p5757N12184O78535
38300A825295J80932j95697j9006l3673p65461j324730p14361M53891P92403J81495
38290C81088k64702p153L52901K95385Q2491N1129O8049l5233j24580j07923j23602
38279E67850j95160j19125J39413L01826J89449L738M3135L13662N18656L64044
38269B127488j15250n12562m70694j66765j10144l81726m58728r515N43390O04736
38259A050230K18988j07108j45370r2772j48010l13314m89232m80449q8488N35733
$$ y = [22444633, 28279348, 33635774, 34033288, 28150916, 19631875, 13080566, 9694043, 7819890, 6260364, 5263895, 5010266, 4935341, 4621696, 4196109, 3747631, 3181134, 2644315, 2393871, 2285029, 1988182, 1567687, 1279648, 1039121, 710333, 634576, 1146760, 1825295, 2006227, 1810530, 1791524, 1757851, 992390, -332340, -1046701, -592810, 199593, 381088, 116386, 109233, 462134, 757519, 840010, 891139, 959188, 923955, 799375, 691452, 567850, 372690, 253565, 392978, 694804, 884253, 887991, 931126, 1244788, 1763444, 2127488, 2012238, 1499676, 1028982, 862217, 752073, 370347, -88381, -97896, 445494, 1050230, 1269218, 1162110, 1016740, 923968, 775958, 462644, -26588, -507037, -595525, -59792]
38249e9792Q75165O73330K97370J55162R2281k00100n06259l77624Q9065L40682
38239A379280J70489p7519j07530l3672q3109k59691l64275j81803K88555O86073
38229A416798N94432J27326j45528n1837r8372n52020q32172m17952J70190J01728
38219C12593m20042m63544J58758O70591N87082K74506J04511r4046m41607o00570
38209H8232l49573n450Q6172J9647j0557p0996k03318j89261O3844K35263J8767
38198c17230l98115n56475k64926K60003O41554O29946K95060k6886j12981r8631
38188E1319j54711j27451J41585L45504P8452m36982n66569j96822J31482O8726
38178f65467j48445k44262k68031k63966j19697R6408J56641J48153L70651O54454
$$ y = [-59792, 815373, 1488703, 1786073, 1941235, 2033516, 1833416, 1327157, 949533, 1038598, 1379280, 1549769, 1472250, 1364720, 1331048, 1247939, 988248, 623973, 442170, 730725, 1416798, 2011230, 2138556, 1993028, 1941191, 1842819, 1290799, 458627, 40675, 210865, 312593, -107449, -570993, -412235, 258356, 845438, 1119944, 1224455, 1130409, 688802, 88232, -261341, -266791, -180619, -160972, -171529, -242525, -445843, -635104, -571260, -335997, -317230, -715345, -1271820, -1536746, -1276743, -635189, -5243, 289817, 262931, 149950, 51319, -103392, -230843, -89258, 256246, 334698, -102284, -668853, -865675, -734193, -665467, -813912, -1058174, -1326205, -1590171, -1709868, -1613460, -1456819, -1308666, -938015, -283561]
38168b83561M33259k99110p76677n11780O3964L51314L71559M08266M31768L36119
38158E25121K70746L05441K01365j06324k65335j19112n3617l20085n42359l72163
38148d76322j13808j66244l31200k39840j0152R7490K21373M82698M96798o302
38138d5509m98257l50075J48207K69527L8804N9987L64755L75209k3340k73453
38128F5855j04176J03050O3285j3602L8295M5412o1483q3162j5917j34767m35936
38117e33146n29821k80894l6604j2573L8095K94121M92281L93278K14222K62311
38107C01270M42755M41575J84991j22414k57706j35550J28987K45270L7753k64019
38097A002912k75091L519K00257J45095O6395J37694J85230j556l40729n80021
$$ y = [-283561, 149698, -149412, -926089, -1437869, -1373905, -1022591, -651032, -242766, 189002, 525121, 795867, 1101308, 1302673, 1196349, 931014, 811902, 758285, 438200, -104159, -476322, -590130, -756374, -1087574, -1327414, -1337566, -1240076, -1018703, -536005, -39207, -45509, -543766, -893841, -745634, -476107, -437303, -377316, -12561, 362648, 339308, 65855, -38321, 64729, 128014, 114412, 152707, 198119, 136636, 53474, 37557, -97210, -533146, -1062967, -1343861, -1380465, -1393038, -1354943, -1060822, -568541, -175263, 38959, 301270, 744025, 1185600, 1370591, 1248177, 990471, 854921, 983908, 1229178, 1266931, 1002912, 727821, 731340, 931597, 1076692, 1143087, 1280781, 1466011, 1464455, 1123726, 543705]
38087E43705n58746k94717J1166Q7904q0839j51963R3451L46188K31197l2535
38077A94811L4977L28757K97080r8747k68549M5268L68545K72960n8398k82530
38067H34174l37134j96223K17137O12938M55975j79517n16917k02403J53339N951
38057H47320k67841j49610P3232q8328l45430j51111K21757R3406l87676m32314
38047e86595M6313K91199J0075j55540K15042N71248L06704k44492l47478K5633
38037A32109K56246L9625k83418l33735j76845p2157l5448J26010M25110N52558
38027F30055K37713l29994o36554m42763m5206J73250K22704L15489M01516K34118
38017G60328j67016m50600l76463r2501Q1535o628k24747k63134Q4576O33121
$$ y = [543705, -15041, -309758, -298592, -210688, -291527, -443490, -350039, -3851, 227346, 194811, 229788, 558545, 855625, 756878, 488329, 533597, 902142, 1175102, 1116704, 834174, 497040, 300817, 517954, 1130892, 1586867, 1407350, 890433, 688030, 841369, 847320, 579479, 429869, 503101, 414773, 69343, -81768, 139989, 233395, -154281, -586595, -540282, -249083, -239008, -394548, -179506, 391742, 698446, 453954, 106476, 132109, 388355, 427980, 144562, -189173, -366018, -438175, -473623, -347613, 77497, 630055, 867768, 537774, -98780, -541543, -586749, -413499, -190795, 124694, 526210, 760328, 593312, 142712, -233751, -326252, -244717, -251345, -476092, -739226, -654650, -21529]
38007b1529R13483P04268K86459N349j64454l46176l55431j0585L69882L22324
37997A703590k0709j27360L3782m8752m77214o58413k61788J84175J06244k35898
37987A97657k52362m987k4688l51574m39901l7682M24086M80576K23202J5550
37977B29877m8294j21322k27916j99992K6646K45282K00041o9162k05883N0876
37967a19847M80166N79469J95640k56792l48778j90006j74473l40638l51148p8228
37957f04635J80975J81762Q7546J48371K86143K63743J00727L4675J36795K26618
37947A042720J67328K6178r3496j96543l12486m05017m20778l28608r8361K31405
37937c87658M60029L76220N7998j55875q4939P1493M7169j26046k21317j38182
$$ y = [-21529, 891954, 1596222, 1882681, 1888030, 1723576, 1377400, 1021969, 1011384, 1381266, 1703590, 1682881, 1555521, 1589303, 1540551, 1063337, 404924, 143136, 327311, 433555, 197657, -54705, -59692, -84380, -435954, -875855, -913537, -489451, -8875, 214327, 229877, 181583, 60261, -167655, -367647, -341001, -95719, 104322, 35160, -170723, -119847, 360319, 939788, 1135428, 878636, 529858, 339852, 165379, -175259, -526407, -604635, -423660, -241898, -154352, -5981, 280162, 543905, 644632, 679307, 816102, 1042720, 1210048, 1236226, 1142730, 946187, 633701, 228684, -192094, -520702, -619063, -387658, 72371, 448591, 506589, 350714, 265775, 337268, 384437, 258391, 37074, -101108]
37927a01108N6501K80921M43299M20976K47940J99559M44598P35220P36305N40005
37917D004216M70228M52879P9758o20702r93675o02999J23711M12981L4110o09547
37907B750960j017848r35017m02028K13097M32965K03182n088J12734K13630j01634
37897A464953n49680n62998j94522J3523n6026j7037J75327O2898m34587p03262
37887h01411l65387J01244J39245l7153P3331L74011M25727K64826K44266K45121
37877F63820j63739p79021p89467P214P24660N55591j29314l93574n9878K16231
37867a47477K8346k86864l16263j71442j59881k31007q9009L18656P12006Q11063
37857D68128N66814J27074k60240l74367k22447p3070j44887l20092l23479j09600
$$ y = [-101108, -44607, 236314, 679613, 1100589, 1348529, 1548088, 1992686, 2727906, 3464211, 4004216, 4474444, 4927323, 5007081, 4386379, 3392704, 2789705, 2913416, 3326397, 3360507, 2750960, 1733112, 798095, 396067, 609164, 1042129, 1245311, 1240223, 1352957, 1566587, 1464953, 915273, 352275, 157753, 171276, 115250, 98213, 273540, 336438, -98149, -801411, -1166798, -1065554, -926309, -963462, -890131, -516120, -90393, 174433, 418699, 663820, 500081, -278940, -1068407, -1061193, -336533, 219058, 89744, -303830, -363708, -147477, -119131, -405995, -722258, -893700, -1053581, -1284588, -1373597, -1054941, -342935, 468128, 1034942, 1162016, 901776, 527409, 304962, 231892, 87005, -233087, -556566, -666166]
37847f66166J30857K86881L94140M05584J93969j48130k92622r4776J92552K52176
37837F54465N1095k42622m49540l73775Q5398O23733O58504N9696n30700m72852
37827F3402K1895K44746N68k45136j56887O4715J30046M9532n1807j25379q1227
37816h5532J66006M16541L12218j15909l87252k30051N5811J05370J1210N9652
37806C08064K22829K30219j3991l28998m59679k53462J86770M50099K01976k73659
37796B70168k89294L01548P98987N99156J9584k38908p9242P1372L8738j2658
37786A479451j08331m29556p69189o44765o2994L72005K87365Q021j5684J65837
37776B82160K03098m1645m24416p12003o67443k09107L40959M53339N1138k94996
$$ y = [-666166, -535309, -248428, 145712, 551296, 745265, 597135, 304513, 209737, 402289, 654465, 705560, 462938, 13398, -360377, -274979, 348754, 1007258, 1066954, 536254, 63402, 85297, 330043, 330611, 85475, -71412, -6697, 123349, 172881, 121074, -4305, -85532, 80474, 497015, 809233, 693324, 306072, 76021, 131832, 237202, 248412, 308064, 530893, 761112, 747121, 418123, -41556, -295018, -108248, 341851, 543827, 270168, -19126, 282422, 1081409, 1680565, 1700149, 1461241, 1381999, 1453371, 1492109, 1479451, 1371120, 941564, 172375, -472390, -535384, -163379, 123986, 132007, 116323, 282160, 485258, 443613, 19197, -692806, -1360249, -1569356, -1228397, -775058, -723920, -1018916]
37766a018916q3228M49758O74015L99515K8615m6122J17393J97039J1203l24710
37756D04562n24323l78160N3813M83533O48035M97494J63609j43140k12247J1609
37746A004785K89399K71340q8919m47919m78165k01310J52580M04578M28278J38770
37736A473417l08003n04609k39858J77327K93768R8414l0908J21386L90256N14169
37726A985359L68687m5209n61963q15706n49580K974L32196K88075J93685K64612
37716A463130K96722J10170p4765k1127N8654j71545n47710n59706j10044L03484
37706G47263K61781p0858k79543k42213j14441P920J32215J87160P1647j28964
37696E71967j90771l7841J83678L32124M03703M04438K66936l951k26885k13424
$$ y = [-1018916, -1102144, -652386, 21629, 421144, 449759, 403637, 521030, 718069, 729272, 404562, -119761, -497921, -444108, 39425, 687460, 1184954, 1348563, 1205423, 993176, 1004785, 1294184, 1565524, 1476605, 1028686, 550521, 349211, 501791, 906369, 1334647, 1473417, 1165414, 660805, 420947, 598274, 892042, 990456, 959548, 1080934, 1471190, 1985359, 2354046, 2308837, 1746874, 931168, 381588, 384562, 716758, 1004833, 1198518, 1463130, 1759852, 1870022, 1795257, 1774130, 1832784, 1661239, 1113529, 553823, 443779, 747263, 1009044, 938186, 658643, 416430, 301989, 309909, 442124, 629284, 700931, 571967, 381196, 343355, 527033, 859157, 1262860, 1667298, 1934234, 1930283, 1703398, 1489974]
37686A489974N549K06752K01658l384k29810k81744j30096N0403R5303O6279J09849
37675A580733J39900p0813m20709m47329K089L90528J72902l68489m75692q985
37665D94135L88862K88985L5252O0075J99028J02769j06341j00790L7618J0631
37655A410224j09945n5674L9288j56768m37198k32247L88796O17557R0555m88643
37645A065945l52439K48536N16132K59063l2543l0011J13433J83376J23534j15721
37635A979305m82424o25708k65922K57794K98592k03109o15207m83561k9328L51732
37625A82164O10356Q50702J022505J048282R47672O85493K49711k5012K81255
37616E853128Q85304Q59749j37657j238201j468272r87780o12944n54841m21962
$$ y = [1489974, 1495523, 1702275, 1903933, 1900549, 1670739, 1388995, 1258899, 1309302, 1404605, 1470884, 1580733, 1720633, 1649820, 1229111, 781782, 783871, 1174399, 1347301, 978812, 503120, 494135, 882997, 1171982, 1207234, 1267309, 1466337, 1569106, 1462765, 1361975, 1399593, 1410224, 1300279, 1244605, 1283893, 1127125, 689927, 457680, 846476, 1464033, 1554588, 1065945, 713506, 962042, 1478174, 1737237, 1704694, 1674683, 1788116, 1971492, 2095026, 1979305, 1496881, 871173, 605251, 863045, 1161637, 958528, 343321, -140240, -169568, 182164, 792520, 1643222, 2665727, 3714009, 4661681, 5347174, 5596885, 5571873, 5853128, 6738432, 7598181, 7460524, 6222323, 4754051, 3766271, 3153327, 2598486, 2176524]
37607B176524j90426k59391n68384n29768o973L92978K59905m6611p4280O3309
37597A216883O3928m9483j77403m29721p48226o92620q2854N31876N71557K67024
37587D70961K30291M47346L63879j29784m81687l30731N118Q8097n3250j48546
37577D61694j51017j97314l09199l75991l32882k06204m6779J08726K69553M79971
37567b99442O82913O58351K76835k27659m60203l31638r2396Q5910K60397L94361
37557I47429K39063k53806o69982n74052q2703K68887J79147j33580k92865k01811
37547e74273n1585l1165j29071j80750n6677J85811L30833K26576J260j2395L35701
37536D4265P26147O35433j9138o56818o62631j46849K12858P7390j73079r3075
$$ y = [2176524, 1986098, 1726707, 1158323, 628555, 621582, 1014560, 1274465, 1227854, 1153574, 1216883, 1280811, 1231328, 1053925, 624204, -124022, -816642, -899496, -367620, 203937, 470961, 701252, 1148598, 1512477, 1382693, 901006, 570275, 575393, 663490, 610240, 461694, 310677, 113363, -195836, -571827, -904709, -1110913, -1157692, -1048966, -779413, -299442, 383471, 1041822, 1318657, 1090998, 630795, 299157, 206761, 292671, 553068, 947429, 1186492, 932686, 262704, -311348, -394051, -125164, 53983, -79597, -372462, -574273, -625858, -657023, -786094, -966844, -1023521, -837710, -506877, -280301, -279041, -291436, 44265, 770412, 1405845, 1386707, 729889, 67258, -79591, 133267, 210657, 37578, -55497]
37526e5497J82700K51089Q8897l2333r3738l07701n99406o01768k54483K6982
37516a395258m7038k31206j51361J78233M78476N97020N24829K31978k24702n60074
37506e99103n10418j80403P7668J01779N1906J24467L10925M59522M45638K45898
37496E27879o9690l71595n20538m20488q5744K91981M24168K18021m5934j0267
37486f2207K85443M37154K18193j50742l61711l96063l81916l09927j25693N3988
37476g93481P2681K216N4647K60932M18883L50950R0281j63723j97645L0931K89436
37465D16108K77793K7351q5753J34968L81486K70215r4305k97504k35403j86284
37455F08672k74142k42582J00028M90169M80528j0656n83246p74579n28105k18096
$$ y = [-55497, 127203, 378292, 467189, 434856, 341118, 33417, -565989, -1167757, -1422240, -1395258, -1442296, -1673502, -1824863, -1646630, -1168154, -571134, -46305, 185673, -39029, -599103, -1109521, -1289924, -1212256, -1110477, -1058571, -934104, -623179, -163657, 281981, 527879, 458189, 86594, -433944, -854432, -940176, -648195, -224027, -6006, -51940, -62207, 223236, 660390, 878583, 727841, 366130, -29933, -411849, -721776, -847469, -793481, -720800, -718584, -663937, -403005, 15878, 366828, 457109, 293386, 95741, 126672, 416108, 693901, 721252, 635499, 770467, 1151953, 1422168, 1327863, 1030359, 794956, 608672, 334530, 91948, 191976, 682145, 1162673, 1152017, 568771, -205808, -733913, -952009]
37445i52009j81117k70776n4013N10020Q70246N83395l7575l27995j54391M8904
37435C4689M9684R0702K92426L16098p4814n07125m40048J03880N96564O53202
37425A115258L26040j24560m45760m54475j77524R6909J42039R9665K04164K99953
37415A081709K3796n16078o94550k12979L81627L66778j87971n24753k03177L91579
37405i4019O30843M08328J20534P6410J77210J47453r9325l68277l83845p7417
37395E37895K86574L18118q8373n84320o94566l03108K59835N88846N64954L51987
37385A237842J43648k3035k22885m37229m50868q4780M38647N78693J17627m52742
37375H44918m88576m4735K15574k6911l31742k10257J67924L11268J42543j1136
$$ y = [-952009, -1133126, -1403902, -1457915, -947895, -77649, 505746, 468171, 140176, -14215, 34689, 84373, 175075, 467501, 783599, 708785, 201660, -238388, -134508, 462056, 1115258, 1441298, 1316738, 870978, 416503, 238979, 335888, 477927, 577592, 781756, 1081709, 1105505, 589427, -105123, -318102, 63525, 430303, 242332, -282421, -485598, -94019, 536824, 945152, 1065686, 1142096, 1319306, 1466759, 1367434, 999157, 615312, 537895, 824469, 1142587, 1054214, 469894, -224672, -527780, -267945, 320901, 885855, 1237842, 1381490, 1358455, 1135570, 698341, 247473, 162693, 601340, 1180033, 1297660, 844918, 356342, 311607, 527181, 500270, 168528, -41729, 126195, 437463, 580006, 568870]
37365E68870R716N3640K3709N295K2798l733l4900N0196J58043L5001l05395n08311
37353G4929l49706j4091K37025M06038N69832N79739K30206l67383q19592q53513
37343c06516n41975j50068J19326K36264K98724L90236M47505L04319q5636n08404
37333B03775o39288l46582J66299N30086N41111L23315J24890n11j63109k98303
37323D41683j42805K89876N11011J73775l29587l49291N4612J95769j36779l04814
37313D03450J45845O55479M08339m23216q48688m04542K75358L78762p3539m33949
37303H3299l50681r7503l5308r6163J6730K92282L70105Q0754k42711j98112J26943
37292e0365L19459K51658J74208K33813K91895K68423K55604J94539j07392m72982
$$ y = [568870, 578586, 632226, 655935, 661230, 684028, 680295, 645395, 695591, 853634, 888635, 583240, 74929, -274777, -288868, -51843, 354195, 924027, 1503766, 1733972, 1366589, 546997, -306516, -848491, -998559, -879233, -642969, -344245, 45991, 493496, 797815, 712179, 203775, -435513, -782095, -615796, -85710, 455401, 778716, 903606, 903095, 739986, 441683, 298878, 588754, 1099765, 1273540, 943953, 594662, 649274, 845043, 708264, 403450, 549295, 1204774, 1613113, 1189897, 341209, -63333, 212025, 590787, 517248, 83299, -267382, -364885, -400193, -496356, -479626, -187344, 182761, 263515, 20804, -177308, -50365, 269094, 520752, 694960, 928773, 1220668, 1489091, 1744695, 1939234, 1831842, 1358860]
37282A358860l84060J91714N29012J45039m09853l47975J64967L30679k7625l33110
37272A217648k87748k05510k34176o7050L12910L61884j33748n29525k12573M60226
37262F82338O84387L34491j0265K2528K06936J90471p9020m17122n82780l94674
37252F37290Q5746N07604N64060L22057O2584r2763k13241l47306m78214n71990
37242D75827n07297j36387M00094O54209M17274M1989p7878p1957k41482m17719
37232E36673k18374K04356K85782p6156l57127k29047L544n581j01809L4828L70224
37221D47313O08228N49200J82443l10900n38427k32584K66206K85003k38745n76340
37211D41397k60735K04896J54265j97347j59891K73336M09689m8725n64675n51442
$$ y = [1358860, 974800, 1166514, 1695526, 1840565, 1430712, 1082737, 1247704, 1578383, 1550758, 1217648, 929900, 724390, 490214, 423164, 736074, 1097958, 964210, 434685, 222112, 682338, 1366725, 1701216, 1690951, 1713479, 1920415, 2110886, 2031866, 1614744, 1031964, 637290, 723036, 1230640, 1794700, 2116757, 2179341, 2086578, 1873337, 1526031, 1047817, 475827, -31470, -167857, 232237, 886446, 1303720, 1345709, 1267831, 1195874, 954392, 536673, 318299, 522655, 808437, 732281, 375154, 146107, 149651, 144070, 42261, 77089, 447313, 1055541, 1604741, 1787184, 1476284, 937857, 705273, 971479, 1256482, 1017737, 441397, 180662, 385558, 539823, 342476, 182585, 455921, 865610, 816885, 252210, -299232]
37201b99232q4670L57530M78663L01895J9071j28899k6012J65035J90598N4464
37191A028443l4140k9422q2683k10977k50042j76974j54508j79188j6322L85736
37181B79923P13794O83541L80809P8239p0442n2133N7778Q1313q2192k01512M7844
37170A916962N01890N53828j6970o32182o23799n8340M67423O02084M55971K27274
37160C394141r138k01853l00587l12515k23359K0093L04756L38112N5574j80410
37150B884814o1310J92594J54889j80397m39038m13410k34861q6256m4042j17691
37140A655292j72797N1433N52644Q65091O06688O2205j91049r5761q1365l09887
37130B942494m71932l41692n7193J96407L55997L24358Q4016n7407J66194M03176
$$ y = [-299232, -383902, -26372, 452291, 754186, 773257, 644358, 618346, 783381, 973979, 1028443, 994303, 964881, 882198, 671221, 421179, 244205, 89697, -89491, -105813, 279923, 993717, 1677258, 2058067, 2136306, 2065864, 2013731, 2071509, 2152822, 2070630, 1869118, 1916962, 2418852, 2972680, 2955710, 2323528, 1699729, 1641389, 2108812, 2710896, 3166867, 3394141, 3385003, 3183150, 2882563, 2570048, 2346689, 2366782, 2671538, 3009650, 3065224, 2884814, 2823504, 3016098, 3170987, 2990590, 2551552, 2138142, 1903281, 1817025, 1772983, 1655292, 1482495, 1533928, 2086572, 2951663, 3558351, 3620556, 3429507, 3333746, 3252381, 2942494, 2470562, 2128870, 2071677, 2268084, 2624081, 2948439, 3032455, 2975048, 3141242, 3544418]
37120C544418P8968o11516q16362k84960K39963J87779m2940Q1020L06547J52194
37110B835111j73918j54015J24509J72040m4976j59132j29646k10520l09861r6315
37100A853277K84354L11758k4923j39530J93405M64733K92259L8046J48589L74474
37090C796442J78428l74788o79285m36944K0387K81370L39950L87179L97031J81181
37080D090951k12329m08540j42262L37513N08506K23630j04606o7360K12993L19302
37070D757798J38144n2980l7131P3670N8896j10159k55335j93786M8712K07338
37060D635167P6074j26512O9884O95879J121038Q37385K11846J3671L40795N47263
37050H422490K40245k01430k75306m8391R4429O5952J01301L34906O36930Q14745
$$ y = [3544418, 3623386, 3011870, 2195508, 1910548, 2150511, 2338290, 2295350, 2376370, 2682917, 2835111, 2661193, 2507178, 2631687, 2803727, 2758751, 2599619, 2469973, 2259453, 1949592, 1853277, 2137631, 2449389, 2424466, 2284936, 2478341, 2943074, 3235333, 3273379, 3421968, 3796442, 3974870, 3600082, 2920797, 2483853, 2504240, 2785610, 3125560, 3512739, 3909770, 4090951, 3878622, 3470082, 3327820, 3665333, 4173839, 4397469, 4292863, 4225503, 4438496, 4757798, 4895942, 4842962, 4805831, 4879501, 4938397, 4828238, 4572903, 4379117, 4427829, 4635167, 4711241, 4584729, 4654613, 5350492, 6471530, 7308915, 7520761, 7534432, 7875227, 8422490, 8662735, 8461305, 8185999, 8137608, 8232037, 8297989, 8399290, 8734196, 9371126, 10185871]
37040A0185871Q05175O99657O56847P36945Q16300P71935P16507Q66549J189681
37031A7445467J404852J355842J166546J010400R67446J121460J507399J913533
37023B7892945K048933J987885K114475K517332K823150K828756K907229L469330
37015D8590035M335970N023845N427517N818186O324741O851326P458155Q392538
37007I8222313R662325J0922058J1929681J2874366J4092311J5634808J7303453
37000A90641315J9023005K0983476K3376835K6100990K8790184L1070421L2673139
36993C72659365L3299853L2493969K9682344K4245857J5624180L769980j0167445
36986E01608103k3823849l4739425m1615114m4420551m3651668m0040349l4841927
$$ y = [10185871, 10991046, 11690703, 12347550, 13084495, 13900795, 14672730, 15389237, 16255786, 17445467, 18850319, 20206161, 21372707, 22383107, 23350553, 24472013, 25979412, 27892945, 29941878, 31929763, 34044238, 36561570, 39384720, 42213476, 45120705, 48590035, 52926005, 57949850, 63377367, 69195553, 75520294, 82371620, 89829775, 98222313, 107884638, 118806696, 130736377, 143610743, 157703054, 173337862, 190641315, 209664320, 230647796, 254024631, 280125621, 308915805, 339986226, 372659365, 405959218, 438453187, 468135531, 492381388, 508005568, 511775548, 501608103, 477784254, 443044829, 401429715, 357009164, 313357496, 273317147, 238475220]
36979B38475220k9604959k5262615k1771179j8782998j6242012j4145391j2252405
36972A00413661j0410272q810246p601890o610690n734367n187519m970021m549182
36964D6539474l589413k612671k329601k601859k702474k384187k013759j791262
36956B6514248j553411j319712j329940j483404j403530j142967j147871j391774
36948A5741639j277438o56763k10677l98137p04160n03130j06748k32468p82188
36939A0869930r36030l77319K71644L39140j08258n54416p09452o49143n18963
36930G627133l52848j31325J15321K80692K55402M0736k45623m94610o69678p39684
36920E685516o74578n45669m74946m20406j93140K13697N15812N04710L23126
$$ y = [238475220, 208870261, 183607646, 161836467, 143053469, 126811457, 112666066, 100413661, 90003389, 81193143, 73591253, 66980563, 61246196, 56058677, 51088656, 46539474, 42950061, 40337390, 38007789, 35405930, 32703456, 30319269, 28305510, 26514248, 24960837, 23641125, 22311185, 20827781, 19424251, 18281284, 17133413, 15741639, 14464201, 13807438, 13596761, 13198624, 12494464, 11991334, 11884586, 11652118, 10869930, 9933900, 9556581, 9828225, 10167365, 10059107, 9504691, 8795239, 8146096, 7627133, 7274285, 7142960, 7258281, 7538973, 7794375, 7835111, 7589488, 7094878, 6425200, 5685516, 5010938, 4465269, 3990323, 3569917, 3376777, 3590474, 4106286, 4610996, 4934122]
36911D934122J87296M0658k53838n37915n00782j43974J90306K55663J24259j9222
36901D276573o2971N6571L09491M62179K60661j98516n04298m32854k04956j32811
36891C829069k21040k76243k30631j52548n5203R0963K12966J92890M9823q8003
36881C352043j64722k03489j78506p0780k6547k15132m81792m14667Q7109N53160
36871B236677N00430Q3632j31309L5204J81332j8591l37506l84885j87340q0162
36861A897482j77032k63516j68858M0471K52752M48350N84547N47165L09625K355
36851C473341k40234l79537l86855k17962N6386K45215K61473K34150L05083M25945
36841C777005M52551L31013Q7264k50325n79768o81240m34070m9318R4510j15346
$$ y = [4934122, 5121418, 5162076, 4908238, 4370323, 3869541, 3725567, 3915873, 4171536, 4295795, 4276573, 4213602, 4270173, 4579664, 5041843, 5302504, 5103988, 4599690, 4166836, 3961880, 3829069, 3608029, 3331786, 3101155, 2948607, 2893404, 2984367, 3197333, 3390223, 3440046, 3352043, 3187321, 2983832, 2805326, 2734546, 2707999, 2492867, 2011075, 1596408, 1683517, 2236677, 2737107, 2820739, 2689430, 2724634, 2905966, 2887375, 2549869, 2164984, 1977644, 1897482, 1720450, 1456934, 1288076, 1328547, 1581299, 2029649, 2614196, 3161361, 3470986, 3473341, 3233107, 2853570, 2466715, 2248753, 2305139, 2550354, 2811827, 3045977, 3351060, 3777005, 4229556, 4560569, 4647833, 4397508, 3817740, 3136500, 2702430, 2653112, 2747622, 2632276]
36831B632276l82823l45376K3883M07520M87557K56573L022l472J84261K42703
36821C506124k3997l98780m80492j87325J19727Q6596j99174l70312k84539j47557
36811A620271j28734j12051L1131J40796k675k62627k68181M7930L31152K94764
36801A691776M3049k10826m44277o33908n57174j12449L60741M55926K78736K56508
36791A128102M32567M13148P8089j48045K5296K19789p5429o80158q93437m40484
36781E9438J63997L07716K0115j95458p6621J40595J56944K0613l7234J8985N5458
36770F34548P5887J95196K98263Q2259m12661o66242l54533J25402J80243j51030
36760G332l38421j79784M2296J72259L69272N89139M61489o4328m49291k78712
$$ y = [2632276, 2249453, 1904077, 1927960, 2335480, 2823037, 3079610, 3082632, 3079160, 3263421, 3506124, 3482127, 3083347, 2602855, 2415530, 2535257, 2621853, 2422679, 2052367, 1767828, 1620271, 1491537, 1379486, 1410617, 1551413, 1548738, 1286111, 1017930, 1065860, 1397012, 1691776, 1734825, 1523999, 1079722, 445814, -111360, -223809, 136932, 592858, 871594, 1128102, 1560669, 1973817, 2051906, 1903861, 1929157, 2148946, 2073517, 1393359, 499922, 59438, 223435, 531151, 551266, 355808, 279187, 419782, 576726, 597339, 560105, 579090, 634548, 710435, 905631, 1203894, 1286153, 873492, 207250, -147283, -21881, 158362, 7332, -331089, -510873, -468577, -296318, 72954, 662093, 1123582, 1059254, 609963, 331251]
36750C31251J54027L36590K55874K22900K74624K04409P26j75017l19478n01595
36740G84311n63021l05021J05303L01481K23437Q0777r0914l78685n51278k26236
36730f19846M25443O96368L05093j53082o7829K99088K66756k14516n38550l80614
36720A8311q6430k3858o0924L8049J05503j17445m00724k65752K31255M74031
36710h7984J88963j16206N7327L87778K31261l12552m77628K9737O04615O45494
36700A150805L18405Q9531k8079k97038o41557p16663m51351j01200J60495L51306
36690a65346M59232M41728L73692L08043J08093k69184m86315k24897K52096L96637
36680A193779J61800j0556L2040l8423l31167m25056k9345N09533O94299N10946
$$ y = [331251, 485278, 821868, 1077742, 1300642, 1575266, 1779675, 1780401, 1605384, 1285906, 784311, 221290, -83731, 21572, 323053, 546490, 627267, 536353, 157668, -393610, -619846, -194403, 501965, 807058, 653976, 586147, 885235, 1151991, 937475, 398925, 18311, -68119, -91977, -152901, -114852, -9349, -126794, -527518, -793270, -562015, -87984, 100979, -15227, 42100, 429878, 661139, 348587, -129041, -99304, 505311, 1150805, 1469210, 1558741, 1530662, 1233624, 592067, -124596, -575947, -677147, -516652, -165346, 293886, 735614, 1109306, 1417349, 1525442, 1256258, 769943, 545046, 797142, 1193779, 1355579, 1345023, 1377063, 1338640, 1007473, 582417, 553072, 1062605, 1756904, 2267850]
36670B267850K48694K421k78337m75756m17990j89925l2702k0769o8040j44225
36660H91221k63266l58583l66476l27945k45749M41M05069O86852O32369M24594
36650A478527L53982L54448J53078k22605m47628l79288j89358j3017J78758K98606
36640A565503J07999l70309p12799n96936k21313Q842L1011Q6484K52935L34559
36630D85976K23305Q5640Q3833J09515n6612m24669p62084q20544n10222O5375
36620a520487O20952Q02346M66829j22769n07032m63967j46647J88052M25735
36611b56988N46070N21406L70483J83258K886j93009l36852k85203q1431K9244
36601D99864J45J25629N31185P98983M91444j44047m61839l17916j71091k73566
$$ y = [2267850, 2516544, 2518965, 2240628, 1764872, 1346882, 1156957, 1124255, 1103486, 1035446, 891221, 627955, 269372, -97104, -425049, -670798, -670357, -265288, 421564, 1053933, 1478527, 1832509, 2186957, 2340035, 2117430, 1669802, 1290514, 1101156, 1088139, 1266897, 1565503, 1673502, 1303193, 590394, -6542, -227855, -219013, -188002, -101518, 151417, 485976, 709281, 794921, 878754, 988269, 931657, 506988, -255096, -1075640, -1585862, -1520487, -899535, -97189, 369640, 246871, -260161, -724128, -870775, -682723, -256988, 289082, 810488, 1180971, 1364229, 1367115, 1174106, 837254, 552051, 470620, 499864, 500009, 625638, 1156823, 1955806, 2447250, 2303203, 1841364, 1523448, 1352357, 1078791]
36591A078791l14435m5273K40745J67703j46464l10489k09450l0471O8317M5113
36581E44087j02718k64154k27789Q785J29983n0943k28101Q745N51600Q57670
36571A227165O06676J6625m63553n60299l13127j824Q6379n5315j68652j13133
36561B60942m9009j05432j28773m718L9905j88011l96363j76264L16803N44317
36551A13397M00088L18663N04717N85680K48210k21909l50704j29466N6548l4212
36541A491012l00389n10113m97633k44472O9912J90451Q2097j3900P4621K13390
36531E54976K19340J80190K87622M56292L73107o3269n55508p26690n05024j26435
36521I4601J61187L04931L71014L57662J86296j11900l23140k70583l8497J43053
$$ y = [1078791, 764356, 719083, 959828, 1127531, 981067, 670578, 461128, 430657, 498974, 544087, 441369, 177215, -50574, -41789, 88194, 37251, -190850, -182105, 369495, 1227165, 1833841, 1850466, 1386913, 826614, 513487, 511663, 598042, 542727, 374075, 260942, 211933, 106501, -22272, -26990, 12915, -175096, -571459, -747723, -430920, 113397, 513485, 832148, 1336865, 1922545, 2170755, 1948846, 1598142, 1468676, 1525224, 1491012, 1190623, 680510, 182877, -61595, 8317, 198768, 280865, 266965, 341586, 554976, 774316, 954506, 1242128, 1698420, 2071527, 2008258, 1452750, 726060, 221036, 94601, 255788, 560719, 931733, 1289395, 1475691, 1363791, 1040651, 770068, 731571, 874624]
36511H74624J80081J38943M6874j32199l23613l52474j83852J4939J01578Q7204
36501D52105M457j55271l05377k69942l2982J95196K60636K28865J70540K4338
36491E72565j64916j29269K35281N60705M15215q0934l79666k13215J41887L25231
36481A282884K92353J64102j9905k22523l14160k66330k73507m53986n49929k01968
36471e62969M91971R60152P97365K36134j61185j57307j2095m9148k47805l35802
36461I59311j64469J26161K88784K30104P1199k3683n2647j71386m47291o78186
36451A37897n85923j96013J42377J97447J49500K86517N42090N75404K66215j21142
36441A394369l02397k79479k06173j52783j33411k06934l82273n08235m11416
$$ y = [874624, 1054705, 1193648, 1240522, 1108323, 784710, 432236, 248384, 263323, 364901, 452105, 456562, 301291, -4086, -274028, -307010, -111814, 148822, 377687, 548227, 572565, 407649, 278380, 513661, 1074366, 1489581, 1408647, 1028981, 815766, 957653, 1282884, 1575237, 1739339, 1719434, 1496911, 1182751, 916421, 642914, 188928, -361001, -562969, -70998, 889154, 1686519, 1922653, 1761468, 1604161, 1592066, 1542918, 1295113, 959311, 794842, 921003, 1209787, 1439891, 1511090, 1487407, 1434760, 1263374, 816083, 137897, -448026, -644039, -501662, -304215, -154715, 131802, 673892, 1249296, 1515511, 1394369, 1091972, 812493, 606320, 453537, 320126, 113192, -269081, -777316, -1188732]
36432a188732j12104K06555M14957N19352N39243M11963Q5373l15966m96103k56001
36422a91463K26235N05070L55213L9801n9848K9885l6289l56851o14860n38563
36412f41670k45467j101J10012J09513l6301k79313l70837j24245L03464N78794
36402e97151N44436K70972q2096k91301j50220K47360M79128K93378m2186j52155
36392E20165q6364q5305m8997K52613N71101L88194k33917o16390m34888j40634
36382H5578j47876j83502J21170M77384L54200j49104m39381k97180n4867M1580
36372a91998J12302K27950K02749l0830k15880j41242M8959R3932l8526j89204
36362a21788k25733j21444L4573N4680j43263l24695j65938K59549N00912L37506
$$ y = [-1188732, -1300836, -1094281, -679324, -159972, 379271, 791234, 876607, 560641, 64538, -191463, 34772, 539842, 895055, 934856, 875008, 904893, 868604, 511753, -103107, -641670, -887137, -888238, -778226, -668713, -705014, -984327, -1355164, -1479409, -1175945, -597151, -52715, 218257, 136161, -155140, -305360, -58000, 421128, 714506, 672320, 520165, 433801, 348496, 299499, 552112, 1123213, 1511407, 1277490, 661100, 226212, 85578, -62298, -245800, -124630, 352754, 706954, 557850, 118469, -178711, -233578, -191998, -79696, 148254, 351003, 320173, 104293, -36949, 12010, 105942, 67416, -121788, -347521, -468965, -434392, -379712, -522975, -847670, -1013608, -754059, -253147, 84359]
36352H4359P4776P3021K66098L67469K92120J04739k09826n83783o61685j78840
36342c71552N12025P11773K45100k85620k56922K34206N69087L68591j42835m64451
36332A119402l60197n7717M8326j39541l31494k66795o9802j4631o3550N7603
36322g8396L38187L92167L0984l69272l24259J11931M29531L18595j1964j77408
36312F60096o3400J48944K56914K10405O3760j22002k80427l09061j45887R9407
36302E18749J91303K7511k16274k93354j68707J7681J83787L27587L71378K06305
36292A165966r1687k92780l00047k21091j24528N5575L01049M18887K96207P6205
36282A283756l9745k2651M4516J09909J50821J66967K17023K96321J97042k29368
$$ y = [84359, 159135, 232156, 498254, 865723, 1157843, 1262582, 1052756, 468973, -192712, -371552, 140473, 852246, 1097346, 811726, 554804, 789010, 1358097, 1726688, 1583853, 1119402, 759205, 701488, 749814, 610273, 278779, 11984, -57818, -72449, -135999, -78396, 259791, 651958, 682942, 313670, -10589, 101342, 530873, 849468, 837504, 660096, 596696, 745640, 1002554, 1212959, 1276719, 1154717, 874290, 565229, 419342, 518749, 710052, 737563, 521289, 227935, 59228, 76909, 260696, 588283, 959661, 1165966, 1074279, 781499, 481452, 260361, 135833, 191408, 492457, 911344, 1207551, 1283756, 1244011, 1221360, 1265876, 1375785, 1526606, 1693573, 1910596, 2206917, 2403959, 2174591]
36272B174591o66157n92361p0195J91543j73152n92836l67870L13798P03820N63006
36262A484187K96679J59045l1076l42675m92426l32734j28187j30825k18046j50812
36252A13130O6481K40703K04021j00779n32252p22556m06652J81691N19367M27594
36242i252J95611N9182o3818k28962k53102l1972K40143L41421K48784j2284m13946
36231G1805o94204m66296K14395P37326O55678K22527n1592p5379r7286k01874
36221C15100k40326j25899P9221K65984K86512L2340l28100m17193j44528J15104
36211a61785M5423j94978l15170l19949k86582n9650M17435P58006O00956K11557
36201F95263J10640K60354J59533l15339p07610o60529l27983j9813J55552J93641
$$ y = [2174591, 1508434, 916073, 845878, 1037421, 864269, 271433, -96437, 217361, 921181, 1484187, 1780866, 1939911, 1908835, 1566160, 1073734, 741000, 612813, 481988, 263942, 113130, 179611, 420314, 624335, 523556, -8696, -731252, -1137904, -956213, -436846, -9252, 186359, 245541, 181723, -47239, -300341, -332313, -92170, 249251, 498035, 485751, 71805, -622399, -1088695, -874300, -136974, 518704, 741231, 689639, 614260, 516974, 315100, 74774, -51125, 28096, 294080, 580592, 612932, 284832, -132361, -276889, -161785, -116362, -311340, -626510, -946459, -1233041, -1292691, -875256, -117250, 483706, 695263, 805903, 1066257, 1225790, 910451, 202841, -457688, -785671, -805484, -649932, -456291]
36191d56291R8700j749N6898J95108J62678o2626k24504j72856l1288M6968L8082
36180c50880l1353p0527J05920M95326O98932L90462r8975j58801J67241K08620
36170A355965k79213p12512n74584j33979R1946Q2475P7448K4402k14817m13499
36160f96368k81348j0568J4742r5345Q1924M67618M76425m0580m30249j36432
36150f50181M68788N89546R1010m03074m30200k20349j74598k33827r9617J69518
36140h92984K26339M2864j1245J91393K63190o0628l98366k56151J79065K90817
36130d25706m5952l35696k60484p2970o7337j51596j65848j98107l04608k74036
36120b302340K2173L37878M12056L51335L45144K72531l0989l35024k76076O0375
$$ y = [-456291, -357591, -359340, -302442, -107334, 55344, -7282, -231786, -404642, -435930, -388962, -350880, -382233, -452760, -346840, 148486, 847418, 1237880, 1138905, 980104, 1147345, 1355965, 1076752, 364240, -210344, -344323, -252377, -169902, -92454, -68052, -282869, -696368, -977716, -988284, -973542, -1068887, -986963, -519345, -42920, -83500, -513749, -650181, -181393, 408153, 499163, 96089, -334111, -554460, -729058, -962885, -1062502, -892984, -666645, -623781, -635026, -443633, -180443, -241071, -639437, -895588, -716523, -425706, -471658, -807354, -1067838, -1140808, -1208145, -1359741, -1525589, -1723696, -2028304, -2302340, -2280167, -1942289, -1530233, -1178898, -833754, -561223, -592212, -927236, -1203312, -1142937]
36110a142937K46552J60742J14929K93994M55237L33387N2334p3537J5136P8074
36100E33911o2221k54526j82998K12151N67801M81755L9143k57834j55207J3884
36090I35859j48801m70257m11954J70581P90545Q86574L94414k78944o73262o21793
36080E72962l19847r6497n7335J647K45670M92546M40290J13883j63360k23886
36070A006073k20438k93228l26899j64040J22677L18439L10593J25595j68880
36061G09892m54863n30237k62622J96101M78115L65613L0372j76205j35169l6417
36051A84580l3856j3406J54120K97400J56020j55489k35032k897J35805p5446
36041D11799k92028q0761L59787M27046k2494m82089n20504k90996j43135p5736
$$ y = [-1142937, -896385, -735643, -620714, -326720, 128517, 461904, 514238, 440701, 455837, 533911, 471690, 217164, 34166, 246317, 814118, 1295873, 1335016, 1077182, 921975, 935859, 787058, 316801, -95153, 75428, 865973, 1752547, 2146961, 1868017, 1194755, 572962, 253115, 156618, 99283, 100930, 346600, 839146, 1279436, 1393319, 1229959, 1006073, 785635, 492407, 165508, 1468, 124145, 442584, 753177, 878772, 709892, 255029, -275208, -537830, -341729, 136386, 501999, 532371, 356166, 220997, 184580, 150724, 137318, 291438, 588838, 744858, 589369, 354337, 351440, 487245, 411799, 119771, 39010, 398797, 825843, 803349, 321260, -199244, -490240, -633375, -709111]
36031g09111J17106L54746K95328j42255n72825n87088k24637J52825L46213M57732
36021e11966N65121N28758K65592k48j1248J23566J02832m8301L085L04903M37165
36010A759259J22685l15087m09932k19376j57409l05589l23055o0715J42946l0245
36000B03482l47659k97116J81791N24391K35555m05934o14974j04161M98921M79131
35990C53427K654j86979R0600K14965k14188p13923o21703q109N43040P27096
35980A86880O36401L61624k3860k59323j67876j7597j49083l59150j73434L19038
35970C53620M72091J3585n37199n74605j41389K48180K38396q4366l35970j75129
35960e22786L19197O17966L21900k78998n25518k18769K25351M15814L67004K23032
$$ y = [-709111, -592005, -237259, 58069, -84186, -657011, -1244099, -1468736, -1315911, -969698, -511966, 53155, 581913, 847505, 847257, 836009, 959575, 1062407, 1014106, 1017191, 1322094, 1759259, 1881944, 1566857, 1156925, 937549, 780140, 474551, 151496, 90781, 233727, 203482, -144177, -441293, -259502, 264889, 500444, 94510, -520464, -624625, -125704, 353427, 356081, 169102, 259702, 474667, 260479, -453444, -1075147, -1083256, -540216, 186880, 823281, 1184905, 1161045, 901722, 733846, 716249, 567166, 208016, 34582, 353620, 825711, 839296, 302097, -272508, -413897, -165717, 72679, -11687, -347657, -522786, -203589, 414377, 736277, 457279, -68239, -287008, -61657, 354157, 721161, 944193]
35950I44193M2559n9473K9142J25497o8549m14472m30293n1932K11963P3965j22457
35939B80143o5750m702k09490l81368j10334M14887O67145N16666K37911j4081
35929A331027k54735l40635p4690L93013O63624N81424L22919N3791j93087l53143
35919B129508l52887k71876k26290j50140N4771K37583J55514j45726l88667m54334
35909E87456m46527m16912l08851j52453n0569J5720J24470J90358O7342j46368
35899e36334j81042Q967J75242J38648k933p7035m7428L2036J10381J34193O9940
35888a75365l6484r6691n8125R7021L31375M71681L24298j0096j52614M0150K17765
35877I52915N2812k26628j87597J06303J88457q2955l37101k65254P258K07073
$$ y = [944193, 986752, 927279, 956421, 1081918, 1013369, 598897, 168604, 116672, 328635, 402600, 280143, 214393, 209691, 201, -381167, -491501, -76614, 590531, 1107197, 1345108, 1331027, 1076292, 735657, 660967, 1053980, 1717604, 2299028, 2621947, 2675738, 2482651, 2129508, 1776621, 1504745, 1278455, 1128315, 1183086, 1420669, 1576183, 1430457, 1041790, 587456, 140929, -275983, -584834, -737287, -787856, -772136, -647666, -457308, -389966, -536334, -717376, -708409, -533167, -394519, -397452, -474487, -521915, -489879, -379498, -245305, -175365, -211849, -308540, -366665, -269644, 61731, 533412, 857710, 847614, 695000, 735150, 952915, 1005727, 779099, 591502, 697805, 886262, 803307, 466206, 200952, 208210, 415283]
35867D15283K37305J15871j19312l23612k93181j2717K96235M19040L14109P1582
35857A120603j41364j70690p0768o6142j37920Q2705O81875J040567N76854l10405
35847B605315o95549m15779j61929k68711k69647J03342L36807L9175k97453q0955
35837H94616L86618M11995J4212k21376j45850j42900l09911k77240P4700L52462
35827A037326K92283J51684K11541K94143Q0631l52361o12075m96189k12433j21562
35817B72988l59120o91147p20031k73739M07815Q90486Q94780M28556k57814p48503
35807a55729o80915q9357N62025Q42805P46229N00079J98813j49897m04743m21881
35797I47429k93859j82435m2068J92406L02913O5853k76388k76963J4438R8948
$$ y = [415283, 652588, 768459, 649147, 325535, 32354, 19637, 315872, 734912, 1049021, 1120603, 979239, 808549, 737781, 671639, 533719, 616424, 1298299, 2338866, 2915720, 2605315, 1909766, 1493987, 1332058, 1063347, 793700, 897042, 1233849, 1273024, 975571, 894616, 1281234, 1693229, 1707441, 1486065, 1340215, 1197315, 887404, 610164, 684864, 1037326, 1329609, 1481293, 1692834, 1986977, 2067608, 1715247, 1103172, 606983, 394550, 272988, -86132, -777279, -1497310, -1771049, -1363234, -472748, 422032, 850588, 592774, -155729, -836644, -926001, -363976, 478829, 1225058, 1725137, 1923950, 1774053, 1369310, 947429, 653570, 471135, 429067, 621473, 924386, 990239, 713851, 436888, 451326, 550274]
35787E50274j76805l82880k10525P8388J46900P9150O9796K2305j54122j85702
35777a63221J62084N50017M34565j27492n15156l76940k575J93649J71926J26099
35767D52956J64736K90467M52359M80563J98575k53760m36999j39628L03016M30259
35757A942544K32285N2171L6966P207j37672k15470r0605M7251m7099k64987k54142
35746A308449Q1909M23560M52142K51339J37292J85635J44579j45889m49719m19236
35736A970061r6345Q7071j48562n64838o98120m00836N3499L26553L03388O3412
35726H95283k27936l57192j81504J91313M68140M89230L46460J35000j83604n22941
35716A052249n36623m8749N32167N98933J16377l40613l42682m9933J72816K15631
$$ y = [550274, 373469, -9411, -219936, -141548, 5352, 84502, 154298, 176603, 22481, -163221, -1137, 548880, 983445, 855953, 340797, -36143, -38718, 154931, 326857, 452956, 617692, 908159, 1360518, 1841081, 2039656, 1785896, 1348897, 1209269, 1512285, 1942544, 2174829, 2227000, 2263966, 2271173, 2133501, 1918031, 1827426, 1874677, 1827578, 1562591, 1308449, 1390358, 1813918, 2266060, 2517399, 2654691, 2840326, 2984905, 2839016, 2389297, 1970061, 1873716, 1960787, 1812225, 1247387, 549267, 148431, 201930, 528483, 831871, 895283, 667347, 310155, 128651, 319964, 788104, 1277334, 1623794, 1758794, 1575190, 1052249, 515626, 466877, 999044, 1597977, 1714354, 1373741, 1031059, 981126, 1153942, 1369573]
35706A369573J36262m4646k25321j82621Q9625K49126P7078j79458k48902l25645
35696G15071o67122r29149n11516M47417J030217O79403j04662m59525j67710
35687C2424L19707N45732L97665J0047l51773m22051k03071j6638r8648k61577
35677d8183j48782K98599Q09892J088203R78671N10063k2820k00109N6746L34726
35667C657006K94070J56038K99358O28003Q08418R14898J199354J302098M93537
35658I752780j080101k159386j870425q80999m45170p32283q70143m35107k4387
35649A254779j96055n87313n21891l7360K15725o6704m41571l35213K24008O47551
35639A55956M74978j09054m94522l33185J17488L78981L08897J00319j24992m01773
$$ y = [1369573, 1505835, 1461189, 1235868, 1053247, 1142872, 1391998, 1469076, 1289618, 1040716, 715071, 47949, -881200, -1392716, -945299, 84918, 764321, 659659, 200134, 32424, 352131, 897863, 1295528, 1305575, 953802, 531751, 328680, 312042, 213394, -48183, -196965, 101634, 911526, 1999729, 2978400, 3488463, 3465643, 3265534, 3322280, 3657006, 3951076, 4107114, 4406472, 5034475, 5842893, 6757791, 7957145, 9259243, 9752780, 8672679, 6513293, 4642868, 3761869, 3316699, 2584416, 1714273, 1279166, 1254779, 1058724, 471411, -50480, -87840, 127885, 61181, -380390, -715603, -491595, 155956, 630934, 521880, 27358, -305827, -188339, 190642, 499539, 599858, 474866, 73093]
35629G3093o13078m75066J386L40988J78157j93673j78106L04620P08582O10833
35619G57736K33478M9332J26196J45454m3644k13508j53122l791l0000k25278
35609F42853l67707l78686l67921l29490q7549L41918O03211M36304P5315n3379
35599E14869Q9486J78183O5042l9240K2356Q3070n4037k90921l88539k89538j19745
35588b29014J9696J16365J85329K54142L38665L74919K79643J12409J3194o6947
35578A398401l39723p72083r71561o91551k20303P676l361N8872K46586L15448
35568i71599K16536K01035L41844L31459l3409m40797m12642O0534M80313M21001
35558A94275j7887l73039l30028m892K64656L19396K77455K68674K47671J51239
$$ y = [73093, -539985, -1015051, -1013665, -672677, -494520, -688193, -866299, -561679, 146903, 757736, 991214, 1040546, 1166742, 1312196, 1268552, 1055044, 901922, 898131, 868131, 642853, 275146, -103540, -471461, -800951, -888500, -546582, 56629, 492933, 568248, 514869, 604355, 782538, 847580, 808340, 830696, 913766, 859729, 568808, 180269, -109269, -229014, -209318, -92953, 92376, 346518, 685183, 1060102, 1339745, 1452154, 1465348, 1398401, 1058678, 286595, -684966, -1376517, -1596820, -1589144, -1592505, -1533633, -1287047, -971599, -755063, -554028, -212184, 119275, 85866, -354931, -767573, -707039, -226726, 194275, 176388, -196651, -526679, -531571, -266915, 52481, 329936, 598610, 846281, 997520]
35548I97520P0150R9221J37157K9335j73347k95290l02352k77210k01619j0469
35538G3096J84630K03499J19379J77055L57573L38305j4185m04165n10773l83290
35528A41124k56214j80387m5208J70268L56689M08086K83136K7213j84726j51932
35518E68049J11141L47287L42751J34316j00164k13004j31588Q1168J89104J9887
35508A348947k46644k86393j26586q0535j54562N089M13367N37501J29123k50901
35498A288406m5826L93819L67722k5240o9954L44625N10998L8716n38799o00494
35488A663973k79794p3154p7694p7078n8448j64401l04855k46673k8591N7934
35478D11219r6011k53758j39193K38447N75730N42949J37354k24657j55073J44522
$$ y = [997520, 1067670, 1166891, 1304048, 1333383, 1160036, 864746, 562394, 285184, 83565, 73096, 257726, 461225, 580604, 757659, 1115232, 1453537, 1439352, 1035187, 524414, 141124, -115090, -295477, -340685, -170417, 186272, 594358, 877494, 904707, 719981, 568049, 679190, 1026477, 1369228, 1503544, 1403380, 1190376, 1058788, 1139956, 1329060, 1348947, 1102303, 815910, 689324, 608789, 454227, 459316, 872683, 1410184, 1539307, 1288406, 1242580, 1636399, 2004121, 1978881, 1908927, 2253552, 2764550, 2803266, 2264467, 1663973, 1384179, 1311025, 1233331, 1156253, 1097805, 933404, 628549, 381876, 353285, 411219, 315208, 61450, -77743, 160704, 736434, 1279383, 1416737, 1192080, 1037007, 1181529]
35468A181529Q4217m25641o94150j85733O25269Q39983L58372p6211j255K30397
35458A936777J75687l5221p9892k8341j35876l55504m64511m68533m93536m37682
35448c86632j21868L18827N67376N65154M58382K16732k45267o27014m68128R6487
35438C74049L44423o6974o26652p28105m32248j26515J27287M32540N94442L64324
35428B56571m9783k16153q2181R7443K50435M11788L53989j05453n40276l26619
35418D9761L85236P84375N50569J89762P4791q5178m99799p48587m60440L4341
35408B74831K42970K12986J95721R4533j80902k57735J46256N68499L99219j37465
35398A558913l27720j00067l7682l30208n07737l11938j01533j69775k75285j41189
$$ y = [1181529, 1265746, 840105, 145955, -39778, 585491, 1425474, 1783846, 1707635, 1706380, 1936777, 2112464, 2077243, 1997351, 1969010, 1833134, 1477630, 1013119, 544586, 51050, -386632, -508500, -189673, 377703, 942857, 1401239, 1617971, 1372704, 745690, 277562, 374049, 718472, 651498, 24846, -703259, -1135507, -1262022, -1134735, -702195, -107753, 256571, 206788, -9365, -91546, 5897, 256332, 668120, 1022109, 916656, 376380, 49761, 434997, 1219372, 1769941, 1959703, 2034494, 1949316, 1449517, 700930, 240490, 274831, 517801, 730787, 926508, 1021041, 840139, 582404, 728660, 1297159, 1696378, 1558913, 1231193, 1131126, 1093444, 763236, 255499, -56439, -157972, -327747, -603032, -744221]
35388g44221P5806J25886Q7326J40134K02008P1831k28090m42209l30108J07438
35378i34199N38660N27552N6150l22025j44989L10657M38799J87338J6363Q4026
35368G58332R2435m4836l2382J81958K32595j6901k36669k56042l21591m64014
35358a07115k58500L78692P64592L56797l91382o48292l01152J14074K48864J38587
35348B95165j64309n62328p04071l68949P0690J04049j25351m2010M15202O65550
35338d16362L66040j19444k87115r7893J71293L36946L64656K55861O8022p5676
35328E66328q7922M7937L08723N59899N37376J19931m21794o70732n36072k80222
35318A43452j22221m9091K299K6168M1657J06989K07181K75141L11930L35399
$$ y = [-744221, -668415, -542529, -455203, -315069, -113061, -41230, -269320, -711529, -1041637, -934199, -395539, 132013, 188163, -133862, -278851, 31806, 470605, 657943, 674306, 758332, 850767, 805931, 773549, 955507, 1188102, 1171201, 934532, 678490, 356899, -107115, -365615, 13077, 777669, 1134466, 743084, 94792, -206360, -92286, 156578, 295165, 130856, -431472, -1135543, -1504492, -1433802, -1329753, -1455104, -1497114, -1081912, -416362, -50322, -169766, -456881, -554774, -383481, -46535, 318121, 573982, 642004, 566328, 478406, 526343, 835066, 1394965, 1932341, 2052272, 1630478, 959746, 423674, 143452, 21231, -27860, -25561, 607, 42264, 149253, 356434, 631575, 943505, 1278904]
35308A278904K48436o0014m89160p56436o63147k50857K42940N09094L80390M5490
35298D85640r1282J05985L33118K95990R5998l5502j15703k29948k31401J547
35288F14442K11235Q7914j91745j90405J30204M25056N54370O52395O31320J77181
35278C101967o29743j179918j041821m57280L9982J86621L6099k21891l17159
35269d83143o8522L32446M63408K27730o631M4508J97821J49079p4121k26416
35259E56159j99057n7191J06779J91747J18919k4298m0192O9969N0794k27261
35249E46368n36588n90705l90692j22361J16037L07938L78298K50898K60j70860
35239b11407j05406J53982L41984J86726k31487m65854k50283R4388J11954p5990
$$ y = [1278904, 1527340, 1467326, 978166, 221730, -441417, -692274, -449334, 59760, 440150, 485640, 394358, 500343, 833461, 1129451, 1225449, 1189947, 1074244, 844296, 612895, 614442, 825677, 913591, 721846, 531441, 661645, 1086701, 1641071, 2293466, 2924786, 3101967, 2472224, 1292306, 250485, -206795, -166813, 19808, 55907, -165984, -483143, -551665, -219219, 244189, 471919, 465288, 509796, 707617, 856696, 782575, 556159, 357102, 299911, 406690, 598437, 717356, 693058, 652866, 722835, 773629, 546368, 9780, -580925, -971617, -1093978, -977941, -670003, -291705, -40807, -40547, -211407, -316813, -162831, 179153, 365879, 134392, -331462, -581745, -487357, -375403, -451393]
35229d51393M5867N27957P95673M59910j72393n67653n35975j69869L51657O86232
35219I70013M92426n8631l36551r1962J72878j8824m26762n83557n26627n14346
35209i21943l94718R8651O62380P25268L47312J49382L19373L46396p7209m86147
35199G68745l25294K09748M38525J06700l51497m32816j49857J07843J26210P7069
35189E75376J64169K70930J59068j02634k14049j35732j44259l06373k94917N6941
35179B8520L92469L31422J4092k07721l25247m93244n46204k01756L74114O87697
35169E4142N58797K31842p9561l27692l80053j16082K24430K57294M9223L5060
35159E07400K97641M31342K27359k7272j23878k86694o51020q43119m95358J25383
$$ y = [-451393, -405526, 122431, 918104, 1378014, 1205621, 637968, 101993, -67876, 283781, 970013, 1462439, 1403808, 1067257, 975295, 1148173, 1129349, 702587, 119030, -407597, -921943, -1316661, -1218010, -555630, 169638, 516950, 666332, 985705, 1332101, 1254892, 768745, 443451, 653199, 1091724, 1198424, 846927, 414111, 264254, 372097, 498307, 575376, 739545, 1010475, 1169543, 1066909, 852860, 717128, 572869, 266496, -28421, 28520, 420989, 752411, 766503, 558782, 233535, -259709, -805913, -1007669, -633555, 54142, 612939, 844781, 765220, 437528, 57475, -58607, 165823, 423117, 472340, 507400, 805041, 1236383, 1463742, 1436470, 1312592, 1025898, 374878, -468241, -963599, -838216]
35149h38216M30495K81867P7668J46358L71142M30471K09487q4438j69542n0608
35139H04684m9869l41296n84263l35646K28570M33719K6968m72300n20107j95909
35129a005449J56420M69040P38161O89818J86334l14299k73016J27170K61489
35120A035668L6060m2083K25598L98242J48892k24199l17489j78653l5846R0103
35110A136293J46513j43280p56656j026069m25252N24360Q10693L12519j06026
35101D73095M9663K61782L6502k02510J09536N93299M48907k44837o41438m50271
35091D33728k48390l58716l32621Q9344L44263l3246n32072m34424M1601J86080
35081h44453K1451J60083O00276O53173J69283j07673K56349O49858L90944k09492
$$ y = [-838216, -407721, -125854, -48186, 98172, 469314, 899785, 1109272, 1024834, 855292, 804684, 754815, 413519, -170744, -506390, -277820, 155899, 182867, -289433, -809540, -1005449, -849029, -379989, 358172, 1047990, 1234324, 920025, 647009, 774179, 1035668, 1071728, 1029645, 1255243, 1653485, 1802377, 1578178, 1260689, 1082036, 1046190, 1136293, 1282806, 1139526, 382870, -643199, -1068451, -544091, 266602, 579121, 473095, 522758, 784540, 821042, 618532, 728068, 1321367, 1770274, 1525437, 883999, 433728, 185338, -173378, -505999, -416655, -72392, -105638, -637710, -1072134, -1030533, -844453, -823002, -662919, -62643, 590530, 759813, 652140, 908489, 1558347, 1949291, 1739799]
35071A739799l83472o6241J36194q6588m11260m45862j69925J89930L86212K66170
35061A154957p0849k70516r9315K54802M52357M25679K98955P7990k48338m44400
35051A531322k61750J15098K34716j2764l06440m20343m58116m97475l91651r1836
35041e59239J55448J48309K4866O598M7188l2597k00252k35017l6969K62439M66233
35030D7007M66877K82044M8293n5977K5695J64745K02765J19860m0r7304j60973
35019A042992j91203k08008k37720k33125r2621J56202K82772R8874k59616m33514
35009g4967k36650J48386L92789L56654J68015L6796N2728J54070K47223L13327
34999A558371L69521L56192J62685j75982l93394k39582J84336M71760L51722
$$ y = [1739799, 1356327, 1290086, 1426280, 1339692, 928432, 482570, 312645, 502575, 888787, 1154957, 1084108, 813592, 714277, 969079, 1421436, 1847115, 2146070, 2224060, 1975722, 1531322, 1269572, 1384670, 1619386, 1606622, 1300182, 879839, 421723, -75752, -467403, -559239, -403791, -255482, -230616, -224018, -176830, -209427, -409679, -644696, -681665, -419226, 47007, 513884, 795928, 844221, 788244, 813939, 978684, 1181449, 1301309, 1301269, 1203965, 1042992, 851789, 643781, 406061, 172936, 80315, 236517, 519289, 618163, 358547, -74967, -311617, -163231, 229558, 586212, 754227, 791023, 843751, 997821, 1245044, 1558371, 1927892, 2284084, 2446769, 2270787, 1877393, 1637811, 1822147, 2293907, 2645629]
34990B645629j6161k73562k95513k46991k59647k57957j63692p9712j17414j71271
34980G63709o7159J30491J90785R2301P0327K08623K47225j0192l06243k37317
34970A082550J38193L15387O167m80675o45005l90922o0617J5445j49754k74705
34960d43936j13316K93544O24422N95411L04847J43506K84573M18849J75812l08287
34950A975425n15772k46669R2498L6406l22743m95346k58843J02978K39280J75153
34940G82367J87081L67716M87693K98261j26635m13914k69553J78856M73032L16738
34930B281642o5167j76780J37350M87061M29601K8675k45746j12539K16212L44568
34920C324877J45729j62950k90093j43239R7292J31885j50602m82061m52823k5049
$$ y = [2645629, 2629468, 2355906, 2060393, 1813402, 1553755, 1295798, 1132106, 1052394, 934980, 763709, 696550, 827041, 1017826, 1110127, 1180454, 1389077, 1636302, 1626110, 1319867, 1082550, 1220743, 1536130, 1542297, 1061622, 416617, 25695, -34922, -19477, -169231, -443936, -557252, -263708, 360714, 956125, 1260972, 1404478, 1689051, 2107900, 2283712, 1975425, 1459653, 1212984, 1305482, 1341888, 1019145, 523799, 264956, 367934, 607214, 782367, 969448, 1337164, 1824857, 2123118, 1996483, 1582569, 1313016, 1491872, 1964904, 2281642, 2216475, 2039695, 2177045, 2664106, 3093707, 3122382, 2876636, 2764097, 2980309, 3324877, 3470606, 3307656, 3017563, 2874324, 2971616, 3103501, 2952899, 2470838, 2018015, 1992966]
34910A992966L22924J33066m22746o84187k80093M28713P77793N16869l4472m21842
34900B328991m46745j72578K18014M89972M54690J48733j56180k26584r9107L0879
34890B570085N7861n912j45202l07730l18520m5207L49148N31081M13129K37670
34880C336403J89781J63135K4930j26100j47802r5673o3002L1831K45270L70299
34870C929072K16106L015J10215M80204O67815N05720L14254L43160M07569K79144
34860G256274P8786P588j1163r9761q4743K35753O49828P62194N91008N30656
34850I916420P17202Q34994O58826M29009M91641Q29572J172179J380764J493019
34841A7923626J513405J409219J285804J360972J715558K165777K419080K345327
$$ y = [1992966, 2315890, 2448956, 2026210, 1342023, 1061930, 1490643, 2268436, 2785305, 2750833, 2328991, 1882246, 1709668, 1927682, 2417654, 2872344, 3021077, 2864897, 2638313, 2539206, 2570085, 2627946, 2622034, 2476832, 2169102, 1850582, 1805375, 2154523, 2685604, 3098733, 3336403, 3526184, 3689319, 3714249, 3588149, 3440347, 3344674, 3281672, 3313503, 3558773, 3929072, 4145178, 4148193, 4258408, 4738612, 5406427, 5912147, 6226401, 6569561, 6977130, 7256274, 7335060, 7342648, 7331485, 7231724, 7146981, 7382734, 8032562, 8794756, 9385764, 9916420, 10633622, 11468616, 12127442, 12556451, 13048092, 13877664, 15049843, 16430607, 17923626, 19437031, 20846250, 22132054, 23493026, 25208584, 27374361, 29793441, 32138768]
34833C2138768K141786K235576K885524L796706M288925M025416L458765L323000
34825E8294466L760248M255027M437863M562549M978199N460098N464983M925390
34817I6138823M344646M007658L463009K057389j79412k453465l995276m739381
34809I8643991n181518n720431o280431o553038o447086o158009n831732n367698
34801E1104048m674822l965344l569772l504489l446853l154078k700163k267107
34793B3821420j928952j717158j665918j664012j471493j039828o29041m48234
34785A3256784l84447k84202k74801n06650p46603o12237j78508J9387l19860
34776I968863q45159r76882n81358p6241O6625j86472m56457m38483k62833k44979
$$ y = [32138768, 34280554, 36516130, 39401654, 43198360, 47487285, 51512701, 54971466, 58294466, 62054714, 66309741, 70747604, 75310153, 80288352, 85748450, 91213433, 96138823, 100483469, 104491127, 107954136, 110011525, 109832113, 107378648, 103383372, 98643991, 93462473, 87742042, 81461611, 74908573, 68461487, 62303478, 56471746, 51104048, 46429226, 42463882, 38894110, 35389621, 31942768, 28788690, 26088527, 23821420, 21892468, 20175310, 18509392, 16845380, 15373887, 14334059, 13705018, 13256784, 12872337, 12588135, 12313334, 11806684, 11060081, 10447844, 10269336, 10288723, 9968863, 9123704, 8146822, 7565464, 7489223, 7555848, 7369376, 6912919, 6474436, 6211603, 5966624]
34766E966624l69365l20879n7436M7969j72938l40959j52884M3404k01520o17579
34756C824437n71580q4311J96136K6550j26136N1125K14279O040l49204m42581
34746B744755k47224L3211L03340M56103K73703k26539o49097p06031n46992l66993
34736A068236o3649M06938P19313O11408L06895J26234J608k17056l24894j29581
34726B505452N1036j64841n03569l90137J03033L18351K5464k69849j59925R8141
34716A613156R5571j05297j72070k3886J41204J67458P2966l8873p1113j1465
34706A667651L9997J0767r306P5029J27622p1327m44726o30575m31558m9563J97945
34695D81956K22954J53033J13597J09579N3013j26766l63056m76943l72174j27602
$$ y = [5966624, 5597259, 5276380, 5218944, 5266913, 5093975, 4753016, 4600132, 4643536, 4442016, 3824437, 3252857, 3168546, 3364682, 3391232, 3265096, 3316221, 3530500, 3536540, 3187336, 2744755, 2497531, 2530742, 2834082, 3290185, 3563888, 3337349, 2688252, 1982221, 1435229, 1068236, 1004587, 1411525, 2130838, 2742246, 3049141, 3175375, 3176983, 2959927, 2635033, 2505452, 2556488, 2391647, 1888078, 1497941, 1600974, 1919325, 1944789, 1674940, 1515015, 1613156, 1708727, 1603430, 1431360, 1407474, 1548678, 1716136, 1789102, 1750229, 1679116, 1667651, 1707648, 1718415, 1709109, 1784138, 1911760, 1840433, 1395707, 765132, 333574, 284011, 481956, 704910, 857943, 971540, 1081119, 1134132, 1007366, 644310, 167367, -204807, -332409]
34685c32409J57052M56931O57151N02916m7869n70019n72334j13652K52957J59667
34675E50391j91716l69464k33226j9663j0803k00652k99732q5648K99634N25291
34665c5588N05143M32872L77974J67036k09067m06789j86859K06364L81473K90719
34655A523278J37300K4543l5243J5300J26911O5548k43006n06227m66189k68186
34645C74029j62476j16115j3608P0155J26809L85744Q27990R16069L28260l76213
34635B360644m32139M0808K61795n8906m35181m03350j5562M38866O82583M61083
34625B900641j92478p37177o35796m5900M08357M38830K49740O9975J439J54153
34615B611784M46874M70708M1063l62718k37043J57840K36605N17j44639j64533
$$ y = [-332409, -175357, 281574, 938725, 1441641, 1393772, 823753, 251419, 137767, 390724, 550391, 358675, -10789, -244015, -263678, -274481, -475133, -774865, -860513, -560879, -35588, 469555, 902427, 1280401, 1447437, 1238370, 831581, 644722, 851086, 1232559, 1523278, 1660578, 1685121, 1649878, 1665178, 1792089, 1857637, 1614631, 1108404, 642215, 374029, 211553, 95438, 81830, 151985, 278794, 664538, 1492528, 2408597, 2736857, 2360644, 1928505, 1969313, 2231108, 2172202, 1737021, 1333671, 1318109, 1756975, 2439558, 2900641, 2708163, 1970986, 1335190, 1289290, 1697647, 2136477, 2386217, 2456192, 2457631, 2611784, 3058658, 3529366, 3570429, 3207711, 2970668, 3128508, 3365113, 3365630, 3220991, 3056458]
34605C056458k71025l17332p0334J96527J39097N0933L47630P14000O22769L08161
34595D776884L16554N37056O41827R29380J622897J982510J433576Q95320J446815
34586A4582819K360178K259599J590329J845354K853665L181783K883237L293511
34578C4850475M281932M470226M134919M897411O460622O973907O861500Q541846
34570H1472838J1888437J4207747J5411541J8233673K2377104K4925883K8509954
34563B17027177L9957707N4585909N1029217J4130956m0256513p6205221p4990386
34556A85278846n1350754l0748054k1887567j7595521j2477406q579265p386116
34549C5254163o408713m344115l065373l359056l326874k001532q86702r91345
$$ y = [3056458, 2785433, 2468101, 2397767, 2594294, 2733391, 2784324, 3131954, 3845954, 4468723, 4776884, 5093438, 5630494, 6272321, 7201701, 8824598, 10807108, 12240684, 13136004, 14582819, 16942997, 19202596, 20792925, 22638279, 25491944, 28673727, 31556964, 34850475, 39132407, 43602633, 47737552, 52634963, 59095585, 66069492, 72930992, 81472838, 93361275, 107569022, 122980563, 141214236, 163591340, 188517223, 217027177, 256984884, 311570793, 362600010, 376730966, 336474453, 260269232, 185278846, 133928092, 103180038, 81292471, 63696950, 51219544, 42640279, 35254163, 28845450, 24501335, 21435962, 18076906, 14750032, 12748500, 11861798, 10870453]
34541A0870453j291881r43517n56461n69023m28614O827J6556n55854r27737p40687
34531D880062m57616k70164P7181L37378l7287p07687p48799j67547J25850j25472
34521B905899k49092J7549J38244j23363l24867k43018j87820k88629l12114k28156
34511A104633j86552l2888L74025N91043J91374l59366l60938o1801j38740l72141
34501G48649o0594N34942N06690r0853l30402o5270o6400m37718l83749J80627
34491E35922K69987m46681r32428m35777L47170M97305K15934J49996K46647J14394
34481E62469j23533j04975J04743K27117K54521K55508J01315k13873l67518j60279
34471E35495J79164L63423L44138J28732k29398l85394j4019N50625O13426J49118
$$ y = [10870453, 9578572, 8635055, 8078594, 7509571, 7080957, 7087784, 7104340, 6548486, 5620749, 4880062, 4422446, 4152282, 4229463, 4566841, 4529554, 3821867, 3073068, 2905521, 3031371, 2905899, 2656807, 2674356, 2812600, 2689237, 2364370, 2121352, 1933532, 1644903, 1332789, 1104633, 918081, 885193, 1259218, 1850261, 2041635, 1682269, 1321331, 1259530, 1120790, 748649, 688055, 1222997, 1729687, 1638834, 1308432, 1243162, 1176762, 739044, 355295, 535922, 805909, 359228, -573200, -1008977, -661807, -164502, 51432, 201428, 448075, 562469, 438936, 333961, 438704, 665821, 920342, 1175850, 1277165, 1063292, 695774, 535495, 714659, 1078082, 1422220, 1550952, 1321554, 936160, 922141, 1472766, 2086192, 2235310]
34461B235310j56265o685J39426l157q4335J08133K18526N0397l6744J24690J14706
34450B704002k53209m50458j17334K57189J52438r7669R5044N83990P81057N69563
34440D224613K97212J40221K7774k4370L2936R6677J25126K75210N32049N42041
34430F269489J38908l11288m11843k32404j3607K26950M82922N72117M94781N63749
34420G779774Q51988R58360O71983L97445N27640Q59510J046944J167491J396961
34411A5658096J575576J555139J541922J664878J684697J569230J792963K535674
34403B9578175L178902L227333L116215L340541L391143K528740J153846K88333
34395D9803228o7948q94685k461255l801125m117890l756542l404031l138110
$$ y = [2235310, 2079045, 2072360, 2211786, 2208629, 2124294, 2232427, 2450953, 2501350, 2464606, 2589296, 2704002, 2450793, 2000335, 1883001, 2140190, 2292628, 2194959, 2290003, 2873993, 3655050, 4224613, 4521825, 4662046, 4689820, 4665450, 4698386, 4795063, 4920189, 5195399, 5727448, 6269489, 6408397, 6097109, 5685266, 5452862, 5439255, 5666205, 6149127, 6721244, 7216025, 7779774, 8631762, 9590122, 10262105, 10659550, 11187190, 12046700, 13093644, 14261135, 15658096, 17233672, 18788811, 20330733, 21995611, 23680308, 25249538, 27042501, 29578175, 32757077, 35984410, 39100625, 42441166, 45832309, 48361049, 49514895, 49803228, 49735280, 48840595, 46379340, 42578215, 38460325, 34703783, 31299752, 28161642]
34387B8161642k753836k404571k355042k450196k291650j777423j193778q90224
34379A2044922r82946j239168j241584q56644m73182n06065p72018p45338l63617
34370D864360r9765j97119l34614k10537q376k8875k06117k83131k39071k56608
34360C000147l78229m23132k30968J27601L99003L98035K12374Q4834P0991k2475
34350C238181k69899m25811k91456o7265o1176k15812k46573j25861q4641j98244
34340A251443k99837k76396j62888J6030K24571L02862J59769l784L3624J24866
34330A370260r609k59877k68431m9071J2394j75102k19965J19390N36310O32819
34320A689118M35706K12122M4352j43731l21798l69705k67142r1329R6782K30562
$$ y = [28161642, 25407806, 23003235, 20648193, 18197997, 15906347, 14128924, 12935146, 12044922, 11061976, 9822808, 8581224, 7724580, 7251398, 6745333, 5973315, 5227977, 4864360, 4764595, 4567476, 4232862, 4022325, 4013949, 3985074, 3778957, 3495826, 3256755, 3000147, 2621918, 2198786, 1967818, 2095419, 2494422, 2892457, 3104831, 3189665, 3260656, 3238181, 2968282, 2542471, 2251015, 2183750, 2122574, 1906762, 1660189, 1534328, 1449687, 1251443, 951606, 675210, 512322, 528352, 752923, 1055785, 1215554, 1211770, 1245394, 1370260, 1360651, 1100774, 832343, 783272, 795666, 620564, 400599, 519989, 1056299, 1689118, 2124824, 2336946, 2381298, 2237567, 1915769, 1546064, 1278922, 1187593, 1284375, 1514937]
34310A514937J84660j08432n03754p06453n30869r5988K57816K93439J10301k3227
34300C92430l1197m7461q2523L8202L00239L85435J42447j33850j73760j75236
34290F14726l96358n88375l43163J59807L25621M0488j70961Q869K20084N0565
34280g8697k87050k62538K06894O40317O00378J84517j48630j33995L7870M6030
34270H05096j14133k13168k31677l65075n42124l88977J24332M72602L47884J73293
34260F8053L72960N85935K61603l10065l58958J38077M20231J33945k48318l29506
34250G33957l26213m38334l87203K0240M19387M11306J56419O4466K08633L69719
34240A232377L92582K34761r1767m20480n16227m02944l29080l19700j29762K41639
$$ y = [1514937, 1699597, 1591165, 1087411, 380958, -149911, -245899, 11917, 305356, 415657, 392430, 361233, 313772, 231249, 269451, 569690, 955125, 1097572, 963722, 789962, 614726, 218368, -370007, -713170, -553363, -227742, -187254, -358215, -349346, -129262, -78697, -365747, -628285, -421391, 218926, 819304, 1003821, 855191, 721196, 759066, 805096, 690963, 477795, 246118, -118957, -661081, -1050058, -925726, -453124, -105240, 68053, 441013, 1026948, 1288551, 978486, 619528, 757605, 1177836, 1311781, 1063463, 733957, 407744, -30590, -417793, -397553, 21834, 433140, 589559, 654025, 862658, 1232377, 1624959, 1859720, 1767953, 1347473, 831246, 428302, 99222, -220478, -350240, -108601]
34230a08601M15694J98839j22802k55716k58649k20627k1372L14692M49735K33238
34220F24431j0954o401N5309o1144j98274j67902j46146k79380k93320j566J65086
34209c20261k41127q16479p40745R753N90174N03207K16616L05421N47282L39832
34199C93673k98620o84296l94146K15809N77722O36307O68667O25078K02145m11872
34189A530467n18371M3307M43925L2814n82784m51462J36754Q0547o38201p74898
34179f97902J74314J045377P40609j76705n10915j99469L856j8004K10629N86788
34169A158578M74046j18249m27927j34265K14464J64700j9970J8175J22189j9742
34159A431999l54618o05953o28158m28420r0911K13517L66686M64077O04882O15366
$$ y = [-108601, 307093, 505932, 383130, 127414, -131235, -351862, -373234, -58542, 391193, 624431, 613477, 607076, 662385, 601241, 402967, 235065, 88919, -190461, -483781, -485347, -320261, -561388, -1377867, -2118612, -2108859, -1518685, -1015478, -798862, -493441, 53841, 393673, 95053, -589243, -983389, -767580, -189858, 446449, 1115116, 1740194, 1942339, 1530467, 1012096, 1055403, 1499328, 1532142, 949358, 497896, 634650, 715197, 76996, -697902, -523588, 521789, 1262398, 1085693, 574778, 375309, 379165, 361161, 571790, 1158578, 1632624, 1514375, 1086448, 952183, 1166647, 1331347, 1311377, 1329552, 1451741, 1431999, 1077381, 471428, -156730, -585150, -676061, -462544, -95858, 368219, 973101, 1588467]
34149A588467L07832r2982j86325R847J19832J0385j05584j16041j04048m1243
34139A390140J27546J42097k80262q17179q15031k59746J57038Q3479l9967J77731
34129a34154M39798L55400J04678L0210J9097j78715l59077j52939K94021M63942
34119H82261K12361q8158j51234j28374k67479n07915n75642l66327j06491r8119
34109a195117l18331l89734p2800L44316M12106J90104J57195M18474M74909P419
34099B8541n36354n17757J2539M33443M02641J71890R3119J90499K96950L29017
34089I04528K96682K18241J45554J59157K28571J56258k02319o61260p86880l71322
$$ y = [1588467, 1896299, 1803317, 1616992, 1626839, 1746671, 1757056, 1651472, 1535431, 1431383, 1390140, 1517686, 1659783, 1379521, 562342, -252689, -512435, -355397, -271918, -311885, -134154, 305644, 661044, 765722, 795932, 815029, 636314, 277237, 124298, 418319, 882261, 1094622, 1006464, 855230, 726856, 459377, -48538, -624180, -990507, -1096998, -1195117, -1513448, -1903182, -1975982, -1631666, -1219560, -1029456, -872261, -453787, 21122, 28541, -507813, -1025570, -1013031, -579588, -176947, -5057, 88062, 278561, 575511, 904528, 1201210, 1419451, 1565005, 1724162, 1952733, 2108991, 1906672, 1245412, 458532, 87210]
$$ [...]
##END NTUPLES=NMR SPECTRUM
##END=
