##TITLE=31Pdec_DE-63_pH6
 D2O, 64 sc
 27.12.2024
##JCAMPDX= 6.0         $$ Bruker NMR JCAMP-DX V2.0
##DATA TYPE= NMR SPECTRUM
##DATA CLASS= NTUPLES
##ORIGIN= UXNMR, Bruker Analytische Messtechnik GmbH
##OWNER= root
$$ XWIN-NMR		Version 3.5
$$ Fri Dec 27 14:14:15 2024 Russian Standard Time (UT+4h)  she@DPX200
##.OBSERVE FREQUENCY= 81.013821
##.OBSERVE NUCLEUS= ^31P
##.ACQUISITION MODE= SIMULTANEOUS
##.ACQUISITION SCHEME= undefined
##.AVERAGES= 64
##.DIGITISER RES= 17
##SPECTROMETER/DATA SYSTEM= spect
##.PULSE SEQUENCE= zgpg30
##.SOLVENT NAME= D2O
##.SHIFT REFERENCE= (INTERNAL, D2O, 0, 198.062)
##AUDIT TRAIL= $$ (NUMBER, WHEN, WHO, WHERE, WHAT)
$$ ##TITLE= Audit trail, XWIN-NMR		Version 3.5
$$ ##JCAMPDX= 5.01
$$ ##ORIGIN= Bruker BioSpin GmbH
$$ ##OWNER= she
$$ F:/spectra/data/she/nmr/P31/2/pdata/1/auditp.txt
$$ ##AUDIT TRAIL=  $$ (NUMBER, WHEN, WHO, WHERE, WHAT)
(   1,<2024-12-27 14:09:10.73 +0400>,<she>,<DPX200>,
      <created by zg, POWCHK disabled, PULCHK disabled
       configuration hash MD5:
       00 E9 B6 7A A2 85 ED C7 34 08 36 98 17 FE 4E 26
       data hash MD5: 32K
       FE CC E4 C7 1B E8 11 06 14 84 86 EE 17 B4 43 F1>)
(   2,<2024-12-27 14:12:52.32 +0400>,<she>,<DPX200>,
      <Start of raw data processing
       efp BC_mod = 2 LB = 1.5 FT_mod = 6 PKNL = 1 PHC0 = 2115.303 PHC1 = 110.4863 SI = 64K 
       data hash MD5: 64K
       48 B4 0B 9A 6B A4 FA FE 6B FE 85 B6 EE E7 50 30>)
(   3,<2024-12-27 14:13:25.00 +0400>,<she>,<DPX200>,
      <pk PHC0 = -123.2462 PHC1 = 216.4001 
       data hash MD5: 64K
       A2 FA 37 88 CF 74 44 B3 0F 9C CC DF 2B 91 FD 30>)
(   4,<2024-12-27 14:13:30.50 +0400>,<she>,<DPX200>,
      <abs ABSG = 5 
       data hash MD5: 64K
       9F C9 32 51 9C 78 D1 DC FB F7 28 CE 2B C0 AC DB>)
$$ ##END=
$$ 
$$ hash MD5
$$ 05 9F 71 3A AF DA 63 45 65 A9 10 7F B6 A5 27 60
##$RELAX= 
##$RELAX= 
##$RELAX= 
##$RELAX= 
##$RELAX= 
##$RELAX= 
##$RELAX= 
##$RELAX= 
$$ Bruker specific parameters
$$ --------------------------
##$DU= <F:/spectra>
##$EXPNO= 2
##$NAME= <P31>
##$PROCNO= 1
##$TYPE= <nmr>
##$USER= <she>
##$AMP= (0..31)
100 100 100 100 100 100 100 100 100 100 100 100 100 100 100 100 100 100 
100 100 100 100 100 100 100 100 100 100 100 100 100 100 
##$AQSEQ= 0
##$AQ_mod= 1
##$AUNM= <au_zg>
##$AUTOPOS= <>
##$BF1= 81.014009
##$BF2= 200.13
##$BF3= 200.13
##$BF4= 200.13
##$BF5= 200.13
##$BF6= 200.13
##$BF7= 200.13
##$BF8= 200.13
##$BYTORDA= 1
##$CFDGTYP= 0
##$CFRGTYP= 5
##$CHEMSTR= <none>
##$CNST= (0..31)
1 1 145 1 1 1 1 1 1 1 1 1 1 1 1 1 1 1 1 1 1 1 1 1 1 1 1 1 1 1 1 1 
##$CPDPRG= <waltz16>
##$CPDPRG1= <>
##$CPDPRG2= <waltz16>
##$CPDPRG3= <>
##$CPDPRG4= <mlev>
##$CPDPRG5= <mlev>
##$CPDPRG6= <mlev>
##$CPDPRG7= <mlev>
##$CPDPRG8= <mlev>
##$CPDPRGB= <>
##$CPDPRGT= <>
##$D= (0..31)
0 1 0 0 0 0 0 0 0 0.06 0 0.03 2e-05 3e-06 0 0 0.0002 0 0 0 0 0 0 0 0 0 
0 0 0 0 0 0 
##$DATE= 1735294150
##$DBL= (0..7)
120 120 120 11 120 120 24 19 
##$DBP= (0..7)
150 150 150 150 150 150 150 150 
##$DBP07= 0
##$DBPNAM0= <>
##$DBPNAM1= <>
$$ [...]
##$SUBNAM3= <"">
##$SUBNAM4= <"">
##$SUBNAM5= <"">
##$SUBNAM6= <"">
##$SUBNAM7= <"">
##$SUBNAM8= <"">
##$SUBNAM9= <"">
##$SW= 400.765351723535
##$SWIBOX= (0..15)
0 1 3 0 0 0 0 0 0 0 0 0 0 0 0 0 
##$SW_h= 32467.5324675325
##$TD= 32768
##$TD0= 1
##$TE= 0
##$TE2= 300
##$TE3= 300
##$TEG= 300
##$TL= (0..7)
0 120 53 12 22 120 120 120 
##$TP= (0..7)
150 150 150 150 150 150 150 150 
##$TP07= 0
##$TPNAME0= <>
##$TPNAME1= <>
##$TPNAME2= <>
##$TPNAME3= <>
##$TPNAME4= <>
##$TPNAME5= <>
##$TPNAME6= <>
##$TPNAME7= <>
##$TPOAL= (0..7)
0.5 0.5 0.5 0.5 0.5 0.5 0.5 0.5 
##$TPOFFS= (0..7)
0 0 0 0 0 0 0 0 
##$TUNHIN= 0
##$TUNHOUT= 0
##$TUNXOUT= 0
##$USERA1= <user>
##$USERA2= <user>
##$USERA3= <user>
##$USERA4= <user>
##$USERA5= <user>
##$V9= 5
##$VALIST= <valist>
##$VCLIST= <CCCCCCCCCCCCCCC>
##$VD= 0
##$VDLIST= <DDDDDDDDDDDDDDD>
##$VPLIST= <PPPPPPPPPPPPPPP>
##$VTLIST= <TTTTTTTTTTTTTTT>
##$WBST= 1024
##$WBSW= 4
##$XGAIN= (0..3)
0 0 0 0 
##$XL= 0
##$YL= 0
##$YMAX_a= 31089
##$YMIN_a= -32149
##$ZGOPTNS= <>
##$ZL1= 120
##$ZL2= 120
##$ZL3= 120
##$ZL4= 120
##$ABSF1= 198.0616
##$ABSF2= -202.7028
##$ABSG= 5
##$ABSL= 3
##$ALPHA= 0
##$AQORDER= 0
##$ASSFAC= 0
##$ASSFACI= 0
##$ASSFACX= 0
##$ASSWID= 0
##$AUNMP= <proc_1d>
##$AZFE= 0.1
##$AZFW= 0.5
##$BCFW= 0
##$BC_mod= 2
##$BYTORDP= 0
##$COROFFS= 0
##$CY= -3
##$DATMOD= 1
##$DC= 0
##$DFILT= <>
##$DTYPP= 0
##$F1P= 0
##$F2P= 0
##$FCOR= 1
##$FTSIZE= 65536
##$FT_mod= 6
##$GAMMA= 0
##$GB= 0
##$INTBC= 1
##$INTSCL= 9.790993e-09
##$ISEN= 30
##$LB= 1.5
##$LEV0= 0
##$LPBIN= 0
##$MAXI= 10000
##$MC2= 0
##$MEAN= 0
##$ME_mod= 0
##$MI= 50
##$NCOEF= 0
##$NC_proc= -6
##$NLEV= 6
##$NOISF1= 182.463
##$NOISF2= 159.3651
##$NSP= 0
##$NTH_PI= 0
##$NZP= 0
##$OFFSET= 198.0616
##$PC= 4
##$PHC0= 1992.057
##$PHC1= 326.8864
##$PH_mod= 1
##$PKNL= yes
##$PPARMOD= 0
##$PSCAL= 0
##$PSIGN= 0
##$REVERSE= no
##$SF= 81.0140089999434
##$SI= 65536
##$SIGF1= 159.3651
##$SIGF2= -187.1042
##$SINO= 113.3802
##$SIOLD= 16384
##$SREGLST= <1H.CDCl3>
##$SSB= 0
##$STSI= 65536
##$STSR= 0
##$SW_p= 32467.5324675325
##$SYMM= 0
##$S_DEV= 0
##$TDeff= 32768
##$TDoff= 0
##$TI= <>
##$TILT= no
##$TM1= 0
##$TM2= 0
##$TOPLEV= 0
##$USERP1= <user>
##$USERP2= <user>
##$USERP3= <user>
##$USERP4= <user>
##$USERP5= <user>
##$WDW= 1
##$XDIM= 65536
##$YMAX_p= 464906303
##$YMIN_p= -49300618
$$ End of Bruker specific parameters
$$ ---------------------------------
##NTUPLES= NMR SPECTRUM
##VAR_NAME=  FREQUENCY,     SPECTRUM/REAL,   SPECTRUM/IMAG
##SYMBOL=    X,             R,               I
##VAR_TYPE=  INDEPENDENT,   DEPENDENT,       DEPENDENT
##VAR_FORM=  AFFN,          ASDF,            ASDF
##VAR_DIM=   65536,         65536,           65536
##UNITS=     HZ,            ARBITRARY UNITS, ARBITRARY UNITS
##FACTOR=    0.49542278885378, 1,            1
##FIRST=     16045.7642231865, 0,            0
##LAST=      -16421.768244346, 0,            0
##MIN=       -16421.768244346, -49300618,    0
##MAX=       16045.7642231865, 464906303,    0
$$ Real data points
##PAGE= N=1
##DATA TABLE= (X++(R..R)), XYDATA
$$ [...]
42314 -1049782 -1053163 -1268488 -1244124 -642265 480068 1758079 2780975 3262272 3060205
42305 3060205 2196237 952963 -134139 -586309 -373371 88189 388998 502352 664478
42296 664478 1004511 1414379 1712142 1787796 1604204 1200436 740861 446361 372119 293938
42286 293938 -65449 -659354 -1064972 -910466 -296399 350641 800202 1156257 1442109 1399622
42276 1399622 950826 543299 588831 735149 277418 -684282 -1141489 -503799 532383
42267 532383 895781 487189 34556 -93251 -194399 -407688 -352052 141252 542433 320237
42257 320237 -252551 -492119 -314546 -344382 -993419 -1844985 -2124202 -1544198 -522815 288047
42247 288047 533861 329307 90954 207474 747786 1413523 1773408 1563298 836504 -35539
42237 -35539 -481508 -66730 1046457 2040626 2128202 1366489 574912 370219 545240 542511
42227 542511 227037 -109580 -254697 -165801 285853 1160741 2060447 2414355 2254790 2183568
42217 2183568 2371241 2160099 1080292 -207740 -603214 -2994 548830 165743 -901639
42208 -901639 -1708196 -1689340 -1123548 -714118 -857947 -1300383 -1508706 -1340976 -1138430 -1122694
42198 -1122694 -1071626 -815563 -647314 -821842 -996110 -730364 -304395 -373622 -934582 -1349822
42188 -1349822 -1382527 -1416631 -1529600 -1210850 -352777 294965 207481 -81302 103566 456704
42178 456704 356535 189617 929537 2477908 3487426 3106859 2052586 1503922 1593939
42169 1593939 1577808 1079367 517803 394219 665860 925201 914268 739563 685285 861483
42159 861483 1014717 749624 907 -788007 -1047369 -615075 147822 713587 811476 556288
42149 556288 229936 -42385 -368789 -836221 -1297070 -1537370 -1560594 -1494030 -1271129 -722935
42139 -722935 -68689 26128 -821902 -2079670 -2707455 -2210561 -1064405 -81695 390551
42130 390551 518989 467562 180978 -250684 -309854 511087 1958215 3014939 2902867 1946404
42120 1946404 1168885 1118690 1461168 1734150 1980853 2317406 2326246 1510226 231856 -470761
42110 -470761 -179105 351429 257214 -294690 -530587 -278298 -74777 -174453 -192391 87179
42100 87179 217307 -193769 -782335 -970855 -841570 -851954 -907157 -453676 470969 997852
42090 997852 521253 -498048 -1191628 -1341137 -1347879 -1421255 -1287503 -661864 335870 1262328
42080 1262328 1664720 1390178 777057 447793 702492 1181580 1285141 799777 -60016
42071 -60016 -1017143 -1818706 -2104866 -1620146 -625202 197451 374502 57484 -190436 86510
42061 86510 839125 1491275 1465779 903972 604995 952947 1230716 530739 -875069 -1774266
42051 -1774266 -1598318 -1030025 -888548 -1167027 -1510931 -1931987 -2499919 -2863747 -2690031
42042 -2690031 -2195662 -1687285 -974360 94030 864512 503533 -715703 -1588811 -1535157
42033 -1535157 -1214275 -1368076 -1765036 -1719779 -1145831 -593576 -518982 -903801 -1399160 -1529938
42023 -1529938 -946204 210557 1304712 1819146 1874568 1950954 2241293 2519964 2549254 2361925
42013 2361925 2143441 1989878 1790308 1308517 479410 -335459 -575394 -88829 653075
42004 653075 1091888 1153416 1114351 1103524 1017087 827330 675383 638780 623148 541992 476977
41993 476977 605639 993444 1429736 1502823 1005406 290146 -24297 196820 444959 348282
41983 348282 254988 660214 1327836 1507009 927302 51634 -675413 -1288015 -1843656 -2003172
41973 -2003172 -1415766 -266804 854328 1502893 1625686 1423957 1156512 993220 954755
41964 954755 1030015 1263483 1523495 1329246 354772 -881789 -1380810 -925203 -455573 -827890
41954 -827890 -1683652 -2057408 -1704063 -1176765 -824649 -432983 166368 790038 1313431 1815568
41944 1815568 2173204 2069151 1625507 1481731 1896050 2239920 1840512 973009 483934
41935 483934 632626 881451 816361 711450 964914 1381810 1392302 839696 193008 -82388
41925 -82388 -83089 -173156 -286180 102132 1196892 2410607 2953158 2693476 2110272 1566697
41915 1566697 1078052 709788 645943 759711 648333 310031 289416 858220 1532926 1777851
41905 1777851 1707238 1610013 1265078 412422 -460043 -658686 -482093 -957242 -2242177 -3152841
41895 -3152841 -2652341 -1115147 368029 1358635 2126672 2734756 2798329 2134865 1133244
41886 1133244 362459 76139 139182 264440 326132 527416 1146253 2043115 2658467 2664392
41876 2664392 2348020 2102011 1829949 1238080 489074 71159 80513 116184 -42667 -62181
41866 -62181 495867 1634361 2950798 3962380 4303360 3851243 2819512 1589088 374239
41857 374239 -796597 -1749119 -2063597 -1475669 -283747 747331 897391 16419 -1293611
41848 -1293611 -2097396 -1946267 -1243754 -615591 -99090 653796 1516037 1871047 1602242
41839 1602242 1438586 1878072 2270672 1608568 -2228 -1314439 -1392180 -540640 355314
41830 355314 948014 1574273 2552175 3683384 4434344 4402401 3560425 2185919 698994
41821 698994 -416415 -714473 -77505 1019373 1728231 1504416 552905 -427408 -837138
41812 -837138 -505122 322606 1128446 1421075 1138979 729965 687994 1062681 1508336 1671120
41802 1671120 1401920 787866 193044 92911 589765 1206261 1421755 1283529 1186097 1191758
41792 1191758 993223 529645 202238 357094 881771 1454152 1934583 2376211 2831823
41783 2831823 3235787 3349378 2881451 1904761 1073367 1055082 1719691 2258399 2178070 1805305
41773 1805305 1706087 1997209 2392272 2565075 2284083 1527927 648565 90287 -183822 -570688
41763 -570688 -1002660 -834745 103809 949528 864270 186949 -153755 -29606 -109645 -604774
41753 -604774 -873660 -445718 251610 504059 183429 -303937 -619776 -750303 -837019 -965774
41743 -965774 -1072304 -1029583 -909076 -1035182 -1551034 -2038460 -1885496 -993371 175912 1187595
41733 1187595 1923670 2346189 2392091 2146290 1759979 1175844 300875 -559709 -895672 -684774
41723 -684774 -447548 -520145 -720666 -818265 -802411 -537693 241426 1291168 1796159 1372418
41713 1372418 628137 241997 -10669 -650244 -1297038 -944270 593553 2258473 2986617
41704 2986617 2816315 2459726 2174192 1503420 71262 -1704362 -2878887 -2924236 -2236876
41695 -2236876 -1596469 -1287821 -1033830 -664455 -359238 -155261 214970 698030 667522 -199994
41685 -199994 -1176633 -1202877 -164636 1058629 1631786 1327196 284516 -1077305 -1944989
41676 -1944989 -1656003 -552617 286517 355090 198807 385201 649670 498392 109773
41667 109773 22092 245123 325773 170624 181324 515865 762702 572351 215105 203446
41657 203446 603132 1044002 1284501 1425503 1583030 1692340 1729275 1788703 1735498 1123245
41647 1123245 -127291 -1196594 -1101755 14421 920527 827161 325150 442026 1285261
41638 1285261 2177203 2756370 3229983 3651804 3649584 2993020 1938759 896583 156519
41629 156519 -23887 426854 1009422 932200 57591 -819058 -936410 -472586 -132031 -111361
41619 -111361 51183 663893 1373794 1645826 1492172 1426801 1691472 1817894 1237448 204849
41609 204849 -344602 -15209 433292 88052 -846612 -1332332 -856798 109016 959989 1596982
41599 1596982 2092969 2346027 2361413 2415350 2623177 2699361 2425910 2044289 1913802 2051686
41589 2051686 2246444 2363645 2315922 1988489 1434729 951188 779036 904978 1238127 1727220
41579 1727220 2223976 2523051 2609377 2569922 2296048 1732704 1386624 1898922 2946453 3326018
41569 3326018 2507435 1374530 887154 712518 -43487 -1275750 -1990094 -1758198 -1187900
41560 -1187900 -933798 -959888 -908148 -642640 -252467 131244 422698 693563 1114738 1580594
41550 1580594 1642668 1154930 691134 845605 1358310 1481953 1044615 549934 303775 55922
41540 55922 -444848 -1067354 -1566169 -1816502 -1710722 -1167503 -286496 745418 1793915
41531 1793915 2580438 2640757 1918439 1127108 979598 1280693 1362070 1163220 1165419 1427536
41521 1427536 1493226 1214300 878325 510895 -148815 -927897 -1298627 -1269182 -1341109 -1455183
41511 -1455183 -944778 178655 888418 572991 -84729 -235979 -63906 -176822 -502498
41502 -502498 -546280 -243388 127685 433868 489381 -112760 -1291039 -2100113 -1866585 -1329728
41492 -1329728 -1801899 -3388640 -4826030 -4999780 -3948571 -2430077 -1139860 -373160 65104
41483 65104 629949 1349456 1547150 709812 -600341 -1299976 -1122711 -794320 -926617 -1339738
41473 -1339738 -1532810 -1323042 -939269 -831452 -1311632 -2018378 -1963299 -656024 1010769
41464 1010769 1666201 1136352 469807 342987 365076 192946 376770 1466301 2910040
41455 2910040 3601560 3246697 2544950 2121651 1865372 1411854 816292 443244 376743 284972
41445 284972 -38300 -262760 31550 593871 659838 1564 -695357 -856040 -903825 -1512439
41435 -1512439 -2355452 -2445139 -1623264 -831763 -739798 -927594 -793474 -523187 -568545 -696323
41425 -696323 -284009 658446 1428769 1592309 1462531 1482017 1534469 1152475 217283 -842447
41415 -842447 -1538669 -1757908 -1590546 -975188 134896 1313759 1840535 1528434 997105
41406 997105 856094 998278 1052167 1101522 1389126 1623394 1279107 447273 -308993 -867997
41396 -867997 -1561719 -2247634 -2201048 -1191035 45798 734330 852740 695991 321710
41387 321710 -122566 -130725 513809 1223988 1269726 643088 -144997 -739785 -955438 -538950
41377 -538950 469164 1406155 1611393 1220791 841298 620700 173025 -682199 -1590097
41368 -1590097 -2003344 -1514155 -83150 1626791 2458354 1926812 973562 868147 1512116
41359 1512116 1644609 713002 -399071 -756245 -560240 -414611 -170086 671636 1800061
41350 1800061 2220084 1534850 452078 -136862 -107591 70792 78806 -24496 -170313 -529304
41340 -529304 -1258038 -2119375 -2551153 -2216207 -1424847 -880900 -992636 -1535420 -1994782 -2075090
41330 -2075090 -1790063 -1238102 -519771 151395 479957 341712 -78573 -483651 -750597
41321 -750597 -963178 -1215728 -1478621 -1646022 -1638522 -1463355 -1238418 -1112731 -1037486 -660762
41311 -660762 313230 1582426 2307993 1919471 720446 -482416 -1191081 -1441677 -1413042
41302 -1413042 -1170413 -763916 -281301 195218 459798 131469 -909134 -2103362 -2674357
41293 -2674357 -2533083 -2299010 -2367381 -2433672 -2068252 -1261821 -208620 908409 1607021
41284 1607021 1154218 -523398 -2331576 -2991756 -2376802 -1422202 -899256 -781360 -716900
41275 -716900 -560047 -299625 157321 907395 1860975 2705664 3083724 2938722 2686441 2768407
41265 2768407 2972804 2592871 1446563 287371 -133196 14118 83042 -77378 -127508
41256 -127508 108188 573539 1324496 2343018 3193583 3458199 3353926 3339138 3318731 2920990
41246 2920990 2366642 2238573 2450289 2318212 1724262 1313348 1352161 1302368 864693 570378
41236 570378 842829 1251121 1291102 1227526 1481244 1760663 1569753 1132787 983117 929773
41226 929773 333912 -643449 -939125 40727 1570011 2426272 2141679 1153370 71767
41217 71767 -785973 -1253119 -1140723 -451276 354731 612757 142322 -475334 -527560 30913
41207 30913 666718 1027669 1223434 1391607 1470800 1520656 1811709 2388947 2921325 3171737
41197 3171737 3231468 3114695 2594738 1725328 1056129 961651 1177054 1380288 1755501 2455635
41187 2455635 2953260 2632010 1775739 1246169 1274748 1272880 856693 373272 232709 300608
41177 300608 247558 82166 10575 22240 -96622 -450844 -905753 -1193673 -1080677 -527031
41167 -527031 257942 976793 1466191 1739860 1902013 2073685 2270850 2290320 1918012 1353089
41157 1353089 1151716 1553632 2138673 2395372 2329822 2195339 1952207 1462933 980164 889629
41147 889629 1077533 1087759 867902 829553 1131068 1404814 1315875 975680 679617 595854
41137 595854 812249 1332416 1896544 2102284 1811821 1219830 539842 -85544 -439833 -410847
41127 -410847 -296083 -481134 -795385 -683409 -96416 315566 66043 -623711 -1353437 -2087836
41117 -2087836 -2850657 -3349448 -3317432 -2874864 -2160676 -956214 843630 2626925 3461072
41108 3461072 3047420 1901391 641793 -509258 -1500993 -2126534 -2162597 -1723927 -1281492
41099 -1281492 -1210654 -1304697 -888679 393398 1999254 2982513 3035287 2674922 2354952 1870933
41089 1870933 909398 -227093 -886689 -884893 -669690 -722863 -1075157 -1386696 -1286180 -637527
41079 -637527 362511 1319755 1913424 2009444 1602098 891323 416405 739375 1772209
41070 1772209 2653097 2533858 1377954 -125617 -1223351 -1537290 -1134593 -456368 -66074
41061 -66074 -239023 -798262 -1362572 -1616674 -1393107 -798808 -277777 -171595 -167821 343735
41051 343735 1249155 1636808 1044928 187663 -33487 298355 549165 681942 1165947 1938554
41041 1938554 2274452 1762495 805754 49808 -203490 22438 458753 542671 -205724 -1510384
41031 -1510384 -2366973 -1985971 -580230 842319 1326396 655276 -574306 -1516151 -1795586
41022 -1795586 -1606297 -1148410 -386656 471342 823142 464366 59624 230306 612366
41013 612366 552638 330361 734437 1659028 2188052 2041032 1821198 1696600 1024106 -312029
41003 -312029 -1314279 -1274287 -834650 -910664 -1336141 -1393605 -1052198 -832324 -930190 -1267427
40993 -1267427 -1942267 -2809557 -3053744 -2108632 -711183 -121829 -500099 -954460 -1000963
40984 -1000963 -930927 -774831 -52797 1166719 1975963 1865457 1441647 1399840 1509827 1248295
40974 1248295 840137 901378 1376519 1589330 1272388 911210 969192 1236453 1160042 584831
40964 584831 -40920 -187174 93226 124977 -620766 -1784195 -2435522 -2188322 -1635998 -1474348
40954 -1474348 -1540492 -1112664 19742 1218393 1718140 1346553 491148 -325604 -718590
40945 -718590 -563645 -89407 231930 46745 -610271 -1408411 -1983177 -2085091 -1659753 -965744
40935 -965744 -523348 -701284 -1295639 -1681672 -1462375 -841505 -301911 -108237 -260035 -703335
40925 -703335 -1283841 -1603422 -1299909 -524063 149662 344103 135699 -317893 -976923 -1574129
40915 -1574129 -1525660 -581624 696762 1494317 1599407 1382719 1165054 1045126 1166804
40906 1166804 1606546 2019733 1924083 1407525 1072088 1147920 1139211 576213 -292718 -855332
40896 -855332 -870205 -554300 -207675 -86340 -450107 -1342930 -2345683 -2843270 -2610161 -1990521
40886 -1990521 -1479616 -1241360 -1065843 -721707 -276825 -31090 -149189 -461772 -672278
40877 -672278 -625453 -310841 150233 338063 -305668 -1717826 -2849606 -2673689 -1531428
40868 -1531428 -849198 -1397052 -2451275 -2913463 -2620877 -2144447 -1852796 -1733290 -1746583
40859 -1746583 -1767823 -1422034 -528090 452564 894231 792168 623114 586956 479326 206734
40849 206734 -64632 -215289 -195968 141560 768762 1180740 944273 461546 560257 1347601
40839 1347601 2157160 2667824 3264413 4056927 4382373 3775428 2759376 2076646 1675668
40830 1675668 1108448 458975 97634 -179733 -904460 -1895031 -2279623 -1689903 -755631
40821 -755631 -205995 -83453 -124262 -351627 -875657 -1514944 -2042830 -2476653 -2690910 -2109969
40811 -2109969 -451753 1355214 1777902 467323 -1111777 -1254697 115133 1580044
40803 1580044 1986118 1527719 1105345 1159613 1395212 1307483 647504 -463529 -1578493
40794 -1578493 -2163285 -2060454 -1689172 -1561187 -1642680 -1474839 -933211 -506981 -632923 -1041415
40784 -1041415 -1103305 -697990 -331733 -330695 -326578 142666 778891 774077 -46639 -827918 -726856
40773 -726856 16122 506918 474332 525359 1133784 1998092 2612026 2911686 3012046 2810443
40763 2810443 2343404 2133891 2581724 3262108 3447951 3150172 2969707 3027485 2841771 2372195
40753 2372195 2349746 3157745 4022062 3888315 2768038 1711606 1596710 2278848 2818878
40744 2818878 2348372 890923 -529341 -837653 -61333 807646 1141198 1256275 1430171
40735 1430171 1141677 -4509 -1199095 -1263114 -341693 220999 -259346 -997786 -1042485
40726 -1042485 -550861 -286693 -467045 -701535 -706979 -523196 -225962 85989 136577 -252644
40716 -252644 -771620 -895761 -577385 -329362 -541301 -990292 -1149367 -770527 -50821 568573
40706 568573 615581 -174174 -1537924 -2698724 -3032287 -2757213 -2650280 -2990013 -3167652
40697 -3167652 -2595126 -1600482 -943884 -723835 -424224 39677 121004 -310523 -506684 83857
40687 83857 909605 1140195 924652 1044481 1587874 1831281 1416710 843465 628410 649454
40677 649454 552547 230947 -346060 -1208696 -1955827 -1787934 -470489 1061136 1548557
40668 1548557 721289 -570479 -1365641 -1404793 -1074373 -913243 -1206620 -1844218 -2483210
40659 -2483210 -2850710 -2855618 -2523718 -2063489 -1910012 -2296668 -2742637 -2447333 -1367792 -396611
40649 -396611 -169794 -226896 159094 781982 817871 91776 -708828 -1050464 -1096157 -1131111
40639 -1131111 -1082875 -852023 -587710 -322802 210883 1020648 1485040 1037215 10239
40630 10239 -691593 -691542 -440019 -396232 -414955 -175828 190699 327231 311230 620657 1378846
40619 1378846 2002275 1808400 791000 -377858 -997525 -881495 -414722 -216654 -597434
40610 -597434 -1192204 -1286797 -659486 105571 341243 69566 -237475 -339335 -178529 557473
40600 557473 2063838 3614475 3956455 2825772 1432997 1046993 1640245 2355144 2715710
40591 2715710 2733664 2283607 1243899 153506 -71399 754110 1806967 2276058 2226388
40582 2226388 2226632 2451627 2454415 1747422 465454 -588170 -669687 44556 526872 50108
40572 50108 -920752 -1299147 -674535 353217 1027497 1139210 849579 314768 -283912 -684683
40562 -684683 -812864 -931175 -1289576 -1706231 -1681284 -953046 120492 801392 679053 111094
40552 111094 -235782 -294781 -682211 -1669635 -2511111 -2297406 -1225619 -392880 -363200 -552220
40542 -552220 -174342 718307 1384882 1213499 178466 -1203595 -2171023 -2235639 -1597258
40533 -1597258 -871979 -378002 18547 346012 289520 -289806 -1016937 -1469100 -1628176 -1563263
40523 -1563263 -1037079 102831 1361627 1952613 1700164 1163328 820044 556158 141534
40514 141534 -190559 -67395 271310 80475 -839708 -1642391 -1447937 -613287 -332512 -956917
40504 -956917 -1485953 -1079885 -334884 -368277 -1175851 -1772458 -1650359 -1134897 -428128 620841
40494 620841 1647709 1743569 737125 -337170 -546626 -106022 357619 790094 1310436
40485 1310436 1563441 1307487 1091449 1439780 1780942 1164991 -203833 -1168758 -1282709
40476 -1282709 -1249061 -1584454 -1856478 -1647533 -1417094 -1774528 -2446012 -2635091 -2131461 -1467459
40466 -1467459 -1077614 -825777 -437148 -2134 177370 79446 65030 442440 1040572 1343677
40456 1343677 1064767 477613 105471 138815 240331 -74277 -876390 -1653230 -1779178 -1204139
40446 -1204139 -505120 -125089 157358 674268 1112162 947832 500068 707010 1689523
40437 1689523 2381577 1995353 1081283 567745 464158 259779 7297 103911 384342 353810
40427 353810 86355 17839 51727 -215239 -551533 -416974 -192220 -909519 -2491474 -3377232
40417 -3377232 -2466440 -575951 668015 709229 208732 -76817 174381 1035025 2264393
40408 2264393 3155435 3029518 1944679 629011 -239838 -508798 -461336 -451845 -514712 -282316
40398 -282316 492768 1367623 1579353 1040365 443100 212706 -41872 -704088 -1375771 -1444973
40388 -1444973 -979237 -478066 -60747 501262 1140878 1463299 1309503 934437 688348
40379 688348 836044 1512001 2465856 3015156 2682260 1797219 1110165 921831 957299 946944
40369 946944 886139 771485 485417 -39164 -793054 -1712327 -2469321 -2511668 -1740712 -895499
40359 -895499 -689231 -744692 -73662 1455321 2910405 3637185 3933239 4052644 3434738
40350 3434738 1666141 -369384 -1224164 -612674 362461 695120 469939 257443 252169
40341 252169 416654 925325 1841782 2580517 2312003 975852 -521025 -1221780 -918271
40332 -918271 25865 1219481 2331896 2949994 2781922 1993552 1102211 539016 437515
40323 437515 718778 1151278 1393118 1211310 684648 115063 -148785 250172 1483156
40314 1483156 3097637 4073026 3747459 2530827 1318809 438592 -331340 -968786 -1166789
40305 -1166789 -1016041 -978096 -1123464 -1126156 -1083235 -1486451 -2167442 -2203551 -1309940 -443657
40295 -443657 -422452 -758778 -620251 -211933 -257738 -649612 -671349 -281647 -137309 -412292
40285 -412292 -538596 -206606 181600 221776 13226 -221128 -481190 -784784 -1023669 -1127352
40275 -1127352 -1080568 -843608 -560606 -637878 -1201327 -1722567 -1652728 -1113805 -427043 573334
40265 573334 1945994 2819697 2307554 1067256 694336 1472617 2003250 1389063 509260
40256 509260 513654 1191011 1669317 1813531 1953108 1889556 1205728 197788 -407388 -490729
40246 -490729 -598709 -1117648 -1954197 -2843246 -3460871 -3458106 -2880245 -2314540 -2151638 -1997971
40236 -1997971 -1338310 -452127 -37718 -161137 -244769 36437 496443 1007545 1695959 2523403
40226 2523403 3177997 3424838 3182143 2360463 1117898 169255 234951 1132954 1956350
40217 1956350 2232191 2371337 2822764 3312758 3240849 2507693 1637667 1196814 1240069 1285262
40207 1285262 849583 75433 -352075 -77696 411751 466255 151406 -45642 -104477 -356037
40197 -356037 -587899 -114409 1062839 1923875 1651626 610187 -305966 -779105 -1035508
40188 -1035508 -1152245 -1017649 -766878 -687245 -756262 -722320 -594359 -635798 -892940 -1137705
40178 -1137705 -1308557 -1597915 -1982482 -2057422 -1597412 -1016760 -925214 -1306828 -1475864 -941424
40168 -941424 -57173 439961 438711 639356 1553550 2605902 2669209 1488575 102677 -398086
40158 -398086 -141922 -58797 -451470 -656127 -209356 348856 296832 -138756 -159756 308942
40148 308942 480790 -52532 -685027 -714125 -244490 289366 901894 1696233 2223840 2080409
40138 2080409 1847575 2414236 3403094 3401090 2036345 721936 733206 1505316 1698586 1205769
40128 1205769 1029608 1584012 2225018 2364598 2065152 1476086 574185 -353269 -749502
40119 -749502 -581812 -453496 -677490 -858312 -680137 -494860 -724230 -1176351 -1394011 -1301779
40109 -1301779 -1104756 -875373 -628541 -517949 -587032 -585167 -370983 -209468 -296091 -303301
40099 -303301 104521 537628 255953 -760474 -1652370 -1679665 -957122 -99203 451951 565362
40089 565362 265167 -255927 -662747 -792852 -850620 -1081318 -1354914 -1324322 -964698 -677774
40079 -677774 -775490 -1100319 -1337703 -1511981 -1865918 -2298363 -2291808 -1570784 -586580 -88855
40069 -88855 -306966 -754118 -771051 -80137 1110239 2290685 2927281 2804413 2228839 1789849
40059 1789849 1804391 2002973 1802938 938905 -139352 -593277 -101285 619017 497447
40050 497447 -645839 -1918007 -2518647 -2586784 -2594380 -2465389 -1903148 -1202793 -967017 -1142168
40040 -1142168 -1061693 -445217 304597 820500 1115271 1156628 822442 428135 562040 1157717
40030 1157717 1466399 1255737 1237135 1820073 2217527 1496874 -53992 -1365046 -1954928
40021 -1954928 -2092006 -1912928 -1221469 -88126 1039791 1845445 2277494 2288054 1932323
40012 1932323 1581038 1494699 1333170 678584 -78903 -56695 907649 1998881 2466246 2340947
40002 2340947 2003943 1621864 1221620 846546 422005 -149045 -617321 -519327 183105 985839
39992 985839 1473002 1654740 1610012 1324964 1061676 1317788 2079200 2570150 2138706 1061097
39982 1061097 139909 -173640 35510 439182 543434 -158496 -1580965 -2784239 -2807968
39973 -2807968 -1688758 -290470 705687 1202078 1248148 829936 210726 -44790 297172
39964 297172 749252 619273 -210844 -1210629 -1804808 -1863691 -1619331 -1283262 -877767 -409135
39954 -409135 -28305 140789 258389 605676 1109993 1293842 870996 187087 -164162 -3625
39944 -3625 416731 905255 1460812 1939137 2002966 1544555 840889 121563 -695059 -1572393
39934 -1572393 -1986733 -1467646 -405703 202933 -66705 -597292 -650743 -308815 -95575
39925 -95575 -58628 125648 295997 -150032 -1184502 -1863379 -1556568 -875858 -762488 -1094258
39915 -1094258 -1000860 -373203 -158298 -987628 -2268261 -3004348 -2957406 -2548034 -2037730 -1352620
39905 -1352620 -526056 171783 545985 635585 579197 497229 422412 209336 -320780 -978536
39895 -978536 -1189025 -664233 100531 366607 76009 -166038 -2573 233715 128043 -176493
39885 -176493 -273648 -204230 -441517 -1101873 -1512012 -889304 591368 1749735 1625513 552634
39875 552634 -286941 -257488 203379 468948 603848 1050451 1823087 2466014 2632215 2301022
39865 2301022 1557878 586028 -198274 -466758 -466717 -754879 -1361396 -1660844 -1249113 -517992
39855 -517992 -60634 143065 554034 1307081 2038526 2395988 2339113 1956506 1377114 942272
39845 942272 1071375 1704999 2137743 1727526 672839 -200369 -376982 -71768 291509
39836 291509 609805 887432 863154 326945 -303227 -244825 675743 1726095 2172722 2131834
39826 2131834 2197682 2517795 2695063 2485286 2100038 1759263 1378342 899952 616061 855265
39816 855265 1465563 1862990 1632643 977744 506196 545705 717160 357493 -564847 -1219033
39806 -1219033 -867931 155791 860162 891379 882286 1411613 2172832 2471533 2101048 1360597
39796 1360597 593191 126914 298064 967337 1275806 553483 -613367 -910346 24633
39787 24633 1095157 1152269 350519 -231767 119085 1219391 2386550 2956735 2652799
39778 2652799 1844112 1309882 1446181 1859382 1984209 1829255 1740466 1694456 1368570 829839
39768 829839 593908 883394 1258760 1185863 699162 328249 518628 1202488 1832010 1864359
39758 1864359 1342016 881894 931003 1266349 1516125 1846997 2592092 3424111 3622806 3142689
39748 3142689 2668218 2517466 2290832 1822369 1592945 1754173 1613937 781853 76322
39739 76322 407304 1309828 1571964 957301 276879 -35640 -309976 -579391 -240682 895031
39729 895031 2074686 2542292 2365655 1997956 1626594 1292772 1084148 858559 298111
39720 298111 -450434 -745533 -393606 -17686 -67140 -101379 340773 720018 140656 -1266876
39710 -1266876 -2369479 -2373067 -1550004 -655782 -130343 101675 443878 1263914 2416059
39701 2416059 3188884 3024440 2198900 1505874 1393281 1693659 2006300 1973283 1354450 272851
39691 272851 -685127 -997795 -783737 -546885 -496102 -471648 -353256 -87376 529423 1563295
39681 1563295 2523006 2772077 2328620 1709186 1029829 -30544 -1241881 -1569605 -371500
39672 -371500 1644858 3156935 3622257 3510579 3392528 3313754 3077105 2738855 2599563
39663 2599563 2780763 2961867 2671626 1889612 1196127 1130047 1519155 1736970 1566133 1436607
39653 1436607 1727983 2187489 2262582 1810261 1240065 1001237 1083410 1086411 768066 403450
39643 403450 417005 723500 798613 477582 193181 159877 -107254 -942536 -1725586 -1679230
39633 -1679230 -1093441 -855427 -986643 -678808 229832 905726 864841 638632 744898 981440
39623 981440 1202595 1796380 2740459 3112974 2359146 1257085 749125 562831 17002
39614 17002 -482930 -31594 1081928 1613111 1216430 790183 857827 851163 382167 110911
39604 110911 702372 1721492 2263187 2152466 1894710 1804323 1747948 1543768 1187245 808931
39594 808931 659828 940672 1451426 1683356 1474672 1264147 1422282 1649925 1425597 834900
39584 834900 504424 732981 1062979 841727 -2698 -919034 -1404751 -1522463 -1601360 -1554093
39574 -1554093 -873980 534011 1907662 2396745 2014469 1358633 623946 -451359 -1710562
39565 -1710562 -2407866 -2142796 -1368506 -696080 -242736 28546 -72633 -520582 -747396
39556 -747396 -355047 192489 199434 -189006 -181325 537929 1533476 2423980 3270501 4027426
39546 4027426 4266888 3810285 3172192 2939935 2987996 2743565 2090557 1562947 1591094 1905685
39536 1905685 1877554 1276214 502067 120524 303770 722810 891040 617482 202576 164889
39526 164889 681899 1364678 1752221 1935796 2352806 2944345 3016483 2235813 1324994 1268426
39516 1268426 2102827 3046184 3611275 3940751 4169458 4234854 4357179 4866740 5351192 4868407
39506 4868407 3428017 2375313 2636069 3372288 3274087 2535635 2393435 3040369 3302036
39497 3302036 2505851 1516109 1466317 2319920 3238516 3764521 4058842 4346740 4655944 4950081
39487 4950081 5205350 5454586 5846799 6437906 6918210 6929576 6684577 6784478 7342295 7863195
39477 7863195 8122867 8433728 8755059 8423324 7390013 6886718 7875843 9421210 9796176
39468 9796176 8951697 8578335 9606270 10936808 11177297 10562469 10340149 10978438 11891066
39459 11891066 12526178 12840484 12857886 12568026 12320550 12684708 13747606 14967253 15816994
39450 15816994 16225315 16363965 16420490 16646617 17192690 17750064 17775922 17279456 16980568 17388402
39440 17388402 18076827 18281018 17967851 17819250 18209116 18681781 18596215 17944929 17269639
39431 17269639 16916179 16656409 16112712 15384373 15017783 15263495 15551783 15004701 13468551
39422 13468551 11707921 10464284 9710691 9124813 8880532 9348850 10138161 10156872 8885878
39413 8885878 7089875 5921652 5676517 5789741 5738052 5450958 5001447 4459293 4124885
39404 4124885 4426425 5328719 6129681 6126326 5351382 4434731 3852914 3579565 3440855 3482765
39394 3482765 3805864 4258391 4608082 4966625 5677310 6656025 7218810 6916843 6296599
39385 6296599 6322605 7094560 7703641 7515647 7040634 7163984 7952605 8719223 8977652 8774425
39375 8774425 8230424 7359249 6369957 5626648 5186043 4787611 4387908 4266948 4475032
39366 4475032 4623003 4431493 4095779 3889549 3797443 3775884 3954507 4263287 4270748 3782591
39356 3782591 3227415 3014702 2884573 2415893 1818518 1568471 1547679 1340585 1227368 1939455
39346 1939455 3314880 4135870 3686391 2689092 2200951 2277673 2368180 2433743 2833200 3405211
39336 3405211 3518703 3000200 2310206 1743627 1082907 200694 -541890 -783647 -696476 -746124
39326 -746124 -1090477 -1393026 -1168269 -297303 721541 1150388 803106 296262 301804 804892
39316 804892 1417307 2052476 2693842 2788308 1743576 46824 -994911 -868453 -408370
39307 -408370 -425652 -630766 -436087 -18690 161224 264307 642891 984180 794532 415499
39297 415499 612112 1323783 1764222 1701915 1699450 2025810 2266247 2193939 2142224 2247923
39287 2247923 2180497 1948196 2094878 2636931 2668146 1657461 392087 -99717 98933
39278 98933 337013 662047 1477866 2302793 2072777 740429 -444333 -510134 170429 666730
39268 666730 620982 243225 -159223 -155267 780088 2578158 4174021 4393227 3230568 1829783
39258 1829783 1173323 1168137 1121567 734321 296455 85515 17994 -1701 209700 728428
39248 728428 1137089 1030085 778570 1162222 2177777 2919667 2903613 2739353 2970636 3018530
39238 3018530 2139675 856081 313878 493236 286282 -606553 -1115840 -503187 529959
39229 529959 1067492 1339078 2022434 2933166 3374213 3326659 3346974 3543704 3540161 3316370
39219 3316370 3249775 3348736 3237750 2969749 3102355 3792521 4475326 4660962 4449910 4030545
39209 4030545 3322820 2519489 2384156 3394019 4907195 5783128 5689061 5254541 4993774
39200 4993774 4671300 3931085 3086022 2866021 3535795 4630532 5568072 6185435 6542758
39191 6542758 6561910 6263346 6180853 6952182 8357649 9317905 9218753 8789167 9128351 10202570
39181 10202570 11021926 11168443 11316061 12084449 13169809 14011390 14671273 15496521 16377107
39172 16377107 16965115 17332361 17786068 18218222 18267998 18053028 18120173 18647411 19275528 19789232
39162 19789232 20327355 20730316 20355003 18974826 17356493 16394693 15996006 15379526 14274733
39153 14274733 13220792 12724620 12697221 12829046 13035214 13325449 13607088 13842818 14101643
39144 14101643 14227608 13748167 12413953 10640603 9114991 8079706 7268339 6425629 5580390
39135 5580390 4858625 4350881 4197831 4528422 5232905 6006943 6666548 7196215 7462319
39126 7462319 7215234 6553619 6090745 6357462 7198311 8048438 8680787 9328441 10109867
39117 10109867 10753885 11055387 11292464 11937038 13117876 14579774 16003332 17090377 17464795
39108 17464795 16882167 15601217 14225135 13040973 11793452 10270253 8778217 7709054
39100 7709054 6878105 5759360 4317837 3147141 2712588 2879160 3321184 3962443 4749223
39091 4749223 5366095 5542844 5389439 5080833 4457866 3347395 2075627 1194914 819335
39082 819335 702347 858994 1515384 2402347 2729190 2102449 978570 -64224 -1034483
39073 -1034483 -2156344 -3207406 -3704565 -3529330 -2954813 -2207996 -1384607 -671015 -245242
39064 -245242 33453 511006 1259203 1906474 1979905 1335249 335956 -311797 -85374 831851
39054 831851 1715380 2108042 2209583 2303171 2190820 1595813 837392 596147 1112678 2027478
39044 2027478 2875975 3295037 2901800 1586898 -13243 -886130 -673088 36265 518786
39035 518786 617714 539282 419273 323099 342108 478245 665627 977305 1501996 1990205
39025 1990205 2048720 1768210 1663334 1826923 1686561 893319 -56543 -466547 -262866 224270
39015 224270 841680 1477314 1768858 1576972 1456717 1981334 2764754 2843575 1972927 866405
39005 866405 128661 -338380 -704122 -711494 -224627 253940 139455 -443551 -893008 -979145
38995 -979145 -1002022 -1143614 -1120619 -666968 -92160 -70318 -878525 -2024904 -2737643 -2753268
38985 -2753268 -2485563 -2416643 -2491771 -2228303 -1330638 -82173 842004 934329 345173 -168070
38975 -168070 12873 612257 743487 93388 -563627 -383417 372593 736765 411490 54461
38965 54461 144946 276832 -82845 -663800 -722904 -61389 726649 960684 548444 -1810
38955 -1810 -47374 657879 1733138 2477775 2459182 1751465 681497 -388189 -1010445 -789892
38945 -789892 174985 1228084 1779254 1807041 1572571 1160221 646510 436640 900475 1720413
38935 1720413 2079716 1585198 641646 -158318 -630583 -854491 -846849 -689990 -709065 -1133071
38925 -1133071 -1667657 -1738327 -1171261 -379022 160365 370366 464168 624558 943030 1445324
38915 1445324 1934248 1979604 1399996 686552 553835 1015013 1323315 1010814 539268 562983
38905 562983 958052 1158768 1206572 1727181 2842631 3834072 4133050 4023262 3995623 3983406
38895 3983406 3772150 3730242 4453687 5857545 7225025 8104328 8607384 8801077 8364183
38886 8364183 7079895 5329577 3853004 3129580 3037408 2993035 2480874 1615438 1063217
38877 1063217 1188944 1482984 1209393 455829 39022 411847 1192122 1826625 2197946
38868 2197946 2445874 2680395 3028035 3486416 3600031 2850612 1581668 889015 1232716
38859 1232716 1815182 1843512 1727297 2245682 3051472 3015696 1887879 641626 109246
38850 109246 144543 338915 753839 1544193 2456261 3134632 3522386 3651060 3468924 3194220
38840 3194220 3368646 4128163 4815966 4836642 4629620 5250648 7094701 9499469 11561337
38831 11561337 12900105 13579243 13676542 13146768 11984339 10428581 8977747 8028152 7404436
38822 7404436 6501259 5107757 3815312 3263217 3232049 2976182 2319015 1827922 1853113
38813 1853113 1981353 1683101 1031641 457738 162560 157076 604262 1642604 2914378
38804 2914378 3642364 3280511 1977525 458994 -433732 -269616 625404 1409416 1560756
38795 1560756 1424928 1688466 2407006 2929723 2791633 2222939 1597830 859103 -85406
38786 -85406 -756528 -571549 107640 109923 -1028987 -2237101 -2163199 -947472 -24375 -203497
38776 -203497 -730526 -545607 249121 807176 928906 1153587 1564985 1428500 329646
38767 329646 -1029933 -1673420 -1511463 -1133632 -819015 -406885 39999 150588 -140705
38758 -140705 -506408 -856873 -1435538 -2057175 -1921111 -700491 664653 939694 141452
38749 141452 -552661 -377785 211309 416461 116814 -323190 -745047 -1206369 -1601676 -1759815
38739 -1759815 -1759851 -1716656 -1389169 -499459 585687 1026436 513115 -328486 -717723 -500932
38729 -500932 64983 831051 1612496 1890809 1300223 333850 -45562 389678 845395 642264
38719 642264 143173 147903 727339 1211210 1208669 1055981 1112331 1094281 478982 -644744
38709 -644744 -1517699 -1532658 -886358 -334514 -430077 -1075683 -1733492 -1975359 -1833254 -1657963
38699 -1657963 -1674265 -1740099 -1585215 -1197293 -833713 -691497 -746578 -910428 -1096822 -1081233
38689 -1081233 -635382 -5218 122910 -447332 -830420 -43139 1503638 2261944 1498522
38680 1498522 254778 -79552 512803 1051888 1125159 1140006 1215876 873623 64204 -367922
38670 -367922 228365 1317531 1837762 1528106 1055312 978207 1112104 995494 632519 545793
38660 545793 1129468 2056571 2467120 1853403 641164 -306889 -623527 -544448 -233209 421671
38650 421671 1227765 1514267 912311 -82943 -698556 -722173 -430854 -31059 416002 775319
38640 775319 958594 1059985 1033842 530189 -534897 -1554339 -1884941 -1662089 -1400220
38631 -1400220 -1053593 -204848 932093 1522582 1260633 812363 881120 1408106 1942500
38622 1942500 2263388 2338181 2129684 1762673 1510904 1359889 946468 157078 -610503 -1011201
38612 -1011201 -1137480 -1074359 -590813 278401 793266 270816 -910718 -1633319 -1322985
38603 -1322985 -478602 72888 72042 -89073 74616 592233 983146 797526 204282 -178843
38593 -178843 -78505 170139 314917 700733 1706412 2990252 3779931 3757071 3225206
38584 3225206 2524813 1740567 970416 459619 348865 515491 716674 775525 709445 789356
38574 789356 1286249 2015661 2425678 2359775 2344855 2757256 3149828 2996090 2708973 3075153
38564 3075153 3830918 3771040 2455285 937622 405492 802420 1287512 1436355 1330744
38555 1330744 890247 -89972 -1306136 -2003363 -1818053 -1169587 -668152 -421448 -107934
38546 -107934 436392 926761 958572 536667 158709 309346 947462 1593870 1832632 1562472
38536 1562472 870590 -31624 -736717 -843061 -388791 126451 295907 224060 288597 639095
38526 639095 1027412 1020097 366380 -667891 -1341938 -1073284 -77512 873852 1355252 1620114
38516 1620114 1976203 2261417 2184441 1838450 1543532 1387789 1219057 944884 593806 193482
38506 193482 -224464 -604852 -949583 -1235421 -1208836 -595867 361260 989882 1036186 985509
38496 985509 1221005 1375996 1034129 597307 732580 1263417 1449344 1241335 1336116 1869813
38486 1869813 1989500 1131582 -34431 -511426 -267684 4362 7646 740 45865 -154131
38476 -154131 -611621 -874043 -696412 -404533 -296875 -89000 615204 1524575 1850390 1328245
38466 1328245 607803 427598 763461 1126441 1406099 1871474 2411278 2444209 1837962 1328383
38456 1328383 1529746 1956955 1679101 686314 -159876 -480480 -835557 -1625719 -2371266
38447 -2371266 -2561199 -2505569 -2639839 -2510355 -1351630 549253 1991412 2407467 2419575
38438 2419575 2641113 2772908 2373581 1816330 1745118 1992586 1829693 1127285 494443 221268
38428 221268 -170448 -1035397 -1842517 -1756996 -696851 558645 1160303 865003 127258
38419 127258 -263986 136352 876986 965568 21759 -1199255 -1736790 -1549898 -1280905 -1228658
38409 -1228658 -1197524 -1181768 -1414500 -1676588 -1347934 -444276 71881 -528230 -1724679 -2368554
38399 -2368554 -1964981 -956306 -88433 100111 -491799 -1352106 -1685225 -1323534 -1001708
38390 -1001708 -1316156 -1814144 -1663905 -840122 31973 667420 1138722 1155879 322602 -883672
38380 -883672 -1376711 -911247 -361773 -267947 -48915 819068 1704072 1652836 752064 -88719
38370 -88719 -316528 -16670 634327 1459481 1999781 1819800 1083621 363888 -40990 -215642
38360 -215642 -254261 -227564 -318497 -512489 -372188 345470 1067404 1011740 247439 -491792
38350 -491792 -858957 -982516 -650808 589278 2372482 3550224 3661087 3465070 3525323
38341 3525323 3195427 1805003 68711 -754729 -678895 -840226 -1645021 -2152696 -1507186
38332 -1507186 -70158 1257388 2111161 2556828 2479149 1744448 742775 185553 345629
38323 345629 834377 1120939 1002111 587836 115107 -158504 -91727 206489 489919 658043
38313 658043 805655 979512 1087171 1164426 1523282 2336732 3122277 3019889 1799228 330681
38303 330681 -303928 -77257 2264 -791494 -2033759 -2786167 -2679819 -2003911 -1072527 -49012
38293 -49012 768907 1107290 1189101 1474904 1818213 1499009 379761 -588649 -517872 233292
38283 233292 634814 389453 41651 -95813 -277401 -572587 -646270 -539803 -852336 -1681109
38273 -1681109 -2111137 -1448559 -431288 -390032 -1498928 -2697807 -3200883 -3164996 -2802371
38264 -2802371 -1833149 -274243 1018421 1286731 891999 733517 946244 867890 180007
38255 180007 -605252 -890705 -680125 -330124 -24674 283473 689114 1268426 1969738 2451877
38245 2451877 2281736 1435107 389005 -380991 -750953 -743774 -374126 89553 121750 -411723
38235 -411723 -894590 -687386 13658 531538 717802 971526 1309902 1187319 475724 -78497
38225 -78497 146967 711478 748779 192313 -256857 -162499 304202 938091 1679641 2147247
38215 2147247 1749580 597498 -313662 -300629 103865 -16599 -612826 -836274 -366244
38206 -366244 192796 325721 312723 595249 990232 1053470 923181 1212227 2061840 2772828
38196 2772828 2567608 1466966 229682 -422079 -346592 133241 666838 1159453 1734112
38187 1734112 2471447 3186954 3539741 3449053 3299634 3512992 3930647 3919673 3199112 2236432
38177 2236432 1578317 1119907 472345 -202479 -374163 -132158 -250832 -1005992 -1598036
38168 -1598036 -1236881 -280342 307973 251966 41981 -8213 -11208 105781 657281 1483054
38158 1483054 1850352 1359387 453535 -218203 -500081 -570517 -550833 -557031 -740768 -997566
38148 -997566 -985028 -640696 -269210 67902 681538 1463921 1637913 866748 31233 131061
38138 131061 819394 917304 182513 -385845 -65509 644797 877393 494352 -46270 -413172
38128 -413172 -586147 -640122 -681872 -827196 -1071315 -1341895 -1677945 -2058336 -2101050 -1412309
38118 -1412309 -309592 337549 195938 -100405 119611 690237 1028833 993626 873048
38109 873048 842026 871445 919448 805202 172865 -962234 -1897506 -2002634 -1597105 -1499754
38099 -1499754 -1844870 -1989129 -1570058 -965564 -551984 -159215 413219 857903 757444
38090 757444 189850 -429836 -852940 -1029032 -921452 -671631 -710903 -1262918 -1867441 -1851009
38080 -1851009 -1212023 -566754 -193215 342822 1386982 2475543 2833891 2387556 1863811
38071 1863811 1913467 2452827 2926185 2955736 2596709 2110320 1664616 1259101 856305 511885
38061 511885 310675 187792 -38847 -352682 -392221 172230 1162814 1999943 2259226 1912052
38051 1912052 1082582 -48012 -993722 -1057889 -44431 1331542 2098098 1997113 1537310
38042 1537310 1249336 1264649 1515571 1852154 1895120 1258907 146865 -649272 -617996 -99795
38032 -99795 285321 460330 724016 990359 763523 -82060 -978428 -1323101 -1126115 -770703
38022 -770703 -414255 51007 599225 986457 1061834 902015 615190 238078 -157934 -515239
38012 -515239 -985378 -1761191 -2589236 -2808448 -2144940 -1149853 -474910 -12746 714144 1536584
38002 1536584 1752828 1297246 1019680 1498901 2241871 2485680 2198353 1756641 1196931
37993 1196931 487737 104543 490836 1178100 1286971 811604 588565 1021191 1688675
37984 1688675 2262399 2858081 3258265 2788191 1463435 396779 396507 835888 630726 -220203
37974 -220203 -847105 -828022 -472757 -58001 407934 764268 773285 613989 698675 1011072
37964 1011072 1176011 1133152 1146658 1163085 810238 145716 -201429 134581 743716 979892
37954 979892 641462 -42338 -730783 -1118785 -1113045 -1011363 -1185290 -1478553 -1289012 -384936
37944 -384936 740315 1500433 1827449 1948618 1944422 1836004 1809172 1999551 2232977 2275661
37934 2275661 2211583 2310073 2603434 2812594 2659374 2142735 1578282 1413469 1853605 2607373
37924 2607373 3178601 3455831 3754559 4172662 4235793 3464409 2090452 892713 387870
37915 387870 429126 566187 567058 534541 649102 886462 997460 773693 284862 -228335
37905 -228335 -628659 -884253 -860066 -398099 326231 825983 873567 838657 1225827 2011963
37895 2011963 2683612 2861296 2646502 2352926 2138099 2022640 2105701 2508679 3058875 3247559
37885 3247559 2722369 1740067 877955 341893 -84226 -382591 -137184 681978 1308703
37876 1308703 1130951 698263 1070769 2307791 3324701 3251478 2249686 951392 -136367
37867 -136367 -502210 230016 1571464 2274928 1765837 958667 1038015 1844268 2164450 1398262
37857 1398262 248315 -225537 309344 1397561 2411423 3061431 3455243 3739761 3747302
37848 3747302 3190734 2205416 1361292 1041041 1164268 1599946 2329260 3007128 3000211 2277646
37838 2277646 1691203 1849574 2246175 2113576 1624754 1479601 1700083 1702510 1332923 970009
37828 970009 725977 387577 96670 246513 664976 705887 247391 -153686 -190107 -118639
37818 -118639 -54495 209381 503783 291057 -333661 -545169 -120374 13954 -837879 -1999422
37808 -1999422 -2392907 -2004792 -1576260 -1349928 -1013507 -556936 -278502 -79401 397323
37799 397323 922869 765564 -219706 -1219213 -1410309 -806625 51773 815274 1449671 1945384
37789 1945384 2202610 2099864 1537591 533488 -621260 -1410882 -1418769 -617973 604094
37780 604094 1637473 1977039 1580530 950065 726130 1119412 1757461 2075013 1829303
37771 1829303 1288024 974985 1207454 1838578 2432088 2627595 2316454 1644646 1029792
37762 1029792 992841 1619198 2250551 2119245 1319960 731441 897303 1467579 1922789 2303087
37752 2303087 2843206 3343580 3424243 3140732 2869954 2768993 2776136 2958015 3377161 3728611
37742 3728611 3582551 2958904 2273259 1781418 1472492 1405878 1659525 1969976 1952147 1735645
37732 1735645 1841019 2280246 2359811 1703239 962321 1007555 1727141 2208367 1999322 1598812
37722 1598812 1592201 1851540 1942879 1946371 2331168 3108255 3667288 3614065 3298807 3210641 3260417
37711 3260417 3104824 2821857 2647938 2299773 1375006 387767 434920 1527521 2201066
37702 2201066 1424932 138321 21143 1233827 2336794 2220622 1169190 37013 -703188
37693 -703188 -871758 -310085 876468 2205714 3226948 3785708 3826248 3318586 2491906
37684 2491906 1782181 1423282 1351054 1494527 1808284 2045973 1924912 1531957 1167343 835056
37674 835056 379875 80947 474147 1482563 2349682 2627339 2638705 2745644 2800697 2680838
37664 2680838 2768174 3394136 4197089 4491816 4020080 3031510 1932285 1124082 835814
37655 835814 831349 627707 228906 218994 889566 1779243 2370622 2683851 2837808 2690552
37645 2690552 2413582 2713561 3770309 4582153 4240312 3349381 3188320 3826353 4177354
37636 4177354 3749409 3164724 2875599 2525778 1917786 1594540 1935516 2461105 2591749
37627 2591749 2470655 2473013 2416174 1861895 888110 54599 -210634 124546 780398 1232572
37617 1232572 1020264 326598 -21164 542462 1649137 2499802 2761854 2674769 2564682
37608 2564682 2628297 2985244 3578637 4152589 4587925 5073264 5691703 6079735 5815321 4950516
37598 4950516 3869687 2849820 2075533 1803487 2061673 2378218 2297456 2063063 2312758
37589 2312758 3153215 4027133 4498160 4663849 4713144 4593720 4332201 4233197 4426075 4516701
37579 4516701 4054236 3185390 2509417 2326402 2305535 1952166 1227899 611181 613500 1315775
37569 1315775 2355222 3247997 3646942 3421290 2759923 2231365 2411966 3222452 3864711
37560 3864711 3713029 3097027 2857788 3262282 3790995 3973582 3941424 3996646 4061507 3866988
37550 3866988 3460634 3236820 3527066 4281868 5054886 5253164 4601706 3475119 2615337
37541 2615337 2442836 2790880 3289396 3700479 3830857 3527915 2980690 2683691 2846125
37532 2846125 3139888 3272683 3437397 3862447 4317295 4523405 4684882 5035273 5191888
37523 5191888 4697348 3986073 3934578 4484770 4684823 4281702 4229799 5114095 6041335 5924815
37513 5924815 5128296 4801777 5055313 4958925 4211562 3614056 3675123 3822556 3482357 3055316
37503 3055316 3138610 3444814 3343060 3106912 3711161 5387306 7141205 7941513 7860800
37494 7860800 7736456 8072023 8631695 8916943 8678522 7996696 7167321 6597234 6587158 7034129
37484 7034129 7439866 7389801 6990294 6657113 6508053 6251714 5755913 5356753 5307857 5242008
37474 5242008 4686181 3966512 3973473 4931778 6013266 6448459 6460176 6646410 6923497 6744509
37464 6744509 6120979 5701696 5824334 6126431 6251705 6385985 6819083 7425880 7943140
37455 7943140 8435410 9073605 9640071 9689952 9198034 8705462 8724984 9189011 9550912 9293509
37445 9293509 8321993 7055102 6225252 6380452 7325428 8102287 7823418 6665532 5825105
37436 5825105 6248883 7535991 8403259 8181642 7450977 7114306 7323327 7646417 7908010
37427 7908010 8325164 8965925 9626447 10271906 11094451 11985625 12406446 12076325 11494345
37418 11494345 11439322 12068974 12762835 12817430 12146513 11323311 11017744 11377633 11971532 12376680
37408 12376680 12671993 13132637 13592258 13551451 12985727 12596249 13000181 13975070 14781739
37399 14781739 15017594 14901473 14909287 15374905 16285655 17241911 17759161 17779409 17692532 17721383
37389 17721383 17629642 17301274 17201819 17782453 18716323 19322989 19607143 20224252 21397671
37380 21397671 22520551 23013399 22997661 22840797 22585238 22286495 22510500 23873595 26159093
37371 26159093 28376237 29786716 30580681 31467346 32838233 34437719 35699369 36318111
37363 36318111 36608847 37369010 39255984 42176533 45365305 48188528 50788851 53735973
37355 53735973 57097539 60262883 62944920 65996805 70627954 76796469 83005627 88032325
37347 88032325 92421872 97824147 105148945 113886896 123059454 132240380 141639975 151765740
37339 151765740 163204869 176338811 191052062 206994064 224242765 243373370 264708429
37332 264708429 287842273 312141281 337389594 363549379 389948500 414946755 436411177
37325 436411177 452484433 462086107 464906303 461001620 450499656 433832041 412122620
37318 412122620 387000452 359963184 332138501 304565870 278217885 253579882 230582639
37311 230582639 209121662 189316873 171185872 154569005 139610183 126795186 116160320
37304 116160320 106934248 98374044 90500476 83558867 77290661 71393218 66224907 62192390
37296 62192390 58720787 54796807 50478339 46890217 44565899 42706022 40394309 37702573
37288 37702573 35130996 32724726 30383331 28429494 27079925 25717745 23522863 20737235
37280 20737235 18571516 17747063 17700259 17425845 16648277 15856701 15478131 15393340 15220039
37271 15220039 14778659 14155256 13448933 12659297 11839859 11164982 10700771 10243542 9581000
37262 9581000 8826528 8285613 8075284 8109419 8342250 8698533 8868930 8624311 8316790 8543513
37252 8543513 9217422 9537579 9090515 8379631 7912948 7405152 6487434 5688537 5864941
37243 5864941 6853382 7538527 7336603 6895770 7094679 7920938 8672149 8856693 8522105
37234 8522105 7925661 7232843 6510437 5840816 5403320 5377420 5636967 5645048 4949953 3815368
37224 3815368 3070220 3227339 3968701 4580655 4661064 4297940 3811099 3502675 3475844 3501846
37214 3501846 3191061 2478802 1853369 1918624 2750737 3819783 4546870 4833588 5010754
37205 5010754 5341047 5669902 5611471 5024407 4201772 3596448 3472763 3810067 4339867 4617144
37195 4617144 4316302 3647255 3283018 3652727 4449400 5022748 5069345 4723108 4216654 3781481
37185 3781481 3674521 3920227 4180159 4244245 4441051 5102779 5855044 6072106 5928631 6262676
37175 6262676 7325579 8411841 8954675 9281829 9911491 10705964 11200356 11318286 11292920
37166 11292920 11233103 11198761 11396252 11880568 12302997 12290674 11832328 11038364 9885198 8517225
37156 8517225 7407957 6826627 6496257 6157244 6061938 6462686 7026620 7286574 7292308 7266798
37146 7266798 7047485 6551580 6397202 7211139 8539744 9311760 9274098 9109960 9188439 9136299
37136 9136299 8763963 8494081 8592068 8786668 8994065 9641598 10817360 11784428 11918870
37127 11918870 11648193 11899571 12949160 14307288 15502694 16549882 17763630 19390167
37119 19390167 21338066 23209312 24819635 26653447 29372521 32842967 36208746 39089888
37111 39089888 42121304 46049206 50889704 56327741 62339982 68902997 75523235 81574910
37103 81574910 86819619 91254624 94830794 97620875 99733113 100636703 99160260 94769177
37095 94769177 88401157 81464802 74498325 67452858 60710331 54851972 49716682 44682090
37087 44682090 39815821 35862467 33042193 30649003 27966168 24945889 21917074 19220168
37079 19220168 17162860 15751028 14469915 12921238 11585877 11228637 11588997 11503786 10439840
37070 10439840 9085447 8236056 7906526 7798499 7812781 7713468 7045713 5855507 4857951
37061 4857951 4481737 4391662 4343354 4732410 5714323 6511990 6356005 5562106 4911656 4453595
37051 4453595 3769925 3057678 2994960 3626207 4199617 4166266 3735042 3427471 3590951 4272725
37041 4272725 5053727 5135618 4185568 2993416 2649712 3140199 3477120 3250166 3229857 4159482
37031 4159482 5663281 6801448 7197592 7140714 6944181 6716993 6579222 6621194 6630846 6167299
37021 6167299 5008920 3449589 2153767 1734161 2367017 3719653 5238952 6491476
37013 6491476 7251046 7452544 7216366 6767794 6145869 5167450 3924456 3092071 3320206
37004 3320206 4393173 5414191 5822790 5833301 5860877 5974709 6045057 6019925 5862194 5536800
36994 5536800 5239984 5341200 5898737 6474307 6608877 6305649 5956807 6003367 6683033 7788557
36984 7788557 8610914 8503865 7650881 6917198 6807155 6993808 7079694 7299125 8019753 8918217
36974 8918217 9222353 8677693 7842784 7440015 7727643 8504747 9465127 10465290 11522741
36965 11522741 12568233 13312682 13603383 13845959 14647318 15967828 17122508 17801275 18525204
36956 18525204 19776960 21286373 22673205 24216683 26311085 28642955 30724675 32888030
36948 32888030 35828461 39379345 42758545 46025108 50258349 56083583 62964307 70284047
36940 70284047 78260959 87384123 97788856 109741803 124017766 141183954 161137853
36933 161137853 183960073 210562080 241688793 276675206 313681783 350223464 382253284
36926 382253284 403423916 407401189 392105963 361402055 322459315 281852779 243724867
36919 243724867 209939076 180672489 155185055 132955119 114267434 99471733 87907276
36912 87907276 78052146 68795535 60276893 53346233 48322800 44455677 40683588 36752962
36904 36752962 33209838 30269045 27326437 24028324 21190040 19770334 19273721 18262487
36896 18262487 16420748 14919491 14463103 14204683 13223252 11945343 11167118 10600077 9561760
36887 9561760 8444412 8165708 8488497 8211716 6974720 5640636 4790688 4031180 3071442
36878 3071442 2370504 2255756 2351619 2390886 2734038 3535369 4205570 4327599 4366403 4792401
36868 4792401 5208013 5126373 4972933 5391434 6048358 6132833 5723133 5605463 5862334 5691018
36858 5691018 4725865 3618956 3074311 3067329 3269108 3549082 3765399 3675140 3369881 3263833
36848 3263833 3367953 3135467 2373458 1764948 2029928 2979813 3850690 4221204 4145659 3696967
36838 3696967 2917847 2084420 1558373 1421758 1566901 2013047 2774485 3514542 3729928
36829 3729928 3319954 2711226 2392642 2498051 2782098 2805192 2228595 1171649 225397
36820 225397 -128647 -79454 -235263 -839916 -1490611 -1656614 -1241088 -555231 67137 502035
36810 502035 787962 977695 1064046 1044630 1022356 1149593 1454500 1840204 2293815 2926506
36800 2926506 3691740 4215945 4080405 3210893 1910323 633096 -207221 -447431 -392818
36791 -392818 -623479 -1321164 -1943561 -1864355 -1220948 -776220 -953850 -1349746 -1295863 -671612
36781 -671612 -22020 36610 -522265 -1050299 -889453 -158043 355737 229447 13665 459969
36771 459969 1413773 1987898 1728118 1062624 589499 469798 628528 995879 1316453 1221027
36761 1221027 815598 793608 1597851 2783541 3557420 3664249 3395956 3017489 2607189
36752 2607189 2255088 1978198 1565087 911003 411137 621489 1576906 2787456 3812929
36743 3812929 4454622 4513165 3926004 3209392 3178657 3924596 4459901 3748620 1888614 -5678
36733 -5678 -930671 -736272 113402 1151753 2172822 3086007 3754234 4096340 4276385 4555399
36723 4555399 4846742 4679621 3902003 3224632 3595095 5033710 6578537 7504904 8084120
36714 8084120 8864090 9739865 10297185 10766262 11942732 14136648 16746718 19036179 20909848
36705 20909848 22689484 24427766 25739118 26173577 25537963 23928629 21638906 19029850
36697 19029850 16381457 13850766 11578760 9751896 8482639 7663323 6993882 6163405
36689 6163405 5045479 3802354 2809994 2392832 2560216 2976671 3149162 2664324 1432622
36680 1432622 -123754 -1241338 -1444876 -1031114 -722809 -838752 -1048905 -964443 -625398
36671 -625398 -246240 186773 751329 1220246 1207642 640963 -155667 -799880 -1075053 -937599
36661 -937599 -589322 -469348 -833966 -1324051 -1259012 -413721 776160 1799429 2490751
36652 2490751 2783334 2505514 1738142 1048243 973437 1430224 1920995 2113043 1881485 1069364
36642 1069364 -224448 -1231915 -1076785 82410 1050910 1035820 587020 712390 1511471
36633 1511471 2243409 2439639 2285029 2028520 1742986 1742985 2490525 3732176 4336180 3541408
36623 3541408 2016279 1116786 1302972 1854054 2032594 1883682 1779773 1779860 1769548 1833103
36613 1833103 2090998 2375400 2396586 2102915 1610529 918349 8077 -840205 -1164991 -816997
36603 -816997 -120364 500380 862325 969938 871333 719097 803655 1293425 1940043 2212309
36593 2212309 1839535 1188615 981654 1565047 2518322 3088587 2967985 2496959 2131106
36584 2131106 1941452 1719732 1353382 939869 684752 808578 1364107 2012069 2229853
36575 2229853 1941624 1646007 1637725 1475125 708567 -203425 -454643 -243579 -654669 -1976518
36565 -1976518 -3030918 -2717103 -1517302 -733629 -736597 -855084 -734884 -791031 -1200022 -1373597
36555 -1373597 -884341 -254723 -223763 -608899 -531885 344114 1365898 1739351 1379266 738475
36545 738475 146223 -373407 -797044 -971488 -844133 -619813 -594107 -928617 -1612751 -2489508
36535 -2489508 -3241156 -3510025 -3180228 -2455134 -1576361 -635706 209405 604522 404641
36526 404641 30369 681 196518 73723 -377905 -456395 248777 1160262 1371702 671045
36516 671045 -419204 -1318634 -1747877 -1670749 -1289971 -994140 -1027775 -1316522 -1741530 -2273209
36506 -2273209 -2637624 -2320027 -1317319 -463817 -472354 -1021280 -1400752 -1660169 -2268348 -2892771
36496 -2892771 -2577304 -1239967 -28768 121917 -505288 -1144645 -1442785 -1194927 -70059
36487 -70059 1663974 2783429 2337648 897682 -148897 -244387 137457 634791 1382749
36478 1382749 2231015 2513231 1973911 1283461 1178644 1527970 1715160 1636187 1762526 2286232
36468 2286232 2729003 2587754 2020289 1576931 1431394 1279335 1006350 987604 1441022 1860538
36458 1860538 1606684 904131 648460 1141906 1595068 1162419 28066 -909202 -1123051
36449 -1123051 -838037 -516398 -369005 -356000 -401651 -527610 -787469 -1011457 -739189 278433
36439 278433 1534264 2139801 1814249 1050116 240050 -696860 -1563255 -1557598 -353729 1050361
36429 1050361 1341814 443009 -624710 -1100675 -944913 -226851 987343 2125479 2368715
36420 2368715 1639507 691781 86430 -288553 -582312 -616658 -418790 -422135 -754299 -910896
36410 -910896 -569352 -225270 -522701 -1310846 -1862495 -1820627 -1502624 -1351315 -1381740 -1178145
36400 -1178145 -382923 720532 1230451 556191 -773419 -1712782 -2056389 -2533415 -3451320
36391 -3451320 -4038403 -3519105 -2152469 -697142 532805 1469374 1732130 1085179 139977
36382 139977 -175643 291517 985494 1580894 2134727 2436382 2032951 1022692 146207
36373 146207 -113210 6623 115396 140888 20372 -534684 -1608012 -2761722 -3464711
36364 -3464711 -3603104 -3355877 -2820240 -1990490 -934503 156705 942085 954551 1106
36355 1106 -1350248 -2081088 -1778632 -1091403 -895677 -1328794 -1951042 -2502107 -2974448 -3119740
36345 -3119740 -2523837 -1307963 -267933 -37837 -421704 -826621 -1073773 -1376154 -1674166
36336 -1674166 -1549783 -947164 -495086 -725201 -1263576 -1296196 -714957 -230950 -288502 -482953
36326 -482953 -352586 -172404 -408725 -782645 -606715 64100 364288 -162465 -907786 -1040554
36316 -1040554 -487377 277642 955661 1436717 1416222 643409 -459304 -979769 -535610
36307 -535610 207972 271200 -565987 -1624540 -2148448 -2033736 -1719122 -1557951 -1485956 -1279711
36297 -1279711 -928984 -609056 -398028 -219477 -22939 205187 619578 1422517 2455717
36288 2455717 3125605 2969484 2176031 1355774 930307 967000 1449384 2316419 3198526 3494985
36278 3494985 2964009 2092919 1682369 2086962 2946021 3605688 3717229 3420092 2973568
36269 2973568 2297400 1087115 -505702 -1608048 -1471572 -497579 117121 -133860 -498942
36260 -498942 -159698 627570 1136554 1396654 1977951 2794422 3073582 2584552 1995642 1756741
36250 1756741 1485179 876829 388657 383041 322160 -370251 -1204499 -1311409 -852756 -754636
36240 -754636 -1238877 -1627569 -1535869 -1224001 -720397 289628 1455227 1783748 1179829
36231 1179829 905345 1766508 2745840 2382787 869452 -251575 -102554 769725 1419636
36222 1419636 1384534 635321 -516785 -1404981 -1531894 -1124571 -667471 -83960 945945
36213 945945 2063817 2506365 2275870 2124705 2261265 2034142 1210655 603487 844839
36204 844839 1327916 1119310 373128 27655 410589 933127 1074284 982770 1017214 1183818
36194 1183818 1185553 771633 8047 -622494 -521749 354599 1288185 1608925 1555379 1845115
36184 1845115 2455771 2469625 1357314 -142370 -887784 -734920 -518879 -801219 -1283795
36175 -1283795 -1556960 -1757440 -2070613 -2104007 -1429695 -512012 -335997 -1081923 -1890500 -2118308
36165 -2118308 -2066170 -2086279 -1762461 -694102 502919 902189 646793 651628 1065678 1081600
36155 1081600 395127 -205671 -129950 55002 -385873 -1075747 -1038904 -154330 648286 570638
36145 570638 -227221 -1007328 -1274998 -1134508 -1010645 -1081452 -1051895 -656417 -236298 -341154
36135 -341154 -760302 -633079 201719 679498 -98034 -1498795 -2122739 -1573598 -672517
36126 -672517 -95745 312280 767666 911931 367429 -543810 -1067309 -821937 -114090 395481
36116 395481 209177 -624010 -1485751 -1702943 -1239174 -768538 -925948 -1566813 -1938337 -1584857
36106 -1584857 -894575 -594513 -834789 -1115258 -1168966 -1417590 -2149134 -2692155 -2170972 -934208
36096 -934208 -331659 -912467 -1732128 -1816472 -1426862 -1256899 -1185929 -713690 -58366 164065
36086 164065 4795 -42868 -93960 -693100 -1685454 -2273852 -2225495 -2022774 -1717033 -737626
36076 -737626 818401 1798428 1537087 920958 1133606 1982831 2329645 1761204 957646
36067 957646 558499 466303 344810 185425 156144 248647 293552 191166 33218 19943
36057 19943 214183 389250 285021 12071 -75493 41025 -27933 -399985 -574017 -93882
36047 -93882 753220 1291831 1295859 1086951 977775 1042465 1333738 1865266 2347239 2341314 1801418
36036 1801418 1161331 747365 357105 -382867 -1393304 -2096396 -1994123 -1181653 -255963
36027 -255963 241567 268372 200044 369399 720808 895862 622609 13695 -550193 -881005
36017 -881005 -1234123 -1884134 -2480134 -2217032 -863979 738679 1586644 1641354 1590000 1712416
36007 1712416 1614671 1034462 230732 -565240 -1460482 -2404850 -2939127 -2794086 -2320814 -1993402
35997 -1993402 -1864255 -1821049 -1958631 -2281000 -2376129 -1844100 -844828 116200 708046 804007
35987 804007 365250 -305891 -570613 -221885 66708 -366613 -1115244 -1243574 -728689 -556685
35977 -556685 -1290682 -2296906 -2688103 -2420840 -2032110 -1731329 -1267385 -501403 331890
35968 331890 907241 1056072 731989 -12297 -923409 -1593812 -1785069 -1691340 -1722139 -1934871
35958 -1934871 -1838794 -990495 298618 1192465 1318464 1138280 1155615 1189606 837054 325559
35948 325559 307711 844402 1141030 488469 -857670 -1941914 -2085452 -1461409 -796497
35939 -796497 -615355 -808374 -953836 -942854 -1015603 -1164136 -917654 4971 1148289 1779944
35929 1779944 1658468 1004832 26378 -1020189 -1546569 -1115332 -210581 128468 -391237
35920 -391237 -941133 -736619 -70320 185737 -248396 -807636 -839970 -279418 388757 603997
35910 603997 177188 -584576 -1143217 -1133111 -550245 303767 964054 1066350 681662 261475
35900 261475 50945 -224521 -772287 -1112619 -626373 352782 664228 -273453 -1722123
35891 -1722123 -2553454 -2452826 -1881639 -1281246 -782374 -460383 -400439 -537511 -731379 -982660
35881 -982660 -1370967 -1827814 -2155184 -2245542 -2162457 -2045950 -2023768 -2150910 -2356861 -2497105
35871 -2497105 -2477986 -2260792 -1775230 -982373 -37856 752214 1165429 1161420 807973 260329
35861 260329 -259443 -649316 -1032083 -1519430 -2015445 -2438468 -2882363 -3255053 -3095952 -2263248
35851 -2263248 -1486527 -1496929 -1775024 -1073136 733080 2243993 2279923 1162646 -145735
35842 -145735 -1283553 -2215008 -2497826 -1740172 -397531 657894 1095535 1056835 538538
35833 538538 -406788 -1181994 -1199143 -773497 -702259 -1086577 -1361546 -1386355 -1591203 -1977806
35823 -1977806 -1932314 -1340308 -1021259 -1534108 -2223959 -2102676 -1246077 -642867 -838347 -1326581
35813 -1326581 -1314557 -652579 137290 505508 370429 55478 -101292 19690 412501 1048290
35803 1048290 1742754 2080264 1710045 699833 -534422 -1565984 -2111293 -2058549 -1618718
35794 -1618718 -1309969 -1461764 -1773473 -1642827 -904699 -9445 471270 292980 -391924
35785 -391924 -1148837 -1552790 -1604636 -1688649 -1894764 -1737966 -976578 -312277 -583279 -1496119
35775 -1496119 -1966541 -1631167 -1132904 -859935 -416935 319114 603243 -88599 -1122323
35766 -1122323 -1569354 -1436965 -1316439 -1306229 -1117847 -915786 -1139650 -1572605 -1434010 -535001
35756 -535001 324743 336985 -420363 -1268326 -1720707 -1798757 -1837293 -2132003 -2593000 -2719386
35746 -2719386 -2143036 -1180962 -561762 -596125 -920596 -1087316 -1075777 -1137590 -1450119 -2055011
35736 -2055011 -2862236 -3553159 -3715007 -3269738 -2627979 -2263774 -2232628 -2202042 -1857419 -1222089
35726 -1222089 -684765 -707331 -1311471 -1836752 -1493078 -301601 763928 805003 -9513
35717 -9513 -739356 -821215 -573258 -555330 -793685 -840429 -396123 362277 997703 1180086
35707 1180086 898084 474031 306623 404245 257328 -518964 -1446696 -1551937 -645070 271260
35697 271260 301849 -67831 323851 1575232 2553305 2538271 2132014 2134801 2347408 2197861
35687 2197861 1945382 2306021 3111174 3298745 2361356 1058956 451916 800167 1662095
35678 1662095 2541113 3085336 3065227 2556527 1921795 1360321 735386 46648 -310211 -106626
35668 -106626 229543 144517 -245459 -387727 -193426 -154163 -540122 -1016131 -1218591 -1245873
35658 -1245873 -1305079 -1265943 -951916 -619338 -712568 -1254814 -1897414 -2522451 -3310851 -4107763
35648 -4107763 -4245374 -3370015 -2084209 -1254264 -876257 -262865 629171 822991 -292508
35639 -292508 -1788104 -2160250 -1257461 -419444 -589951 -1119141 -927775 -198637 -41995
35630 -41995 -679513 -917694 245375 2174325 3350744 3230856 2686113 2636048 2900268
35621 2900268 2697244 1836296 948207 680665 1068709 1690582 2100822 2039202 1522665 900383
35611 900383 604349 653906 553825 -118365 -1114785 -1701519 -1420018 -533380 257993 428525
35601 428525 -11468 -629609 -1006538 -1091976 -1123866 -1235215 -1286173 -1123525 -825458 -582037
35591 -582037 -500581 -645944 -1061224 -1567489 -1770474 -1520634 -1149718 -945441 -643144 112069
35581 112069 996230 1288225 858962 228698 -405015 -1415655 -2733380 -3384715 -2677376
35572 -2677376 -1285126 -410322 -253454 -138534 102586 -104547 -834367 -1205319 -665898
35563 -665898 27423 -159336 -983941 -1220832 -379923 649904 839712 246686 -397709
35554 -397709 -838922 -1387958 -2001506 -2028516 -1198893 -318664 -365538 -1117520 -1388757 -680993
35544 -680993 130566 84070 -571403 -959383 -940781 -1071234 -1432341 -1423321 -808606 -172056
35534 -172056 -68640 -373740 -736018 -1018232 -966341 -170684 1104757 1701646 887050 -578935
35524 -578935 -1440586 -1595028 -1868317 -2446306 -2600363 -2013385 -1350029 -1195482 -1280734 -1191471
35514 -1191471 -1111720 -1313665 -1484052 -1180814 -582894 -200856 -88071 139080 657089 1249229
35504 1249229 1631465 1610710 1097567 324288 -133922 68394 618206 1025285 1278826 1591608
35494 1591608 1770837 1456838 855206 564832 659727 581377 50681 -540833 -838114 -987262
35484 -987262 -1083772 -777332 71158 820415 773188 209221 46351 536250 902435 400115
35474 400115 -733756 -1615822 -1694209 -1155568 -554863 -294905 -424317 -756178 -1095320 -1345102
35464 -1345102 -1427624 -1235544 -811929 -510052 -720393 -1341534 -1727254 -1353710 -426871 383300
35454 383300 721781 764480 674145 280439 -445764 -981112 -810238 -241620 -99679 -577893
35444 -577893 -989467 -852707 -612688 -859010 -1345253 -1415186 -1088947 -1014635 -1446833 -1971307
35434 -1971307 -2291908 -2619477 -3068961 -3248052 -2790392 -1914901 -1145218 -760295 -772192 -1166038
35424 -1166038 -1873948 -2674959 -3321359 -3655050 -3555835 -2997520 -2196209 -1449988 -835915 -370230
35414 -370230 -361019 -1070885 -2040548 -2425245 -2149989 -1985551 -2192467 -1944662 -678705 757975
35404 757975 1126840 414183 -444791 -1018157 -1576432 -2108186 -2188772 -1823128 -1482254 -1220253
35394 -1220253 -645446 83115 148646 -700694 -1622655 -1813819 -1511706 -1390317 -1514264 -1428313
35384 -1428313 -905854 -140724 529454 744770 269729 -651291 -1358860 -1475841 -1260938
35375 -1260938 -1064805 -840741 -493968 -281864 -425876 -636750 -474935 29269 499875
35366 499875 757866 886005 955783 1037981 1284439 1647218 1703472 1113008 98245 -821342
35356 -821342 -1362826 -1464160 -1052765 -265091 350598 355618 21399 -26323 358669 765528
35346 765528 806666 334539 -701503 -2048618 -2950981 -2798254 -1942146 -1264619 -988572
35337 -988572 -625788 -102185 -27616 -550402 -826710 -229245 575971 493512 -477284 -1321988
35327 -1321988 -1377344 -894913 -326078 234151 738837 882760 407323 -539792 -1507991 -2044652
35317 -2044652 -1904399 -1239914 -618487 -550961 -925847 -1184650 -1118216 -1133421 -1551640 -1996478
35307 -1996478 -1832948 -1042497 -289358 -120445 -374892 -448245 45018 941690 1725226 1971335
35297 1971335 1673297 1191072 883043 821876 883777 977298 1026302 817585 129942 -908374
35287 -908374 -1781229 -2049035 -1779637 -1422528 -1298270 -1272491 -917565 -9529 1078883 1550852
35277 1550852 923270 -413974 -1571585 -2108285 -2358017 -2748273 -3114522 -2927089 -1987820
35268 -1987820 -643605 557424 1202815 1151232 575313 -195068 -978829 -1696774 -1945322
35259 -1945322 -1097745 749647 2328167 2337440 888160 -771491 -1798718 -2310890 -2495602
35250 -2495602 -2116638 -1213087 -492044 -496184 -888004 -1006169 -685414 -124535 570217 1219313
35240 1219313 1385669 926192 428531 574877 1301389 2010527 2306753 2084015 1292729
35231 1292729 219493 -353005 23087 686892 626099 -158643 -760495 -694451 -323673 5107
35221 5107 410113 923507 1251335 1304387 1325180 1303221 909836 202463 -272776 -283018 -102070
35210 -102070 309512 1435800 3063126 3896144 3083976 1501301 673787 875413 1153838
35201 1153838 927910 604252 637948 843950 861752 713850 651688 797038 1053296 1108076
35191 1108076 570125 -542386 -1508588 -1518371 -588267 504272 1157284 1382770 1351807 1061331
35181 1061331 591770 202703 -38617 -304185 -488724 -128191 839135 1667970 1627791 943808
35171 943808 439536 453842 643332 725213 767706 669397 36800 -1053274 -1711397 -1232910
35161 -1232910 -144796 375792 21322 -376888 -165807 268440 294464 24875 -107973
35152 -107973 -296412 -1034873 -1976639 -1982669 -560784 1364723 2467507 2387315 1795628 1476981
35142 1476981 1668887 2013618 1843163 741854 -894587 -2058705 -2110475 -1350396 -482093
35133 -482093 135522 478293 551423 502647 673412 1061001 1037216 128165 -1189103 -2049408
35123 -2049408 -2341564 -2638128 -3136519 -3415963 -3239476 -2820080 -2168795 -1000661 381861
35114 381861 899619 -17085 -1488418 -2171054 -1830707 -1301999 -1147284 -1095602 -817974 -567734
35104 -567734 -744593 -1217566 -1448363 -1181875 -765664 -724138 -1092565 -1305706 -880195 -126661
35094 -126661 139427 -301283 -664078 -209868 624962 741376 -70199 -780317 -517057 336688
35084 336688 892860 1074941 1466615 2084937 2164070 1338830 338181 86666 595533 1213377
35074 1213377 1612394 1981979 2465893 2965569 3389180 3568035 3039578 1547357 -237633
35065 -237633 -1167961 -928715 -274553 144083 397744 473531 -153025 -1474598 -2344981 -1876542
35055 -1876542 -817869 -432329 -467255 425835 2382420 3879636 3880670 3092149 2499350
35046 2499350 1862380 613735 -648688 -759576 310669 1413084 1787578 1796957 2032666
35037 2032666 2430613 2533528 2169445 1590585 1126546 838317 488842 -76874 -540018
35028 -540018 -391934 297867 818046 751311 496615 493762 465946 27060 -415089 -149570
35018 -149570 691324 1273958 1216675 802859 145547 -921701 -2020749 -2268784 -1502016
35009 -1502016 -652781 -478518 -631641 -446735 70641 601100 1146677 1583638 1200592
35000 1200592 -402156 -2336707 -3291171 -3158126 -2886735 -2866741 -2525923 -1643882 -963068
34991 -963068 -1017729 -1235988 -861649 -118763 278395 311724 524998 907137 760298 -167902
34981 -167902 -1045139 -788448 730668 2530759 3427857 3004058 1815840 752652 193194
34972 193194 -150806 -590407 -976965 -1088252 -1169692 -1598565 -2127735 -2038669 -1156583 -209869
34962 -209869 53100 -307011 -748720 -1018258 -1208225 -1340173 -1343307 -1303141 -1303900 -1102289 -395928
34951 -395928 560896 1015747 515421 -647353 -1869108 -2795148 -3301293 -3269190 -2720408
34942 -2720408 -2030682 -1665845 -1655465 -1540951 -953905 -134784 269266 -67728 -758238 -1156782
34932 -1156782 -1114823 -1033547 -1144456 -1096280 -516429 304023 713720 559139 261199 52855
34922 52855 -307851 -893721 -1225871 -940657 -468668 -540751 -1182534 -1692681 -1600649 -1195075
34912 -1195075 -999767 -1117661 -1321428 -1511912 -1751949 -1942907 -1825413 -1419842 -1209841
34903 -1209841 -1618721 -2388281 -2782008 -2441195 -1713972 -1012093 -265395 629311 1220858
34894 1220858 1003132 327199 77568 412033 599025 287936 75467 367919 541793
34885 541793 -15395 -735225 -717591 -270593 -474082 -1419121 -2074924 -1949950 -1662092 -1541378
34875 -1541378 -885980 702924 2239338 2529781 1774341 1077628 875711 829025 904256
34866 904256 1421921 2062553 1922200 839967 -198824 -372728 -24567 84220 -131431
34857 -131431 -315403 -503556 -1000465 -1638497 -1839715 -1428528 -865119 -607762 -689479 -1016959
34847 -1016959 -1612441 -2297292 -2507971 -1833139 -593200 470390 1044740 1457233 2007427
34838 2007427 2450129 2365270 1793144 1167846 713335 275665 -199542 -422470 -246855 -103733
34828 -103733 -520418 -1288234 -1578953 -1043437 -413611 -670399 -1781244 -2634652 -2257809
34819 -2257809 -827688 626827 1315076 1300605 1145452 1174255 1176393 767493 -41567 -701410
34809 -701410 -617767 189472 1000536 1063407 327869 -565454 -988800 -872912 -540221 -221936
34799 -221936 60700 255471 217803 -37051 -238792 -167930 75912 263248 377724 567256
34789 567256 810764 884141 713823 544998 611565 771745 644996 66169 -733788 -1383442
34779 -1383442 -1690571 -1706722 -1584862 -1422238 -1207707 -915998 -663625 -692458 -1087152 -1538546
34769 -1538546 -1542523 -910038 -17453 500439 288975 -455385 -1143908 -1223164 -586704 356540
34759 356540 1088010 1477654 1778632 2127763 2270789 1933392 1296793 866402 913208 1239584
34749 1239584 1474117 1407549 1040344 506396 18105 -260563 -364868 -477752 -723769 -1100831
34739 -1100831 -1543185 -1864538 -1717820 -949712 -57627 92301 -744223 -1763128 -2000951
34730 -2000951 -1444644 -865886 -697404 -616915 -340841 -262242 -853991 -1718939 -1803411 -641915
34720 -641915 1010373 2007262 2003795 1519123 998619 305902 -720127 -1642747 -1790485 -1107750
34710 -1107750 -237620 243790 288975 4677 -711158 -1812905 -2694302 -2636698 -1674471 -640974
34700 -640974 -243127 -350679 -342028 57951 510656 570688 249773 -24056 52281 285959
34690 285959 234429 -253658 -904400 -1425155 -1822223 -2188785 -2393995 -2252035 -1899003 -1672980
34680 -1672980 -1579026 -1192533 -289398 637719 783214 -72608 -1301421 -2128671 -2401182
34671 -2401182 -2501231 -2652158 -2612980 -2104552 -1249366 -397604 282606 802730 1109267 1150057
34661 1150057 1083301 1086287 1033447 749753 510563 764936 1310876 1349987 589155 -293552
34651 -293552 -613509 -523216 -432067 -180375 515425 1228080 1247017 628018 51018 -218675
34641 -218675 -435668 -539854 -120607 671261 1036132 626486 9684 -256247 -301738 -361981
34631 -361981 -232643 208692 542366 407771 81014 -60498 -197993 -659458 -1249837 -1547356
34621 -1547356 -1532386 -1396209 -1070653 -519928 -182525 -485051 -1131027 -1479829 -1443332 -1397752
34611 -1397752 -1400737 -1203359 -954956 -1137262 -1695580 -1912252 -1378440 -568016 -179262 -295684
34601 -295684 -452341 -265796 203850 570724 535069 272586 291792 732134 1067369 848447
34591 848447 444197 520663 1017605 1296906 1173776 1044317 998035 661116 136665 258816
34581 258816 1446846 2942520 3706426 3592992 3150677 2711961 2258172 1868832 1688758
34572 1688758 1546959 1080015 232351 -638567 -1084812 -836041 28351 950847 1202739
34563 1202739 616060 -191921 -559759 -477357 -290991 -86947 213013 440366 359811 75762
34553 75762 -187047 -486605 -830550 -693131 379162 1692490 1776671 176578 -1760460
34544 -1760460 -2383511 -1593231 -640409 -359760 -321135 189243 1008906 1387155 1119181 793017
34534 793017 841408 891568 449945 -104766 164950 1428430 2666096 2875874 2287863 1974157
34524 1974157 2526035 3588642 4560100 5195792 5419783 5029236 3958471 2674006 1957552
34515 1957552 2191037 2988362 3665807 4042578 4606632 5833842 7585622 9415104 11230613
34506 11230613 13188041 15008560 16032748 16141155 16017845 16120380 15936719 14832083 13206943
34497 13206943 12075647 11678930 11266137 10276125 9044856 8149804 7604486 6990312 6029412
34488 6029412 4795092 3607310 2848833 2639495 2634678 2423276 2126659 2233636 2817159
34479 2817159 3369308 3533942 3537191 3684117 3873809 3897183 3815427 3702581 3361196 2685785
34469 2685785 2026359 1749846 1624403 1107042 199372 -410449 -176371 582846 939607
34460 939607 299419 -926557 -1622075 -1063205 290512 1287467 1343207 905774 653653
34451 653653 702393 828047 997491 1241739 1323909 1011177 473129 -23830 -593112 -1388461
34441 -1388461 -1980426 -1714524 -685123 264302 611348 633105 640614 367826 -476945 -1528782
34431 -1528782 -2140466 -2157874 -1861048 -1368165 -635063 56271 213955 -115017 -208928 403061
34421 403061 1209648 1314078 609406 -83817 -97091 282821 329740 -103162 -476760 -378732
34411 -378732 -8121 243377 303274 276037 102683 -275910 -585358 -453473 40276 418106
34401 418106 467084 496191 767573 990296 704759 33889 -318139 95830 891562 1340129
34391 1340129 1304739 1359642 1883160 2394333 2183535 1418910 1035358 1407578 1750435 1260257
34381 1260257 367298 201773 1044848 2018267 2302390 1987753 1575016 1261238 1018434
34372 1018434 864942 692398 232063 -422159 -599464 233283 1795618 3366020 4511037
34363 4511037 5050117 4691235 3362019 1741347 763269 543819 404645 55346 83497
34354 83497 958102 2134803 2684000 2463219 2084196 1862756 1417450 445950 -575454
34345 -575454 -812304 -19275 1211527 2105594 2385979 2270384 2013575 1664080 1254934
34336 1254934 1024595 1254110 1863219 2312068 2078510 1272917 630323 730020 1299597 1542356
34326 1542356 1168784 761153 929731 1467777 1733718 1590285 1394169 1185288 606627
34317 606627 -250946 -662068 -289853 224784 172170 -284594 -652935 -1046017 -1771819 -2373078
34307 -2373078 -2061141 -1025624 -356118 -537655 -907612 -852577 -678094 -861687 -1215931
34298 -1215931 -1388006 -1585513 -2119140 -2634732 -2503004 -1764102 -1082701 -879436 -1008290
34289 -1008290 -1196321 -1326268 -1309864 -1072654 -684143 -279465 42922 79968 -413134 -1205560
34279 -1205560 -1493687 -809053 242059 682118 375058 -56216 -292462 -535907 -753159
34270 -753159 -585704 -196592 -378291 -1426075 -2570221 -2987072 -2803191 -2578560 -2321662
34261 -2321662 -1703798 -925052 -609450 -888996 -1226077 -1227823 -1112527 -1197459 -1352688 -1234940
34251 -1234940 -803803 -330763 -15935 174355 312931 330453 88298 -443279 -1141315 -1824358
34241 -1824358 -2306364 -2380064 -1925325 -1150199 -560611 -452112 -512034 -223548 341140 494632
34231 494632 -161122 -1141682 -1659192 -1558651 -1351979 -1454989 -1750528 -1905435 -1790125 -1462248
34221 -1462248 -962192 -310320 383086 959265 1353175 1594271 1648823 1356741 620305 -362701
34211 -362701 -1164457 -1474114 -1306727 -841901 -201964 494119 998893 1067718 682169 -5350
34201 -5350 -862194 -1727920 -2304106 -2389015 -2180229 -2045431 -2025346 -1909181 -1779046 -2002521
34191 -2002521 -2540371 -2739958 -2141320 -1151361 -551465 -565249 -775116 -797414 -660476 -566132
34181 -566132 -607235 -775810 -1067061 -1525245 -2211539 -3021036 -3518348 -3225098 -2241155 -1336699
34171 -1336699 -1179818 -1636077 -2039055 -1958677 -1469439 -869926 -430656 -269045 -217144 15339
34161 15339 312375 64799 -1017085 -2254407 -2648374 -2044219 -1163754 -577072 -188724
34152 -188724 248477 675920 936888 986619 738204 118024 -568574 -771345 -425132 -125947
34142 -125947 -281347 -483745 -140920 577132 942797 699460 340106 260906 119951 -600513
34132 -600513 -1611291 -1866591 -760071 993524 1977056 1521130 264810 -713383 -944550
34123 -944550 -628171 -115206 244683 34483 -895804 -2062897 -2749677 -2765866 -2455755 -2060588
34113 -2060588 -1583918 -1259282 -1508839 -2226612 -2645233 -2231742 -1308512 -506429 -22053
34104 -22053 259598 340638 253260 281882 551522 662184 258503 -246236 -113987 636409
34094 636409 1218618 1202636 1019299 1120799 1226430 851800 205031 -2387 471198 1095031
34084 1095031 1283761 1037381 732562 589057 579616 671363 839766 847865 275886 -1063738
34074 -1063738 -2777196 -4032465 -4114847 -2953875 -1190768 325285 1188527 1551824 1620002
34065 1620002 1320734 703758 345587 805807 1715145 1987333 1123715 -174646 -936836
34056 -936836 -1002793 -871983 -937770 -1293121 -1905140 -2496315 -2559590 -1974969 -1336002 -1205071
34046 -1205071 -1376978 -1388746 -1333192 -1468728 -1421815 -684033 347927 853711 1005795 1746781
34036 1746781 3006032 3350953 1919860 -291210 -1694787 -1848228 -1295825 -474853 397030
34027 397030 901314 748213 273027 1608 -8623 61175 250981 511984 382637 -387256
34017 -387256 -1243659 -1482052 -1161916 -760961 -304815 419269 1078241 1046191 341609 -383991
34007 -383991 -710625 -689063 -389324 80582 230126 -357550 -1214910 -1365524 -583163 378440
33997 378440 844988 810920 436462 -203447 -643178 -165404 1083523 1794255 965297 -728388
33987 -728388 -1670515 -1200589 -204290 128991 -400271 -1103468 -1410872 -1428569 -1560546 -1897940
33977 -1897940 -2174381 -2179021 -1941976 -1537191 -995451 -449746 -49695 338800 984918 1737236
33967 1737236 2037437 1649380 917398 139156 -716215 -1410030 -1331016 -512810 14437 -368018
33957 -368018 -820477 -353957 431929 113749 -1407149 -2794599 -3222284 -3191571 -3311107
33948 -3311107 -3431360 -3268769 -2888061 -2263543 -1252055 -246725 43512 -291537 -395392
33939 -395392 -38494 29895 -532937 -988267 -736861 -214408 35780 225655 555710 498987
33929 498987 -300467 -1170559 -1338312 -1086076 -1110924 -1310865 -1151269 -782254 -801139 -1170475
33919 -1170475 -1305053 -1123642 -1190611 -1786596 -2456311 -2526748 -1699140 -261080 964293
33910 964293 1175953 499621 11929 469836 1420028 1992586 2049368 1957791 1756246 1307871
33900 1307871 890536 827510 803188 318087 -400487 -697098 -503096 -315653 -344676 -415693
33890 -415693 -536520 -792314 -858049 -447441 -91045 -524897 -1349013 -1334247 -237658 711813
33880 711813 543372 -138964 -175754 482091 868081 429331 -340772 -703298 -623733 -692923
33870 -692923 -1248628 -1853744 -1858186 -1363890 -1201507 -1815935 -2650758 -2950457 -2688161 -2229247
33860 -2229247 -1567789 -599903 178884 90323 -679205 -1188740 -947458 -388645 -89544 -108556
33850 -108556 -217889 -311511 -440962 -746576 -1335054 -1981851 -2181510 -1833334 -1530040 -1699674
33840 -1699674 -1886538 -1504957 -842585 -503503 -287808 369112 1166977 1313767 975244
33831 975244 1115330 1881148 2422049 2456573 2665728 3187833 3129694 2218047 1639605 2333872
33821 2333872 3508336 3870052 3491670 3367561 3739618 3990951 3861809 3739003 3830233
33812 3830233 3851667 3548483 2998633 2462939 2280861 2664719 3243818 3192771 2287656 1476618
33802 1476618 1844196 3256607 4560430 4946054 4648037 4432829 4798627 5615765 6326179
33793 6326179 6604307 6830179 7530851 8355725 8290841 7133079 5979289 5756921 5989861
33784 5989861 5716793 5042004 4915048 5693213 6732962 7278662 7106279 6370788 5360687
33775 5360687 4375312 3502399 2652867 2009066 2021558 2632232 3029683 2683707 2122527 2082736
33765 2082736 2377948 2346333 2034743 2122544 2870086 3848361 4530300 4523266 3493114 1594871
33755 1594871 -217200 -1034706 -993405 -772280 -393810 612645 2040554 3005400 3184762
33746 3184762 3146028 3243883 3044073 2201727 1218479 841788 1111356 1397437 1184757 581148
33736 581148 126747 142529 259439 -179143 -1140333 -1748291 -1403331 -578339 -74548 -23354
33726 -23354 -204873 -753992 -1709326 -2345048 -1952105 -993370 -509500 -647261 -801791 -920874
33716 -920874 -1423357 -1950144 -1580957 -449474 175632 -264693 -921122 -1053155 -1017568 -1248553
33706 -1248553 -1450096 -1435946 -1657428 -2177452 -2176403 -1291587 -463480 -548540 -995902 -883397
33696 -883397 -421013 -302025 -275957 353318 1251050 1360166 529827 -287807 -450269 -269787
33686 -269787 -215463 -334770 -560269 -849356 -914816 -456606 248053 541979 229546 -261102
33676 -261102 -521161 -461165 -47681 672281 1277852 1266731 719739 235190 195822 513063
33666 513063 1000407 1473392 1539079 892740 -103592 -672609 -544400 -146283 175692 565283
33656 565283 1142692 1629557 1743886 1549903 1189098 666408 148840 79487 657969 1476328
33646 1476328 1974931 2046456 1914339 1629562 1037459 152146 -760339 -1474709 -1912314 -1912022
33636 -1912022 -1205854 126284 1351314 1646952 1079588 633711 949328 1369115 818558
33627 818558 -518830 -1195411 -373478 1048197 1656935 1240140 607502 206977 -176761
33618 -176761 -533286 -398393 303611 927717 932989 519752 154639 -95024 -425780 -824847
33608 -824847 -1051544 -906097 -339887 487632 1146747 1235456 915715 835667 1268462 1621789
33598 1621789 1143802 -78715 -1196953 -1585872 -1404743 -1189866 -1236752 -1481424 -1692377
33589 -1692377 -1576707 -907924 159974 980294 939474 180317 -464519 -416409 31348 301302
33579 301302 477631 1167352 2430211 3380658 3123621 1778184 310694 -441848 -385373
33570 -385373 -48157 -107145 -871844 -1988052 -2718449 -2638249 -1955850 -1142828 -504865 -149874
33560 -149874 -6106 245708 840413 1373772 1093569 5184 -897760 -911071 -509248 -395344
33550 -395344 -326436 252278 914265 701299 -316431 -1046291 -1001508 -871734 -1231936 -1665552
33540 -1665552 -1584872 -1091392 -545280 109 451614 463309 123460 194561 1013651 1749962
33530 1749962 1547050 934458 1170014 2401369 3449827 3478641 2991418 2862473 3084160
33521 3084160 3011811 2469387 2024751 2183185 2712295 2947847 2594528 1984567 1530018 1176632
33511 1176632 625469 -66645 -476035 -400732 -81541 246206 607558 916274 804753 184594
33501 184594 -385720 -349384 79749 274984 131218 87951 293126 351285 29228 -310972
33491 -310972 -234716 188832 592112 786713 778820 587048 353233 421815 961269 1618869
33481 1618869 1869449 1632956 1245314 912227 592643 408034 652152 1183653 1283504 546500
33471 546500 -375317 -433091 512132 1527102 1759440 1288035 729915 471394 530093 808566
33461 808566 1165943 1447664 1665885 1948094 2174154 2001494 1468117 1173012 1499182 2013588
33451 2013588 2086653 1799333 1702785 1922621 2128340 2262152 2599379 3025329 2918666 2018881
33441 2018881 951753 602332 1215571 2254876 2928405 2828441 2299870 2127754 2589228
33432 2589228 3002899 2643639 1845804 1520548 1744798 1738449 1313207 1306366 2153344 2972716
33422 2972716 2766842 1828887 1176461 1115009 1192404 1198568 1305497 1358450 902507 29129
33412 29129 -485520 -140934 602728 815318 67704 -1141563 -1779868 -1183699 247107
33403 247107 1389979 1601853 1334282 1313285 1464549 1113499 28415 -1250279 -2036511
33394 -2036511 -2028389 -1315039 -293782 490755 850376 1233601 2089386 3056778 3309292 2701381
33384 2701381 2024896 1992777 2437057 2721861 2578381 2276629 2197465 2437625 2720545 2618479
33374 2618479 1978027 1129298 550931 398827 522491 798199 1174438 1485733 1506775 1131264
33364 1131264 297157 -1050485 -2600616 -3557959 -3421167 -2749661 -2562430 -2986384 -3119885
33355 -3119885 -2347347 -1175562 -504494 -577931 -995419 -1369100 -1580025 -1612758 -1476476 -1217456
33345 -1217456 -852293 -370655 169195 698638 1234920 1673513 1609153 796060 -249759
33336 -249759 -643097 -221173 298982 416622 484940 914436 1340082 1156989 502011 71032
33326 71032 144043 383744 545909 815633 1314245 1727084 1687390 1294618 991258 996351
33316 996351 1067668 867266 398858 -90227 -549703 -1127873 -1635980 -1463474 -438711 584378
33306 584378 652345 70241 53442 952550 1675094 1233980 99655 -589743 -586140 -574928
33296 -574928 -1009971 -1630101 -1994496 -1895514 -1322901 -544679 -148995 -500907 -1194869 -1484730
33286 -1484730 -1169859 -607055 -12788 625051 1008925 662389 -203488 -616536 -4028
33277 -4028 1049155 1580847 1402991 1062067 952103 956865 884255 838914 1073131 1660382
33267 1660382 2375493 2842873 2859390 2633552 2620095 3051082 3702132 4128020 4003990 3270978
33257 3270978 2194659 1327483 1115985 1393805 1517726 1179094 808308 931377 1392608
33248 1392608 1569028 1184641 526992 -44775 -397371 -466840 -264550 -134398 -562413 -1490696
33238 -1490696 -2144228 -1825255 -676849 558785 1301763 1402633 935316 146350 -512613
33229 -512613 -726837 -675879 -693876 -641230 -92657 816256 1306714 976062 393530 275513
33219 275513 477015 335940 -248835 -710563 -715138 -547407 -487147 -355609 48708 492299
33209 492299 642916 577399 566257 523596 107364 -621837 -1045312 -705982 38701 370696
33199 370696 -36457 -713524 -1115040 -1310412 -1665216 -2089269 -2119987 -1729464 -1452625 -1508874
33189 -1508874 -1388893 -723799 -14196 133780 67669 555257 1401395 1545454 634092 -395311
33179 -395311 -619352 -254911 -45077 -182270 -413500 -720619 -1251684 -1855678 -2251411 -2481708
33169 -2481708 -2722438 -2809296 -2444567 -1795120 -1433575 -1653508 -2146917 -2385700 -2138976 -1650401
33159 -1650401 -1395155 -1514174 -1467341 -615090 722730 1309394 468944 -944779 -1572476
33150 -1572476 -1151741 -488353 -173462 -106627 -135924 -305165 -347788 286727 1565550 2577860
33140 2577860 2482663 1419930 214429 -531054 -799555 -862087 -889849 -812497 -486932 -40104
33130 -40104 102689 -244651 -622028 -416619 318883 941844 1064392 869675 578637 118342
33120 118342 -516970 -997594 -970656 -383913 558525 1441602 1662325 905176 -290947 -939145
33110 -939145 -766474 -491290 -728444 -1161867 -1178979 -842714 -700162 -898112 -1009852 -657322
33100 -657322 70331 789841 1180977 1223566 1198554 1327485 1388045 987917 287683 13216
33090 13216 539418 1411391 2058003 2469014 2735360 2469266 1396971 193344 -110030
33081 -110030 505635 1023434 810246 336958 259189 454902 415268 124200 12464 243634
33071 243634 515411 535652 348027 145402 13065 -58276 -78626 -100100 -265070 -667727
33061 -667727 -1136725 -1245966 -642547 612628 2041314 3046291 3209848 2469332 1211612
33052 1211612 136587 -252157 -104785 20431 -88756 -39779 555041 1470798 2076652
33043 2076652 1976715 1281090 438381 -12123 254768 1012948 1582817 1507290 1008616 567462
33033 567462 255283 -187298 -757273 -1086220 -936422 -468046 32627 405347 526828 228258
33023 228258 -544892 -1577824 -2448305 -2750184 -2403396 -1854972 -1758537 -2195772 -2387793 -1539494
33013 -1539494 92600 1339499 1344869 343136 -786076 -1380044 -1335098 -961888 -721834
33004 -721834 -903446 -1382716 -1808516 -2051552 -2257282 -2418163 -2212610 -1468564 -548642 13297
32994 13297 168440 373076 908098 1373681 1034985 -327562 -2050085 -3188791 -3421734
32985 -3421734 -3158592 -2799187 -2241530 -1290422 -200068 542877 763847 564686 -58147
32976 -58147 -1093102 -2103289 -2461293 -2079807 -1499572 -1161575 -979130 -732287 -478202
32967 -478202 -380256 -449092 -628834 -869291 -990999 -775796 -306407 98916 382298 789820
32957 789820 1297161 1479722 1231107 1133152 1670941 2433710 2618547 2130600 1654022 1676811
32947 1676811 1924038 1851970 1341567 711854 237267 -135584 -581017 -1025902 -1152694 -830178
32937 -830178 -346643 -24236 176602 337370 126204 -755925 -1799287 -2109906 -1690295
32928 -1690295 -1479107 -1864074 -2045441 -1368249 -421062 -94857 -314513 -573474 -1031107
32919 -1031107 -1987866 -2771109 -2381583 -1038251 82485 522807 799836 1102374 1076318
32910 1076318 1011659 1786067 3189986 3689740 2561148 1052632 592663 928166 991059
32901 991059 599724 164175 -448573 -1460397 -2201136 -1907438 -1092344 -808050 -860739 -193263
32891 -193263 1041154 1313778 -47335 -1751552 -2194509 -1216633 245147 1302548 1374047
32882 1374047 198115 -1696309 -3129880 -3461379 -3150061 -2781757 -2243113 -1335660 -425900
32873 -425900 186139 841357 1698720 2014415 1190174 927 -326557 62938 -71923
32864 -71923 -1065159 -1834157 -1579200 -858199 -484289 -296391 276470 1084303 1461062 1204155
32854 1204155 665249 49730 -750845 -1639481 -2139837 -1898396 -1108549 -345093 -110999
32845 -110999 -522844 -1267104 -1860373 -2094382 -2232573 -2661070 -3372588 -3942616 -4035878 -3778556
32835 -3778556 -3515271 -3294919 -2805545 -1882036 -887166 -374050 -441671 -671892 -694823 -533621
32825 -533621 -360050 -271875 -439774 -1057365 -1887716 -2282024 -2019907 -1701848 -1808092 -1827248
32815 -1827248 -1065543 31323 362328 -107548 -232074 460876 911215 124818 -1290848
32806 -1290848 -2014096 -1770848 -1313739 -1111417 -1013111 -952144 -1013840 -860068 909 1258178
32796 1258178 1920852 1615028 1053865 945615 1101219 1005861 676543 422814 179664 -312224
32786 -312224 -850236 -864931 -204761 583742 898174 752742 619302 680782 454417 -677892
32776 -677892 -2588396 -4290513 -4885479 -4475324 -3909572 -3750068 -3775373 -3430763 -2437193
32767 -2437193 -973850 422626 1164167 1168917 1085269 1543559 2209782 2139327 1168801 297744
32757 297744 353896 876460 846722 88452 -662254 -804189 -381740 293039 941098 1282745
32747 1282745 1220460 1065045 1144741 1225509 802137 -32783 -537817 -247757 521451 1216053
32737 1216053 1606622 1623497 1141868 274039 -493462 -809701 -840595 -858400 -751880 -273772
32727 -273772 496301 1276964 1902615 2167682 1715472 630103 -133461 367800 1783194
32718 1783194 2758508 2591022 1898547 1455566 1170334 718067 473806 979122 1839593
32709 1839593 2057745 1431741 811422 800517 938910 537440 -264748 -797366 -847855 -801796
32699 -801796 -964001 -1252051 -1545113 -1889351 -2253527 -2420104 -2289678 -2078320 -2041111 -2120419
32689 -2120419 -2010428 -1515931 -756717 -54423 312492 265667 -68555 -438271 -565640 -304745
32679 -304745 164395 379954 69328 -407494 -367345 314627 924289 769962 92321 -254293
32669 -254293 88456 616142 737315 510276 404141 585226 720390 458803 -54932 -254601
32659 -254601 189291 833326 839215 23804 -778728 -735542 -115226 159523 -103894 -147233
32649 -147233 477325 1179051 1242904 833924 511919 221039 -494713 -1481993 -1955922 -1553845
32639 -1553845 -782997 -219376 219378 870966 1561614 1703008 1124940 478704 593975
32630 593975 1444750 1954025 1081573 -904516 -2584833 -2960415 -2464073 -2076374 -1894731
32621 -1894731 -1263916 -105888 761449 779849 326852 -97637 -592136 -1197917 -1228847 -156672
32611 -156672 1218578 1524778 719817 220287 874564 1799834 1847473 1387860 1644902 2684885
32601 2684885 3230260 2539401 1402505 822448 580435 -124154 -1162532 -1553714 -922124
32592 -922124 -18274 349019 186725 -122095 -466063 -791832 -794605 -397344 -167245 -612482
32582 -612482 -1275574 -1206198 -283286 616655 852415 721732 677860 539709 14609 -503558
32572 -503558 -381486 221003 498992 222863 135741 848133 1847963 2090497 1361982 584600
32562 584600 709421 1608612 2249982 1886031 903885 392834 887316 1705982 1697921 549346
32552 549346 -905310 -1663543 -1517755 -922751 -284643 247396 488351 206981 -520443
32543 -520443 -1280653 -1756584 -1928167 -1757269 -1015969 299333 1589640 2045235 1449125
32534 1449125 402670 -289063 -340579 -71175 115099 204615 458900 874957 989002 434611
32524 434611 -420029 -734696 -159044 773774 1345356 1439549 1409813 1425046 1278375 749290
32514 749290 -95786 -912220 -1241247 -805104 188979 1184248 1854526 2328712 2690479 2635115
32504 2635115 1984319 1204791 896709 956250 775242 150977 -545347 -1023197 -1303313 -1297539
32494 -1297539 -782771 69456 666608 660055 209748 -445498 -1132318 -1415848 -849689 178561
32484 178561 518242 -400338 -1778525 -2391840 -1898785 -892502 -116273 19161 -406370
32475 -406370 -780616 -507197 109552 76082 -864658 -1718072 -1660313 -1220513 -1278979 -1571674
32465 -1571674 -1230045 -380178 -29094 -441935 -735000 -270757 457382 669977 337769
32456 337769 -16693 -88249 -3748 -12078 -169710 -241413 55794 610252 950663 920172 942698
32445 942698 1278867 1470801 1040619 295910 -198276 -516149 -975174 -1250638 -815909 -3183
32435 -3183 351811 161642 6339 -46089 -457629 -1111430 -1325041 -1043586 -896012 -960785
32425 -960785 -674439 -145090 -239866 -992465 -1246901 -437287 541791 886900 1033858 1451595
32415 1451595 1552416 868226 245877 669468 1701217 2245999 2167832 2020606 1817142
32406 1817142 1236310 546728 221072 86763 -131679 10629 856734 1595959 1307381
32397 1307381 571727 668315 1517883 1870453 1321528 618419 5017 -1133276 -2712070
32388 -2712070 -3543984 -3040996 -2124127 -1865595 -2219048 -2603901 -2807672 -2756364 -2201883 -1196569
32378 -1196569 -268084 248621 474411 430200 -10677 -465531 -267926 389249 528434 -32466
32368 -32466 -231766 569831 1518375 1584895 1021491 650323 504118 153499 -198528 36004
32358 36004 794130 1393114 1372247 686283 -584119 -2042827 -2841863 -2469856 -1487450 -885295
32348 -885295 -934263 -1192145 -1302442 -1163730 -656888 61741 259388 -593392 -1889927 -2502228
32338 -2502228 -2231706 -1846637 -1700242 -1234555 -128416 886051 911770 112906 -518764
$$ [...]
##END NTUPLES=NMR SPECTRUM
##END=
