##TITLE=31Pdec_DE-63_ost
 D2O, 64 sc
 25.12.2024
##JCAMPDX= 6.0         $$ Bruker NMR JCAMP-DX V2.0
##DATA TYPE= NMR SPECTRUM
##DATA CLASS= NTUPLES
##ORIGIN= UXNMR, Bruker Analytische Messtechnik GmbH
##OWNER= root
$$ XWIN-NMR		Version 3.5
$$ Wed Dec 25 14:12:05 2024 Russian Standard Time (UT+4h)  she@DPX200
##.OBSERVE FREQUENCY= 81.013821
##.OBSERVE NUCLEUS= ^31P
##.ACQUISITION MODE= SIMULTANEOUS
##.ACQUISITION SCHEME= undefined
##.AVERAGES= 64
##.DIGITISER RES= 17
##SPECTROMETER/DATA SYSTEM= spect
##.PULSE SEQUENCE= zgpg30
##.SOLVENT NAME= DMSO
##.SHIFT REFERENCE= (INTERNAL, DMSO, 0, 198.062)
##AUDIT TRAIL= $$ (NUMBER, WHEN, WHO, WHERE, WHAT)
$$ ##TITLE= Audit trail, XWIN-NMR		Version 3.5
$$ ##JCAMPDX= 5.01
$$ ##ORIGIN= Bruker BioSpin GmbH
$$ ##OWNER= she
$$ F:/spectra/data/she/nmr/P31/2/pdata/1/auditp.txt
$$ ##AUDIT TRAIL=  $$ (NUMBER, WHEN, WHO, WHERE, WHAT)
(   1,<2024-12-25 14:10:27.73 +0400>,<she>,<DPX200>,
      <created by zg, POWCHK disabled, PULCHK disabled
       configuration hash MD5:
       00 E9 B6 7A A2 85 ED C7 34 08 36 98 17 FE 4E 26
       data hash MD5: 32K
       57 EF A4 09 AD 93 DD 83 81 06 E7 8E FA 4F B7 95>)
(   2,<2024-12-25 14:10:30.07 +0400>,<she>,<DPX200>,
      <Start of raw data processing
       efp BC_mod = 2 LB = 1.5 FT_mod = 6 PKNL = 1 PHC0 = 2059.426 PHC1 = 175.4863 SI = 64K 
       data hash MD5: 64K
       19 B3 2D D2 59 A4 9A 79 60 62 A5 FB 63 04 A3 58>)
(   3,<2024-12-25 14:10:57.90 +0400>,<she>,<DPX200>,
      <pk PHC0 = 1.93798 PHC1 = 0 
       data hash MD5: 64K
       3B 6C 0F E1 CB 8F 62 6F E1 DE 47 C2 0C E5 C6 4F>)
$$ ##END=
$$ 
$$ hash MD5
$$ BC 3E 69 1B A3 8A 3C 30 56 6A 1B C3 9B 07 E2 AA
##$RELAX= 
##$RELAX= 
##$RELAX= 
##$RELAX= 
##$RELAX= 
##$RELAX= 
##$RELAX= 
##$RELAX= 
$$ Bruker specific parameters
$$ --------------------------
##$DU= <F:/spectra>
##$EXPNO= 2
##$NAME= <P31>
##$PROCNO= 1
##$TYPE= <nmr>
##$USER= <she>
##$AMP= (0..31)
100 100 100 100 100 100 100 100 100 100 100 100 100 100 100 100 100 100 
100 100 100 100 100 100 100 100 100 100 100 100 100 100 
##$AQSEQ= 0
##$AQ_mod= 1
##$AUNM= <au_zg>
##$AUTOPOS= <>
##$BF1= 81.014009
##$BF2= 200.13
##$BF3= 200.13
##$BF4= 200.13
##$BF5= 200.13
##$BF6= 200.13
##$BF7= 200.13
##$BF8= 200.13
##$BYTORDA= 1
##$CFDGTYP= 0
##$CFRGTYP= 5
##$CHEMSTR= <none>
##$CNST= (0..31)
1 1 145 1 1 1 1 1 1 1 1 1 1 1 1 1 1 1 1 1 1 1 1 1 1 1 1 1 1 1 1 1 
##$CPDPRG= <waltz16>
##$CPDPRG1= <>
##$CPDPRG2= <waltz16>
##$CPDPRG3= <>
##$CPDPRG4= <mlev>
##$CPDPRG5= <mlev>
##$CPDPRG6= <mlev>
##$CPDPRG7= <mlev>
##$CPDPRG8= <mlev>
##$CPDPRGB= <>
##$CPDPRGT= <>
##$D= (0..31)
0 1 0 0 0 0 0 0 0 0.06 0 0.03 2e-05 3e-06 0 0 0.0002 0 0 0 0 0 0 0 0 0 
0 0 0 0 0 0 
##$DATE= 1735121427
##$DBL= (0..7)
120 120 120 11 120 120 24 19 
##$DBP= (0..7)
150 150 150 150 150 150 150 150 
##$DBP07= 0
##$DBPNAM0= <>
##$DBPNAM1= <>
##$DBPNAM2= <>
##$DBPNAM3= <>
##$DBPNAM4= <>
##$DBPNAM5= <>
##$DBPNAM6= <>
##$DBPNAM7= <>
##$DBPOAL= (0..7)
0.5 0.5 0.5 0.5 0.5 0.5 0.5 0.5 
##$DBPOFFS= (0..7)
$$ [...]
##$SUBNAM3= <"">
##$SUBNAM4= <"">
##$SUBNAM5= <"">
##$SUBNAM6= <"">
##$SUBNAM7= <"">
##$SUBNAM8= <"">
##$SUBNAM9= <"">
##$SW= 400.765351723535
##$SWIBOX= (0..15)
0 1 3 0 0 0 0 0 0 0 0 0 0 0 0 0 
##$SW_h= 32467.5324675325
##$TD= 32768
##$TD0= 1
##$TE= 0
##$TE2= 300
##$TE3= 300
##$TEG= 300
##$TL= (0..7)
0 120 53 12 22 120 120 120 
##$TP= (0..7)
150 150 150 150 150 150 150 150 
##$TP07= 0
##$TPNAME0= <>
##$TPNAME1= <>
##$TPNAME2= <>
##$TPNAME3= <>
##$TPNAME4= <>
##$TPNAME5= <>
##$TPNAME6= <>
##$TPNAME7= <>
##$TPOAL= (0..7)
0.5 0.5 0.5 0.5 0.5 0.5 0.5 0.5 
##$TPOFFS= (0..7)
0 0 0 0 0 0 0 0 
##$TUNHIN= 0
##$TUNHOUT= 0
##$TUNXOUT= 0
##$USERA1= <user>
##$USERA2= <user>
##$USERA3= <user>
##$USERA4= <user>
##$USERA5= <user>
##$V9= 5
##$VALIST= <valist>
##$VCLIST= <CCCCCCCCCCCCCCC>
##$VD= 0
##$VDLIST= <DDDDDDDDDDDDDDD>
##$VPLIST= <PPPPPPPPPPPPPPP>
##$VTLIST= <TTTTTTTTTTTTTTT>
##$WBST= 1024
##$WBSW= 4
##$XGAIN= (0..3)
0 0 0 0 
##$XL= 0
##$YL= 0
##$YMAX_a= 12539
##$YMIN_a= -14209
##$ZGOPTNS= <>
##$ZL1= 120
##$ZL2= 120
##$ZL3= 120
##$ZL4= 120
##$ABSF1= 0
##$ABSF2= 0
##$ABSG= 0
##$ABSL= 0
##$ALPHA= 0
##$AQORDER= 0
##$ASSFAC= 0
##$ASSFACI= 0
##$ASSFACX= 0
##$ASSWID= 0
##$AUNMP= <proc_1d>
##$AZFE= 0.1
##$AZFW= 0.5
##$BCFW= 0
##$BC_mod= 2
##$BYTORDP= 0
##$COROFFS= 0
##$CY= -3
##$DATMOD= 1
##$DC= 0
##$DFILT= <>
##$DTYPP= 0
##$F1P= 0
##$F2P= 0
##$FCOR= 1
##$FTSIZE= 65536
##$FT_mod= 6
##$GAMMA= 0
##$GB= 0
##$INTBC= 1
##$INTSCL= 9.790993e-09
##$ISEN= 30
##$LB= 1.5
##$LEV0= 0
##$LPBIN= 0
##$MAXI= 10000
##$MC2= 0
##$MEAN= 0
##$ME_mod= 0
##$MI= 50
##$NCOEF= 0
##$NC_proc= -8
##$NLEV= 6
##$NOISF1= 182.463
##$NOISF2= 159.3651
##$NSP= 0
##$NTH_PI= 0
##$NZP= 0
##$OFFSET= 198.0616
##$PC= 4
##$PHC0= 2061.364
##$PHC1= 175.4863
##$PH_mod= 1
##$PKNL= yes
##$PPARMOD= 0
##$PSCAL= 0
##$PSIGN= 0
##$REVERSE= no
##$SF= 81.0140089999434
##$SI= 65536
##$SIGF1= 159.3651
##$SIGF2= -187.1042
##$SINO= 113.3802
##$SIOLD= 16384
##$SREGLST= <1H.CDCl3>
##$SSB= 0
##$STSI= 65536
##$STSR= 0
##$SW_p= 32467.5324675325
##$SYMM= 0
##$S_DEV= 0
##$TDeff= 32768
##$TDoff= 0
##$TI= <>
##$TILT= no
##$TM1= 0
##$TM2= 0
##$TOPLEV= 0
##$USERP1= <user>
##$USERP2= <user>
##$USERP3= <user>
##$USERP4= <user>
##$USERP5= <user>
##$WDW= 1
##$XDIM= 65536
##$YMAX_p= 398908709
##$YMIN_p= -186245072
$$ End of Bruker specific parameters
$$ ---------------------------------
##NTUPLES= NMR SPECTRUM
##VAR_NAME=  FREQUENCY,     SPECTRUM/REAL,   SPECTRUM/IMAG
##SYMBOL=    X,             R,               I
##VAR_TYPE=  INDEPENDENT,   DEPENDENT,       DEPENDENT
##VAR_FORM=  AFFN,          ASDF,            ASDF
##VAR_DIM=   65536,         65536,           65536
##UNITS=     HZ,            ARBITRARY UNITS, ARBITRARY UNITS
##FACTOR=    0.49542278885378, 1,            1
##FIRST=     16045.7642231865, 0,            0
##LAST=      -16421.768244346, 0,            0
##MIN=       -16421.768244346, -186245072,   0
##MAX=       16045.7642231865, 398908709,    0
$$ Real data points
##PAGE= N=1
##DATA TABLE= (X++(R..R)), XYDATA
$$ [...]
39487B159851J131036O99049j620826k086934l2041J857260K022377J440529N76705
$$ 2159851 3290887 3989936 2369110 282176 250135 2107395 4129772 5570301 6147006
39478F147006j449123l648116k786660J550328M623943K370101k674929m736277
$$ 6147006 4697883 1049767 -1736893 -186565 4437378 6807479 4132550 -603727
39470f03727k523890J47463N87215R3672M90020J479479K289240K943463K977690
$$ -603727 -3127617 -2980154 -2392939 -2299267 -1809247 -329768 1959472 4902935 7880625
39461G880625J555891k66402p1355K086239K997022P52740k553068m018189l508276
$$ 7880625 9436516 9170114 9098759 11184998 14182020 14934760 12381692 8363503 4855227
39452D855227k467582j425639n69027q03990k202874l010153k073168o77821j84930
$$ 4855227 2387645 962006 392979 -411011 -2613885 -5624038 -7697206 -8375027 -8559957
39443h559957L07304J804653K833767J756944J72269Q62371L206098L863142J790822
$$ -8559957 -8252653 -6448000 -3614233 -1857289 -1685020 -822649 2383449 6246591 8037413
39434H037413n39185j204654j152900j587010j600157O3031K499939L450712J969492
$$ 8037413 7498228 6293574 5140674 3553664 1953507 2016538 4516477 7967189 9936681
39425I936681n76166j877472q50041J196776J760528K7046k002780k039799l63061
$$ 9936681 9360515 7483043 6633002 7829778 9590306 9617352 7614572 5574773 5211712
39416E211712J000300J106699N83103j1264n39759m97848L06961P28983j28426
$$ 5211712 6212012 7318711 7901814 7890550 7350791 6852943 7159904 7888887 7760461
39407G760461q18513O13738L029364L246494R40319n38240P51464K319133J098531
$$ 7760461 6941948 7555686 10585050 13831544 14771863 14233623 14985087 17304220 18402751
39398A8402751j947117l335650j814834N72063J543481R36213J21769K18765J016528
$$ 18402751 16455634 13119984 11305150 11877213 13420694 14356907 14478676 14697441 15713969
39389A5713969J342711O38946j19083J77846R80221J068291P85890J245756J674671
$$ 15713969 17056680 17695626 17576543 17754389 18734610 19802901 20588791 21834547 23509218
39380B3509218L61034j506742l51749M122858P097407M720964p11334m223542
$$ 23509218 23870252 22363510 22011761 26134619 33232026 37952990 37241656 33018114
39372C3018114m269207k433733M29707L773951M762125Q39743n225968p192686
$$ 33018114 28748907 26315174 26744881 30518832 35280957 36120700 30894732 23702046
39364B3702046l076815K467746M519477L308782J769806Q08450m99123j917857
$$ 23702046 20625231 23092977 27612454 30921236 32691042 33499492 33000369 31082512
39356C1082512j943563j94230J780584K056083Q0023k700287l744524j822953
$$ 31082512 29138949 28944719 30725303 32781386 32861409 30161122 26416598 24593645
39348B4593645J301357K651688J538711j43187j106712k014452l012137k450608
$$ 24593645 25895002 28546690 30085401 29942214 28835502 26821050 23808913 21358305
39340B1358305J74612K043986L36892l281490m210354r53147K747232K584695
$$ 21358305 21532917 23576903 23913795 20632305 16421951 15468804 18216036 20800731
39332B0800731j174013m395195l994377q70483J919439K776108K609627K645304
$$ 20800731 19626718 15231523 11237146 10366663 12286102 15062210 17671837 20317141
39324B0317141K367409N33455k275001l537674j773128J295788K463888O14920
$$ 20317141 22684550 23218005 20943004 17405330 15632202 16927990 19391878 20006798
39316B0006798k188587l172168j797559N4274N32875j80169o80462n91135q64778
$$ 20006798 17818211 14646043 12848484 12902758 13435633 13255464 12575002 11983867 11119089
39307A1119089j738064j852812l30260J543459K048615J342098M04755j092692
$$ 11119089 9381025 7528213 7197953 8741412 10790027 12132125 12536880 11444188
39299A1444188l477012m569168j784435L215581N495350L422168Q25422R80104
$$ 11444188 7967176 3398008 1613573 4829154 10324504 13746672 14572094 15552198
39291A5552198J988159Q04406j404378j733104j020327k298498m905444m987939
$$ 15552198 17540357 18344763 16940385 15207281 14186954 11888456 6983012 1995073
39283A995073k009511o7657j473485l251448k192971K53183J104156R66170K315554
$$ 1995073 -14438 -82095 -1555580 -4807028 -6999999 -6746816 -5642660 -4676490 -2360936
39274b360936M387666L893660N72226j734699m11328K537998L851392L306951
$$ -2360936 2026730 5920390 6492616 4757917 4346589 6884587 10735979 14042930
39266A4042930K662740K138523N82818j608218k475477j680741j297627k440585
$$ 14042930 16705670 18844193 19427011 17818793 15343316 13662575 12364948 9924363
39258I924363l193148j564783J079803J774852K21052j206696j379358j532893
$$ 9924363 6731215 5166432 6246235 8021087 8242139 7035443 5656085 4123192
39250D123192k099068j483489N91251J406305o71934k700742r30900L328884N208206
$$ 4123192 2024124 540635 1131886 2538191 1866257 -834485 -1765385 1563499 6771705
39241F771705L147446M98132j80325n51967k548022m328246l044723L85311K323554
$$ 6771705 9919151 10417283 10236958 9684991 7136969 2808723 -236000 149311 2472865
39232B472865J339259n67684j324699r63124l32910K31223M29061j65609j140547
$$ 2472865 3812124 3244440 1919741 956617 623707 854930 1283991 1118382 -22165
39223b2165j387971p43012l05378o25854q11955j26081P46522R70821J009869
$$ -22165 -1410136 -2153148 -2458526 -3084380 -3896335 -4022416 -3275894 -2305073 -1295204
39214a295204J601922K180019J758708Q13586O68194J261914J232216K74492l92030
$$ -1295204 306718 2486737 4245445 5059031 5727225 6989139 8221355 8495847 8103817
39205H103817l16007o24765j635120j638278L12202K066385J046575j825036l337882
$$ 8103817 7787810 7163045 5527925 3889647 4201849 6268234 7314809 5489773 2151891
39196B151891k538439j367227q59794K66711K448605L573548K100234k88248j076326
$$ 2151891 -386548 -1753775 -2613569 -2346858 101747 3675295 5775529 5487281 4410955
39187D410955l66577r194n37491r70848q76175q12834j176735j924279k824439
$$ 4410955 4044378 4035184 3497693 2526845 1650670 837836 -338899 -2263178 -5087617
39178e087617k949201j057814K177412L714218J740126j487038k470213j044347
$$ -5087617 -8036818 -9094632 -6917220 -3203002 -1462876 -2949914 -5420127 -6464474
39170f464474J96522M8765m23041n73149q95824j161819m71677P62428J313340
$$ -6464474 -6267952 -6219187 -6642228 -7215377 -8111201 -9273020 -9744697 -8982269 -7668929
39161g668929J526081K635104L851738L099174P78508m03952J67507J79123j206641
$$ -7668929 -6142848 -3507744 343994 3443168 4221676 3817724 3985231 4164354 2957713
39152B957713j698090j61428Q78678p53744l223155l487455j517513O03712J821535
$$ 2957713 1259623 1098195 1976873 1223129 -2000026 -5487481 -7004994 -6401282 -4579747
39143d579747K151997J413966N4153l77574N73850J272468P40288K76563O71672
$$ -4579747 -2427750 -1013784 -959631 -1337205 -763355 509113 1249401 1525964 2197636
39134B197636L54269j564765l032709k295931p31845K04077J786079M421117M551818
$$ 2197636 2551905 987140 -2045569 -4341500 -5073345 -4869268 -3083189 1337928 5889746
39125E889746k40955n663340n597795q63088K488669K415480K248633L156579
$$ 5889746 5648791 -14549 -5612344 -6475432 -3986763 -1571283 677350 3833929
39117C833929K088714j355086k453422J288781N491460N145844J516932q20159
$$ 3833929 5922643 4567557 2114135 3402916 8894376 14040220 15557152 14736993
39109A4736993o66100k23049p36490j627776k530726l284231k959110j222990
$$ 14736993 14070893 13847844 13111354 11483578 8952852 5668621 2709511 1486521
39101A486521L10492J4717j449490k284362j825091l59014J824580L772719L806144
$$ 1486521 1797013 1811730 362240 -1922122 -3747213 -4106227 -2281647 1491072 5297216
39092E297216J690978m56910p86791J28362Q33863J009190Q11015Q8260n52151
$$ 5297216 6988194 6531284 5744493 5872855 6706718 7715908 8526923 8615183 8063032
39083H063032L8615J096481K17268k467356l373057q43618J694281Q78787j260718
$$ 8063032 8101647 9198128 9415396 6948040 3574983 2731365 4425646 5304433 4043715
39074D043715q37513J521022K184835O67127l87782l54967j002904k048269j156563
$$ 4043715 3206202 4727224 6912059 7579186 7191404 6836437 5833533 3785264 2628701
39065B628701J194879J536474p93054k062876q6108K328372K175101Q51533J006618
$$ 2628701 3823580 5360054 4567000 2504124 2418016 4746388 6921489 7773022 8779640
39056H779640J805397Q92459r31495p76067J470256K811331J680561j14332n02056
$$ 8779640 10585037 11477496 10546001 9769934 11240190 14051521 15732082 15617750 15115694
39047A5115694K07581O80640O27417L24168m77639j712582j978907K2526L259029
$$ 15115694 15323275 16003915 16631332 16955500 16477861 14765279 12786372 12808898 16067927
39038A6067927N046183M171809K085576N94453k14263q77586q65826L28113J386995
$$ 16067927 21114110 25285919 27371495 27965948 27751685 26874099 26008273 26336386 27723381
39029B7723381O10676j200339j594254k74537L92762p65489j896069j257757J65241
$$ 27723381 28334057 27133718 25539464 25264927 25657689 24892200 22996131 21738374 21903615
39020B1903615O76290L65100l2147o66147j156688J35573L168139M686814K326288
$$ 21903615 22579905 22945005 22912858 22246711 21090023 21225596 24393735 29080549 31406837
39011C1406837j633214l483866l179419k891549k358640J09316L105617L271964
$$ 31406837 29773623 26289757 23110338 20218789 17860149 17969465 21075082 24347046
39003B4347046Q23333n53665L13111O21183j061935k466685k133036j977944l181416
$$ 24347046 25170379 24616714 24929825 25551008 24489073 22022388 19889352 17911408 14729992
38994A4729992l352427n51858K971890L950834K482360N11285j716973m675178
$$ 14729992 11377565 10825707 13797597 17748431 20230791 20742076 19025103 14349925
38986A4349925o843432o103536k923710K37289J900296K148973J429177N46114
$$ 14349925 7506493 1402957 -1520753 -1283464 616832 2765805 4194982 4741096
38978D741096N92239J198199L57123k249828l573533j134504K931750M341969
$$ 4741096 5333335 6531534 6888657 4638829 1065296 -69208 2862542 7204511
38970G204511K050352j264610l063354k839868j054922J280273K466482J754047
$$ 7204511 9254863 7990253 4926899 2087031 1032109 2312382 4778864 6532911
38962F532911O17714N96374Q62324m6535j387109j621593j418470k283268l179581
$$ 6532911 7150625 7746999 8609323 8562788 7175679 5554086 4135616 1852348 -1327233
38953a327233j858804R40873K067825O67191r95546j480330j501941j072424Q93666
$$ -1327233 -3186037 -2245164 -177339 489852 -505694 -1986024 -3487965 -4560389 -3666723
38944c666723L285450L003870J9899j467019Q96290L750690K984344l58577k404796
$$ -3666723 -381273 2622597 2642496 1175477 2071767 5822457 8806801 8448224 6043428
38935F043428k337360k160672k144526p58678J194965O34419k609156m234359
$$ 6043428 3706068 1545396 -599130 -1357808 -162843 471576 -2137580 -6371939
38927f371939j191189L521177M470844J013207j938245n13564L201461M262690
$$ -6371939 -7563128 -4041951 428893 1442100 -496145 -1009709 2191752 6454442
38919F454442J396940j755123j803573K23001J040732j96880j392338j020623
$$ 6454442 7851382 6096259 4292686 4515687 5556419 5359539 3967201 2946578
38911B946578Q4577O25286M40055m60921k453123m606235m218681j22912M479333
$$ 2946578 3031155 3656441 4096496 3635575 1182452 -3423783 -7642464 -7765376 -3286043
38902c286043M871013O27898l458068l073160N16157K382404J55184l325982l837620
$$ -3286043 1584970 2212868 -1245200 -4318360 -3802203 -1419799 -1264615 -4590597 -8428217
38893h428217r73212J612830Q97709j786354k472121M90125M292640M925805J923088
$$ -8428217 -9401429 -7788599 -6890890 -8677244 -11149365 -10659240 -6366600 -1440795 482293
38884D82293j122248r65426J294206J706872j230007m292363l485633Q39833M473792
$$ 482293 -639955 -1605381 -311175 1395697 165690 -4126673 -7612306 -6772473 -2298681
38875b298681M504369K067035k29533j505798k209603k267284j287749K73964
$$ -2298681 2205688 4272723 4043190 2537392 327789 -1939495 -3227244 -2953280
38867b953280J509100J991809J426318n89788l291790m394472k548195P13887
$$ -2953280 -1444180 547629 1973947 1384159 -1907631 -6302103 -8850298 -8136411
38859h136411K907505L479009L246187K265763L54430j352287j775930j962494
$$ -8136411 -5228906 -1749897 1496290 3762053 4116483 2764196 988266 -974228
38851i74228l197935l965706j936623J579496K855825J454480P14361J850569
$$ -974228 -4172163 -8137869 -10074492 -8494996 -5639171 -4184691 -3470330 -1619761
38843a619761J876586q90665l429823k778360n75385L59063P27621K164696K747166
$$ -1619761 256825 -633840 -4063663 -6842023 -7417408 -7058345 -6330724 -4166028 -1418862
38834a418862q4573l799045l294047J114847L427959O74334k866356k259012J293888
$$ -1418862 -1503435 -5302480 -8596527 -7481680 -4053721 -3379387 -6245743 -8504755 -7210867
38825g210867L310214K693688J793228J442942k0821k778251m013793j687986
$$ -7210867 -3900653 -1206965 586263 2029205 2008384 -769867 -4783660 -6471646
38817f471646K304190M229008K551515j255173m752175n992378l969261M00135
$$ -6471646 -4167456 61552 2613067 1357894 -3394281 -9386659 -13355920 -12955785
38809a2955785L999810M207622K067856Q51981J217643M63355k290681l437554
$$ -12955785 -8955975 -4748353 -2680497 -1828516 -610873 -147518 -2438199 -5875753
38801e875753k51103L749497L130298j077973k451797J103715M057175J692519
$$ -5875753 -6126856 -2377359 752939 -325034 -2776831 -1673116 2384059 4076578
38793D076578k957416m084352j343299J165387J742425K271477L610730M203451
$$ 4076578 1119162 -2965190 -4308489 -3143102 -1400677 870800 4481530 8684981
38785H684981L354902K296870J558245K83350j387060k048130j684586j939481
$$ 8684981 12039883 14336753 15894998 16178348 14791288 12743158 11058572 9119091
38777I119091l052332l121014j384817J84558j20382j209288j153518p8302M34553
$$ 9119091 6066759 2945745 1560928 1745486 1625104 415816 -737702 -816004 -381451
38768c81451k44716j235925j270226L20632K818284L947773J902006j896939l767560
$$ -381451 -626167 -1862092 -3132318 -2811686 6598 3954371 5856377 3959438 191878
38759A91878k445447q86585j780326l075979o75291N095313Q728054O081923n16530
$$ 191878 -2253569 -3140154 -4920480 -7996459 -8671750 -3576437 5151617 11233540 10717010
38750A0717010n253572n508204l558991k191836j158079R20925L093426K906658
$$ 10717010 5463438 -44766 -3603757 -5795593 -6953672 -6032747 -2939321 -32663
38742c2663K64322j897562j378415O86743J897999J650956R74787P05755J078462
$$ -32663 231659 -1665903 -3044318 -2357575 -459576 1191380 2166167 2871922 3950384
38733C950384J868767J763205q20429m731567n731131j463426M620609O944188
$$ 3950384 5819151 7582356 6761927 2030360 -3700771 -5164197 -543588 6400600
38725F400600M343218K17350k668870m100932l860561j397956J502244J631218
$$ 6400600 10743818 10961168 8292298 4191366 330805 -1067151 435093 2066311
38717B066311q97742k207063k88849K198905K354134R64485m2860r52283k408459
$$ 2066311 1168569 -1038494 -1327343 871562 3225696 4190181 4147321 3195038 786579
38708G86579k874788j038948J133895Q10003j535962l046381k456310o54466J567556
$$ 786579 -2088209 -3127157 -1993262 -1183259 -2719221 -5765602 -8221912 -8876378 -7308822
38699g308822L711393M459597L014896R48011L58049Q60528O90148q3186q2017
$$ -7308822 -3597429 862168 3877064 4825075 5183124 6043652 6733800 6650614 6568597
38690F568597L75465k33035j493000j520715o21022j211736l443544m134813j519349
$$ 6568597 6944062 6711027 5218027 3697312 3076290 1864554 -1578990 -5713803 -7233152
38681g233152J702195K066334N5704j187291n64561K216r90038k311720j769538
$$ -7233152 -5530957 -3464623 -3408919 -4596210 -5160771 -5158555 -6148593 -8460313 -10229851
38672a0229851Q46732L452903M017089K543119N20815j003771j980928k180272
$$ -10229851 -9383119 -5930216 -1913127 629992 1150807 147036 -1833892 -4014164
38664d014164q33003J837850L826744L299262Q74141j009011o98987J281766K875658
$$ -4014164 -4847167 -3009317 817427 4116689 4990830 3981819 3282832 4564598 7440256
38655G440256K041607j321468m400490l887343l74813J533392p71905l823047
$$ 7440256 9481863 8160395 3759905 -127438 -502251 1031141 259236 -3563811
38647c563811k792455J256151K632220p26251m233346l053304J668182M909309
$$ -3563811 -6356266 -5100115 -2467895 -3194146 -7427492 -10480796 -8812614 -3903305
38639c903305M058069J124020l03355J091039L122920K383846j595731m920028
$$ -3903305 154764 1278784 975429 2066468 5189388 7573234 5977503 1057475
38631A057475l694468N91434K549591M3043l035242k375828J002982K731408J036982
$$ 1057475 -2636993 -2045559 504032 547075 -2488167 -4863995 -3861013 -1129605 -92623
38622i2623j618717k100570M916K353482K299517k45563k248003r62202K092412
$$ -92623 -1711340 -3811910 -3806994 -1453512 846005 600442 -1647561 -2609763 -517351
38613e17351K622471l89387k752677q30594L211190M493332K064319n85900q99583
$$ -517351 2105120 1715733 -1036944 -1867538 1343652 5836984 7901303 7315403 6415820
38604F415820r2001l85626j872940l003141k708593j309810r9920k15255j241352
$$ 6415820 6323819 5938193 4065253 1062112 -1646481 -2956291 -3056211 -3271466 -4512818
38595d512818j204512J100948M069040M707894K057726j796388m078760l808128
$$ -4512818 -5717330 -4616382 -547342 4160552 6218278 4421890 343130 -3464998
38587c464998k033296m96477j20130k16091O66750K642231L782599K369524o18181
$$ -3464998 -5498294 -5994771 -6114901 -6330992 -5664242 -3022011 760588 3130112 2511931
38578B511931k400194j675707N3744O07442l41027j348625j325262q45336j060351
$$ 2511931 111737 -1563970 -1510226 -902784 -1243811 -2592436 -3917698 -4763034 -5823385
38569e823385j754459j476607J30645J487381J611461J910641L317953L183810
$$ -5823385 -7577844 -9054451 -8923806 -7436425 -5824964 -3914323 -596370 2587440
38561B587440j272909o824195o346844J344305Q350274P484802J417377k056666
$$ 2587440 1314531 -5509664 -11856508 -10512203 -2161929 5322873 6740250 4683584
38553D683584p97938P90942q9732j361720j036595l45525o61399j262529j496449
$$ 4683584 3885646 4676588 4586856 3225136 2188541 1843016 1181617 -80912 -1577361
38544a577361j810864j539089Q90339M268073M760288J599154q83329N97151L230276
$$ -1577361 -3388225 -4927314 -4036975 231098 4991386 6590540 5707211 6304362 9534638
38535I534638K370611j568196m101995l191347j173633n19402p79356k85453J259212
$$ 9534638 11905249 10337053 6235058 3043711 1870078 1350676 571320 285867 1545079
38526A545079K652781K538482O18953j771455k608597j454400k43706r17511k883646
$$ 1545079 4197860 6736342 7355295 5583840 2975243 1520843 1277137 359626 -2524020
38517b524020l780551k193235J205039M453574N444201L334992q2657j554902
$$ -2524020 -6304571 -8497806 -7292767 -2839193 2605008 5940000 5857343 4302441
38509D302441k07128J003499o94137l735852m407344k254632m07399n96477r39908
$$ 4302441 4095313 5098812 4404675 668823 -3738521 -5993153 -6400552 -6997029 -7936937
38500g936937M17789K269136K672090K114580K040348J699333o92799m076151
$$ -7936937 -7519148 -5250012 -2577922 -463342 1577006 3276339 2583540 -1492611
38492a492611m811139j664090J921431K248626L08370m7747K093883L644872K442940
$$ -1492611 -6303750 -7967840 -6046409 -3797783 -3489413 -3537160 -1443277 2201595 4644535
38483D644535K87507l04500J41103k45220j086040o90173M59296K12872j473962
$$ 4644535 4932042 4627542 4768645 4523425 3437385 2747212 3206508 3419380 1945418
38474A945418k229564j066905K42627K87872o4941J36281K15760m20941j011501
$$ 1945418 -284146 -1351051 -1108424 -820552 -885493 -749212 -533452 -954393 -1965894
38465a965894j132906j588751k318787j667390O54465K110159Q50584j260181
$$ -1965894 -3098800 -4687551 -7006338 -8673728 -8019263 -5909104 -5058520 -6318701
38457f318701j315943O05787K280902K655340K106594Q74317m90899n34544R60811
$$ -6318701 -7634644 -7028857 -4747955 -2092615 13979 888296 397397 -137147 823664
38448H23664J739385L15752j315675r24133o589j065129k721312j779920R66014
$$ 823664 2563049 2878801 1563126 638993 632404 -432725 -3154037 -4933957 -3967943
38439c967943J671187j66136j048037L84580J308420p9890j795272k114489k209431
$$ -3967943 -2296756 -2462892 -3510929 -3126349 -1817929 -1897819 -3693091 -5807580 -8017011
38430h017011k712460j600878J946035M994229M912424L097183K053051J612686
$$ -8017011 -10729471 -12330349 -10384314 -5390085 -477661 2619522 4672573 6285259
38422F285259Q28483P70104K160720K663001J26146l287592l801824j460154N73979
$$ 6285259 7113742 7883846 10044566 12707567 12833713 9546121 5744297 4284143 4858122
38413D858122R25876O69719J8729j864026m007466m153875k400097j222582j518627
$$ 4858122 5783998 6453717 6472446 4608420 600954 -3552921 -5953018 -7175600 -8694227
38404h694227j575620n44359l0885j092760j985251l73052L525275O919950O769674
$$ -8694227 -10269847 -10814206 -10845091 -11937851 -13923102 -14296154 -10770879 -3850929 2918745
38395B918745K175610m215905p438804m662381J386800N026685L708462p286k295909
$$ 2918745 5094355 878450 -6560354 -11222735 -9835935 -4809250 -1100788 -1108074 -3403983
38386c403983j896942p4125J156120M06035j662332k147674R22108N201631O146980
$$ -3403983 -5300925 -5375050 -4218930 -3812895 -5475227 -7622901 -6700793 -1499162 4647818
38377D647818K825354r43517j870834q56471k18367j05551L21016L65724j054441
$$ 4647818 7473172 6529655 4658821 3802350 3583983 3478432 3799448 4165172 3110731
38368C110731k981381l290004j343640J621398L881059L901148J030119l017897
$$ 3110731 129350 -3160654 -4504294 -2882896 998163 4899311 5929430 2911533
38360B911533m762836k755433M65255J889305J945973K644519L396273J980147
$$ 2911533 -1851303 -4606736 -4141481 -2252176 -306203 2338316 5734589 7714736
38352G714736r41420j941422o0581J400554j91382k802509k801170j36320K002846
$$ 7714736 6773316 4831894 4771313 6171867 5980485 3177976 376806 240486 2243332
38343B243332J689056K1868j273996j757217j476564k65776J229770J264543r42025
$$ 2243332 3932388 3954256 2680260 923043 -553521 -819297 410473 1675016 732991
38334G32991l571884l928876j624408R45159J337969m67395k386179k345641o7513
$$ 732991 -2838893 -6767769 -8392177 -7447018 -6109049 -6576444 -8962623 -11308264 -11375777
38325a1375777K627193L335633J588831l30134m1202J734417K181799O67067j37049
$$ -11375777 -8748584 -5412951 -3824120 -4154254 -4195456 -2461039 -279240 387827 250778
38316B50778J596985L670334K763868q68869l825640l881316j766674Q28181K837356
$$ 250778 1847763 5518097 8281965 7413096 3587456 -293860 -2060534 -1232353 1605003
38307A605003L589980L026646K191633J906861J304383o07943k647763k955751
$$ 1605003 5194983 8221629 10413262 12320123 13624506 13016563 10368800 7413049
38299G413049k034593j573065r95535J336492L875571L117501m60627k332559
$$ 7413049 5378456 3805391 2809856 4146348 8021919 11139420 10678793 8346234
38291H346234j078413o47847l156224m579450j452821K712814K737009o8244q20506
$$ 8346234 7267821 6619974 3463750 -1115700 -2568521 144293 2881302 2813058 1992552
38282A992552L40088r96606n137447p033755l928258J147535M503463N658727
$$ 1992552 2332640 1336034 -3801413 -10835168 -14763426 -13615891 -9112428 -3453701
38274c453701N053603K602365J2397J10065K037732J344699l006625n902301l178977
$$ -3453701 1599902 4202267 4214664 4324729 6362461 7707160 4700535 -1201766 -4380743
38265d380743K135934M008860J143428k644255l714788j423346K557546N187202
$$ -4380743 -2244809 1764051 2907479 263224 -3451564 -4874910 -2317364 2869838
38257B869838L964087L6734k357718j323727K68394k37903j084457J07282J544245
$$ 2869838 6833925 6870659 4512941 3189214 3457608 3219705 2135248 2242530 3786775
38248C786775L78971j905521j936671m55410p55177k239060j121290K483304L842747
$$ 3786775 4165746 2260225 323554 -131856 -887033 -3126093 -4247383 -1764079 2078668
38239B078668J130070j555938p45618J385786J267860n64377j316362m09425R21133
$$ 2078668 3208738 1652800 907182 2292968 3560828 2996451 1680089 1270664 2191797
38230B191797K211201L089910K056057j135259l570702k672292k41781M9754j834438
$$ 2191797 4402998 7492908 9548965 8413706 4843004 2170712 1928931 1978685 144247
38221A44247k601033r79757O22116K38825q61920o06115Q85817K030300K006609
$$ 144247 -2456786 -3436543 -2814427 -2575602 -3437522 -4043637 -3157820 -1127520 879089
38212H79089J104825o1253p46586l44143P61714J336597Q91983L64931N74750
$$ 879089 1983914 1922661 1176075 831932 1593646 2930243 3822226 4187157 4761907
38203D761907Q18874r4777j943325l183716k765363j031562J103587K976778L931327
$$ 4761907 5580781 5486004 3542679 358963 -2406400 -3437962 -2334375 642403 4573730
38194D573730L161534O72936j905996k486797q34660R71582R18699o46573j796259
$$ 4573730 7735264 8408200 6502204 4015407 3180747 4152329 5071028 4424455 2628196
38185B628196j623900j061248j238028k126322k982189l108617j923014N92462
$$ 2628196 1004296 -56952 -1294980 -3421302 -6403491 -9512108 -11435122 -10842660
38177a0842660L014215L269589J183250q06317n42535J172300K069703J669813
$$ -10842660 -7828445 -4558856 -3375606 -4181923 -4724458 -3552158 -1482455 187358
38169A87358J258768J106267o6955k427899l867247k675983m9705J423146R22512
$$ 187358 1446126 2552393 2485438 57539 -3809708 -6485691 -6535396 -5112250 -4189738
38160d189738k85261j047435j245574o72261J221867L784593M818029L080769
$$ -4189738 -4474999 -5522434 -6768008 -7440269 -6218402 -2433809 2384220 5464989
38152E464989L22110o92289J83959N89302m69179j037708L26553J654605N18132
$$ 5464989 5787099 5094810 5278769 5868071 5398892 4361184 4687737 6342342 6860474
38143F860474j501017o49539K795654L930178K89130l869189l175990J268262
$$ 6860474 5359457 4709918 7505572 11435750 11724880 7855691 4679701 5947963
38135E947963L483024P24369l613195n212731l626544j074464P26771J239192
$$ 5947963 9430987 10155356 6542161 1329430 -2297114 -3371578 -2644807 -1405615
38127a405615P00170K78819J027539J956620J087166r57888j041588J534606L111376
$$ -1405615 -705445 -426626 600913 2557533 3644699 2686811 1645223 3179829 6291205
38118F291205R74887k154782k156966J45204P74834m99354R5384L360695M751460
$$ 6291205 7266092 5111310 2954344 3099548 3874382 3375028 3470412 6831107 11582567
38109A1582567J066984m279435n762036l033896l30669K3090j04965J123816K276735
$$ 11582567 12649551 8370116 2608080 -425816 -756485 -733395 -838360 285456 2562191
38100B562191J132817j443134k153649M28086L741076M193014J479955j334329
$$ 2562191 3695008 2251874 98225 526311 4267387 8460401 9940356 8606027
38092H606027k007959j615327j863279j857610J9389K185590J270235k367139
$$ 8606027 6598068 4982741 3119462 1261852 1281241 3466831 4737066 2369927
38084B369927m118684j490981K239141K846025P92627o91848p63332q23726r09891
$$ 2369927 -1748757 -3239738 -1000597 1845428 2638055 1946207 1182875 359149 -550742
38075e50742J00190J520913J583800O80146O08541J021095Q2245j631541j705332
$$ -550742 -450552 1070361 2654161 3334307 3942848 4963943 5046188 3414647 1709315
38066A709315l66655k34611j224161m04311J998521J752872j916550l463311N29281
$$ 1709315 1342660 1108049 -116112 -520423 1478098 3230970 1314420 -2148891 -1619610
38057a619610M949520L472676j630262l377751j182921p71992l746591m873454
$$ -1619610 3329910 6802586 5172324 1794573 611652 -160340 -3906931 -8780385
38049h780385j290055K492882K047045q9576O29099K990433K391485j189092k781582
$$ -8780385 -10070440 -7577558 -5530513 -5620089 -4990990 -2000557 390928 -798164 -3579746
38040c579746J85790M262080M839489J927601n13276K44394K585213K687114p49444
$$ -3579746 -3393956 868124 5707613 7635214 7121938 7366332 9951545 12638659 11889215
38031A1889215m657067n164066k385666o6312m52124j614158p86834J558614K653453
$$ 11889215 7232148 2068082 -317584 -383896 -836020 -2450178 -3237012 -1678398 975055
38022I75055J326687p08897j081138P44397K887593K642009n60326l714407l253765
$$ 975055 2301742 1592845 511707 1256104 4143697 6785706 6225380 2510973 -742792
38013g42792K86825K683260J709710j82250k31987M65758l57607j766549j284693
$$ -742792 -455967 2227293 3937003 3754753 3522766 3988524 3630917 1864368 579675
38004E79675O18650J296411L64393j93560m7467j015745l221890m262564l153778
$$ 579675 1198325 2494736 2859129 2665569 2618102 1602357 -1619533 -5882097 -9035875
37995i035875j974102k242150k434304p79197J804982L402091L841269L921598
$$ -9035875 -11009977 -13252127 -15686431 -16465628 -14660646 -11258555 -7417286 -3495688
37987c495688L512918K359547J521026K045270L038337K868928J713405J143691
$$ -3495688 17230 2376777 3897803 5943073 8981410 11850338 13563743 14707434
37979A4707434J435270R94597j186923l705146m105569j756550J167718J918958
$$ 14707434 16142704 17137301 15950378 12245232 8139663 6383113 7550831 9469789
37971I469789L42500r15686J21559K061674K161323J81624j699699k328786k459462
$$ 9469789 9812289 8896603 9018162 11079836 13241159 13422783 11723084 9394298 6934836
37962F934836k163929k97946K503833L192710M57080k856098l553084k246396
$$ 6934836 4770907 4472961 6976794 10169504 10626584 7770486 4217402 1971006
37954A971006j365258j028437J01556J329756Q61392l08489Q70138M311924N630288
$$ 1971006 605748 -422689 -321133 1008623 1870015 1561526 2431664 6743588 12373876
37945A2373876J736836m610093p711234n272610l89340K299072J368199m95154
$$ 12373876 14110712 9500619 1789385 -3483225 -3872565 -1573493 -205294 -700448
37937g00448P5293L160123N606734N063349K644941P57964j80854j156558k002772
$$ -700448 -625155 2534968 8141702 13205051 15849992 16607956 16427102 15270544 13267772
37928A3267772j845193j417196k282175l837790l688697j276215J312106K499234
$$ 13267772 11422579 10005383 7723208 3885418 196721 -1079494 232612 2731846
37920B731846K638562J872129m41264l163515l368157o13044J642536J030682
$$ 2731846 5370408 7242537 6801273 3637758 269601 -343443 1299093 2329775
37912B329775j00528J167588L107889J985562j674115l544139j783265R22423
$$ 2329775 2229247 3396835 6504724 8490286 6816171 3272032 1488767 2411190
37904B411190J848815J318214N85512j86458o44371L13556K286763K801872O02314
$$ 2411190 4260005 5578219 6163731 5977273 5332902 5646458 7933221 10735093 11337407
37895A1337407k308527l400060k704939j724001r68093k93878j25437m30195J84584
$$ 11337407 9028880 5628820 2923881 1199880 231787 -62091 -187528 -617723 -433139
37886d33139K324891L946828K850035M7577j732733k059688k565045l231754k172534
$$ -433139 1891752 5838580 8688615 8736192 7003459 4943771 2378726 -853028 -3025562
37877c025562N41535K050211Q52703r63166j120057k88998l3496O2528R35797
$$ -3025562 -2484027 -433816 418887 -544279 -1664336 -1953334 -1986830 -1924302 -988505
37868i88505J640234J034944M20860J629188L446132K945116p3200k909633m018865
$$ -988505 651729 1686673 2107533 3736721 7182853 10127969 10054769 7145136 3126271
37859C126271m164920l489073r66092K289479K730214o27346l768757k717223
$$ 3126271 -1038649 -4527722 -5493814 -3204335 -474121 -1101467 -4870224 -7587447
37851g587447J128858L242970J835842j180916l652520m612721l149842R21410
$$ -7587447 -6458589 -3215619 -1379777 -2560693 -6213213 -10825934 -13975776 -13054366
37843a3054366N231608O521330M633040K565763K110264J757905k03423k669164
$$ -13054366 -7822758 -1301428 3331612 5897375 8007639 9765544 9562121 6892957
37835F892957l218565j287733J461328L130039K977122J440099m26458j759479
$$ 6892957 3674392 2386659 3847987 6978026 9955148 11395247 10968789 9209310
37827I209310k405600k454455j631895J36577J970414K791129K453114J248522
$$ 9209310 6803710 4349255 2717360 2853937 4824351 7615480 10068594 11317116
37819A1317116q26522k956719k911205J23919L041692K132741j491986l211764
$$ 11317116 10490594 7533875 4622670 4746589 7788281 9921022 8429036 5217272
37811E217272j648748n8840j82978N67488L489691M760256J104555m233180n798756
$$ 5217272 3568524 3509684 3326706 3894194 7383885 12144141 13248696 9015516 3216760
37802C216760l667905j904988j172660J366117N302823O160673K467881j583601
$$ 3216760 -451145 -2356133 -3528793 -2162676 3140147 9300820 11768701 10185100
37794A0185100k566525k330773l423848m063700j343870L286177N594680M175868
$$ 10185100 7618575 5287802 1863954 -2199746 -3543616 -257439 5337241 9513109
37786I513109J258358j064703k432941k686278j593945j17228K88745k42573l17610
$$ 9513109 10771467 9706764 7273823 4587545 2993600 2876372 3165117 2922544 2604934
37777B604934M53018J215808J693671K405800L044788K466567O71945p65056q08594
$$ 2604934 3057952 4273760 5967431 8373231 11418019 13884586 14556531 13791475 12982881
37768A2982881l00069o24975j894326k873488k220424J59845K507064K539625
$$ 12982881 12682812 12057837 10163511 7290023 5069599 5229444 7736508 10276133
37760A0276133K97694j247046L8291K041531J217943j723145k362269N13167K358752
$$ 10276133 10573827 9326781 9365072 11406603 12624546 10901401 8539132 9052299 11411051
37751A1411051m07425m442634m088399P6634K059869m92597l045157j439310K047706
$$ 11411051 11003626 6560992 2472593 2549227 4609096 4116499 1071342 -367968 1679738
37742A679738K909135J283302N43551J059424J41301k183127k220987J215209
$$ 1679738 4588873 5872175 6415726 7475150 7616451 5433324 3212337 4427546
37734D427546L881197J970112k202523l709504k108129j160265k372252k958049
$$ 4427546 8308743 10278855 8076332 4366828 2258699 1098434 -1273818 -4231867
37726d231867q56971J847416K316221J177351J023530K190872K487261P31365
$$ -4231867 -5088838 -3241422 -925201 252150 1275680 3466552 5953813 6685178
37718F685178j447668j708222K88568K747629L776858L185865K290131K000033
$$ 6685178 5237510 3529288 3817856 6565485 10342343 13528208 15818339 17818372
37710A7818372J533659l14140k921759m113979k976421j111854l97563o75124
$$ 17818372 19352031 19037891 16116132 12002153 9025732 7913878 7516315 6841191
37702F841191o33719R3837R76627J878229K847264L112524J737549q85566l331221
$$ 6841191 6207472 6301309 7277936 9156165 12003429 15115953 16853502 15967936 12636715
37693A2636715m624288m346266j953819K227273N608509N146697J154336k497801
$$ 12636715 8012427 3666161 1712342 3939615 9548124 14694821 15849157 13351356
37685A3351356k885404j189672k63568n60533k49091J414637K837847K429288
$$ 13351356 10465952 9276280 9012712 8452179 8203088 9617725 12455572 14884860
37677A4884860P32300m80810m61336j6501M204n7767N28887J230886M98857j803447
$$ 14884860 15617160 15136350 14675014 14658513 14662717 14604950 15133837 16364723 16863580 15060133
37667A5060133l276540j644822J994395M319059M096633L235852L021350J858153
$$ 15060133 11783593 10138771 12133166 16452225 20548858 23784710 26806060 28664213
37659B8664213j484831m562709l994068m16437K289089K340245J523945J196748
$$ 28664213 27179382 22616673 18622605 18206168 20495257 22835502 24359447 25556195
37651B5556195L27546j276439j294012J129757K617939J65404l471896l058156
$$ 25556195 25883741 24607302 23313290 24443047 27060986 27226390 23754494 20696338
37643B0696338J309908M079288K281841p35394j219819m74096j423818l029696
$$ 20696338 22006246 26085534 28367375 27631981 26412162 25938066 24514248 21484552
37635B1484552k227624L92077J255611l33545j191738L76238K013939J427096
$$ 21484552 19256928 19649005 20904616 20571071 19379333 19755571 21769510 23196606
37627B3196606k22635q72289p02978n05798O50730L349412N271174L931220R74352
$$ 23196606 22973971 22101682 21398704 20892906 21543636 24893048 30164222 34095442 35069794
37618C5069794M52719L041057N108995L939211R09336j459550k845255l883461
$$ 35069794 35522513 38563570 43672565 47611776 48521112 47061562 44216307 40332846
37610D0332846l863421j903623R01390K652680L171786L431272L190782J500663
$$ 40332846 36469425 34565802 35467192 38119872 41291658 44722930 47913712 49414375
37602D9414375n84389l52515K599744M834732L190411p97162k577581l52998K805058
$$ 49414375 48829986 48477471 51077215 55911947 59102358 58305196 55727615 55374617 58179675
37593E8179675L145882R57520k42593J462114L969127L966650J090922j732320
$$ 58179675 61325557 62283077 62040484 63502598 67471725 71438375 72529297 70796977
37585G0796977j889300j4807J222798O90125K4624J021920K899261L337178J745560
$$ 70796977 68907677 68892870 70115668 70805793 70830417 71852337 74751598 78088776 79834336
37576G9834336q9417p50711q03547q67038K9423K400279M087844K650940o38166
$$ 79834336 79744919 78994208 78190661 77323623 77353046 79753325 83841169 86492109 85853943
37567H5853943k004008n35331N28279j243989m004019m739216l476112k207737
$$ 85853943 83849935 83314604 83842883 82598894 78594875 73855659 70379547 68171810
37559F8171810j469609m63711O63453J173137J509495K297725K283188q4815l330042
$$ 68171810 66702201 66238490 66901943 68075080 69584575 71882300 74165488 74080673 70750631
37550G0750631l995035j329017J544317J799605J09608j144252r60103N5669J122536
$$ 70750631 66755596 65426579 66970896 68770501 68880109 67735857 66775754 66831423 67953959
37541F7953959J825898J980481J604544O64371r70780k708464l173955k152286
$$ 67953959 69779857 71760338 73364882 74029253 73058473 70350009 67176054 65023768
37533F5023768j504390k392819k901503r74154J540598J293375q81680j011404
$$ 65023768 63519378 61126559 58225056 57250902 58791500 60084875 59203195 58191791
37525E8191791J217852J623185j290379l382229j599601J018993M98125j955601
$$ 58191791 59409643 61032828 59742449 56360220 54760619 55779612 56277737 54322136
37517E4322136l028163k994065l693630l637472l56938M089923N152833K467123
$$ 54322136 51293973 48299908 44606278 40968806 40611868 44701791 49854624 52321747
37509E2321747k17154j082222j499942j747723n31310J004614j79247l531836
$$ 52321747 52104593 51022371 49522429 47774706 47243396 48248010 48068763 44536927
37501D4536927m632177j769593J451085J682511K8899j145973j830421k613856
$$ 44536927 39904750 38135157 39586242 41268753 41297652 40151679 38321258 35707402
37493C5707402k573732j126676O22094J946008L161181L207661K08046m168817
$$ 35707402 33133670 32006994 32629088 34575096 37736277 40943938 41151984 36983167
37485C6983167n140483j739498J096238J03900j368203J93861J885946l54325
$$ 36983167 31842684 30103186 31199424 31303324 29935121 30128982 32014928 31660603
37477C1660603l746121k525690K380069M411675J453619j697267j434208J36439
$$ 31660603 27914482 25388792 27768861 32180536 33634155 31936888 30502680 30639119
37469C0639119K16786m85485p32967j468968l076771l524429j666140N71424J394988
$$ 30639119 30855905 30370420 29637453 28168485 25091714 21567285 19901145 20472569 21867557
37460B1867557J683147K313071J920869k57929k039815j563615n99077j559503
$$ 21867557 23550704 25863775 27784644 27526715 25486900 23923285 23324208 21764705
37452B1764705l110542k177005Q02916K189214N66190j349471r29404P96998J150556
$$ 21764705 18654163 16477158 17280074 19469288 20035478 18686007 17756603 18553601 19704157
37443A9704157k39374j172341j56932J451441J267547o75756j524971O64151L801899
$$ 19704157 19464783 18292442 18135510 19586951 20854498 20178742 18653771 19317922 23119821
37434B3119821L964006M45333l258521l933558k324176j375712k219624l196530
$$ 23119821 27083827 27529160 24270639 20337081 18012905 16637193 14417569 11221039
37426A1221039k186587R85939M114518M413487J482570j774775k477852j534543
$$ 11221039 9034452 10020391 14134909 18548396 20030966 18256191 15778339 14243796
37418A4243796j925595l518323k883020Q54120L679564K506187O5217O44450L382543
$$ 14243796 12318201 8799878 5916858 6770978 10450542 12956729 13021946 13666396 17048939
37409A7048939L856957R74254j978446k777155k661559k891945k691210j701497
$$ 17048939 20905896 21880150 19901704 17124549 14462990 11571045 8879835 7178338
37401G178338j221772j529212p63367J820510L893285L274174J185364L00972
$$ 7178338 5956566 4427354 3663987 5484497 9377782 12651956 13837320 14138292
37393A4138292J053201J831058J657792P48641o71276k224475k757736j728978
$$ 14138292 15191493 17022551 18680343 19428984 18757708 16533233 13775497 12046519
37385A2046519p42720j770357l949218m103478r11116L061925M327667K331888
$$ 12046519 11303799 9533442 5584224 1480746 569630 3631555 7959222 10291110
37377A0291110o30453k500729l115142k985614j975825q2917J385289R28849q44205
$$ 10291110 9660657 7159928 4044786 1059172 -916653 -999570 385719 1314568 470363
37368D70363j525445r8900J605977J730439J205344J922403L188752K578059L7204
$$ 470363 -1055082 -1153982 451995 2182434 3387778 5310181 8498933 11076992 11114196
37359A1114196j699537j326160p43235j347708j332029J027631L527193K536844
$$ 11114196 9414659 8088499 7345264 5997556 4665527 5693158 9220351 11757195
37351A1757195j603370m699593m167837j759087l41739k75990j11111P20298J344253
$$ 11757195 10153825 5454232 1286395 -472692 -814431 -1090421 -1201532 -481234 863019
37342H63019R69684k3478m87222K17087J251472R99765p22660j784674k17462
$$ 863019 1832703 1809225 1322003 1539090 2790562 3790327 3067667 1282993 1065531
37333A065531K820511M105809K442227O6206n08406N43622J453959J517577J278049
$$ 1065531 3886042 7991851 10434078 10500284 9991878 10535500 11989459 13507036 14785085
37324A4785085R41281J81841o92253p80819p7674J01671j226822l161297l710025
$$ 14785085 15726366 15908207 15215954 14435135 14357461 14459132 13232310 10071013 6360988
37315F360988k136433N2827Q46304P4217p49125q09421r40937j626918j571110
$$ 6360988 4224555 4277382 5123686 5197903 4448778 3639357 2698420 1071502 -499608
37306d99608J73089J816944R77712j217770j117115J785167L318257O20158l131935
$$ -499608 -326519 1490425 2468137 1250367 133252 1918419 5236676 5856834 2724899
37297B724899l011030M28032J994002m60865l072585j707238K513129N344621
$$ 2724899 -286131 141901 2135903 1675038 -1397547 -3104785 -591656 4752965
37289D752965M823067K267755n94034k949075l930827k797320m55569R23713M53680
$$ 4752965 9576032 11843787 11249753 8300678 4369851 1572531 1116962 2040675 2494355
37280B494355m51045j18308J310290K425423K333940J223759k37575j348637j577440
$$ 2494355 2043310 1925002 3235292 5660715 7994655 9218414 8980839 7632202 6054762
37271F054762r46892n6674O17612J110157J376732J003612J30533j25442P03737
$$ 6054762 5107870 5051196 5668808 6778965 8155697 9159309 9289842 9164400 9868137
37262I868137J046959p46782l249722l026592M08881L096352J854096j077257
$$ 9868137 10915096 10168314 6918592 3892000 4300881 7397233 9251329 8174072
37254H174072j365012Q70038J521565p23137k244330m51614J983122J479978r28145
$$ 8174072 6809060 7679098 9200663 8477526 6233196 5781582 7764704 9244682 8316537
37245H316537j867127j199971j324165k190640j411347R20514J910411R27706
$$ 8316537 6449410 5249439 3925274 1734634 323287 1243801 3154212 4081918
37237D081918O73615J920987J578287j709030m163475k450761P64590R54128j176327
$$ 4081918 4755533 6676520 8254807 6545777 2382302 -68459 696131 1650259 473932
37228D73932j389432R68108K586446K222277J924835J998889K7925l678143m698354
$$ 473932 -915500 52608 2639054 4861331 6786166 8785055 8812980 5134837 436483
37219D36483j150959K547309J957773p51550m13057L297540N863401M526959R36713
$$ 436483 -714476 1832833 3790606 3039056 2625999 5923539 11786940 16313899 17250612
37210A7250612k305295m145451m093791j995910O17121J491647N37788k99467
$$ 17250612 14945317 10799866 6706075 4710165 5327286 6818933 7356721 7057254
37202G057254k18535l49989j130104j324140k98702R21844J517225J665368R30283
$$ 7057254 6838719 6488730 5358626 4034486 3735784 4657628 6174853 7840221 8770504
37193H770504j631779m732975m836841o71704M266192N712681L601734J106271
$$ 8770504 7138725 2405750 -2431091 -3102795 1163397 6876078 10477812 11584083
37185A1584083Q5844l32437j424538l144361m462061m093052j417553K186715
$$ 11584083 11669927 11337490 9912952 6768591 2306530 -1786522 -3204075 -1017360
37177a017360L799809K124234o20905j373383P8697J589845J880232J406666P09094
$$ -1017360 2782449 4906683 4285778 2912395 2991092 4580937 6461169 7867835 8576929
37168H576929j33667p24826p29842o66089q13174j21888J941566L413112K128122
$$ 8576929 8443262 7718436 6988594 6322505 5509331 5387443 7329009 10742121 12870243
37159A2870243o54019j691601n06425L28675l31343p61796k1173L34163n66136
$$ 12870243 12216224 10524623 10018198 10346873 10015530 9253734 9232561 9566724 9000588
37150I000588j153316m74893n3697p87366q77686Q11607K084676R74594m29393
$$ 9000588 7847272 7372379 7318682 6531316 5653630 6465237 8549913 9524507 9095114
37141I095114R04414L814575M564934K438042P4597j052566j782906k122839q07934
$$ 9095114 9999528 13814103 18379037 20817079 20891676 19839110 18056204 15933365 15125431
37132A5125431J406499J528556j339851m220474m160981j721562N77327J240150
$$ 15125431 16531930 18060486 16720635 12500161 8339180 6617618 7194945 8435095
37124H435095J37588k127234l898868l173342J07455L653718N409660N182324
$$ 8435095 8572683 6445449 2546581 -626761 -519306 3134412 8544072 13726396
37116A3726396L469438Q03163j128118k87664K411273L042826j92156l867409
$$ 13726396 17195834 17998997 16870879 16583215 18994488 22037314 21845158 17977749
37108A7977749l694698l70424J542669l19632l646424m789463k645019Q29371
$$ 17977749 14283051 13912627 15455296 15135664 11489240 6699777 4054758 4884129
37100D884129K724140J912739K90144N46255K387986K731664M66614j473314o08460
$$ 4884129 7608269 9521008 9811152 10357407 12745393 15477057 15943671 14470357 13861897
37091A3861897J182320J126325M70066J905596L777788J891525l125037n486609
$$ 13861897 15044217 16170542 16640608 18546204 22323992 24215517 21090480 15603871
37083A5603871k511954J493111J804193m23754j442022r94579j226802j848955
$$ 15603871 13091917 14585028 16389221 15965467 14523445 13528866 12302064 10453109
37075A0453109p17896J665916K289954M75371p55333R23509L874910M835926K832081
$$ 10453109 9735213 11401129 13691083 14166454 13411121 14334630 18209540 23045466 25877547
37066B5877547l43426k395601k344189q69764M23897N27472P0886L63061J465692
$$ 25877547 25534121 23138520 20794331 19924567 20348464 20875936 20946822 21309883 22775575
37057B2775575K107355J594329P52489N82483R28027J042686O78566k1561r50560
$$ 22775575 24882930 26477259 27229748 27812231 28740258 29782944 30461510 30439949 29489389
37048B9489389j540727n71551K258028M808776M062685k15795m457097m866513
$$ 29489389 27948662 27377111 29635139 34443915 38506600 38290805 33833708 28967195
37040B8967195j459011K331805L517285J944162o60500k397286j899203Q13392
$$ 28967195 27508184 29839989 33357274 35301436 34640936 32243650 30344447 31157839
37032C1157839L460962L196234K96363j435137N66637M041148N023106L023211
$$ 31157839 34618801 37815035 38111398 36676261 37242898 41284046 46307152 49330363
37024D9330363N21275j360109l187752l875314j318114K911514L853391J45459
$$ 49330363 49851638 48491529 45303777 41428463 40110349 43021863 46875254 47020713
37016D7020713l124682j416044K736233L848988J539835N4285J266412K824185
$$ 47020713 43896031 42479987 45216220 49065208 50605043 50659328 51925740 54749925
37008E4749925K902385K327423J531248l61165k261194r62930L729284P108690
$$ 54749925 57652310 59979733 61510981 61149816 58888622 57925692 61654976 68763666
37000F8763666N395844Q73771j568097r34116m6316l60904l54883J050596K536561
$$ 68763666 74159510 75033281 73465184 72531068 72484752 72123848 71768965 72819561 75356122
36991G5356122K701551K190363K337536K998878K961476J980077J385501K462481
$$ 75356122 78057673 80248036 82585572 85584450 88545926 90526003 91911504 94373985
36983I4373985M620725N734978M657523K901532K835091M378227N007142L433152
$$ 94373985 98994710 104729688 109387211 112288743 115123834 119502061 124509203 127942355
36975A27942355J469006J102617J543112J202183J182981L835201Q132113R729441
$$ 127942355 129411361 130513978 132057090 133259273 134442254 138277455 146409568 156139009
36967A56139009O726927K775747K542019N800367Q285169P501901N306315M708206
$$ 156139009 162865936 165641683 168183702 173984069 182269238 189771139 195077454 199785660
36959A99785660O226745Q184648R160222R069950Q588093Q423775Q757679Q743036
$$ 199785660 206012405 214197053 223357275 232427225 241015318 249439093 258196772 266939808
36951B66939808P090596L957013J757945K908995O748129R872357R928385Q043097
$$ 266939808 274030404 277987417 279745362 282654357 289402486 299274843 309203228 317246325
36943C17246325O842385P072069P399570P027124O892609P889041R125296Q913034
$$ 317246325 324088710 331160779 338560349 345587473 352480082 360369123 369494419 378407453
36935C78407453O978587M773899L600710L121567K026493k29724k824770m618140
$$ 378407453 385386040 390159939 393760649 396882216 398908709 398678985 395854215 391236075
36927C91236075n261366m975217l757478j678019O8900m64485l768047p629553
$$ 391236075 385974709 380999492 377242014 375563995 375632895 375168410 371400363 363770810
36919C63770810r073383p448640m885550l781444m560259n920354o541685o314827
$$ 363770810 354697427 347248787 342363237 338581793 334021534 328101180 321559495 315244668
36911C15244668o359896p901927j0653161j2419942j1131998p476970m723992
$$ 315244668 308884772 300982845 290329684 277909742 266777744 259300774 254576782
36904B54576782n365100q328309j0058011q308752m600880k773938m936464q911730
$$ 254576782 249211682 240883373 230825362 222516610 217915730 215141792 210205328 201293598
36896B01293598j0323625p550196l706808k746579m475174n260809l510383k076617
$$ 201293598 190969973 183419777 179712969 176966390 172491216 167230407 163720024 161643407
36888A61643407m053912p952796r146785n703520r19515M85630k398535o106218
$$ 161643407 157589495 149636699 140489914 134786394 133866879 134352509 131953974 125847756
36880A25847756p044895n280738l585968l432188l354783j679161O47642J394782
$$ 125847756 118802861 113522123 109936155 106503967 103149184 101470023 102117665 103512447
36872A03512447L01226r33215j588381k623009m038443l869857j195947J520010
$$ 103512447 103813673 102880458 101292077 98669068 94630625 90760768 89564821 91084831
36864I1084831R89073k696354o018383o036078l281942o44220k09022j501772
$$ 91084831 92073904 89377550 83359167 77323089 74041147 73396927 73187905 71686133
36856G1686133k602548k677597k765678l640481l963154k114550P61338J765473
$$ 71686133 69083585 66405988 63640310 59999829 56036675 53922125 54683463 56448936
36848E6448936L42321j058916r38982o66868j287769j257388N67988K119316R84179
$$ 56448936 56791257 55732341 54793359 54126491 52838722 51581334 52149322 54268638 55252817
36839E5252817j694884l043425k811052k887703l434229k746714p10019O71005
$$ 55252817 53557933 50514508 47703456 44815753 41381524 38634810 37924791 38595796
36831C8595796M32662k55067m84941p33636j176971j053109k09366N39282Q60418
$$ 38595796 39028458 38773391 38288450 37554814 36377843 35324734 35115368 35654650 36515068
36822C6515068R84897M31815j293717k831536k188685N775R78928m3722p71139
$$ 36515068 37499965 37931780 36638063 33806527 31617842 31623617 32602545 32558823 31787684
36813C1787684L35837J753818J600923M65698J21838R94966K049658K063004N70450
$$ 31787684 32123521 33877339 35478262 35943960 36065798 37060764 39110422 41173426 41743876
36804D1743876j215586p36001K665287N347289L168907k469667n940496n041305
$$ 41743876 40528290 39792289 42457576 47804865 50973772 48504105 42563609 37522304
36796C7522304l173786k926710k336218J61995J861165N11108j111024K59221
$$ 37522304 34348518 31421808 29085590 29247585 31108750 31619858 30508834 30768055
36788C0768055K521184J775221q09891j098677O23968R2065l399824n320739k699556
$$ 30768055 33289239 35064460 34254569 33155892 33779860 33871925 30472101 25151362 22451806
36779B2451806J789541L876585K486884n56382k771353k305230L69797J876333
$$ 22451806 24241347 28117932 30604816 30048434 27277081 24971851 25341648 27217981
36771B7217981j27662k739409j196774L614642N557326K049725k243994k544829
$$ 27217981 27090319 24350910 23154136 26768778 32326104 34375829 32131835 29587006
36763B9587006m20218j81020k377036m304017m413089k932750j40195K906979
$$ 29587006 29166788 28985768 26608732 22304715 17891626 14958876 14818681 17725660
36755A7725660L705731J387379j112538q89705N15874k70087k881400l942957
$$ 17725660 21431391 22818770 21706232 20816527 21332401 21062314 18180914 14237957
36747A4237957k571595j239625j152400n82300J377232K802595K141853O83456
$$ 14237957 11666362 10426737 9274337 8692037 10069269 12871864 15013717 15697173
36739A5697173Q2941l46775j819551l184773k248302O30661K447820J372432q38340
$$ 15697173 15780114 15433339 13613788 10429015 8180713 8811374 11259194 12631626 11793286
36730A1793286j062030J249391L357124K637216j06056j713157r33844j98521
$$ 11793286 10731256 11980647 15337771 17974987 17868931 16155774 15221930 15023409
36722A5023409k211044n829206o980045l572393J917941N128515M100996N41549
$$ 15023409 12812365 6983159 3114 -3569279 -1651338 3477177 7578173 8119722
36714H119722k347121k754944j473012o57055j270269j876896m39323K847308
$$ 8119722 5772601 3017657 1544645 887590 -382679 -2259575 -2698898 148410
36706A48410N304953M589552J213155j990831k545034l99401K175038K598463
$$ 148410 5453363 10042915 11256070 9265239 6720205 6320804 8495842 11094305
36698A1094305L60542k351882k737842l18396K500517L056078J375649N6399J084794
$$ 11094305 11454847 9102965 6365123 6046727 8547244 11603322 12978971 13035370 14120164
36689A4120164L208820L214925J2124l516802l801207j115459Q89540K31349j012163
$$ 14120164 17328984 20543909 20556033 17039231 13238024 12122565 13012105 13243454 12231291
36680A2231291m04040R52027M52280j499430j982862k31624J221306O60684l90745
$$ 12231291 11827251 12779278 13231558 11732128 9749266 9517642 10738948 11399632 11008887
36671A1008887k39396R010j296029k981553k647667o48587M41787K09845J243201
$$ 11008887 10769491 10778501 9482472 6500919 3853252 3204665 3646452 3856297 5099498
36662E099498M651454P346898N758456P23600l519042m518805l619332k864110
$$ 5099498 9750952 17097850 22856306 23579906 20060864 15542059 11922727 9058617
36654I058617k203085p99202N64264J99262j765435k911545j192987K698080O039902
$$ 9058617 6855532 6056330 6620594 6819856 5054421 2142876 949889 3647969 9687871
36645I687871O732119M872977J965042q45027l300354m987864m740025k056026
$$ 9687871 16419990 21292967 23258009 22412982 19112628 14124764 9384739 7328713
36637G328713J292020K593074J505232M79810J020745J299782p09387l309384
$$ 7328713 8620733 11213807 12719039 13198849 14219594 15519376 14809989 11500605
36629A1500605l194421q38791k31823k622575m174175j789820J945862K739659
$$ 11500605 8306184 7467393 7235570 4612995 438820 -1351000 594862 3334521
36621C334521J123734J030800L016814L429874P32800j669230p33670J577126
$$ 3334521 4458255 5489055 8505869 11935743 12668543 10999313 10265643 11842769
36613A1842769J660053k39992j131887l52270l5897r62075j390128o13530n23997
$$ 11842769 13502822 13262830 12130943 11778673 11742776 10780701 9390573 8777043 8253046
36604H253046k117072l020799q67111K506123L047233J97233k173761j084598
$$ 8253046 6135974 3115175 2248064 4754187 7801420 7998653 5824892 4740294
36596D740294J678725K408712N36281j174139q96291j13119j071261l146086l087723
$$ 4740294 6419019 8827731 9364012 8189873 7293582 7180463 6109202 2963116 -124607
36587a24607R30410O256335P799181L665510k043500l498376o7699K955126J244060
$$ -124607 805803 7062138 14861319 18526829 16483329 12984953 12917254 15872380 17116440
36578A7116440l136198n018816k974894m325J605673K581550L555952L143022
$$ 17116440 13980242 8961426 5986532 5982207 7587880 10169430 13725382 16868404
36570A6868404N91063k305352l749585m302944m908700m580820k252073P02508
$$ 16868404 17459467 15154115 11404530 7101586 2192886 -2387934 -4640007 -3937499
36562c937499K173711K347624K699032L027743K040014K02649n49049K92300J417293
$$ -3937499 -1763788 583836 3282868 6310611 8350625 8553274 8004225 8296525 9713818
36553I713818J930938J900407J153283k31124q09337L22916J171091n70742l109681
$$ 9713818 11644756 13545163 14698446 14467322 13657985 13980901 15151992 14581250 11471569
36544A1471569k512636Q93042K508022Q32523m0772K283098L530727o81458o848193
$$ 11471569 8958933 9851975 12359997 13192520 13151748 15434846 18965573 18284115 11435922
36535A1435922p517593j664708M141634M820834K247468O04013L52764q92958
$$ 11435922 3918329 2253621 6395255 11216089 13463557 14067570 14420334 13527376
36527A3527376l861633o255768n176713p4145O065224Q594250N595388K16852
$$ 13527376 9665743 3409975 -1766738 -1840883 4224341 12818591 18413979 18630831
36519A8630831k915437l107001l193762m242487m024262j491342P43620L53652
$$ 18630831 15715394 12608393 9414631 5172144 1147882 -343460 400160 753812
36511G53812j145106j279417o87617j294685k224381j061614J689958L017411
$$ 753812 -391294 -1670711 -2358328 -3653013 -5877394 -6939008 -5249050 -2231639
36503b231639K186252J669732K754726L522135K399712P36908J32457j62682j069053
$$ -2231639 -45387 1624345 4379071 7901206 10300918 11037826 11170283 11007601 9938548
36494I938548j293786K45174J575582L83827j842321j930943m43815q77526l346513
$$ 9938548 8644762 8889936 10465518 10849345 9007024 7076081 6632266 5754740 2408227
36485B408227l589214J39912L400917J776780k428426l494560l35693K802300
$$ 2408227 -1180987 -1041075 2359842 4136622 1708196 -1786364 -2122057 680243
36477F80243K857192J204962K39370K08005L22018K18825o51790k686206m290696
$$ 680243 3537435 4742397 4981767 5189772 5511790 5730615 5078825 2392619 -1898077
36468a898077k847840J363940M618516M458075K569836J321687L9348k672821
$$ -1898077 -4745917 -3381977 1236539 5694614 8264450 9586137 9625485 6952664
36460F952664n011104l884425j5981K265334P65069j735805j444322J532395L698413
$$ 6952664 1941560 -1942865 -1958846 306488 1071557 -664248 -2108570 -576175 3122238
36451C122238K757063L27275k32138J815749L393943J562273k223835l826529
$$ 3122238 5879301 6206576 5974438 7790187 11184130 12746403 10522568 6696039
36443F696039k281353j048832k337716l479564j594330J059137M47956k359206
$$ 6696039 4414686 3365854 1028138 -2451426 -4045756 -2986619 -2538663 -4897869
36435d897869k573788N48435K518686J039457m87972R63366L074079K565815P94855
$$ -4897869 -7471657 -6923222 -4404536 -3365079 -3853051 -2889685 184394 2750209 3545064
36426C545064Q73191J984031J186231q48237q26154J077446J126201j443115k577963
$$ 3545064 4418255 6402286 7588517 6740280 5914126 6991572 8117773 6674658 4096695
36417D096695J62363L459013L161803J58484j819937j847743j703619j694991
$$ 4096695 4259058 7718071 10879874 11038358 9218421 7370678 5667059 3972068
36409C972068n25189J104222O84046j615308k165351P86140L882268L098810o28435
$$ 3972068 3446879 4551101 5235147 3619839 1454488 2240628 6122896 9221706 8593271
36400H593271k932640j919355L47315J707848K190584K105749Q34974j200144
$$ 8593271 5660631 3741276 4088591 5796439 7987023 10092772 10927746 9727602
36392I727602j809777j74813J093517o92843m041157m881024k009504J527542
$$ 9727602 7917825 7743012 8836529 8143686 4102529 -778495 -2787999 -1260457
36384a260457K705208J854527R12458L79760m35440j365092j344644j68717J034101
$$ -1260457 1444751 3299278 4211736 4591496 4156056 2790964 1446320 1277603 2311704
36375B311704J298933J030604J330504K343335K629928O40909k921012m861613
$$ 2311704 3610637 4641241 5971745 8315080 10945008 11585917 8664905 3803292
36367C803292k719893J845361M250547K134185j838648l222930r11506K206266
$$ 3803292 1083399 2928760 7179307 9313492 7474844 4251914 3340408 5546674
36359E546674L085078J501113p93111k341837k661760j682409K44003J908459
$$ 5546674 8631752 10132865 9339754 6997917 4336157 2653748 2897751 4806210
36351D806210J871034K0446j963930k234642o51434J388137K624688K661014J346887
$$ 4806210 6677244 6697690 4733760 2499118 1847684 3235821 5860509 8521523 9868410
36342I868410j110136l113693k540874J60982J393401j065461m244483l493677
$$ 9868410 8758274 5644581 3103707 3264689 4658090 3592629 -651854 -4145531
36334d145531Q02507L497878K078280n7414N86262K258970J583071m92267o49785
$$ -4145531 -3343024 154854 2233134 2175720 2761982 5020952 6604023 6111756 5461971
36325E461971P16259L90482j219656n6535L998664N013167l52834o546796o113104
$$ 5461971 6178230 6568712 5349056 5292521 9291185 14304352 13951518 7404722 1291618
36316A291618j30161L700826K125479k80773O66995K816056K476623N79501N4788
$$ 1291618 1161457 4862283 6987762 6706989 7373984 10190040 12666663 13246164 13300952
36307A3300952P3359k330255o101444o421095j633597L973774N674131L574925
$$ 13300952 13374311 11044056 4942612 -1478483 -3112080 861694 6535825 10110750
36299A0110750Q38726o49771p81816L41438J904124J816029p10417l030803k164262
$$ 10110750 10949476 10299705 9517889 9859327 11763451 13579480 12869063 9838260 7673998
36290G673998O69420J479039o89759k383268p52259K821857N190497N098408L018293
$$ 7673998 8343418 9822457 9132698 6749430 5997171 8819028 14009525 19107933 22126226
36281B2126226l79464l703980m633342k475882K01866N51116r25117j732291j338626
$$ 22126226 21746762 18042782 13409440 10933558 11135424 11686540 10761423 9029132 7690506
36272G690506j215614j491623n75565J464303K031869j23147k418035j781495
$$ 7690506 6474892 4983269 4407704 5872007 7903876 7780729 5362694 3581199
36264C581199R52343K206777O27701j345297j217407J25602r434k032622l235615
$$ 3581199 4533542 6740319 7368020 6022723 4805316 4930918 4921484 2888862 -346753
36255c46753j397784J991463L289502J135103j988925k945567j470227L16188
$$ -346753 -1744537 246926 3536428 4671531 2682606 -262961 -1733188 -1417000
36247a417000Q76611M48515p2935R9852J696202M453021O020568L767556j487283
$$ -1417000 -540389 -91874 -164809 -64957 1631245 6084266 12104834 15872390 14385107
36238A4385107n275639m378042o37407J682082J188221j03653p85804j682935
$$ 14385107 9109468 4731426 4094019 5776101 6964322 6860669 6074865 4391930
36230D391930k880530k080665J903753N861814N350932O95527l098265k919197
$$ 4391930 1511400 -569265 1334488 7196302 12547234 13242761 10144496 7225299
36222G225299j161498j226096k122732o13518K716384L473642l4928l882554l867086
$$ 7225299 6063801 4837705 2714973 2101455 4817839 8291481 8256553 4373999 506913
36213E06913j033489O30736L1597o10408j74096m1033q80386j156095N2865J249729
$$ 506913 -526576 104160 135757 -474651 -648747 -689780 -1570166 -2726261 -2673396 -1423667
36203a423667J054306M86416Q66614J118807m92446k900016l072231k83299K623742
$$ -1423667 -369361 117055 983669 2102476 1610030 -1289986 -4362217 -4645516 -2021774
36194b021774K744331K80373k310058k929313j074565K118755M229258L167298
$$ -2021774 722557 1002930 -1307128 -4236441 -5311006 -3192251 1037007 4204305
36186D204305m49168l308643k777662L04585K905419L066687J065206j687116
$$ 4204305 3755137 446494 -2331168 -2026583 878836 3945523 5010729 3323613
36178C323613l593087l430508j436024N38357J175729J370675K341171L070959
$$ 3323613 -269474 -3699982 -5136006 -4597649 -3421920 -2051245 289926 3360885
36170C360885J922881J07407M37017K484496K510412o32695l113113j852941N87978
$$ 3360885 5283766 5391173 5828190 8312686 10823098 10190403 7077290 5224349 5812327
36161E812327K6529k950481m343065k829373o38197O02841J027868K94468j779181
$$ 5812327 5838856 2888375 -1454690 -4284063 -4922260 -4319419 -3291551 -2997083 -4776264
36152d776264k777288j90658L699671M051426R21645n88959J324325K291375n93917
$$ -4776264 -7553552 -7744210 -4044539 6887 928532 339573 1663898 3955273 3361356
36143C361356l929994m196977l418491m171390l926003q5095L477734J751605
$$ 3361356 -568638 -4765615 -8184106 -12355496 -16281499 -16366594 -12888860 -11137255
36135a1137255k385309j922873L008771N443850L035031J137422K812389L508413
$$ -11137255 -13522564 -15445437 -12436666 -6992816 -3957785 -2820363 -7974 3500439
36127C500439o79571n822480n996665j738533K149999L792277M398998L805167
$$ 3500439 2820868 -3001612 -8998277 -10736810 -8586811 -4794534 -395536 3409631
36119C409631R46701k301789k378385O94075K722230P11191l487309n600579l605571
$$ 3409631 4356332 2054543 -323842 370233 3092463 3803654 316345 -5284234 -8889805
36110h889805N70229L414204L583931K860307K828622K002109j376581m745200
$$ -8889805 -8319576 -4905372 -1321441 1538866 4367488 6369597 4993016 247816
36102B47816l548213J393929L573681o2189m209479k894327J839106L496147O37991
$$ 247816 -3300397 -1906468 1667213 1605024 -2604455 -5498782 -3659676 -163529 474462
36093D74462k254495j954680L60575K533073L504262K096356k072375o096590
$$ 474462 -1780033 -3734713 -3374138 -841065 2663197 4759553 2687178 -3409412
36085c409412n964304j812739K184622L386481K803273J617885l97250k206071
$$ -3409412 -9373716 -11186455 -9001833 -5615352 -2812079 -1194194 -1591444 -3797515
36077c797515j355206J818065L342978J035675k225169k804509j170828J0382
$$ -3797515 -5152721 -3334656 8322 1043997 -1181172 -3985681 -5156509 -5146127
36069e146127K97759J074510K189563J910737j67532k308560k766683j516973
$$ -5146127 -4848368 -3773858 -1584295 326442 158910 -2149650 -4916333 -6433306
36061f433306J7563L16352p30899j422382k20025J870830K395635J060985J91503
$$ -6433306 -6415743 -6099391 -6830290 -8252672 -8472697 -6601867 -4206232 -3145247 -2953744
36052b953744R82777J683993P76377l97750q0649Q44161N61282m72136n87760
$$ -2953744 -1970967 -286974 489403 91653 11004 855165 1416447 944311 356551
36043C56551o2180m91689j612765j537206j52484M03852p48057j690739q83601
$$ 356551 294371 -197318 -1810083 -3347289 -3499773 -3095921 -3843978 -5534717 -6418318
36034f418318R2849j188868m011524m844458j809037K697560M674457L023080
$$ -6418318 -6325469 -7514337 -11525861 -16370319 -18179356 -15481796 -10807339 -7784259
36026g784259L07761p10172P2765J160941J942911K747946L258044K626997J043465
$$ -7784259 -7476498 -8186670 -8113905 -6952964 -5010053 -2262107 995937 3622934 4666399
36017D666399l88835j323221k173331k514259j410378M27132J028176M11390J059723
$$ 4666399 4277564 2954343 781012 -1733247 -3143625 -2716493 -1688317 -1276927 -217204
36008b17204L804601N559184L328523j201531l645934k576419o32325k58674q37735
$$ -217204 3587397 9146581 12475104 11273573 7627639 5051220 4418895 4160221 3322486
35999C322486o49159K04241M5219j874662m011472l898625q95005K785269M437655
$$ 3322486 2673327 2877568 2922787 1048125 -2963347 -6861972 -7756977 -4971708 -534053
35990e34053L911803L034195K307121M61503k154477k596641L20381L071484J674566
$$ -534053 3377750 6411945 8719066 9180569 7026092 4429451 4749832 7821316 9495882
35981I495882k625771n058645l824113j540690m24291L89801J835160K431284
$$ 9495882 6870111 1811466 -2012647 -3553337 -3977628 -3587827 -1752667 678617
35973F78617P50216j627536j741539R39738L818088M049569J379593j767147k823272
$$ 678617 1428833 -198703 -1940242 -1000504 2817584 6867153 8246746 6479599 3656327
35964C656327j857531j403427k984013m688067l530533M35054M116241N190650
$$ 3656327 1798796 395369 -2588644 -7276711 -10807244 -10372190 -6255949 -1065299
35956a065299M043461K025810n7174j323249p70643J190410K573779J915005m65715
$$ -1065299 2978162 5003972 4946798 3623549 2852906 4043316 6617095 8532100 8066385
35947H066385l276333m866774l414446J105540N042518M113845p89162l835505
$$ 8066385 4790052 -76722 -3491168 -2385628 2656890 6770735 5981573 2146068
35939B146068j765697J883451K255985j07230j240283j37480Q14242O33675Q43777
$$ 2146068 380371 2263822 4519807 4412577 3172294 3034814 3849056 4482731 5326508
35930E326508J796630J663250j18771j530794j286034q72098j914096l595471
$$ 5326508 7123138 8786388 8667617 7136823 5850789 4978691 3064595 -530876
35922e30876m125652l117755j271953P71073K121343J761473K10944m77362L12822
$$ -530876 -4656528 -7774283 -9046236 -8275163 -6153820 -4392347 -4181403 -4658765 -4345943
35913d345943M75752j482563l530352k781177K09707K428163K857864L069405
$$ -4345943 -3870191 -5352754 -8883106 -11664283 -11454576 -9026413 -6168549 -3099144
35905c099144L639146L121620J130452n23881r00611j423638k782635k967548
$$ -3099144 540002 3661622 4792074 4268193 3367582 1943944 -838691 -3806239
35897c806239n78282K173660K501197J277021J083527J462545r18k405265j799468
$$ -3806239 -4384521 -2210861 290336 1567357 2650884 4113429 4112511 1707246 -92222
35888i2222K381868N323657L365125q49463k491974j203424m62608k081150m578054
$$ -92222 2289646 7613303 10978428 10128965 7636991 6433567 5970959 3889809 -688245
35879f88245o009706n425217k295273K473455N484914M036170K93151r42397J100912
$$ -688245 -6697951 -12123168 -14418441 -11944986 -6460072 -2423902 -2130751 -3073148 -1972236
35870a972236K221901r3195k730641j817935J431781K735951Q48430j407698j485060
$$ -1972236 249665 156470 -2574171 -4392106 -2960325 -224374 624056 -783642 -2268702
35861b268702J80048J718435J915014M96100j913105l619689k971766k74862K238926
$$ -2268702 -2088654 -370219 1544795 2040895 127790 -3491899 -6463665 -6738527 -4499601
35852d499601K897069K427538K694735L887849L824031O83520l867458n565190
$$ -4499601 -1602532 825006 3519741 7407590 11231621 11915141 8047683 2482493
35844B482493k412744K290643L320094l98982m747648n470923k508352J072097
$$ 2482493 69749 2360392 5680486 5281504 533856 -4937067 -7445419 -6373322
35836f373322K602959J511706q22796j921951l54845K099455J983480j267037
$$ -6373322 -3770363 -2258657 -3081453 -5003404 -5358249 -3258794 -1275314 -2542351
35828b542351m101015l378623j94188K325956L031773K589238J251405o69644
$$ -2542351 -6643366 -10021989 -10216177 -7890221 -4858448 -2269210 -1017805 -1687449
35820a687449j530935k18359J749967K410455K408625L185973L565483J604854
$$ -1687449 -3218384 -3436743 -1686776 723679 3132304 6318277 9883760 11488614
35812A1488614j217863j755108o76418j630192m519874m584575N0498M515864
$$ 11488614 10270751 8515643 7839225 6209033 1689159 -2895416 -2844918 1670946
35804A670946L816739l41275k769382j983161l91080O68123J986391L398446L281967
$$ 1670946 5487685 5146410 2377028 393867 2787 670910 2657301 6055747 9337714
35795I337714J250894j231342k900912l311914j932937J060240L493078L080637
$$ 9337714 10588608 9357266 6456354 3144440 1211503 2271743 5764821 8845458
35787H845458M33986j957948l252325m221899m230820j615694K504290M267221
$$ 8845458 9279444 7321496 4069171 -152728 -4383548 -5999242 -3494952 772269
35779G72269K269361k96608n24832L743j501063l797523l071751J200288N083172
$$ 772269 3041630 2745022 2220190 2223933 722870 -3074653 -6146404 -4946116 137056
35770A37056N112501J935066j461115l020823k369572k31999J605006J084471
$$ 137056 5249557 7184623 5723508 2702685 333113 101114 1706120 2790591
35762B790591j863689m504038m015288p33282K338240K994618J772525N75475
$$ 2790591 926902 -3577136 -7592424 -8325706 -5987466 -2992848 -1220323 -644848
35754f44848N49141J571403K777658L032871J709959l28620j183974p5186J545669
$$ -644848 -95707 1475696 4253354 7286225 8996184 8667564 7483590 7408404 8954073
35745H954073J829784Q85490K64481N86977R89722P40739j7725j162958k682232
$$ 8954073 10783857 11669347 11933828 12520805 13510527 14251266 14233541 13070583 10388351
35736A0388351l604913k587628k95807N40588j312038l489795l116640p77363
$$ 10388351 6783438 4195810 3900003 4440591 3128553 -361242 -3477882 -4255245
35728d255245N79015k9857n86906O81283K989181M307657L506925Q10379k594148
$$ -4255245 -3676230 -3706087 -4292993 -3611710 -622529 3685128 7192053 8002432 5408284
35719E408284m985212n214070l704318j580444R07743L791459N599910M274410
$$ 5408284 423072 -4790998 -8495316 -10075760 -9168017 -5376558 223352 4497762
35711D497762L30564k873577l034644j528155j085886k250992l380167l065926
$$ 4497762 4828326 1954749 -1079895 -2608050 -3693936 -5944928 -9325095 -12391021
35703a2391021j287414J088387K938192L627260L664800L721430K900725j19111
$$ -12391021 -13678435 -12590048 -9651856 -6024596 -2359796 1361634 4262359 4143248
35695D143248l684779l678813P17964M435725K714312k077420l621628n35439
$$ 4143248 458469 -3220344 -2502380 1933345 4647657 2570237 -1051391 -1586830
35687a586830K344645J644404k46832j48461Q16352O2393j469220q34710J800886
$$ -1586830 757815 2402219 2155387 2006926 2823278 2885671 1416451 581741 2382627
35678B382627L056200J153329j872613l131116k042750q1026J116237Q42657l76531
$$ 2382627 5438827 6592156 4719543 1588427 -454323 -535349 580888 1423545 1047014
35669A047014j134645n22340O98316R84373K9087r44216r48170m45301n45065
$$ 1047014 -87631 -609971 88345 1072718 1101805 157589 -790581 -1235882 -1780947
35660a780947j553051k532917k068581L37723L247178M097840J791655j734266
$$ -1780947 -3333998 -5866915 -7935496 -7597773 -4350595 -252755 1538900 -195366
35652a95366l270730j599366J549579L471890K701065k86470l394717m017578
$$ -195366 -3466096 -5065462 -3515883 -43993 2657072 2370602 -1024115 -5041693
35644e041693j123799L304917N762398M596131J378292j190461j959179j662445
$$ -5041693 -6165492 -2860575 2901823 7497954 8876246 7685785 5726606 4064161
35636D064161j408473j386535p18804J579376N042331P233181N707075Q36841
$$ 4064161 2655688 1269153 550349 2129725 7172056 14405237 20112312 20949153
35628B0949153m128713o284147n633377m040650k626702j194080L94825J581586
$$ 20949153 16820440 10536293 4902916 862266 -1764436 -2958516 -2563691 -982105
35620i82105J930805J621462Q33235n62441k159410k492963l87410L065974M862048
$$ -982105 948700 2570162 3403397 2840956 681546 -1811417 -2198827 867147 5729195
35611E729195L212072j95013k119402j699604r62542j195527q68283J413017L703488
$$ 5729195 8941267 8746254 6626852 4927248 3964706 2769179 1900896 3313913 7017401
35602G017401L034322J04426j351450o7993R70190n81906k671630k200999O3430
$$ 7017401 10051723 10156149 8804699 8736706 9706896 9124990 6453360 4252361 4315791
35593D315791Q72673m14023j319624o30728j56803j329873k729451k527712j381537
$$ 4315791 5188464 4774441 3454817 2824089 2667286 1337413 -1392038 -3919750 -5301287
35584e301287r06083o45181J026014L469867L866084J383225r51880j77623K288060
$$ -5301287 -6207370 -6852551 -5826537 -2356670 1509414 2892639 1940759 1763136 4051196
35575D051196K551019p5732k033230q88396R32475j12951l075531l710939o98580
$$ 4051196 6602215 6526483 4493253 3604857 4537332 4424381 1348850 -2362089 -3060669
35566c060669K575191K975307J370367J45051l23000o86448l71813J083524J981844
$$ -3060669 -485478 2489829 3860196 4005247 3682247 2995799 2623986 3707510 5689354
35557E689354O40091j303595q00470J695893K371435m22084l694257m007798j738415
$$ 5689354 6329445 5025850 4225380 5921273 8292708 7870624 4176367 168569 -1569846
35548a569846L40223P92512J24357r07619j754745j681212n02179P58968J120251
$$ -1569846 -1229623 -437111 -312754 -1220373 -2975118 -4656330 -5158509 -4399541 -3279290
35539c279290R82831J179190J423480R68348J62023o9267J70501J73344L28600
$$ -3279290 -2296459 -1117269 306211 1274559 1436582 1367315 1537816 1711160 2039760
35530B039760J598625L196600K769811k46015l120049l093961j047877j63248
$$ 2039760 3638385 6834985 9604796 9358781 6238732 3144771 2096894 1933646
35522A933646j450353k608947j654639K26282O33664n39819j234886l03133J281701
$$ 1933646 483293 -2125654 -3780293 -3554011 -2920347 -3460166 -4695052 -4998185 -3716484
35513c716484K289470K618815K362912J089681j001991k448198k179423r23498
$$ -3716484 -1427014 1191801 3554713 4644394 3642403 1194205 -985218 -1908716
35505a908716O0454O94531J389484J656507Q65247m23190j366129k192205k970901
$$ -1908716 -1848262 -1153731 235753 1892260 2757507 2334317 968188 -1224017 -4194918
35496d194918k196140R37466L704924K540358j435418l095429m33932K482867
$$ -4194918 -6391058 -5453592 -1748668 791690 -643728 -3739157 -4173089 -1690222
35488a690222J540064j624471k591972n19600J775870K601032K765625K723069
$$ -1690222 -150158 -1774629 -4366601 -4886201 -3110331 -509299 2256326 4979395
35480D979395J670197j30990q71589J18508J250745J124908L97052J77971o5397
$$ 4979395 6649592 6518602 5647013 5765521 7016266 8141174 8538226 8716197 8650800
35471H650800j633583m163291n338661l465606Q2782J832556K27581k030282j177183
$$ 8650800 7017217 2853926 -2484735 -5950341 -5867559 -4035003 -3807422 -5837704 -7014887
35462g014887K334846M116214K070172m62851L06629L114578M105470K727367
$$ -7014887 -4680041 -563827 1506345 1043494 1350123 4464701 8570171 11297538
35454A1297538J347127K69822k297661n382164n152021j072908K059588N82828
$$ 11297538 12644665 12914487 10616826 5234662 82641 -990267 1069321 1652149
35446A652149k868737l413006n55706K206007K603208J424902J54364n77054n92316
$$ 1652149 -1216588 -4629594 -5185300 -2979293 -376085 1048817 1203181 626127 33811
35437C3811j47435N0056j1421N59722J548608J061270j448581l419942k606948
$$ 33811 -113624 -63568 -74989 484733 2033341 3094611 1646030 -1773912 -4380860
35428d380860n27392Q6106l61884L09760J635847J220266o32527r97650O40915
$$ -4380860 -4908252 -4822146 -5184030 -4874270 -3238423 -2018157 -2650684 -3648334 -3007419
35419c007419J370843o8005r10269J018106L439311K934965m6611k165997j913652
$$ -3007419 -1636576 -1704581 -2614850 -1596744 1842567 4777532 4730921 2564924 651272
35410F51272r01438q81461j381624o02664K031592M431952L538065o37166l686564
$$ 651272 -250166 -1131627 -2513251 -3115915 -1084323 3347629 6885694 6248528 2561964
35401B561964j793563K600964L419921n95417m090513l039765p7238P43212K18200
$$ 2561964 768401 3369365 6789286 6193869 2103356 -936409 -1013647 -270435 -52235
35392e2235R47488J573804o52642l795478l501773l85656O87769j259947j771241
$$ -52235 895253 2469057 1816415 -1979063 -5480836 -5866492 -5178723 -6438670 -8209911
35383h209911J289773M046311K983102J20294j185718j412819k283691k480029
$$ -8209911 -6920138 -2873827 109275 229569 -956149 -2368968 -4652659 -7132688
35375g132688q4244K984053L048994j3755k923515l573014k596574j199934p6230
$$ -7132688 -7216932 -4232879 -1183885 -1197640 -4121155 -7694169 -10290743 -11490677 -11566907
35366a1566907J81870j43128N13835K672835M259083L403613J253927k82924j659897
$$ -11566907 -11385037 -11528165 -11014330 -8341495 -4082412 -678799 575128 292204 -1367693
35357a367693l629940m157275j337931K071579J645187j749083k706650P47561
$$ -1367693 -4997633 -9154908 -10492839 -8421260 -6776073 -8525156 -11231806 -10484245
35349a0484245M577494N039777L190727J613093O49413j69325l63444j13842o15194
$$ -10484245 -5906751 -866974 2323753 3936846 4586259 4416934 4053490 3939648 3324454
35340C324454j271489J27658K822992K592837j726131n121774l125756J709440
$$ 3324454 2052965 2180623 5003615 7596452 5870321 748547 -2377209 -667769
35332f67769L863057K520228R14157K12241j178745l257076l887979k529438r10072
$$ -667769 3195288 5715516 6629673 6841914 5663169 2406093 -1481886 -4011324 -4921396
35323d921396o5405K29034m85207k584652m021502k229065J604033L532369K343078
$$ -4921396 -4986801 -4757767 -5242974 -7827626 -11849128 -14078193 -12474160 -8941791 -6598713
35314f598713P11477M99791M62443l45134k66272K026899M749932N026509K228233
$$ -6598713 -5887236 -5387445 -4925002 -5270136 -5536408 -3509509 1240423 6266932 8495165
35305H495165j781690m368789l640880o6655K965283K223434j239094l189941
$$ 8495165 6713475 2344686 -1296194 -1362849 1602434 3825868 2586774 -603167
35297f03167j894156o3919k35939j095414k52665J645058J979782Q6653j940929
$$ -603167 -2497323 -2561242 -2797181 -3892595 -4145260 -2500202 -520420 -433767 -2374696
35288b374696j825437P11327L693253M172960Q85880l738874n580270l545819
$$ -2374696 -4200133 -3488806 204447 4377407 5263287 1524413 -4055857 -7601676
35280g601676p54844j88920r80821m17730J915018L812209L509069J564832n3158
$$ -7601676 -8356520 -8545440 -9526261 -9943991 -8028973 -4216764 -707695 857137 803979
35271H03979P1570J512314K351162J207561j258077l462603m687709m535310k030041
$$ 803979 875549 2387863 4739025 5946586 4688509 1225906 -3461803 -7997113 -10027154
35262a0027154K274796M598779K031420k209071k071652K460987M917841K156187
$$ -10027154 -7752358 -3153579 -1122159 -3331230 -5402882 -2941895 1975946 4132133
35254D132133j032907j62343J703321j50989l485289k774363J246024K574316
$$ 4132133 3099226 2936883 4640204 4489215 1003926 -1770437 -524413 2049903
35246B049903l96058k776260j319666J213468J506253N37859M88805O06094q62385
$$ 2049903 1653845 -1122415 -2442081 -1228613 277640 815499 1304304 1910398 1048013
35237A048013k961390k995188j69929L440752N062210L720342J204502M20778
$$ 1048013 -1913377 -4908565 -5078494 -1637742 3424468 7144810 8349312 8770090
35229H770090J872091K559898l3257l947849n130193k945187l46392R28541J846849
$$ 8770090 10642181 13202079 13168822 9220973 4090780 1145593 799201 1727742 3574591
35220C574591K682468J890029o39011k492978k174672p44164R45511L358192N309495
$$ 3574591 6257059 8147088 7508077 5015099 2840427 2096263 3041774 6399966 11709461
35211A1709461L652864j676423n663093m451548r71809o93374l625705m669550
$$ 11709461 15362325 13685902 8022809 3571261 2599452 1906078 -1719627 -6389177
35203f389177j320030K998568M004656J831264k67412m53272K82625M28225o067
$$ -6389177 -7709207 -4710639 -705983 1125281 857869 404597 687222 1115447 1109380
35194A109380j16115J24090k44224j385112j894938p66639P23815O42953n27123
$$ 1109380 993265 1117355 873131 -511981 -2406919 -3173558 -2449743 -1806790 -2333913
35185b333913l93391J618383L068132J824832j036540k683140j773861N27913
$$ -2333913 -2727304 -1108921 1959211 3784043 2747503 64363 -1709498 -1181585
35177a181585J945662J068565j249071k463607j312821K49323l42053k337108
$$ -1181585 764077 1832642 583571 -1880036 -3192857 -2943534 -3285587 -5622695
35169e622695k654850m78920J906449K938192L291320L068754R48576k622962
$$ -5622695 -8277545 -8756465 -6850016 -3911824 -620504 2448250 3396826 773864
35161G73864m688402l864491k151445j138828K01519K097229K224688O5116q48375
$$ 773864 -3914538 -7779029 -9930474 -11069302 -10867783 -8770554 -6545866 -6480750 -7329125
35152g329125J490297L439003J449718j515403o65918K188161J242690l494019
$$ -7329125 -5838828 -2399825 -950107 -2465510 -3131428 -943267 299423 -3194596
35144c194596n700742k471458J692177K282605P20177K99186P13897k3591j301838
$$ -3194596 -8895338 -11366796 -9674619 -7392014 -6671837 -6372651 -5658754 -5682345 -6984183
35135f984183r45308J142927K954588K996029J332552r09357j974829o83125J857118
$$ -6984183 -7929491 -6786564 -3831976 -835947 496605 -412752 -2387581 -3070706 -1213588
35126a213588L007362J778675j25899r57300r64421j152025j628577j939727j713599
$$ -1213588 1793774 3572449 3446550 2489250 1524829 372804 -1255773 -3195500 -4909099
35117d909099n78043J213939K121698J012371p28822r52207k05469n97148j511672
$$ -4909099 -5487142 -4273203 -2151505 -1139134 -1867956 -2820163 -3025632 -3622780 -5134452
35108e134452k40211K681748L191152L34773j334872J182699M035224K280659
$$ -5134452 -5374663 -2692915 498237 833010 -501862 680837 4716061 6996720
35100F996720k283880l896084j479377O04763j78003j483121r35917K82916L00847
$$ 6996720 4712840 816756 -662621 -57858 -235861 -1718982 -2654899 -2371983 -2071136
35091b071136l15114l35503l89833j477486k478929j451817J143655K546926J339184
$$ -2071136 -2386250 -2721753 -3111586 -4589072 -7068001 -8519818 -7376163 -4829237 -3490053
35082c490053n03644k11371J865307K493706N9811k796348k572069J60062J572929
$$ -3490053 -3993697 -4205068 -2339761 153945 213756 -2582592 -5154661 -4994599 -3421670
35073c421670J11731j587096j036188O28260J136212O34866M92753M32640m72343
$$ -3421670 -3309939 -4897035 -5933223 -5304963 -4168751 -3533885 -3041132 -2608492 -3080835
35064c080835j181110P9645K477634L160743J251031j006953j441739m51423J99241
$$ -3080835 -4261945 -4182300 -1704666 1456077 2707108 1700155 258416 -193007 6234
35055F234l01036j176887r16524J302157M374364N826582M342201J123733j918257
$$ 6234 -294802 -1471689 -2388213 -1086056 3288308 9114890 13457091 14580824 12662567
35046A2662567m151652n370890m633079j927106K80998l67023k675853l411826
$$ 12662567 8510915 3140025 -1493054 -3420160 -3139162 -3506185 -6182038 -9593864
35038i593864j756566J73781Q86477J007238J271886J554174K067852L159897
$$ -9593864 -11350430 -11176649 -10290172 -9282934 -8011048 -6456874 -4389022 -1229125
35030a229125L748021K388572O3604p13909J22071m1937k125077l724284k952455
$$ -1229125 2518896 4907468 4971072 4257163 4379234 4337297 2212220 -1512064 -4464519
35021d464519j060488J48324P57057R52821l62747k919918l534677q8639M597623
$$ -4464519 -5525007 -5376683 -4619626 -3666805 -4029552 -6949470 -10484147 -10572786 -5975163
35012e975163N764063K653973j093681k387063j615021p60362o18103l66272J039968
$$ -5975163 -211100 2442873 1349192 -1037871 -2652892 -3413254 -4031357 -4397629 -3357661
35003c357661L215774M040891J922137j528723k823657j217676J75826r47759
$$ -3357661 -141887 3899004 5821141 4292418 1468761 251085 426911 -520848
34995e20848k779688k684348j339378q45045o92247J026538L589853M308657K743113
$$ -520848 -3300536 -5984884 -7324262 -8169307 -8861554 -7835016 -4245163 63494 2806607
34986B806607J107232O34284M10980k70356j129081k298596l769148l764967q14749
$$ 2806607 3913839 4548123 4959103 4688747 3559666 1261070 -2508078 -6273045 -7087794
34977g087794K738291K870427j91023j947862k98150J753746J430253J26668k44311
$$ -7087794 -4349503 -1479076 -1670099 -3617961 -3916111 -2162365 -732112 -605444 -849755
34968h49755j033625l783276o325407n527945j976410J286463K951667L303703
$$ -849755 -1883380 -5666656 -11992063 -17520008 -19496418 -18209955 -15258288 -11954585
34960a1954585J815446j380989k979157L37431O479212R520875O994988K291814
$$ -11954585 -10139139 -11520128 -14499285 -14161854 -7682642 1838233 8833221 11125035
34952A1125035n72689j148186o71405N49996K067626K204341K16704j981125k045857
$$ 11125035 10552346 9404160 8732755 9282751 11350377 13554718 13771422 11790297 9744440
34943I744440j85490J363479J021481r09841k985864l913671l618515l069777
$$ 9744440 9558950 10922429 11943910 11034069 8048205 4134534 516019 -2553758
34935b553758k444073l52204L450733N730847L255674j695379l243472j65255
$$ -2553758 -4997831 -5350035 -1899302 3831545 7087219 5391840 2148368 1983113
34927A983113K124728l6506k737440r93060K714741K049128k943353n530315k428847
$$ 1983113 4107841 4071335 1333895 340835 3055576 5104704 2161351 -3368964 -5797811
34918e797811J695902J733205q95192j801008l66370P72663N15929r6006o00761
$$ -5797811 -4101909 -2368704 -3263896 -5064904 -5431274 -4658611 -4142682 -4238688 -4839449
34909d839449j127851p16739J213171K482371O03386k675492k878395O80715L532259
$$ -4839449 -5967300 -6684039 -5470868 -2988497 -2385111 -5060603 -7938998 -7258283 -3726024
34900c726024K528372J60686M5429J180419K62086k198615k367999O40017L155629
$$ -3726024 -1197652 -1036966 -991537 188882 450968 -1747647 -4115646 -3475629 -320000
34891c20000K601504J124880J627447L091503K618008K06409j551844j583643
$$ -320000 2281504 3406384 5033831 8125334 10743342 10949751 9397907 7814264
34883G814264j196010j167575p69955J24629M72150K2734m45300j222828l348096
$$ 7814264 6618254 5450679 4680724 4805353 5277503 5300237 4854937 3632109 284013
34874B84013n460135m095369J079400N167248L868870o63098k859578j137627
$$ 284013 -5176122 -9271491 -8192091 -3024843 844027 180929 -2678649 -3816276
34866c816276J181941J607701J332468J908133K497550J921210J003223J083577
$$ -3816276 -2634335 -1026634 305834 2213967 4711517 6632727 7635950 8719527
34858H719527J654864J045774j300568m211294n906860n339531l107735j123424
$$ 8719527 10374391 11420165 10119597 5908303 1443 -5338088 -8445823 -9569247
34850i569247n08701r2167J705350L934100M073000J885720l3470m3391N93937
$$ -9569247 -10077948 -10170115 -8464765 -4530665 -457665 1428055 1394585 1351194 1945131
34841A945131L39665m67793j166531j985798k329771n22778K818397L898958Q89051
$$ 1945131 2284796 1817003 650472 -1335326 -3665097 -4187875 -1369478 2529480 3418531
34832C418531k517441k010166R20933J501438p35529j573603P50503K805988J630138
$$ 3418531 901090 -1109076 -188143 1313295 577766 -995837 -245334 2560654 4190792
34823D190792j028612k274052k419261k938588k668758M23593M833732O259349
$$ 4190792 3162180 888128 -1531133 -4469721 -7138479 -6714886 -1881154 4378195
34815D378195K981121j853371l991559k559146o982J338770J508301J727057J984558
$$ 4378195 7359316 5505945 1514386 -1044760 -1051742 287028 1795329 3522386 5506944
34806E506944Q50491k007924m268588l289596L67953L354643L621665K436785
$$ 5506944 6357435 4349511 80923 -3208673 -2840720 513923 4135588 6572373
34798F572373J749691J315779j98877k454465l506180k286383K94914K605012
$$ 6572373 8322064 9637843 9438966 6984501 3478321 1191938 1486852 4091864
34790D091864L579635K822543M92871k516236m805530n211150l353392J57805
$$ 4091864 7671499 10494042 10986913 8470677 3665147 -1546003 -4899395 -4741590
34782d741590L647054M945846L000894p98263l472930l149016p81446J122193
$$ -4741590 -1094536 3851310 6852204 6053941 2581011 -568005 -1349451 -227258
34774b27258J338133R08498J157576J613461Q76349r24165k025129j546184n44856
$$ -227258 1110875 2019373 3176949 4790410 5666759 4742594 2717465 1171281 626425
34765F26425N303N36627J098577K08352k495590m086251j690760K812889M622823
$$ 626425 631728 1168355 2266932 2475284 -20306 -4106557 -5797317 -2984428 1638395
34756A638395K504973J89040N74791J826888R55612j410214k287090q01725R81319
$$ 1638395 4143368 4332408 4907199 6734087 7689699 6279485 3992395 3190670 4171989
34747D171989J048627m90282k067256k388161j767906j929051l584297m489190
$$ 4171989 5220616 4730334 2663078 274917 -1492989 -3422040 -7006337 -11495527
34739a1495527j911320K797677M893919K567586m40213m87515P10846n13843l514108
$$ -11495527 -13406847 -10609170 -5715251 -3147665 -3587878 -4075393 -3364547 -3878390 -7392498
34730g392498m270629j393150K498779M841455N169280L425519j90121l348469
$$ -7392498 -11663127 -13056277 -10557498 -5716043 -546763 2878756 2688635 -659834
34722f59834k947119O34546L286951K220654r36259k931628k623510j008236M69161
$$ -659834 -3606953 -2972407 314544 2535198 1598939 -1332689 -3956199 -4964435 -4495274
34713d495274O19096p58220j989014r97725J694807L245179K441277J371628K112747
$$ -4495274 -3876178 -4634398 -6623412 -7621137 -5926330 -2681151 -239874 1131754 3244501
34704C244501L677668L695440J681669p93377k197923k187922j489508j395638
$$ 3244501 6922169 10617609 12299278 11505901 9307978 7120056 5630548 4234910
34696D234910k560843l887258l618963j712023J82081J104772J463239J326229
$$ 4234910 1674067 -2213191 -5832154 -7544177 -7362096 -6257324 -4794085 -3467856
34688c467856K78582o89269K97120K757620L702969J866741m46900j094561r94668
$$ -3467856 -3189274 -3878543 -3581423 -823803 2879166 4745907 4299007 3204446 2209778
34679B209778j549055j861122q07102M93228P83724J121194K611839L738252K754083
$$ 2209778 660723 -1200399 -2007501 -1514273 -730549 390645 3002484 6740736 9494819
34670I494819Q57554O7084j60934j083385j526417k54109N74745j290531l224536
$$ 9494819 10352373 10419457 10258523 9175138 7648721 7394612 7969357 6678826 3454290
34661C454290j322241K211393J478850l260080m975298q36362K975335R83595
$$ 3454290 2132049 4343442 5822292 2562212 -2413086 -3249448 -274113 709482
34653G09482l029855k379205K063958L954563J515135q48354l25662O96518k96402
$$ 709482 -2320373 -4699578 -2635620 1318943 2834078 1985724 1660062 2356580 2060178
34644B060178j939332j858999l15759Q80946R01568j03294j724448k791589j791985
$$ 2060178 120846 -1738153 -2053912 -1172966 -271398 -374692 -2099140 -4890729 -6682714
34635f682714R63571K997432K729152J604396J744863K592804J822232q05408
$$ -6682714 -5719143 -2721711 7441 1611837 3356700 5949504 7771736 6966328
34627F966328k649263j924137m47733j011521k985623k982209k36328J390087
$$ 6966328 4317065 2392928 1945195 933674 -2051949 -5034158 -5270486 -3880399
34619c880399j205030n020821m408025P36018M242728K192326j696214j744758
$$ -3880399 -5085429 -10106250 -14514275 -13778257 -9535529 -7343203 -9039417 -10784175
34611a0784175J708408L745606K489396R86925J705643L162081L074717J744997
$$ -10784175 -9075767 -5330161 -2840765 -1853840 -148197 3013884 6088601 7833598
34603G833598P01721K05093k89936q21506j481921k856801m530156m484957j596568
$$ 7833598 8535319 8740412 8450476 7628970 6147049 3290248 -1239908 -5724865 -7321433
34594g321433K196254L798489K524090M27867n11530k58707K2292n98972k165826
$$ -7321433 -5125179 -1326690 1197400 1625267 1113737 855030 877322 278350 -1887476
34585a887476l690407l571679r68683K942321N552933N018299J898297j320785
$$ -1887476 -5577883 -9149562 -10118245 -7175924 -1622991 3395308 5293605 3972820
34577C972820k379558j215875J54739l1019j280776j742735q16526K36892L79592
$$ 3972820 1593262 377387 532126 501107 -779669 -2522404 -3338930 -3102038 -2722446
34568b722446J24265J89973J87616k74366k85353J101295K919949L106335J063749
$$ -2722446 -2598181 -2408208 -2220592 -2494958 -2780311 -1679016 1240933 4347268 5411017
34559E411017j781355l746503m026580k430620L97672K428291J626020j462843
$$ 5411017 3629662 -116841 -4143421 -6574041 -6176369 -3748078 -2122058 -3584901
34551c584901l789786l187016o05525J635190K548800K452662J516255m5153r88949
$$ -3584901 -7374687 -10561703 -11167228 -9532038 -6983238 -4530576 -3014321 -3059474 -4048423
34542d048423m2583K106713L314593K716873J578316R73345J50141j690972l209090
$$ -4048423 -4091006 -1984293 1330300 4047173 5625489 6598834 6748975 5058003 1848913
34533A848913k321321M64756J947890J53819k921666l702622j577795L99075l73719
$$ 1848913 -472408 -7652 1940238 2094057 -827609 -4530231 -6108026 -5708951 -6082670
34524f082670k507505k408076P78576L577661K430353j470435l313230p14386
$$ -6082670 -8590175 -10998251 -10219675 -6642014 -4211661 -5682096 -8995326 -9709712
34516i709712L267936M331674K501773J222015J677331J222129j701921m201054
$$ -9709712 -6441776 -2110102 391671 1613686 3291017 4513146 2811225 -1389829
34508a389829k888127Q66382K790862J816956Q53323J489072J643954k36753k012556
$$ -1389829 -4277956 -3411574 -620712 1196244 2049567 3538639 5182593 4945840 2933284
34499B933284j265407O10771P32315m89555k56204J619228K167775J44490j785986
$$ 2933284 1667877 2278648 3010963 2521408 2265204 3884432 6052207 6196697 4410711
34490D410711j137958O55134O08519j332179k424613j087085J275792K464717
$$ 4410711 3272753 3927887 4536406 3204227 779614 -307471 968321 3433038
34482C433038K004239R90242L43427p8106p89159j573288j533701m97990J42279
$$ 3433038 5437277 6427519 6770946 6692840 5903681 4330393 2796692 2298702 2440981
34473B440981j050091l239007l755269j432804J578946K323336N90131j239545
$$ 2440981 1390890 -1848117 -5603386 -7036190 -5457244 -3133908 -2543777 -3783322
34465c783322j474803q76416j012395k006149k491482j247465J535051M280511
$$ -3783322 -5258125 -6134541 -7146936 -9153085 -11644567 -12892032 -11356981 -7076470
34457g076470N125460L434403N74269j097283m13628J456777K287595J212932
$$ -7076470 -1951010 1483393 2057662 960379 546751 2003528 4291123 5504055
34449E504055m18096p97524M1813L49659p87255j935901j258705O43268J296795
$$ 5504055 5085959 4288435 4330248 4679907 3892652 1956751 698046 1341314 2638109
34440B638109j57265j641851j087632O67611J257633J87517p79914l82121O23085
$$ 2638109 2480844 838993 -248639 418972 1676605 1864122 1084208 702087 1325172
34431A325172J052964J103448J691061K619048K367503m6396l353640m791310
$$ 1325172 2378136 3481584 5172645 7791693 10159196 10112800 6759160 1967850
34423A967850l080089k81596M02867j239530k050993j9053K601027K454414k6617
$$ 1967850 -1112239 -1393835 -990968 -2230498 -4281491 -4300544 -1699517 754897 728280
34414G28280j498119q35360l37712j478850k567070j967383r20951j071258j295022
$$ 728280 -769839 -1605199 -1942911 -3421761 -5988831 -7956214 -8877165 -9948423 -11243445
34405a1243445M44063L442954N100587M621929L319063J715219q60414l662871
$$ -11243445 -10799382 -7356428 -2255841 2366088 5685151 7400370 6539956 2877085
34397B877085m309444k102496N98565J458578Q82323N67771J000921J667749K319257
$$ 2877085 -1432359 -3534855 -2936290 -1477712 -595389 -27618 973303 2641052 4960309
34388D960309K630029J820127K627j276636j270109j447488k889007l697550j572750
$$ 4960309 7590338 9410465 9413092 8136456 6866347 5418859 2529852 -1167698 -2740448
34379b740448J992608L215874J502257N849K06288k96112k864557m423943k146707
$$ -2740448 -747840 2468034 3970291 3976140 4182428 3886316 1021759 -3402184 -5548891
34370e548891J287957J326422j165871j080615K609831M766826J888543k508330
$$ -5548891 -4260934 -2934512 -4100383 -5180998 -2571167 2195659 4084202 1575872
$$ [...]
##END NTUPLES=NMR SPECTRUM
##END=
