##TITLE=31Pdec_DE-63_P5UP
 D2O, 24 sc
 27.12.2024
##JCAMPDX= 6.0         $$ Bruker NMR JCAMP-DX V2.0
##DATA TYPE= NMR SPECTRUM
##DATA CLASS= NTUPLES
##ORIGIN= UXNMR, Bruker Analytische Messtechnik GmbH
##OWNER= root
$$ XWIN-NMR		Version 3.5
$$ Fri Dec 27 16:39:27 2024 Russian Standard Time (UT+4h)  she@DPX200
##.OBSERVE FREQUENCY= 81.013821
##.OBSERVE NUCLEUS= ^31P
##.ACQUISITION MODE= SIMULTANEOUS
##.ACQUISITION SCHEME= undefined
##.AVERAGES= 24
##.DIGITISER RES= 17
##SPECTROMETER/DATA SYSTEM= spect
##.PULSE SEQUENCE= zgpg30
##.SOLVENT NAME= D2O
##.SHIFT REFERENCE= (INTERNAL, D2O, 0, 198.062)
##AUDIT TRAIL= $$ (NUMBER, WHEN, WHO, WHERE, WHAT)
$$ ##TITLE= Audit trail, XWIN-NMR		Version 3.5
$$ ##JCAMPDX= 5.01
$$ ##ORIGIN= Bruker BioSpin GmbH
$$ ##OWNER= she
$$ F:/spectra/data/she/nmr/P31/2/pdata/1/auditp.txt
$$ ##AUDIT TRAIL=  $$ (NUMBER, WHEN, WHO, WHERE, WHAT)
(   1,<2024-12-27 16:38:35.96 +0400>,<she>,<DPX200>,
      <created by zg, POWCHK disabled, PULCHK disabled
       configuration hash MD5:
       00 E9 B6 7A A2 85 ED C7 34 08 36 98 17 FE 4E 26
       data hash MD5: 32K
       18 6C EB 56 3E 80 C0 19 91 BD A2 7D 94 70 C8 E2>)
(   2,<2024-12-27 16:38:38.59 +0400>,<she>,<DPX200>,
      <Start of raw data processing
       efp BC_mod = 2 LB = 1.5 FT_mod = 6 PKNL = 1 PHC0 = 1992.057 PHC1 = 326.8864 SI = 64K 
       data hash MD5: 64K
       80 F3 A3 F1 7B 20 C1 51 04 F9 57 77 9C BC CE 9D>)
(   3,<2024-12-27 16:38:53.57 +0400>,<she>,<DPX200>,
      <pk PHC0 = 1.072509 PHC1 = 0 
       data hash MD5: 64K
       29 1F 95 48 74 8E 18 03 6B 75 B1 72 0A 46 4C 64>)
$$ ##END=
$$ 
$$ hash MD5
$$ 30 FB 7F DB 07 55 D7 E4 CC B2 A2 29 FB 0B 56 5E
##$RELAX= 
##$RELAX= 
##$RELAX= 
##$RELAX= 
##$RELAX= 
##$RELAX= 
##$RELAX= 
##$RELAX= 
$$ Bruker specific parameters
$$ --------------------------
##$DU= <F:/spectra>
##$EXPNO= 2
##$NAME= <P31>
##$PROCNO= 1
##$TYPE= <nmr>
##$USER= <she>
##$AMP= (0..31)
100 100 100 100 100 100 100 100 100 100 100 100 100 100 100 100 100 100 
100 100 100 100 100 100 100 100 100 100 100 100 100 100 
##$AQSEQ= 0
##$AQ_mod= 1
##$AUNM= <au_zg>
##$AUTOPOS= <>
##$BF1= 81.014009
##$BF2= 200.13
##$BF3= 200.13
##$BF4= 200.13
##$BF5= 200.13
##$BF6= 200.13
##$BF7= 200.13
##$BF8= 200.13
##$BYTORDA= 1
##$CFDGTYP= 0
##$CFRGTYP= 5
##$CHEMSTR= <none>
##$CNST= (0..31)
1 1 145 1 1 1 1 1 1 1 1 1 1 1 1 1 1 1 1 1 1 1 1 1 1 1 1 1 1 1 1 1 
##$CPDPRG= <waltz16>
##$CPDPRG1= <>
##$CPDPRG2= <waltz16>
##$CPDPRG3= <>
##$CPDPRG4= <mlev>
##$CPDPRG5= <mlev>
##$CPDPRG6= <mlev>
##$CPDPRG7= <mlev>
##$CPDPRG8= <mlev>
##$CPDPRGB= <>
##$CPDPRGT= <>
##$D= (0..31)
0 1 0 0 0 0 0 0 0 0.06 0 0.03 2e-05 3e-06 0 0 0.0002 0 0 0 0 0 0 0 0 0 
0 0 0 0 0 0 
##$DATE= 1735303115
##$DBL= (0..7)
120 120 120 11 120 120 24 19 
##$DBP= (0..7)
150 150 150 150 150 150 150 150 
##$DBP07= 0
##$DBPNAM0= <>
##$DBPNAM1= <>
##$DBPNAM2= <>
##$DBPNAM3= <>
##$DBPNAM4= <>
##$DBPNAM5= <>
##$DBPNAM6= <>
##$DBPNAM7= <>
##$DBPOAL= (0..7)
0.5 0.5 0.5 0.5 0.5 0.5 0.5 0.5 
##$DBPOFFS= (0..7)
$$ [...]
##$SUBNAM2= <"">
##$SUBNAM3= <"">
##$SUBNAM4= <"">
##$SUBNAM5= <"">
##$SUBNAM6= <"">
##$SUBNAM7= <"">
##$SUBNAM8= <"">
##$SUBNAM9= <"">
##$SW= 400.765351723535
##$SWIBOX= (0..15)
0 1 3 0 0 0 0 0 0 0 0 0 0 0 0 0 
##$SW_h= 32467.5324675325
##$TD= 32768
##$TD0= 1
##$TE= 0
##$TE2= 300
##$TE3= 300
##$TEG= 300
##$TL= (0..7)
0 120 53 12 22 120 120 120 
##$TP= (0..7)
150 150 150 150 150 150 150 150 
##$TP07= 0
##$TPNAME0= <>
##$TPNAME1= <>
##$TPNAME2= <>
##$TPNAME3= <>
##$TPNAME4= <>
##$TPNAME5= <>
##$TPNAME6= <>
##$TPNAME7= <>
##$TPOAL= (0..7)
0.5 0.5 0.5 0.5 0.5 0.5 0.5 0.5 
##$TPOFFS= (0..7)
0 0 0 0 0 0 0 0 
##$TUNHIN= 0
##$TUNHOUT= 0
##$TUNXOUT= 0
##$USERA1= <user>
##$USERA2= <user>
##$USERA3= <user>
##$USERA4= <user>
##$USERA5= <user>
##$V9= 5
##$VALIST= <valist>
##$VCLIST= <CCCCCCCCCCCCCCC>
##$VD= 0
##$VDLIST= <DDDDDDDDDDDDDDD>
##$VPLIST= <PPPPPPPPPPPPPPP>
##$VTLIST= <TTTTTTTTTTTTTTT>
##$WBST= 1024
##$WBSW= 4
##$XGAIN= (0..3)
0 0 0 0 
##$XL= 0
##$YL= 0
##$YMAX_a= 13039
##$YMIN_a= -14059
##$ZGOPTNS= <>
##$ZL1= 120
##$ZL2= 120
##$ZL3= 120
##$ZL4= 120
##$ABSF1= 0
##$ABSF2= 0
##$ABSG= 0
##$ABSL= 0
##$ALPHA= 0
##$AQORDER= 0
##$ASSFAC= 0
##$ASSFACI= 0
##$ASSFACX= 0
##$ASSWID= 0
##$AUNMP= <proc_1d>
##$AZFE= 0.1
##$AZFW= 0.5
##$BCFW= 0
##$BC_mod= 2
##$BYTORDP= 0
##$COROFFS= 0
##$CY= -3
##$DATMOD= 1
##$DC= 0
##$DFILT= <>
##$DTYPP= 0
##$F1P= 0
##$F2P= 0
##$FCOR= 1
##$FTSIZE= 65536
##$FT_mod= 6
##$GAMMA= 0
##$GB= 0
##$INTBC= 1
##$INTSCL= 9.790993e-09
##$ISEN= 30
##$LB= 1.5
##$LEV0= 0
##$LPBIN= 0
##$MAXI= 10000
##$MC2= 0
##$MEAN= 0
##$ME_mod= 0
##$MI= 50
##$NCOEF= 0
##$NC_proc= -7
##$NLEV= 6
##$NOISF1= 182.463
##$NOISF2= 159.3651
##$NSP= 0
##$NTH_PI= 0
##$NZP= 0
##$OFFSET= 198.0616
##$PC= 4
##$PHC0= 1993.13
##$PHC1= 326.8864
##$PH_mod= 1
##$PKNL= yes
##$PPARMOD= 0
##$PSCAL= 0
##$PSIGN= 0
##$REVERSE= no
##$SF= 81.0140089999434
##$SI= 65536
##$SIGF1= 159.3651
##$SIGF2= -187.1042
##$SINO= 113.3802
##$SIOLD= 16384
##$SREGLST= <1H.CDCl3>
##$SSB= 0
##$STSI= 65536
##$STSR= 0
##$SW_p= 32467.5324675325
##$SYMM= 0
##$S_DEV= 0
##$TDeff= 32768
##$TDoff= 0
##$TI= <>
##$TILT= no
##$TM1= 0
##$TM2= 0
##$TOPLEV= 0
##$USERP1= <user>
##$USERP2= <user>
##$USERP3= <user>
##$USERP4= <user>
##$USERP5= <user>
##$WDW= 1
##$XDIM= 65536
##$YMAX_p= 390003086
##$YMIN_p= -24120359
$$ End of Bruker specific parameters
$$ ---------------------------------
##NTUPLES= NMR SPECTRUM
##VAR_NAME=  FREQUENCY,     SPECTRUM/REAL,   SPECTRUM/IMAG
##SYMBOL=    X,             R,               I
##VAR_TYPE=  INDEPENDENT,   DEPENDENT,       DEPENDENT
##VAR_FORM=  AFFN,          ASDF,            ASDF
##VAR_DIM=   65536,         65536,           65536
##UNITS=     HZ,            ARBITRARY UNITS, ARBITRARY UNITS
##FACTOR=    0.49542278885378, 1,            1
##FIRST=     16045.7642231865, 0,            0
##LAST=      -16421.768244346, 0,            0
##MIN=       -16421.768244346, -24120359,    0
##MAX=       16045.7642231865, 390003086,    0
$$ Real data points
##PAGE= N=1
##DATA TABLE= (X++(R..R)), XYDATA
$$ [...]
40099A425091N57364p79740j320388o08747N6660l33908r66432m92941R61445
40090a501596J961595J533346J19627j016077r66516K3421P85907N42386j14679
40081A367414j28361L23638N9027j069214j613928o13847Q65349J182440L12348
40072F84866m23978k73037L38078P90370Q92460N97310n9098o56884o57256j02061
40062A130770L54705J90376m50680r29184o85093J84017Q36182N16954m15853
40053G32194p93852j67320N71454M56942k72025o79544l98439J70855N04084L05256
40043D29605l44386p74796k54240Q20032J043362l4211r80330m86150N91451N30787
40033E41124n88046j140068n58066O3293K2246n0739L02805N27290L50940M54368
$$ plain form
40099 1425091 1982455 1202715 -117673 -726420 -669760 -1003668 -1970100 -2463041 -1501596
40090 -1501596 459999 1993345 2112972 1096895 130379 153800 939707 1482093 1367414
40081 1367414 1239053 1562691 1621718 552504 -1061424 -1675271 -809922 372518 684866
40072 684866 260888 -12149 325929 1116299 2008759 2606069 2546971 1890087 1232831 1130770
40062 1130770 1485475 1675851 1225171 295987 -389106 -205089 631093 1148047 732194
40053 732194 -61658 -228978 342476 799418 527393 -152151 -550590 -379735 124349 429605
40043 429605 85219 -689577 -943817 -123785 919577 885366 -94964 -581114 10337 541124
40033 541124 -46922 -1186990 -1745056 -1681763 -1659517 -1710256 -1407451 -880161 -529221 -74853
40023g4853J001883Q73469n22136j820567j444184M5332P90717L29602q0337L19061
40013e82013P57597M35450k05401l18707J03900M84006N57789M03074j1105o76942
40003I47648j188056j097646n47047p7355J22291L29397O70463Q78774P87408
39994H25877O19234N70919M88629K13062j15569l83693p19147r97641o52703L71933
39984B20901R70077J61635j220942j358440k6124J004451N71873k83067j94317
39975a53953L95940L11089j92156j3257O30188M67437n26877r06892j00897O68773
39965E79395L71237l79051o07914m69408n41841o45836l36282J71863M45222N78268
39955h34347P45995O50598J52313j98510j0672K34356Q5581j0100L63433N93706
$$ plain form
40023 -74853 927030 1800499 1278363 -542204 -1986388 -1941056 -1150339 -820737 -901074 -582013
40013 -582013 175584 611034 405633 86926 190826 674832 1232621 1635695 1624590 947648
40003 947648 -240408 -1338054 -1885101 -1962456 -1840165 -1510768 -840305 38469 825877
39994 825877 1445111 2016030 2504659 2717721 2602152 2218459 1499312 501671 -151032 220901
39984 220901 1190978 1352613 131671 -1226769 -1252893 -248442 323431 40364 -153953
39975 -153953 241987 553076 360920 347663 977851 1445288 918411 11519 -89378 579395
39965 579395 950632 571581 -36333 -505741 -1047582 -1693418 -2029700 -1857837 -1412615 -834347
39955 -834347 -88352 562246 714559 516049 505377 739733 825314 815214 1178647 1772353
39945A772353Q5769m24913N0381R21233P90000k45775o84178L371O99659N76872
39935C544772J30408j71578p29470j570461j673660n41979O83048P78430J85263
39926F34773M2989K88222N1039n93186p12506j91072M4712l95326p37916l34350
39916a902621L78902O49516M10594P3010j03733j9124L99106R20067J002156M54258
39906B262131k18445m75531m21614m50302n25985l08682J80116N30600N72151
39897A144439N72447P02703O96070K88349k48259l62248L260K17183k47297r96059
39887A770588j057205j34673Q42199P73305k04498q56518m21262M80271P60794
39878A953001K46944l14730l79483j73168j34723k87144l71555l01278k40509
$$ plain form
39945 1772353 1858122 1433209 1483590 2404823 3194823 2949048 2264870 2268241 2967900 3544772
39935 3544772 3675180 3503602 2774132 1203671 -469989 -1011968 -328920 449510 634773
39926 634773 677762 965984 1017023 423837 -288669 -479741 -435029 -830355 -1568271 -1902621
39916 -1902621 -1523719 -874203 -463609 -390599 -494332 -513456 -114350 805717 1807873 2262131
39906 2262131 2043686 1568155 1146541 696239 170254 -138428 41688 572288 1144439
39897 1144439 1716886 2419589 3115659 3404008 3155749 2793501 2796761 3013944 2766647 1770588
39887 1770588 713383 578710 1420909 2194214 1989716 1133198 711936 1192207 1953001
39878 1953001 2199945 1885215 1505732 1332564 1197841 910697 539142 237864 -2645
39869b645l73353p34575j131433j149789m71196O24197J286660R41286J9161m73713
39859a465400j14428N36976P67124N67783M13939M79395M95635L08543J31580
39850B121147J30907J17351j22495m45242n78610n52507n78249n88913k76381
39841g72992L48589P58801M75154l17657q79761o04775M10601J375555J415340
39832B208855L91352q46954j257514p16201o9495L522k03293l0393M92080O96409
39822F68368K72313k99521m16688q8857J93084J03835k05296l74782k83201j72485
39812f03230k97552n13554m14126P2536N02750M91050J67889j63519m63210o82685
39802a903651m64343K98116R07128O24526j59812l63505J90387N44612J63105
$$ plain form
39869 -2645 -375998 -1110573 -2242006 -3391795 -3862991 -3238794 -1952134 -1010848 -991687 -1465400
39859 -1465400 -1579828 -1042852 -275728 292055 705994 1185389 1681024 1989567 2121147
39850 2121147 2252054 2369405 2246910 1801668 1223058 670551 92302 -496611 -772992
39841 -772992 -424403 334398 809552 491895 -387866 -992641 -582040 793515 2208855
39832 2208855 2600207 1753253 495739 -220462 -289957 -286435 -489728 -520121 -28041 668368
39822 668368 940681 641160 224472 135615 328699 432534 227238 -147544 -430745 -603230
39812 -603230 -900782 -1414336 -1828462 -1755926 -1253176 -762126 -594237 -757756 -1220966 -1903651
39802 -1903651 -2367994 -2069878 -1162750 -538224 -698036 -1061541 -871154 -326542 -163437
39793a63437k77852j08542K42543O7632m31483n61893k14604K44126O91113J077680
39783E65283R90514K59472l51549k2438P81880Q46723k4276q05550q28107n01004
39773I10948k89268m6930K56491J46007m56787p74776k77251M23311M57367o1894
39763B87218l87688k95455j48370q1896J39743N18814O77925L86525j42848n19108
39753D34860n09713j82622J20387R9961q7684Q708M32566O64524M05134O8739
39743A454860J16944L01967O7327n73448j045913r21140k32045O69188J187481
39734A025221P58998m26690j256544q41640L49668J084901Q98782L62297l9274
39725A915719m72641j066317j397916j039650j75311O16149Q96075N62265j21982
$$ plain form
39793 -163437 -441289 -549831 -307288 -239656 -671139 -1233032 -1447636 -1203510 -512397 565283
39783 565283 1555797 1815269 1463720 1441282 2223162 3069885 3045609 2240059 1411952 910948
39773 910948 621680 574750 831241 977248 520461 -254315 -531566 -108255 349112 287218
39763 287218 -100470 -395925 -544295 -626191 -486448 32366 710291 1096816 953968 434860
39753 434860 -74853 -257475 -137088 -37127 -124811 -116103 316463 980987 1386121 1454860
39743 1454860 1571804 1873771 1941098 1367650 321737 -599403 -831448 -162260 1025221
39734 1025221 1784219 1357529 100985 -740655 -390987 693914 1592696 1954993 1915719
39725 1915719 1443078 376761 -1021155 -2060805 -2236116 -1619967 -723892 -161627 -283609
39716b83609n68467l23230L45929O65718L06101k44987m07410k08905j1588J04229
39706f26219L28530O83397R16263P86146K90885l35108p66050q23523o35465m77095
39696f58239m64167n27775o20688p13468o17347j17992O36907J151736J124905
39687h06128P95414O16543P11100P90563N91404K82654K82649N71547M47586n59261
39677C724071j644951j421325P0111R90134J19763j207658q35230J068651K149633
39668C013199J148072n68234j209043q06082m00404k39163M4772K98245J28087
39659A409449j75023r2280J08229j47191n42008k44550O51019J120809O93062
39650B781516n060k99394k34627j53142k59058p00247j353880j509521o18404
$$ plain form
39716 -283609 -852076 -1175306 -829377 -163659 142442 -102545 -509955 -718860 -730448 -626219
39706 -626219 -297689 385708 1301971 2088117 2379002 2043894 1277844 454321 -181144 -658239
39696 -658239 -1122406 -1650181 -2270869 -2984337 -3601684 -3719676 -3082769 -1931033 -806128
39687 -806128 -10714 605829 1316929 2107492 2698896 2981550 3264199 3835746 4283332 3724071
39677 3724071 2079120 657795 727906 1718040 1837803 630145 -205085 863566 3013199
39668 3013199 4161271 3593037 2383994 1577912 1177508 938345 983117 1281362 1409449
39659 1409449 1234426 1142146 1250375 1103184 561176 316626 967645 2088454 2781516
39650 2781516 2776456 2477062 2242435 2089293 1830235 1129988 -223892 -1733413 -2351817
39641b351817N91410P61572j27004n52531L27980J403885J305291L22569l94209
39632A287146o77822j076997j316598n61772Q43684J385722N07289m96105l33392
39623d38845N11433O89451k5958o25737m31979J33696L82273K55855J51480K53398
39613H55067L18635K3134n73277r27389n40704L27924P72103L25296l61029l59574
39603a39814K48431N43155J68053j63356J83934P47872O16134k78063j088111
39594H38235j166370p26664l28082j13636J82695O45309R03288N91040l8644k74040
39584E13131J42357N91336M37506Q566P8977N45689N30161p2206k35241M57744
39574B998020Q15885j82180j478384j243830L25750J154588K99912q08316o93002
$$ plain form
39641 -2351817 -1760407 -998835 -1125839 -1678370 -1350390 53495 1358786 1681355 1287146
39632 1287146 609324 -467673 -1784271 -2346043 -1502359 -116637 390652 -105453 -438845
39623 -438845 72588 762039 736081 110344 -321635 -187939 194334 450189 601669 855067
39613 855067 1173702 1196836 623559 -303830 -844534 -516610 255493 580789 219760 -139814
39603 -139814 108617 651772 819825 656469 840403 1588275 2204409 1926346 838235
39594 838235 -328135 -1054799 -1382881 -1496517 -1313822 -668513 234775 825815 787171 513131
39584 513131 655488 1246824 1684330 1692896 1771873 2317562 2847723 2775517 2540276 2998020
39574 2998020 3813905 3631725 2153341 909511 1235261 2389849 2689761 1881445 1188443
39565A188443O8575O9825o77724r86431m19649K44697L22937J268k47419k51427
39555f86905n625M72496R69415J128249Q10212K27663k38968k35467L01880Q42293
39545C585243N72486n72494j487327j045376M72139J621643J446753M34159k21766
39536D805460L6544O18464M77110o85918j949522k164583j336920m59011M8235
39527f10141P90307J906800K246255J000364p19910j228076n97572k29917m83817
39518B074293l85584L44843P39202M06526K27887N74892M50715o14185j288962
39509B529627l91001J066479J308209M27452p0570J91472J64741n00660p94051
39500C931698j63959M91031K93313l12193m81148k93111l19724n07868l58399
$$ plain form
39565 1188443 1257018 1326843 649119 -337312 -756961 -512264 -189327 -188059 -435478 -686905
39555 -686905 -692530 -220034 749381 1877630 2687842 2915505 2676537 2441070 2742950 3585243
39545 3585243 4157729 3585235 2097908 1052532 1524671 3146314 4593067 5027226 4805460
39536 4805460 4842004 5460468 5937578 5251660 3302138 1137555 -199365 -658376 -610141
39527 -610141 180166 2086966 4333221 5333585 4613675 3385599 2788027 2558110 2074293
39518 2074293 1688709 2033552 2772754 3179280 3407167 3982059 4432774 3818589 2529627
39509 2529627 2138626 3205105 4513314 4940766 4870196 5061668 5226409 4725749 3931698
39500 3931698 3767739 4258770 4552083 4239890 3758742 3465631 3145907 2638039 2279640
39491B279640J11988L38708L6163m67727o74088l60873K75248O56677K50079p09248
39481A736567j193830n35104O27279J103588P27625M76785R32803J396788R99233
39472F271734R3160k12276L28950P65370L54676m00121n04021K30425J132128
39463H060025J625441J695780J508826J094481N24434O1568l7263K52645O95906
39454A5481843Q93923N53254j40115n85527m69872k03746l22814o97298q01659
39445A3707989n46581k40809J20065P82016J441861J331419L23780p15396r61233
39436A5243111m59777K50481P18246O10492j11815q17610p70483k92022m43759
39427A3926864j273212j562147q79340n20741j387525k230012j486793J35491
$$ plain form
39491 2279640 2391628 2730336 2766499 2298772 1624684 1263811 1539059 2195736 2445815 1736567
39481 1736567 542737 7633 634912 1738500 2466125 2942910 3875713 5272501 6271734
39472 6271734 6364894 6152618 6481568 7246938 7601614 7201493 6697472 6927897 8060025
39463 8060025 9685466 11381246 12890072 13984553 14508987 14570555 14533292 14785937 15481843
39454 15481843 16375766 16929020 16788905 16203378 15733506 15529760 15206946 14509648 13707989
39445 13707989 13161408 12920599 13040664 13822680 15264541 16595960 16919740 16204344 15243111
39436 15243111 14783334 15033815 15752061 16362553 16250738 15433128 14662645 14370623 13926864
39427 13926864 12653652 11091505 10212165 9691424 8303899 6073887 4587094 4722585
39419D722585P06153N5978k40923L66648P05417J69589k47058J26803L97534k32717
39409F530009r30317n25129O12876J153011O64116j04298m22007k46740O8565
39400F800086J56608p6713k38615J15118O54500M92292n11159j375907j303391
39391D712819o13719J6179M25777N81179K10236m84821n87015K70823J164265
39382E695723J211549Q38695P72202O27907k53545j227512j052708J21401Q56530
39373G590242M54434l32405o32347l83461J18642N63089M57591l84864j157809
39364F293112q74490R0408L55931m44224j127468p35626K19126O90613L77881
39355D845263l29245q95494q22129m1322O72663M97965j41775p3368P49549J103812
$$ plain form
39419 4722585 5428738 5484716 5243793 5610441 6315858 6485447 6238389 6365192 6762726 6530009
39409 6530009 5599692 5074563 5687439 6840450 7504566 7400268 6978261 6731521 6800086
39400 6800086 6956694 6879981 6641366 6756484 7410984 7903276 7392117 6016210 4712819
39391 4712819 4099100 4115279 4541056 5122235 5332471 4847650 4260635 4531458 5695723
39382 5695723 6907272 7745967 8518169 9146076 8892531 7665019 6612311 6733712 7590242
39373 7590242 8044676 7712271 7079924 6696463 6815105 7378194 7835785 7450921 6293112
39364 6293112 5418622 5509030 5864961 5420737 4293269 3557643 3776769 4467382 4845263
39355 4845263 4516018 3620524 2798395 2757073 3429736 3927701 3785926 3712558 4462107 5565919
39345E565919M91482j20511p6054r5591p59350j307772r97663m02642j92216J53012
39335B258614J003588J152260m49790k347714k061509L45538K172548J705750
39327C779285J33226o04715k76438Q1291j35549o92220j101441j018909n25986
39318c61456k32461n37807q32778k75194P12056Q56093M4666m17549N9627M02046
39308e82757k04642q21113l15890O94540Q52319K39955O4909N85018Q61838N13488
39298A887665K72241N25017N59914j65716r63720q60283k1502M93022J41434n34903
39288A333169p20694k76452K35327K62375j73037o27112p98126p24071m54935
39279a943556J02891Q38417J305745J284542J159857J303562J359212P42417k96630
$$ plain form
39345 5565919 6057401 5936890 5860836 5765245 5005895 3698123 2700460 2297818 2105602 2258614
39335 2258614 3262202 4414462 3964672 1616958 -444551 -99013 2073535 3779285
39327 3779285 3912511 3307796 3031358 3112649 2977100 2284880 1183439 164530 -361456
39318 -361456 -593917 -1131724 -1964502 -2239696 -1527640 -671547 -626881 -1044430 -984803 -582757
39308 -582757 -787399 -1608512 -1924402 -1229862 -377543 -137588 -72679 512339 1374177 1887665
39298 1887665 2159906 2684923 3244837 3079121 2115401 1255118 1233616 1726638 1868072 1333169
39288 1333169 612475 336023 571350 833725 660688 33576 -764550 -1488621 -1943556
39279 -1943556 -1840665 -1002248 303497 1588039 2747896 4051458 5410670 6153087 5856457
39270E856457q30770n51637j97613m07957p90047o12674M2222M38724K56145j45449
39260C057401m86841r28608j429605j323488j15822J495079K057426J053415l04995
39251C073962m07123Q29793J871436J432604n1598j056762p23830L46265Q72658
39242F187405J92397j107591j678346p28059R47605J553853K63007j691338k370535
39233A568398j358019L44M74813K41990O7955L0219k83304p53600o95085J71710
39223e34579J248756J671112J089509j46179j255914j483169o66509N06584J093670
39214A523281Q60983L92049J62944n9890n90993j005160n66222O01481J422802
39205B741275J171542L44722j14155k5469J08476P9421J69468M14859L84358r4380
$$ plain form
39270 5856457 5025687 4474050 4276437 3868480 3078433 2465759 2507981 2946705 3202850 3057401
39260 3057401 2570560 1641952 212347 -1111141 -1226963 268116 2325542 3378957 3073962
39251 3073962 2666839 3496632 5368068 6800672 6749074 5692312 4968482 5314747 6187405
39242 6187405 6379802 5272211 3593865 2865806 3813411 5367264 5630271 3938933 1568398
39233 1568398 210379 210723 685536 927526 995481 1025700 742396 -11204 -706289 -534579
39223 -534579 714177 2385289 3474798 3328619 2072705 589536 -76973 429611 1523281
39214 1523281 2384264 2776313 2939257 2879367 2288374 1283214 716992 1318473 2741275
39205 2741275 3912817 4257539 4143384 4117915 4226391 4305812 4475280 4890139 5274497 5180117
39195E180117n65132o09222l89208j74574J74779P56102J101715P72209J82872
39186F429658R3278M19164L81222j31308k55395M69393J258583J201393N75681
39177A0441669L05325N55071P35380O93033R23558J469131J526922O32642m42235
39168A6840496o25033N0628O71351Q02972P94707P69811K72256p18692j287011
39159A7571485q09248p3715k52768j123078j397449p47079k57182n55637p42709
39150A1612620M0063J029423R67883R3576l49809k34619o79360j948617k685221
39141G845939j848991k98269M17192R2729k11492J42106O51015N76183p2010n79627
39131F714775l22199M87920Q60757J37081r77989j063999J64923J360573J285853
$$ plain form
39195 5180117 4614985 4005763 3616555 3441981 3616760 4372862 5474577 6246786 6429658
39186 6429658 6522936 6942100 7323322 7192014 6936619 7406012 8664595 9865988 10441669
39177 10441669 10746994 11302065 12037445 12730478 13654036 15123167 16650089 17282731 16840496
39168 16840496 16215463 16266091 16937442 17740414 18535121 19304932 19577188 18858496 17571485
39159 17571485 16762237 16688522 16435754 15312676 13915227 13168148 12910966 12355329 11612620
39150 11612620 11652683 12682106 13649989 13743565 13393756 13159137 12479777 10531160 7845939
39141 7845939 5996948 5698679 6115871 6208600 5997108 6139214 6790229 7366412 7294402 6714775
39131 6714775 6392576 6880496 7741253 7878334 6900345 5836346 6001269 7361842 8647695
39122H647695L48387k16120m0270L10332M73473N36230M16428k8550l62532K6950
39112A0112023Q47178J104129N11785j65511l85582n42342r98457j244056p01395
39103H537772J67707L05251n75432j619245j805435r72877J16950N81549L02603
39094E038843l5250O7606J59998m24307j250673j084863K75330J392559J011511
39085E150754k49823q46971m17928M7843q8493l33600j47590J50486O4847j59293
39075C170232J4997L76141J17140r04701j673388j182026K00830J060949O44045
39066A824219l01160o45968l31600j24016k62407j86911L73444Q87669Q85567
39057B118837O04603L69701J1026n62818q42673m58490O6675O2271k12790p6234
$$ plain form
39122 8647695 8996082 8779962 8739692 9050024 9523497 10059727 10476155 10447605 10085073 10112023
39112 10112023 10959201 12063330 12575115 12409604 12024022 11481680 10483223 9239167 8537772
39103 8537772 8705479 9010730 8435298 6816053 5010618 4037741 4154691 4736240 5038843
39094 5038843 5003593 5071199 5231197 4806890 3556217 2471354 2746684 4139243 5150754
39085 5150754 4900931 4053960 3636032 3683875 3595382 3261782 3114192 3264678 3329525 3170232
39075 3170232 3185229 3561370 3678510 2773809 1100421 -81605 119225 1180174 1824219
39066 1824219 1523059 877091 545491 421475 159068 -27843 345601 1233270 2118837
39057 2118837 2723440 3093141 3104167 2541349 1698676 1240186 1306861 1369132 1156342 1080108
39047A080108L41312L23526j57024l99851j77752L9524J41207N84987J287252
39038C063289J372336N21530l60657m27843k4330J04972m1368j13797k40993o09579
39028C243560q05710m86300j86176m65723p26985m6064J118834J364964M55376
39019C465776l47213k70079k0168k96159n81733k36762K50783J32814k34170k0112
39009A842977N59932N25206k55645q34647o36809j69382m1021j13215k6989Q6222
38999I36629o6737l18312k51840J56373M88451M03853k2809m13925m08522J9027
38989E22188M60225M31550p1191n23049m64756O443M29292M86504J94383k53277
38979A218312o47978q34055p55069m59750o8497K33319K64006P2668K8432M20204
$$ plain form
39047 1080108 1421420 1744946 1587922 1188071 1010319 1049843 1191050 1776037 3063289
39038 3063289 4435625 4957155 4596498 4168655 4144325 4249297 4207929 4094132 3853139 3243560
39028 3243560 2437850 1951550 1765374 1299651 572666 526602 1645436 3010400 3465776
39019 3465776 3118563 2848484 2828316 2532157 1950424 1713662 1964445 2097259 1863089 1842977
39009 1842977 2402909 2928115 2672470 1837823 1201014 1031632 990611 877396 850407 936629
38999 936629 869892 551580 299740 456113 944564 1348417 1325608 911683 503161 522188
38989 522188 982413 1413963 1342772 819723 354967 361410 790702 1277206 1471589 1218312
38979 1218312 570334 -263721 -1018790 -1478540 -1547037 -1313718 -1049712 -977044 -948612 -528408
38969e28408R49449R27386J25205q11766j018405l63290M32267N85010M5016m97514
38959a55050l74339L09906Q09868O80473L11288K44365K75846j68266q86555r42674
38949A04862q0956O76487L69145n75351j031338p31572l03429l074O02104J541586
38939E68464J920918J033132m76128j148122l53940R63133J285817J47793j344128
38930B596939j680855n91545P02324R19195O8386q40998j054464o04979J14031
38921c71966P19769Q76743N33535J58058K64439O91626Q25739N26133K66617K95458
38911D786151K73142o1970m40893n50501m87179m48491l97797k66851p4202L08090
38901B639499R82893J491090J149468J92134k36430L20186Q99187O35205J00015
$$ plain form
38969 -528408 421041 1348427 1473632 661866 -356539 -719829 -287562 297448 342464 -155050
38959 -155050 -529389 -219483 590385 1270858 1582146 1826511 2102357 1934091 1047536 104862
38949 104862 23906 700393 1069538 494187 -537151 -1268723 -1572152 -1575226 -973122 568464
38939 568464 2489382 3522514 3046386 1898264 1544324 2507457 3793274 3941067 2596939
38930 2596939 916084 324539 1026863 1946058 2014444 1173446 118982 -485997 -371966
38921 -371966 347803 1224546 1758081 1916139 2180578 2872204 3697943 4224076 4490693 4786151
38911 4786151 5059293 4997323 4556430 4005929 3518750 3070259 2672462 2405611 2331409 2639499
38901 2639499 3622392 5113482 6262950 6455084 6218654 6538840 7438027 8073232 8173247
38892H173247J65110L54006l36016j482287j668925p80785k79782q91165j514669
38883A738734j091492k31206k5752k90483j38805M08571O10958L96876L80886
38874A758287O54811O65020L03014Q6553J16448j48907p87477j038526n06764
38865A102459J14156J44120j7271K82031O82959L70808m81121r00159o20221l11695
38855C66066k55714M1000N86691M82171n31643j194311m54770P53879P80846k39836
38845C34379o78268l5993L87615k07601p79576k50032O70646O79919J7656M7207
38835A85952J130498K178584K210202J330366K00068n54296m48582M13487R84522
38826G630801L05278j017010j356943l22062O05953J74379q85584j010193j3384
$$ plain form
38892 8173247 8338357 8692363 8356347 6874060 5205135 4424350 4144568 3253403 1738734
38883 1738734 647242 416036 390284 99801 -39004 369567 980525 1377401 1758287
38874 1758287 2413098 3078118 3381132 3467685 3584133 3435226 2647749 1609223 1102459
38865 1102459 1216615 1360735 1343464 1625495 2308454 2679262 2198141 1297982 677761 366066
38855 366066 110352 151352 738043 1220214 688571 -505740 -960510 -206631 574215 334379
38845 334379 -343889 -379882 7733 -199868 -979444 -1229476 -558830 121089 138745 185952
38835 185952 1316450 3495034 5705236 7035602 7235670 6681374 6232792 6646279 7630801
38826 7630801 7936079 6919069 5562126 5240064 5846017 6020396 5134812 4124619 4111235
38817D111235Q07192M68491o52301j543735j663802j171559m96321N7780L68874
38808B85854L28821j55581q10667r06489l4772J093082J272897L41328o03587
38799H10886p26690m05398k44416k1680O00482J012465L69646r38103j557956
38790a100764q85232L44250J184707J395144J141316N91179O5245m9277J81765
38781B868333K85496J02847n2032o1239k02737m78555m23231O4144L40789l1713
38771B412102n01136k86078M62479Q86381N63420j61702q09386j124366q95639
38762E46075p5672P95705Q44814j51225j344575j663248r18198J28958O59992
38753a177374N29016J39755j35356k18349j06483K76739Q10646R95048M36033
$$ plain form
38817 4111235 4918427 5386918 4734617 3190882 1527080 355521 -140800 -83020 285854
38808 285854 614675 459094 -351573 -1258062 -1292834 -199752 1073145 1414473 810886
38799 810886 84196 -321202 -565618 -587298 13184 1025649 1395295 457192 -1100764
38790 -1100764 -1985996 -1641746 -457039 938105 2079421 2670600 2735845 2686568 2868333
38781 2868333 3153829 3256676 3204644 3143405 2940668 2462113 2038882 2103026 2443815 2412102
38771 2412102 1910966 1624888 2087367 2973748 3537168 3375466 2566080 1441714 546075
38762 546075 470403 1266108 2110922 1959697 615122 -1048126 -1966324 -1837366 -1177374
38753 -1177374 -648358 -508603 -643959 -862308 -968791 -692052 118594 1113642 1549675
38744A549675n10446r73636n31741L98598J183610J526806J291271M04760o57697
38735C681200q99166J6305R94096O94998p08969j755599j586599p69316j48098
38726d81148K09232N46940O78003K85487m85785j196104j506307j122549R1776
38717b980455J514034J880920O82248r83358j629561j102385l74334j0094K36450
38708b766535M93289M82059K52670K77422N97414P00894M66848L65130M47002
38699A316193J20015n95455o29431N02450J514597R00969q89695j991816j547491
38690a299664m50026K36444M38963M90540M40513L53610M87500P32759N25385
38681A956024k68336r62112r63705n47452k80668j90692j3747J65866J21135L6392
$$ plain form
38744 1549675 1039229 65593 -466148 -67550 1116060 2642866 3934137 4338897 3681200
38735 3681200 2782034 2798339 3792435 4487433 3778464 2022865 436266 -333050 -481148
38726 -481148 -271916 275024 953027 1238514 752729 -443375 -1949682 -3072231 -2980455
38717 -2980455 -1466421 414499 1096747 113389 -1516172 -2618557 -2992891 -3002985 -2766535
38708 -2766535 -2273246 -1791187 -1538517 -1261095 -663681 37213 504061 869191 1316193
38699 1316193 1436208 840753 211322 713772 2228369 3129338 2239643 247827 -1299664
38690 -1299664 -1749690 -1513246 -1074283 -583743 -143230 210380 697880 1430639 1956024
38681 1956024 1687688 725576 -238129 -785581 -1066249 -1256941 -1270688 -1104822 -983687 -947295
38671i47295K53620O04118N44940m4607o51763p89935n32711k49271j1669N02605
38661a321968J419431K094999J549320k11177j699602j480599m5255P48832J95954
38652A249935m05971J13533J010533R78580L30046L76946J093870J014548m33027
38643E328993j942043k158596j327128m62769J40038P46440J228264J179598O52877
38634C385674P3049l62301o66274p27692n25488m02550n74848o27798j03183O30781
38624I9370P82862L23671N4581M15107Q76244P44948N5250o11248q03848m71529
38614A465408R6416L85753N8958n29705n69935J73805R04662P31388k02492r43160
38604A571098q91658k93125L25890P00396P72586N74107L18974K27268R7367n20276
$$ plain form
38671 -947295 -693675 -89557 455383 410776 -240987 -1030922 -1563633 -1812904 -1824573 -1321968
38661 -1321968 97463 2192462 3741782 3530605 1831003 350404 305149 1053981 1249935
38652 1249935 843964 957497 1968030 2946610 3276656 3653602 4747472 5762020 5328993
38643 5328993 3386950 1228354 -98774 -561543 -421505 324935 1553199 2732797 3385674
38634 3385674 3458723 3096422 2430148 1702456 1176968 774418 199570 -428228 -531411 99370
38624 99370 882232 1205903 1260484 1675591 2551835 3296783 3352033 2740785 1936937 1465408
38614 1465408 1561824 1947577 2006535 1476830 906895 1080700 1985362 2716750 2514258 1571098
38604 1571098 679440 386315 712205 1412601 2185187 2759294 3078268 3305536 3402903 2882627
38594B882627j460944j724264o39635J007033J654050P93202m37076o52180K53334
38585A676147J231855J327830M52750p63154j468248j137313p6464O89118M31724
38576B364245m17016q11004m23201J02131K80489M79396J080703J536844R98833
38567E191420l15235j152320p73566J36028M27981r6064o75927p02206k89230
38558A750881J78564N10545N79218K06047n10330j076233j165137j044920j043616
38549a614981q41673Q3925J348872J745589P74022n05530p12141J15750O61414
38540A055247Q4239j007816j434142p58007M96391J532163J864031J459806O60254
38531C952166m1671l29578k54390j24615k27924n66487p73580m41366K91831O94548
$$ plain form
38594 2882627 1421683 -302581 -942216 64817 1718867 2512069 2074993 1422813 1676147
38585 1676147 2908002 4235832 4688582 3925428 2457180 1319867 1243403 1932521 2364245
38576 2364245 1947229 1136225 713024 815155 1095644 1575040 2655743 4192587 5191420
38567 5191420 4876185 3723865 2950299 3086327 3514308 3418244 2742317 2040111 1750881
38558 1750881 1929445 2439990 3019208 3225255 2714925 1638692 473555 -571365 -1614981
38549 -1614981 -2456654 -2372729 -1023857 721732 1495754 990224 278083 393833 1055247
38540 1055247 1139486 131670 -1302472 -2060479 -1564088 -31925 1832106 3291912 3952166
38531 3952166 3910495 3580917 3326527 3201912 2973988 2407501 1633921 1192555 1484386 2178934
38521B178934L19613k71065j88915M54811O07427j80041j031107j022617m97784
38512C69256l77461o66660o03862r7372O7856l43702l98511O00739J805562J748299
38502B104144K86141j162414j330827m33103L81063M15122l8897l05534j39343
38493b23648R8677k2782l93684m61847j8902M00716K35343k14670j54837M91058
38483b64576R04144O03050J55343J93623L50970q8679r09799j243432r44001p03783
38473a947140p36375l81791O17564J406554J205607M45581k4200k20755o32754
38464b67709j015668o32410M40686J213838J061900L31115l76279p60186o08625
38455f13338J39657R25969R59992L30961m9061J25291R2294n65509j047258o36588
$$ plain form
38521 2178934 2498547 2227482 2038567 2493378 3100805 2920764 1889657 867040 369256
38512 369256 -8205 -674865 -1278727 -1376099 -1308243 -1651945 -2050456 -1449717 355845 2104144
38502 2104144 2390285 1227871 -102956 -536059 -154996 260126 221229 -84305 -223648
38493 -223648 -124971 -147753 -541437 -1003284 -1022186 -621470 -386127 -600797 -755634 -264576
38483 -264576 639568 1242618 1397961 1591584 1942554 1853875 944076 -299356 -1243357 -1947140
38473 -1947140 -2683515 -3065306 -2447742 -1041188 164419 610000 585800 365045 -267709
38464 -267709 -1283377 -1915787 -1475101 -261263 800637 1131752 755473 -4713 -613338
38455 -613338 -473681 452288 1412280 1743241 1694180 1819471 1911765 1346256 298998 -337590
38445c37590J4683l8353l52783J96645J355386J587896L97415p91805o28011L50799
38435A754282O77813j6413q40614j065822p98361l91092k9741K7570m60444j140189
38425b283011j170429k79957P24688R45559N46393L75396O32904O09358j15311
38416a4410q50277o33716M40352J272859J089716K87502j56267J77229P82308
38407B395296Q85067L11475l60107n32627l48211m35612r09827j115362o50448
38398g60356j18384k42599o14010k12838Q89013J356032M42885q65613j165372
38389a291242m13267L50167N94835P25928J034880J085218M16672o46333j251132
38380F05726r37139j17580L63318J51019k14286l099O73002R81702O14347K97965
$$ plain form
38445 -337590 -322907 -361260 -714043 -517398 837988 2425884 2823299 2031494 1403483 1754282
38435 1754282 2432095 2415682 1575068 509246 -289115 -680207 -709948 -682378 -1142822 -2283011
38425 -2283011 -3453440 -3733397 -3008709 -2063150 -1516757 -1141361 -508457 100901 -14410
38416 -14410 -864687 -1498403 -1058051 214808 1304524 1592026 1435759 1612988 2395296
38407 2395296 3280363 3591838 3231731 2699104 2350893 1915281 1005454 -109908 -760356
38398 -760356 -878740 -1121339 -1735349 -1948187 -1059174 296858 739743 -125870 -1291242
38389 -1291242 -1704509 -1354342 -759507 -33579 1001301 2086519 2503191 1856858 605726
38380 605726 -331413 -448993 -85675 65344 -148942 -152041 520961 1502663 2117010 2414975
38370B414975O65497J195754R58078K0821p06336q42197q35286q76263m98924
38361A496119L72459Q61426L00454o38594p79440r2611L43925q227m19402j19823
38351A316286M88705M89635j11438m13953j6813M16509K18674l54592o86639o84613
38341F61761n13257J0103R28379J426966O37419r13353j716205j288628p07681
38332a474496p95680q77890l3012J323028J998632J598855P13320n0120m85390
38323A917247n70391m44210l11923L511Q61173J789186J572317L2365j267350
38314C581925j072691k13224r4347m12100r725P96964P62034J24657K51356R30474
38304D645323M23009j363587k181888q91893O27308M11228o84966p61122K8484
$$ plain form
38370 2414975 3080472 4276226 5234304 5255125 4548789 3706592 2871306 1995043 1496119
38361 1496119 1868578 2730004 3030458 2391864 1612424 1519813 1863738 1855511 1436109 1316286
38351 1316286 1804991 2294626 2183188 1769235 1752422 2168931 2387605 2033013 1346374 661761
38341 661761 148504 158607 1086986 2513952 3151371 2238018 521813 -766815 -1474496
38332 -1474496 -2270176 -3148066 -3181078 -1858050 140582 1739437 2452757 2402637 1917247
38323 1917247 1346856 902646 590723 594234 1455407 3244593 4816910 4849275 3581925
38314 3581925 2509234 2296010 2201663 1789563 1779838 2576802 3338836 3463493 3714849 4645323
38304 4645323 5068332 3704745 1522857 630964 1258272 1669500 984534 223412 251896
38295B51896J87964l81381m71490J59121N61024M31618M39773P31522O70464J97786
38285B778297O0477M45322N99089R5992n71867r35414j100136j095487o32665
38276c56392J39867N00035J72586k40006k19302n4907k13719n64510o41270k51508
38266a729126M77140J259938J645211J268024L56120l64557m42553q0160K87468
38257B677505L93246J28596l53777m87556J80906J193325J490132P09821l80018
38248E552180r59479j069328j137845j176433r22700m06183P5555L12109K15655
38239D83531k09855o41271m96475L91645J352306J480930N98387n81906j131730
38230A245562o56652L96885J031391N55629o29910j307810p16423O07414J418599
$$ plain form
38295 251896 439860 58479 -413011 -253890 307134 738752 1178525 1910047 2580511 2778297
38285 2778297 2838774 3284096 3883185 3979177 3407310 2471896 1371760 276273 -356392
38276 -356392 -216525 283510 456096 216090 -3212 -58119 -271838 -836348 -1477618 -1729126
38266 -1729126 -1251986 7952 1653163 2921187 3277307 2912750 2470197 2390037 2677505
38257 2677505 3070751 3199347 2845570 2358014 2538920 3732245 5222377 5932198 5552180
38248 5552180 4592701 3523373 2385528 1209095 286395 -119788 -44233 267876 483531
38239 483531 273676 -367595 -864070 -472425 879881 2360811 2959198 2377292 1245562
38230 1245562 588910 985795 2017186 2572815 1942905 635095 -81328 526086 1944685
38221A944685J030094j46622j124851j221173n53897J59841L40773Q8448j13661
38212D03637j03580j34795l18670m08732k36296N5003L59605P64685J136255J005247
38202B522359K29107n95109q11977n51357m46922o85452q18909m96050N4759L83340
38192a216211L65017K39190K44745L43871L20243J51734J78999O71056J237890
38183B536534J086607R5225p59726m90715O26669J391407J166120M23602k13389
38174E862334p61689j380694j712219j324348m81325J59406M50799P24758R45194
38165B482216O45557j38277o23557l61438O4429n3567m64446m35854P7567M76950
38155A669580M94700L95538L41776K59192K18968K63377L1177o57546j096469
$$ plain form
38221 1944685 2974779 2828157 1703306 482133 -71764 88077 428850 517298 403637
38212 403637 300057 165262 -153408 -562140 -798436 -743433 -383828 380857 1517112 2522359
38202 2522359 2751466 2156357 1344380 793023 346101 -339351 -1158260 -1654310 -1599551 -1216211
38192 -1216211 -851194 -612004 -367259 -23388 296855 448589 627588 1298644 2536534
38183 2536534 3623141 3718366 2958640 2467925 3094594 4486001 5652121 6075723 5862334
38174 5862334 5100645 3719951 2007732 683384 202059 361465 812264 1537022 2482216
38165 2482216 3127773 2989496 2365939 2004501 2068930 2015363 1550917 1115063 1192630 1669580
38155 1669580 2164280 2559818 2901594 3160786 3379754 3643131 3674308 3016762 1920293
38146A920293n93238J46073j41038j085679r85449L74623J054563j5242j172164
38137d97258n95149Q47578J150310L32315o3473K09560Q4224m26114j87843O59767
38127A513917N78334o71742j347739m74242O45551O14103o5552k80584j25108
38118C86938k14273l69195j74576J01216J62146L44892P30318O21410j55472n37130
38108H96274J26342Q40486N91566N0836K32324N65455L5349o74552j85446R94962
38098C473596J024210k92033j155086o12595K12149K18695j26682r9944n2439
38089B589871m99035j035035j066833p18674k72272M08952J183616J268484L82424
38080B241498n58136p21671n38456o54626n28490O42421K099021K128656N19114
$$ plain form
38146 1920293 1327055 1473128 1332090 246411 -739038 -364415 690148 674906 -497258
38137 -497258 -1092407 -244829 905481 1237796 1174323 1383883 1468107 1041993 854150 1513917
38127 1513917 2092251 1420509 72770 -401472 244079 858182 792630 512046 386938
38118 386938 172665 -196530 -371106 -269890 -107744 237148 967466 1588876 1433404 896274
38108 896274 1022616 1863102 2454668 2505504 2737828 3303283 3338632 2664080 2478634 3473596
38098 3473596 4497806 4205773 3050687 2438092 2650241 2868936 2742254 2642310 2589871
38089 2589871 2090836 1055801 -11032 -729706 -1001978 -593026 590590 1859074 2241498
38080 2241498 1683362 961691 423235 -231391 -759881 -117460 1981561 4110217 4629331
38071D629331r60285r28312j04254J8059o78972j048071m64821M95036J088202
38062B045913J221856J063082O16724Q5313j696M25000N68749j80068j179036
38053D665837j306200n24324K07501M04547M07165K99437l01686j120318j152190
38044A579769k67366L17433j07052o10196k78526K03497j00859n35754L1037J023644
38034A255627R20698j89894o93000l3028N91523L29378k34933m84992o43312o98490
38024A19577l9960J096203J310198J26949r25445m57028O98261Q26403j15897
38015B639261o99727k57554M34300N45842J60515j83065j39208K79359O82518
38006C462241O01615J83544J79982P76906J012479P6748j335483j866782j314073
$$ plain form
38071 4629331 3669046 2740734 2636480 2654539 1975567 927496 462675 957711 2045913
38062 2045913 3267769 4330851 4947575 5032888 5031192 5456192 6024941 5844873 4665837
38053 4665837 3359637 2835313 3042814 3447361 3854526 4153963 3852277 2731959 1579769
38044 1579769 1312403 1629836 1522784 912588 634062 837559 736700 200946 231983 1255627
38034 1255627 2176325 1986431 1293431 1260403 1851926 2181304 1946371 1461379 818067 119577
38024 119577 79617 1175820 2486018 2612967 1687522 1230494 1928755 2755158 2639261
38015 2639261 1939534 1681980 2116280 2662122 2822637 2639572 2500364 2779723 3462241
38006 3462241 4063856 4247400 4427382 5204288 6216767 6293515 4958032 3091250 1777177
37997A777177o23013l02480O7894P09597J077313P66056K07458K7988K40053M42800
37987D390843M04366Q7377n53266j375053j824315j341538q7562R77569R78016
37978A656437Q8664n98912l24749M48961P16254K96175m3735J62239M04891R1040
37968B897265n10511p45115n64663m28246m55655l14277R2128L76898K39703r0441
37958D97086j64543J22143M35687M41433K33644K01922M44950N66251K74461r1784
37948B961250n6298K05733J43031k44646m27047k42883m2349P0691L03492M18438
37938C089412j06423r43060j011594j19261N91200L90966L3325L21148P45524
37929B991237N55679J49601J98967K81228k76144r37267p95962k62705l60967
$$ plain form
37997 1777177 1154164 851684 919578 1629175 2706488 3472544 3680002 3707990 3948043 4390843
37987 4390843 4795209 4882586 4329320 2954267 1129952 -211586 -299148 678421 1656437
37978 1656437 1745101 1146189 821440 1270401 1986655 2282830 2239095 2401334 2806225 2897265
37968 2897265 2386754 1641639 1076976 648730 193075 -121202 -29074 347824 587527 497086
37958 497086 332543 454686 890373 1331806 1565450 1767372 2212322 2778573 3053034 2961250
37948 2961250 2904952 3110685 3253716 3009070 2582023 2339140 2296791 2367482 2670974 3089412
37938 3089412 2982989 2039929 1028335 909074 1500274 1891240 1924565 2245713 2991237
37929 2991237 3546916 3696517 3895484 4176712 3900568 2963301 2167339 1904634 1543667
37920A543667q14552n26875L18121M59239j54894j74812P47284J233359N07254
37911C137791k85767l8774N51712L80925j33813Q5670Q33554R81571L32294k23337
37901E621826k39716k25185n39168p76121n47504j65612j45571m33471n17857
37892B031621j61291K91902M16399L27181N06806R71907J037467K66878p11281
37883D977589r20037l42467J81012K40560K23165L57042K96978o7789k45702j9602
37873D680749N8785m02777q53723n93582J13768L87411o9590o91270q49257n06481
37863A274033j14265q3973l03531j78718O12289J512156J685473J136309N90674
37854F130447L04446j61313q36691j005306l94132K20298J77185j31393j39030
$$ plain form
37920 1543667 729115 202240 520361 979600 824706 649894 1397178 2630537 3137791
37911 3137791 2852024 2813250 3364962 3745887 3612074 3697744 4531298 5512869 5845163 5621826
37901 5621826 5382110 5156925 4617757 3841636 3294132 3128520 2982949 2549478 2031621
37892 2031621 1870330 2162232 2578631 2905812 3412618 4384525 5421992 5688870 4977589
37883 4977589 4057552 3715085 3896097 4136657 4359822 4716864 5013842 4946053 4700351 4680749
37873 4680749 4739534 4336757 3483034 2889452 3003220 3390631 3321041 2629771 1780514 1274033
37863 1274033 1159768 1075795 772264 593546 1205835 2717991 4403464 5539773 6130447
37854 6130447 6434893 6273580 5436889 4431583 4037451 4257749 4434934 4303541 4164511
37845D164511q5814l25762m41393j1359M03614J23992l34666j5785P60928P48474
37835D986740k31676r45274o20754m018q9204p63963j333916j649159j936682
37826b587906j926849r89947P78811K187451K074882P10827l45921k9490R39244
37817H11102J079385K18846l97472j66959r0839r97827j930808j514850j88663
37808c178085M05749n8730k53119N24173J246670R12790J65920K68000J205959
37799A239327J748950J111053j36368q20158n01457M6750k14685j137129j352045
37790a5762j50707J192606R57071n17943j193989k52069Q24781N98086l10302
37781A131772n03795J7852K17185j74076n08488n16402n27202n17624m7031P73243
$$ plain form
37845 4164511 4078697 3752935 3311542 3300183 3703797 3827789 3493123 3477338 4238266 4986740
37835 4986740 4755064 3809790 3189036 3185018 3095814 2331851 997935 -651224 -2587906
37826 -2587906 -4514755 -5504702 -4725891 -2538440 -463558 247269 -98652 -128142 811102
37817 811102 1890487 2109333 1711861 1544902 1454063 456236 -1474572 -2989422 -3178085
37808 -3178085 -2772336 -2831066 -3084185 -2560012 -1313342 -400552 -234632 33368 1239327
37799 1239327 2988277 4099330 3962962 3142804 2641347 2688097 2473412 1336283 -15762
37790 -15762 -166469 1026137 1983208 1465265 271276 19207 843988 1442074 1131772
37781 1131772 627977 645829 863014 688938 180450 -335952 -863154 -1380778 -1427809 -654566
37771f54566J188380Q82375L91712K16330J91916L6302n2074K60389Q28296J103656
37761D392716P21946j16714p86352q04016l70363j71420m74347p36873m44621
37752A209956O1479J70404Q0180M74824J227500J349772M16244q03750j459563
37743B727046j560635j356320o10906P30980J765027J491343K32395o91920o49719
37734B077291k40531j09549q9131J54575L63739J46809k49495k31710K48383N92611
37724B662992L41477k75589o21228l09077L99343P66847K85713o69927j110756
37715A469795n59745L18266N31597J5480l67917l8657N70519O60220R5401m90405
37705B204554m96454l0297K72413M1898l48930k83610J83110L09184k65697q97325
$$ plain form
37771 -654566 533814 1416189 1807901 2024231 2216147 2252449 2200375 2460764 3289060 4392716
37761 4392716 5114662 4997948 4211596 3407580 3037217 2865797 2391450 1654577 1209956
37752 1209956 1271435 1441839 1522019 1996843 3224343 4574115 4990359 4186609 2727046
37743 2727046 1166411 -189909 -800815 -69835 1695192 3186535 3418930 2727010 2077291
37734 2077291 1836760 1727211 1638080 1792655 2156394 2303203 2053708 1821998 2070381 2662992
37724 2662992 3004469 2728880 2107652 1798575 2197918 2964765 3250478 2580551 1469795
37715 1469795 910050 1228316 1759913 1775393 1407476 1368819 1939338 2599558 2694959 2204554
37705 2204554 1708100 1677803 1950216 1992114 1643184 1359574 1542684 1851868 1586171 688846
37695F88846q00395j41756L10664L21075K43093J57102j68994m97635k72150L07167
37685A47017L66802j87683l79333J96775N87903J15340l40264K00093J038884
37676A745534Q98299Q0946r4370L74572J91483q71268j424404p25092J48315J47997
37666D72012j26071L32436J192900J432036R43052L85235k8184n37980j000046
37657C065390j005426o34804l03691n2481L19931O59197O72509M93506L78534
37648C592665J51508l36502n54005K9297Q68013R20303J87627l13014j04397K45242
37638D686737K78276K43923K50983j25374q92478j229776o73799O3329J60097
37629B761918j13645l9351L05656L51358J53968K30536N00352L78778j17796l32182
$$ plain form
37695 688846 -111549 -253305 57359 378434 621527 778629 609635 112000 -160150 147017
37685 147017 513819 326136 -53197 143578 731481 846821 506557 706650 1745534
37676 1745534 2643833 2724779 2630409 3004981 3196464 2325196 900792 175700 324015 472012
37666 472012 345941 678377 1871277 3303313 4246365 4631600 4603416 4065436 3065390
37657 3065390 2059964 1425160 1121469 1068988 1388919 2048116 2720625 3214131 3592665
37648 3592665 3744173 3407671 2853666 2882963 3750976 4671279 4858906 4545892 4441495 4686737
37638 4686737 4965013 5208936 5459919 5334545 4442067 3212291 2538492 2601821 2761918
37629 2761918 2648273 2608922 2914578 3265936 3419904 3650440 4150792 4529570 4411774 4079592
37619D079592j47887k48115q75485j249479p89198j55031k91274r50959j079731
37610a707567m20450K17296L12049L02690N71823O08233j39834j116002j196877
37601b568639k13495Q28500J079690O99679K14550k60411p18171p55202n1971
37592a745470Q79998J098044L82882n24245q87072o81556k29266L36343R28269
37583d42073J253486J136411Q59412P68975P05076K55090n13593j046629j047648
37574A928507p57620l94417J46302P48479P85666m4754r27298p16787M91762J303438
37564B563278P64614m55044j025483o02652M9636K74636K00337K39635M83177
37555B492134P32689P65046M41828j53478o22687n98705k44132q5859k87322m57066
$$ plain form
37619 4079592 3931705 3683590 2808105 1558626 769428 614397 323123 -627836 -1707567
37610 -1707567 -2128017 -1910721 -1598672 -1295982 -724159 -115926 -255760 -1371762 -2568639
37601 -2568639 -2782134 -1953634 -873944 -174265 40285 -220126 -938297 -1693499 -1745470
37592 -1745470 -865472 232572 615454 91209 -795863 -1477419 -1706685 -1370342 -442073
37583 -442073 811413 1947824 2807236 3576211 4281287 4536377 4022784 2976155 1928507
37574 1928507 1170887 776470 922772 1671251 2456917 2412163 1484865 768078 1259840 2563278
37564 2563278 3327892 2872848 1847365 1244713 1294349 1568985 1769322 2008957 2492134
37555 2492134 3224823 3989869 4431697 4278219 3655532 3056827 2812695 2726836 2439514 1982448
37545A982448l12447j20451k01966l44304j15358M05010O33121K60359k73492
37536A912920k50335M68809J198981J129752K34236o93908r76619p59000n60707
37527A704129m46480j24910L27481M93668L69568L98470N95734L62994m73612
37518C207042j114910q05870J21955P88552Q90019O70894J94112n98363j312141
37509B041290j343409o76723J29793O92660J005450J020935O59385K03893P1784
37500C805058J54010m7028n64159q13595m18720K93414P38912O34659Q7254m89489
37490C380316o04788k47606m9902m10395p63584m34161J33999M2960l80659O9508
37480G35688J324496J746597N73693p77731p91547K0556K66847j11809k27710
$$ plain form
37545 1982448 1670001 1549550 1347584 1003280 887922 1292932 1926053 2186412 1912920
37536 1912920 1662585 2131394 3330375 4460127 4694363 4000455 3023836 2264836 1704129
37527 1704129 1257649 1132739 1460220 1953888 2323456 2721926 3317660 3680654 3207042
37518 3207042 2092132 1286262 1408217 2196769 3086788 3757682 3951794 3353431 2041290
37509 2041290 697881 21158 150951 843611 1849061 2869996 3529381 3733274 3805058
37500 3805058 3959068 3912040 3347881 2534286 2115566 2408980 3147892 3782551 3869805 3380316
37490 3380316 2775528 2527922 2478020 2067625 1304041 869880 1003879 1046839 666180 735688
37480 735688 2060184 3806781 4380474 3602743 2811196 2831752 3098599 2986790 2759080
37471B759080o8887l10272p23273m35587L26581L94445k75158k96076Q77116J838810
37461D086779J225061l29252j202098r13043k31846K42310N57767P32091N25143
37452D692912o7970o60429q47355m72124K79564Q19003N73675k06395n32160J3790
37442C592511O11935M47923J0007K49798R09224Q46152r6554p82918n70067k41543
37432D976468o12955j176908r47368k6878N41946K06535n38222r02311n45145
37423I75162L53463J284144J694200J449872R80257P21470O03033L79175J88542
37414H629318L22137O29568O76726L93702O5857k19818n60494p41819m29427P4586
37404H840336n786p32110j107899l86845Q13530J293084Q08339J84206M3321R4411
$$ plain form
37471 2759080 2690193 2379921 1656648 1221061 1547642 1942087 1666929 1370853 2247969 4086779
37461 4086779 5311840 4982588 3780490 2867447 2635601 2877911 3435678 4167769 4692912
37452 4692912 4624942 3964513 3117158 2645034 2924598 3743601 4317276 4110881 3578721 3592511
37442 3592511 4204446 4652369 4662376 4912174 5821398 6667550 6570996 5788078 5218011 4976468
37432 4976468 4363513 3186605 2239237 2212359 2754305 2960840 2422618 1520307 975162
37423 975162 1328625 2612769 4306969 5756841 6737098 7458568 8061601 8440776 8629318
37414 8629318 8951455 9581023 10257749 10651451 10717308 10497490 9936996 9195177 8765750 8840336
37404 8840336 8834550 8102440 6994541 6607696 7421226 8714310 9522649 9706855 9750176 9844587
37394I844587j80732o48104o95751j15193N39593N95913R4023k90119j52786J82551
37384I173982L26960M90667R67346J321852R07253P9097o4484O76857J200885
37375A5080415P39762l9745j68653K84545P79729J358370K123786K387683J560780
37366B4106672M21966K01206O95479O72541J2290o3224R55781K101537K635853
37357C1740101L049657L669770L660684K457250J124153J099261K275898L406537
37349E2483311L863718M000111M241658M812190N956247P473450Q397258Q101569
37341I9329512P386182P488313Q413410R390560J0592475J2882386J5844415J7724688
37333A89051941J7900411J8000010J9651477K2165116K3525667K2964743K1369316
$$ plain form
37394 9844587 9663855 9015751 8320000 8204807 8744400 9340313 9434336 9144217 8991431 9173982
37384 9173982 9500942 9991609 10958955 12280807 13188060 13267157 13202673 13879530 15080415
37375 15080415 15820177 15780432 15611779 15896324 16676053 18034423 20158209 22545892 24106672
37366 24106672 24528638 24729844 25425323 26097864 26110154 26046930 27002711 29104248 31740101
37357 31740101 34789758 38459528 42120212 44577462 45701615 46800876 49076774 52483311
37349 52483311 56347029 60347140 64588798 69400988 75357235 82830685 91227943 99329512
37341 99329512 106715694 114204007 122617417 132007977 142600452 155482838 171327253 189051941
37333 189051941 206952352 224952362 244603839 266768955 290294622 313259365 334628681
37326C34628681J9464842J6758277J2446035O592922J12329n994767j1174249
37319C72834070j5395629j8896650k1740387k3576592k3939983k2775054k0577184
37312B25932591j8066778j5818366j4120119j3013046j2393868j2079618j1776725
37305A28664071j1108528r890667q414478p250198o651841o297265n729097m917013
37297F8404984m226618l908787l802762l580154l159641k760261k553510k411954
37289D2001297k132575j808607j737013j942066k053160j762748j188920o80008
37281B8696200m81119o66690j101169j373443j163321q09063r89008j590305j566970
37272A8955112m41858P20596O39279m05694j086307r50785p08939p48518o10419
$$ plain form
37326 334628681 354093523 370851800 383297835 389890757 390003086 384008319 372834070
37319 372834070 357438441 338541791 316801404 293224812 269284829 246509775 225932591
37312 225932591 207865813 192047447 177927328 164914282 152520414 140440796 128664071
37305 128664071 117555543 107664876 99250398 92000200 85348359 79051094 73321997 68404984
37297 68404984 64178366 60269579 56466817 52886663 49727022 46966761 44413251 42001297
37289 42001297 39868722 38060115 36323102 34381036 32327876 30565128 29376208 28696200
37281 28696200 28215081 27548391 26447222 25073779 23910458 23101395 22112387 20522082 18955112
37272 18955112 18513254 19233850 19873129 19467435 18381128 17430343 16721404 15972886 15362467
37263A5362467j06029K10256N3593j29798j27447l84607r70410j148509o37268
37254A2122248k94957p01483r99111k42916Q40190P51291n12522j403233r70111
37245H589396J08129P75084Q58503P67909P26293P07820O50126M39682r801n77754
37235A3035387j087224j504160j668298j171488q4732N59711j17339j414305j721861
37226D825691o54342N17507P64369N37062O23879Q02351M61630j41353k13426
37217G523368L12377O89736M36735j60482o09056p41725o40225m35701k77687
37208F097340k60887l49658m96590p22426r24597p92887j63681O67939J227335
37199D281888J353121J205308R03178M15402k18150p78184j049207j032824r18508
$$ plain form
37263 15362467 15256438 15466694 15520287 15390489 15263042 14878435 13908025 12759516 12122248
37254 12122248 11827291 11125808 10126697 9883781 10723971 11475262 10962740 9559507 8589396
37245 8589396 8697525 9472609 10331112 11099021 11825314 12533134 13183260 13622942 13613141 13035387
37235 13035387 11948163 10444003 8775705 7604217 7519485 8079196 7961857 6547552 4825691
37226 4825691 4171349 4688856 5453225 5990287 6614166 7416517 7878147 7736794 7523368
37217 7523368 7835745 8525481 8962216 8801734 8192678 7450953 6810728 6375027 6097340
37208 6097340 5836453 5486795 4990205 4267779 3343182 2550295 2386614 3054553 4281888
37199 4281888 5635009 6840317 7743495 8158897 7940747 7162563 6113356 5080532 4162024
37190D162024q03759m89525K26112R77342R69996P7176o25438j30366R65442J166309
37180F495313K88655k28390M25589J140258O57872m73827q98947n60844l79873
37171F465806l55316L63834J598499K003281J165862L36683M25827O38080K3787
37162A2666343p99147p08065j7544N3426n77442p82098j40747M04755R4001o02115
37152I591367r61433j065622j199454r85732j5923J111567J339355O21966k151
37143H433940J10944M46219L18228r9355k72614l12920p28210j353848j330016
37134E212368l21807Q72124J310248J077330R88679J367900J654466J250660L48090
37125A3760058k71185q1533O69920J259150J279695J095721J341754J997628K339634
$$ plain form
37190 4162024 3358265 2868740 3094852 4072194 5042190 5119366 4493928 4363562 5329004 6495313
37180 6495313 6783968 6555578 6981167 8121425 8779297 8305470 7406523 6845679 6465806
37171 6465806 6110490 6474324 8072823 10076104 11241966 11578649 12004476 12642556 12666343
37162 12666343 11867196 11159131 11141587 11195013 10617571 9835473 9694726 10099481 10193482 9591367
37152 9591367 8629934 7564312 6364858 5379126 5363203 6474770 7814125 8436091 8433940
37143 8433940 8544884 8991103 9309331 9209976 8937362 8624442 7896232 6542384 5212368
37134 5212368 4890561 5762685 7072933 8150263 9138942 10506842 12161308 13411968 13760058
37125 13760058 13488873 13407340 14077260 15336410 16616105 17711826 19053580 21051208 23390842
37116B3390842J985687J524998J682883K273188K619111K718721L161857L974478
37108D3331765M480918M473858M574533N048712N182640M450199L487627L090301
37100G8120553K875378J891187J35720j511152k616155l483585m250489m659246
37092F6502211m740070m821651m806865m301612l512263l100384l081836k891397
37084C5246133k643516l078831l916988l686886j967619m54839o52636j641539
37076A7203279j582181n61737k09807r20713j323501o32184J57696p0027j010166
37067A1050659j670051j610609q91584K66099J167428R02229l75233j199275n79862
37058G059801O19457Q77609L0381p73628p53128k55562K5366j32667m67683n71276
$$ plain form
37116 23390842 25376529 26901527 28584410 30857598 33476709 36195430 39357287 43331765
37108 43331765 47812683 52286541 56861074 61909786 67092426 71542625 75030252 78120553
37100 78120553 80995931 82887118 83022838 81511686 78895531 75411946 71161457 66502211
37092 66502211 61762141 56940490 52133625 47832013 44319750 41219366 38137530 35246133
37084 35246133 32602617 29523786 25606798 21919912 19952293 19497454 18844818 17203279
37076 17203279 15621098 15059361 14849554 13928841 12605340 11973156 12130852 12060825 11050659
37067 11050659 9380608 7769999 6878415 7144514 8311942 9214171 8838938 7639663 7059801
37058 7059801 7679258 8556867 8587248 7813620 7060492 6804930 6830296 6697629 6229946 5658670
37048E658670k43349K44317M05245K00272O8022J52489R3837j62020j28223K06638
37038F495898M3735q31390j284626m98836M97410L25321m63987k95956O92158
37029D679727Q13572k29143o54045N32156J859295J632880L20442n47618o42898
37020G764368o37723o72247m62836l25954p07646j072824n52958N22625R41610
37011D796415L60050l43576m42796j10595K19934L47106J35320l23857m30519
37002D207482K13222R11490O25817m44783j062413p44967k36609l9578K80586
36993C710247R01945J070290L40170m83500m91909j6480L8316l70362n38767j85422
36983C974528L14012O34109P41816N84418J37736l23780m74085l60908k50359
$$ plain form
37048 5658670 5415321 5659638 6064883 6265155 6333177 6485666 6579503 6417483 6289260 6495898
37038 6495898 6539633 5708243 4423617 3924781 4422191 4747512 4283525 3987569 4679727
37029 4679727 5493299 5264156 4610111 5142267 7001562 8634442 8954884 8407266 7764368
37020 7764368 7126645 6454398 5991562 5665608 4957962 3885138 3332180 3854805 4796415
37011 4796415 5156465 4812889 4370093 4259498 4479432 4826538 4961858 4638001 4207482
37002 4207482 4420704 5332194 5958011 5513228 4450815 3705848 3469239 3429661 3710247
36993 3710247 4612192 5682482 6022652 5539152 5047243 5030763 5069079 4698717 4159950 3974528
36983 3974528 4288540 4922649 5664465 6248883 6386619 6062839 5588754 5227846 4977487
36974D977487k27817k32152k14755r347N70945J227614J283996O86439L02752
36965H365162O85942J172241R29547K95618J48509M49456N32878N31391J223447
36956A4334191K455867L005776K342161J417443J223019J515969J583814J465566
36948B9343806J692592K379534L241981M099606M796072N038518M909286N171036
36940F0672431O428838Q252943R771214J0961836J2705454J5574405J9156499
36933A43523620K2678481K5799486K8526195L0549843L0796756K7594321J9567501
36926C29036203O983403p527739j9995467k7488607k9840169k9090664k7295119
36919A94781841k5019599k1928305j8291524j5198411j3239854j1766703r980701
$$ plain form
36974 4977487 4749670 4517518 4302763 4293416 4864361 6091975 7375971 8062410 8365162
36965 8365162 9051104 10223345 11152892 11448510 11597019 12046475 12579353 13110744 14334191
36956 14334191 16790058 19795834 22137995 23555438 24778457 26294426 27878240 29343806
36948 29343806 31036398 33415932 36657913 40757519 45553591 50592109 55501395 60672431
36940 60672431 67101269 75354212 85125426 96087262 108792716 124367121 143523620
36933 143523620 166202101 192001587 220527782 251077625 281874381 309468702 329036203
36926 329036203 336019606 328491867 308496400 281007793 251167624 222076960 194781841
36919 194781841 169762242 147833937 129542413 114344002 101104148 89337445 79356744
36912G9356744q186150p176542o764108n968941m647641l807947l944734m090643
36904C4770038l196293j664114o72358n15019n11607k61283r9535l75497j008825
36895B6465507j784063k484018k720640k210359j293518o94960o83894q59807
36887A3734248p77629l84068J40359N27570M18189l04108j112671j238617n98895
36878A0404378P0517J30746k80147o14622o05777l95166k23254j85020j86068
36869H115587p7895J09824J70456M5192q2064j73624m48829q00254n96043L58635
36859F620985J129043P51043k93369o96857k56112q226l80510n46031p0098J40902
36849F390770n85262j272684o61335P37705J266981M62328m93941n92009q5817
$$ plain form
36912 79356744 71170594 63994052 57229944 51261003 46613362 42805415 38860681 34770038
36904 34770038 31573745 29909631 29237273 28722254 28210647 27949364 27849829 27474332 26465507
36895 26465507 24681444 22197426 19476786 17266427 15972909 15277949 14594055 13734248
36887 13734248 12956619 12572551 12712910 13240480 13658669 13354561 12241890 11003273 10404378
36878 10404378 10474895 10605641 10325494 9710872 9105095 8709929 8486675 8301655 8115587
36869 8115587 8037692 8147516 8317972 8363164 8281100 8107476 7658647 6858393 6262350 6620985
36859 6620985 7750028 8501071 8207702 7510845 7254733 7246507 6865997 6319966 6249868 6390770
36849 6390770 5805508 4532824 3871489 4609194 5876175 6338503 5844562 5252553 5166736
36840E166736M04366Q02335J158302J164044O63769R5944j23404k58257p49559
36831H324276j334922j277152m38576L96105M38396k03933p77337q12541n08209
36822C806107k73089k29194k66654l17084l75658m24474n08705p11200q85428
36813a85379o71693k4913N78153P89169Q68801J042914Q46249j05433j056528
36804B081340r05595M2191L40434m11229r59385m48715K64318J90035j37019K27002
36794B83377Q29802N71190l31577o18474J693M95358J79251m40694o41400l00614
36784B7912L73090J051208J190206N86297r886K54732R56740R11805J2565o39671
36774D714998n02892j92073q9993K31518P27481M40404q55480j806241j269162
$$ plain form
36840 5166736 5571102 6373437 7531739 8695783 9359552 9455496 9332092 9073835 8324276
36831 8324276 6989354 5712202 5273626 5669731 6108127 5904194 5126857 4314316 3806107
36822 3806107 3533018 3303824 3037170 2720086 2344428 1919954 1411249 700049 -185379
36813 -185379 -857072 -881985 -303832 485337 1354138 2397052 3243301 3137868 2081340
36804 2081340 1175745 1217936 1558370 1147141 187756 -260959 3359 193394 56375 283377
36794 283377 1113179 1684369 1352792 734318 736011 1231369 1410620 969926 328526 27912
36784 27912 401002 1452210 2642416 3228713 3218827 3473559 4430299 5342104 5354669 4714998
36774 4714998 4212106 4020033 3930040 4161558 4889039 5329443 4473963 2667722 1398560
36765A398560K8203O38088L67903N1394M9711R9837J64747L61391L66952j43147
36755C383639p11042o08174P0873N74800N45374K44769L270M3470M91562R60432
36745D998973O17080o17901j506323j020302J03578L91335k35536n56614p318
36736B166972P30637J022878R55237O68682J55454k03010R254K94539k01316j125364
36726D473963j204363k71249M11785K25285P7800N72432Q18019R7453o21650j73459
36716D406016Q28158R65716K86779J06290R15886J899957K394359K532974K424159
36707A6760294J883646J172688R60283J274030J364038Q72820L05955K5206m01907
36698B4217053j351979k286295k342637j457363m39394j01411n78229j316403
$$ plain form
36765 1398560 1426763 2064851 2432754 2484148 2533859 2633696 2798443 3159834 3526786 3383639
36755 3383639 2672597 2064423 2135296 2710096 3255470 3500239 3503509 3546979 4038541 4998973
36745 4998973 5616053 4998152 3491829 2471527 2575105 2966440 2730904 2174290 2166972
36736 2166972 2897609 3920487 4875724 5544406 5699860 5496850 5506104 5800643 5599327 4473963
36726 4473963 3269600 2998351 3410136 3635421 3713221 4285653 5103672 5201125 4579475 4406016
36716 4406016 5234174 6199890 6486669 6592959 7508845 9408802 11803161 14336135 16760294
36707 16760294 18643940 19816628 20776911 22050941 23414979 24287799 24593754 24618960 24217053
36698 24217053 22865074 20578779 18236142 16778779 16339385 16237974 15659745 14343342
36690A4343342j563944j065849l66177j92128n40923p43821m67688j65634l42778
36681H894400q32653j110838r74027n77465q8400L40856M74039K44555m977J18764
36671F484254M89776N36096p0677r75837j448769j066289j04551P05759Q46282
36662E396044M35183n5545l79775n92897o65043m61593k01834m27872j176841
36653A869827j616788j042943M0742M98663J24645j46421K59409O80834L79787
36644A047755j38072J29354R68172J098197J37183o90875l39199N19965O19257
36635C351737O0878l1681M96162N67324k28799q15610l28014M84512M73958j36536
36625C893931l22142l3997j44753q25647j220703q25183q1746N96425J309299
$$ plain form
36690 14343342 12779398 11713549 11347372 11155244 10614321 9870500 9402812 9237178 8894400
36681 8894400 8061747 6950909 5976882 5399417 5311017 5651873 6125912 6370467 6365490 6484254
36671 6484254 6974030 7510126 7439449 6463612 5014843 3948554 3844003 4549762 5396044
36662 5396044 5831227 5775682 5395907 4803010 4137967 3676374 3474540 3046668 1869827
36653 1869827 253039 -789904 -749162 -250499 -125854 -272275 -12866 667968 1047755
36644 1047755 909683 1039037 2007209 3105406 3242589 2551714 2212515 2732480 3351737
36635 3351737 3412615 3380934 3877096 4444420 4215621 3400011 3071997 3556509 4030467 3893931
36625 3893931 3571789 3537792 3393039 2567392 1346689 521506 439760 1036185 2345484
36616B345484J839285J463329K23637o08393j96723N23495J89700q96613j218771
36607C664430l47919M41394M6141j011029j482963j035586l69536o6374Q1183
36598h0259N56816J285581J567420R13018k20020q56272o76971k89494j56037
36589B043782Q3757P21511J104271N54361l01741k84084M27841M37137o44179
36580D142656j471388j037869k09007k38247p50929m53349P21006J482317J055152
36571C240342N6848n71268n95297k83954P3488K27046J12512O9243M16557Q18482
36561C563999O69209R9821j30785J41377J71153m78150j139597r56639n3953P15039
36551B601474Q02787K99206m30791r85894j045282o46645j95573M0425K03171
$$ plain form
36616 2345484 4184769 5648098 5871735 5263342 5066619 5590114 5779814 4883201 3664430
36607 3664430 3316511 3757905 3804046 2793017 1310054 274468 -95068 -161442 -80259
36598 -80259 476557 1762138 3329558 4242576 4022556 3166284 2489313 2199819 2043782
36589 2043782 2127539 2849050 3953321 4507682 4205941 3921857 4349698 4786835 4142656
36580 4142656 2671268 1633399 1424392 1186145 435216 -18133 702873 2185190 3240342
36571 3240342 3297190 2725922 2130625 1846671 1920159 2147205 2259717 2328960 2745517 3563999
36561 3563999 4233208 4333029 4202244 4343621 4514774 4036624 2897027 1940388 1886435 2601474
36551 2601474 3404261 3703467 3272676 2286782 1241500 594855 399282 439707 642878
36542F42878M18459M82710K75372Q9594J59009K13457m0621l20308j78781K11314
36532A953083K53081k02796p03519q74258p78021n81090k84898J25692N66007
36523e26719R31357J096229R12238M30621j7692k31283m34902q29665j064572
36514B65612o22960L67049J166847J243912O87592q7359o46371o71160k58143
36505A445019J3255k31019n58269l56853J39946J93171j90586k50288J96074L84204
36495G84654r2945n44539k95513K64362M31795L13068M00408N63915L59392j2231
36485B172366J6739L19258K16838l27237n74975k57209q5249n97680j186416q94644
36475a198209J91600R90107P85530M1446k67726J84474Q08326Q75603L33751k36268
$$ plain form
36542 642878 1061337 1544047 1819419 1909013 2068022 2281479 2240858 1920550 1741769 1953083
36532 1953083 2206164 2003368 1299849 425591 -352430 -933520 -1218418 -1092726 -526719
36523 -526719 404638 1500867 2413105 2843726 2826034 2594751 2159849 1330184 265612
36514 265612 -357348 9701 1176548 2420460 3108052 3020693 2374322 1703162 1445019
36505 1445019 1458274 1227255 668986 312133 452079 645250 454664 204376 400450 784654
36495 784654 691709 147170 -148343 116019 547814 860882 1261290 1825205 2184597 2172366
36485 2172366 2189105 2508363 2725201 2397964 1822989 1565780 1480531 882851 -303565 -1198209
36475 -1198209 -1006609 -16502 769028 810474 542748 727222 1535548 2411151 2744902 2508634
36465B508634l27090K1745M07216M71624R9956m92120p53703k38077P05977J058830
36455C462992L70920m50301k29160P72045J074324P7381r54976o20286N76258
36446D079197Q79961k21368j278078r78901J1404J32432p58447j279466o48822
36437f2088K62549M30319K02497M61433R63911O94909l37660q78203k25534P66476
36427B278609R68505M30066n6747j76089j38243k646K43277K33141l27801r07988
36417B544084o74653K19754P12267L80750Q9316O16682J331604J003935l75683
36408E848056j422825j098296N3372P38568M88629j27324n60156q17972q99925
36399B202127m78431L93420Q45747J79785r97075j373410n67559N68923J237159
$$ plain form
36465 2508634 2181544 2203289 2610505 3082129 3182085 2689965 1936262 1698185 2404162 3462992
36455 3462992 3833912 3383611 3154451 3926496 5000820 5078201 4123225 3502939 4079197
36446 4079197 4959158 4737790 3459712 2480811 2492215 2624647 1866200 586734 -62088
36437 -62088 200461 630780 833277 1294710 2258621 2953530 2615870 1737667 1512133 2278609
36427 2278609 3247114 3677180 3620433 3444344 3306101 3303455 3546732 3779873 3452072 2544084
36417 2544084 1869431 2089185 2801452 3182202 3271518 3888200 5219804 6223739 5848056
36408 5848056 4425231 3326935 3380307 4118875 4607504 4480180 3920024 3102052 2202127
36399 2202127 1723696 2117116 2962863 3142648 2145573 772163 204604 773527 2010686
36390B010686J447542J371620Q47737o1734p75280r57777r64666j054537q17646
36381A045945K9021Q93607J046390O11888J59011k01926n89791p13921l09492
36372A970732J60413R7445k29380j17652L98512O72604N04882K14824j01601m82750
36362C088029n31886N4719O14999K86938n12938n93705R6366M02405r3401m87958
36352B323568k41811k2418l01858m38935P8437O10224M17678k01349n98985p19868
36342I04683o52755j72557N13098N15586l83357j057619o38167J24089J24839
36333g22160l46008l04395K27797M90470L84019L64240M07407K49860J87675M70809
36323A409714M28837n15643j478087j194879n5941M99622K90996L64754P97996
$$ plain form
36390 2010686 3458228 4829848 5677585 5615851 4840571 3882794 2918128 1863591 1045945
36381 1045945 1074966 1968573 3014963 3626851 3785862 3583936 2994145 2280224 1970732
36372 1970732 2131145 2228590 1999210 1881558 2280070 2952674 3457556 3672380 3570779 3088029
36362 3088029 2556143 2610862 3225861 3512799 2999861 2406156 2502522 2904927 2811526 2323568
36352 2323568 2081757 2059339 1757481 1318546 1396983 2007207 2424885 2223536 1624551 904683
36342 904683 251928 79371 592469 1108055 724698 -332921 -971088 -846999 -722160
36333 -722160 -1068168 -1372563 -1144766 -654296 -270277 93963 501370 751230 938905 1409714
36323 1409714 1838551 1322908 -155179 -1350058 -1405999 -906377 -615381 -250627 547369
36314E47369M67382p25528j297777m91887N27113O00854K32215L58773P60833
36305I79347P77413N78351O21179O42979K24784k90077l72847k31455l20911m88769
36295B119994l88173j76833n4359K80699R21525J156183M80983l91232m99937
36286C448850n2934J54306J74253N52741R66517N92894l08925n60059J12651O93888
36276E774182N23860Q0532k02120o33416j240165j245312l75919L17549p9989
36267B919202q71215q15148o4802K02211k33844l73074K04399N80961M3515o84072
36257I08133n58853J67255M37075J03658P0632P02314J136702O02039m00860q93458
36247B274637q15786p94508q50622l48383P04719J291000P56994j95963n18742
$$ plain form
36314 547369 1014751 289223 -1008554 -1500441 -973328 -372474 -140259 218514 979347
36305 979347 1756760 2335111 2956290 3599269 3824053 3533976 3161129 2929674 2608763 2119994
36295 2119994 1731821 1554988 1500629 1781328 2702853 3859036 4340019 3948787 3448850
36286 3448850 3395916 3550222 3724475 4277216 5243733 5836627 5527702 4967643 5080294 5774182
36276 5774182 6298042 6378574 6176454 5543038 4302873 3057561 2681642 2999191 2919202
36267 2919202 2047987 1232839 1168037 1370248 1136404 763330 967729 1548690 1592205 908133
36257 908133 349280 516535 953610 1057268 1127900 1830214 2966916 3568955 3168095 2274637
36247 2274637 1458851 664343 -186279 -534662 170057 1461057 2218051 2022088 1503346
36238A503346k67749k96491q09038j062659n13146M68457J192477J383134J101344
36229B699675M74962j77367m05721j92770p9732l16984k98960N26352J471605
36220C701060J217497l03330j529214j242260j72363J21939n57554r92284m91702
36211b48211K49966M62964L70164L79790J82429m69102q35415j63808Q84500J014637
36201A827914K77216p4603K76889K20746p02296j233008l48625R47173J064190
36192B255596J86596k52260P8620J61602l96484p41926m26466k41846p51287j164909
36182a292764n70983N62103J083305P79163L37331J02026j23392k35966J47414
36173G88237P46347O65889k73947j045752p31191K63995Q40771N95327Q427m11724
$$ plain form
36238 1503346 1235597 939106 130068 -932591 -1445737 -977280 215197 1598331 2699675
36229 2699675 3174637 2997270 2591549 2398779 2319047 2002063 1703103 2229455 3701060
36220 3701060 4918557 4615227 3086013 1843753 1671390 1793329 1235775 243491 -248211
36211 -248211 1755 464719 834883 1214673 1397102 928000 92585 -71223 813277 1827914
36201 1827914 2105130 2030527 2307416 2528162 1825866 592858 244233 1191406 2255596
36192 2255596 2442192 2189932 2268552 2430154 2033670 1291744 865278 623432 -127855 -1292764
36182 -1292764 -1863747 -1301644 -218339 560824 898155 1000181 876789 640823 788237
36173 788237 1534584 2200473 1926526 880774 149583 413578 1254349 1849676 1858103 1446379
36163A446379n57999m80855k97818k60348m22401l92209M4850K94616k58433r66234
36153a850452n07822J022295J829604Q80120m91536n16485L79188L75312p66940
36144C53284j269036q4022J488760J667708N38592l83332k40126M29706O94675
36135C196209K30707n75007j056483q66083l41933j08815k74991l93408k33719
36126d23523m4355L8101J86511L24423Q9415m04033n33321j97905m6385l08857
36116a319929l29228K50249Q17558Q96767Q78663R46575M62933o22975j017147
36107I63466q367J040991O81944k64660k00253M08462m5620j213526j216667J6008
36097A61778N61859o6053q3154J185404J802829M43072j282697j418033n40708
$$ plain form
36163 1446379 888380 407525 109707 -150641 -573042 -965251 -920401 -625785 -884218 -1850452
36153 -1850452 -2358274 -1335979 493625 1373745 882209 365724 744912 1120224 353284
36144 353284 -915752 -999774 488986 2156694 2695286 2311954 2071828 2501534 3196209
36135 3196209 3426916 2851909 1795426 929343 587410 478595 203604 -189804 -423523
36126 -423523 -467878 -429777 -243266 81157 170572 -233461 -766782 -964687 -1011072 -1319929
36116 -1319929 -1649157 -1398908 -581350 315417 1194080 2140655 2603588 1980613 963466
36107 963466 955099 1996090 2678034 2413374 2213121 2621583 2575963 1362437 145770 161778
36097 161778 723637 657584 574430 1759834 3562663 4005735 2723038 1305005 764297
36088G64297j82149j76254L11764O28091j79280j139162o94482N51658P97856
36079F82339J43078K26725J078093R74423l63591j040022j56912O38337q5838
36070B096632j221341j008116K44740Q85643L82733l84818o70874m55831Q9157
36061d2075O91328Q24036L10534j93278k8588M72369N09143J1265m00900m16644
36051A737190k96861k66203k66827k61423k60990r2766M02038R57604J072579
36042B724341O47122J44891O6670M08544O60428L46833l52742o87191l28695k9364
36032C600837o56432j713625j765230n15179N96340M10363l51214l52281L64145
36023c82276P70810O17266M98643M97286J29284l85453j72650P09027J006848
$$ plain form
36088 764297 582148 405894 717658 1345749 1166469 27307 -667175 -115517 682339
36079 682339 825417 1052142 2130235 3104658 2741067 1701045 1544133 2182470 2096632
36070 2096632 875291 -132825 111915 997558 1380291 995473 324599 -131232 -42075
36061 -42075 649253 1473289 1783823 1590545 1561957 2034326 2543469 2554734 2153834 1737190
36051 1737190 1440329 1174126 907299 645876 384886 292120 694158 1651762 2724341
36042 2724341 3371463 3516354 3583024 3991568 4651996 4998829 4646087 3958896 3630201 3600837
36032 3600837 2944405 1230780 -534450 -1049629 -453289 -42926 -394140 -746421 -382276
36023 -382276 388534 1005800 1504443 2001729 2131013 1745560 1572910 2281937 3288785
36014C288785J26381q71873q50798k30851j41982o51365q93646n91448l70155
36005a186952n76610o99176k01098P02957J384386J483779J024485K08195o20418
35996A519548j025818p79557q4891N86960Q61175O99701M02404L39687N43720
35987C062929O17008K24536l95699o70881m15848j4891J49909J12616N3660k8351
35977B694988j50689j52762M4256K19008J85759J11565J53060L8885m90470j011360
35967A642240q31883q5414K81213j76678p46725n93646J21529O55002P33221N86925
35957A585784L13838p3032j87373L50247J100308J123619K32146p34677j032921
35948B677939p68135l42762J34894N36561M86984k4192l32302K6470N56502N24132
$$ plain form
36014 3288785 3415166 2543293 1692495 1461644 1319662 668297 -225349 -816797 -1186952
36005 -1186952 -1763562 -2462738 -2663836 -1960879 -576493 907286 1931771 2139966 1519548
35996 1519548 493730 -285827 -370718 216242 1077417 1777118 2179522 2519209 3062929
35987 3062929 3679937 3904473 3508774 2837893 2422045 2407154 2557063 2669679 2723339 2694988
35977 2694988 2544299 2391537 2435793 2654801 2840560 2952125 3105185 3144070 2653600 1642240
35967 1642240 810357 724943 1006156 829478 82753 -510893 -389364 265638 998859 1585784
35957 1585784 1899622 1826590 1639217 1989464 3089772 4213391 4445537 3710860 2677939
35948 2677939 1909804 1567042 1701936 2238497 2725481 2701289 2368987 2395457 2951959 3476091
35938C476091P1339q2325J73437J79445m79642j392890j814143j318580k9692
35929a216960J362375J906562J235917Q2266n09576l68373q4643M8845J88538
35920B644951J47500n07014j359257j239599M8037J075002O52226m69259p32833
35911B59754K9365O84725O75574N09740M58749J03641n32893o21788J20481P15002
35901B402350L03910n50855q03358m91503l48060l07983L60804J476139J721909
35892C763353M45874j217770j648002o16623O99844J195734P72643P6610j56334
35883C315329L58723J099914J059704j04255j371901j393398k05380P37242M22045
35874C918023m88907p14076r4845L94029J31423m12995n44780l21085k75925n18892
$$ plain form
35938 3476091 3547430 3465105 3638542 3817987 3338345 1945455 131312 -1187268 -1216960
35929 -1216960 145415 2051977 3287894 3370160 2860584 2492211 2407568 2456413 2644951
35920 2644951 2792451 2285437 926180 -313419 -265382 809620 1461846 992587 259754
35911 259754 289119 973844 1649418 2159158 2617907 2721548 2188655 1566867 1687348 2402350
35901 2402350 2706260 2155405 1352047 860544 512484 204501 565305 2041444 3763353
35892 3763353 4209227 2991457 1343455 726832 1426676 2622410 3395053 3471663 3315329
35883 3315329 3674052 4773966 5833670 5729415 4357514 2964116 2758736 3495978 3918023
35874 3918023 3429116 2715040 2620195 3014224 3145647 2732652 2187872 1866787 1590862 1071970
35864A071970n91938j94006L38667M69460J96802O4960L84950P09748L81472m86105
35854B345980r93599n87230J85294M14009L5640k29039m0358J08794k05413n70437
35844D63641l28771L92962P73592L50253m39450q39366o14578j81981m4255k23710
35834f91663k92610L2970M56829M73428J12748o1738K06841M79132L41236O5095
35824A122268Q6003J86577j74515r02554j285704r37999j44305O91363J308194
35815e0672J324857M94455o03930q89989j10928Q24873J133216J006866P92355
35806C921103K18480q42007j632300j472085q82427p51709q51847l21170O77834
35797a936128J050970N06116l1924N8364K85136R2172l04759n54888p09012o55767
$$ plain form
35864 1071970 480032 286026 624693 1094153 1290955 1355915 1740865 2450613 2832085 2345980
35854 2345980 1352381 765151 950445 1364454 1400094 1171055 1130697 1239491 1034078 463641
35844 463641 134870 527832 1301424 1651677 1212227 372861 -241717 -423698 -467953 -691663
35834 -691663 -984273 -951303 -494474 -21046 91702 29964 236805 715937 1057173 1122268
35824 1122268 1208271 1394848 1220333 317779 -967925 -1905924 -2050229 -1358866 -50672
35815 -50672 1274185 1768640 1164710 274721 163793 988666 2121882 3128748 3921103
35806 3921103 4139583 3297576 1665276 193191 -689236 -1440945 -2292792 -2613962 -1936128
35797 -1936128 -885158 -379042 -410966 -352602 -67466 24706 -280053 -834941 -1543953 -2199720
35787b199720M9088J207365J702236R14806k91911p28990l96588j08823j73008
35778b5545k36094m1837L50941P57073P68122Q636r92670r53283L97689J534882
35768A567914J104538j43196o31823l84995n53531j045247o04619P29544J261624
35759A300209K67448q11324o53479L9852N8201k30596K56694J212680J216070
35750B655755j42751j617899j851495q06670M03062O94954Q4536k94544M12073
35741d62979J380304R44274r32483k165681j253134O14710J255486M52981j66019
35732c32541K79055R41817Q18268J9106p40995r74212n47878K54809P07967L57774
35722G83170k58532k91606J77688M07170L31190N73431J097888R98302l0197j005226
$$ plain form
35787 -2199720 -2150632 -943267 758969 1673775 1381864 652874 256286 147463 -25545
35778 -25545 -261639 -303476 47465 804538 1572660 1581296 588626 -364657 33032 1567914
35768 1567914 2672452 2529256 1897433 1512438 958907 -86340 -690959 38585 1300209
35759 1300209 1567657 756333 102854 142706 200907 -29689 227005 1439685 2655755
35750 2655755 2513004 895105 -956390 -1763060 -1359998 -665044 -580508 -875052 -462979
35741 -462979 917325 1861599 929116 -1236565 -2489699 -1874989 -619503 -166522 -332541
35732 -332541 -53486 888331 1706599 1725705 984710 10498 -537380 -282571 425396 783170
35722 783170 524638 233032 410720 817890 1149080 1722511 2820399 3818701 3788504 2783278
35712B783278r51604j44053M28146K81814k60202n51328j73555O03189R07319
35703B923004L04833m32097l38600K20032J29108n17837m81935M13492P75913
35694B995913k5704o64275n8026P27719K65494p51878o38418M27858O73176l56482
35684B595377j075881l35068J020853J612294J227917M29902m33001j077142j020066
35675B945185k50949M20552L23847k48794o59511p78838o83974j58547P48206
35666A657177J196576N34454m91559n27651M17959Q64571N259j067314r66374
35657A623098k9328L21897j68144k75394N86158J202776L16837j333106j875976
35648C68818q34362M16842P11722M04186K52296J15879m52188j086983j032126
$$ plain form
35712 2783278 1831674 1687621 2115767 2397581 2137379 1586051 1412496 2015685 2923004
35703 2923004 3227837 2795740 2457140 2677172 2806280 2288443 1806508 2220000 2995913
35694 2995913 2970209 2305934 2247908 2975627 3241121 2489243 1850825 2278683 2951859 2595377
35684 2595377 1519496 1184428 2205281 3817575 5045492 5475394 5042393 3965251 2945185
35675 2945185 2694236 3114788 3438635 3189841 2530330 1751492 1067518 908971 1657177
35666 1657177 2853753 3388207 2896648 2368997 2786956 3651527 3656786 2589472 1623098
35657 1623098 1593770 1915667 1747523 1472129 2058287 3261063 3577900 2244794 368818
35648 368818 -465544 -48702 663020 1067206 1319502 1435381 983193 -103790 -1135916
35639a135916l08273L61931N89300N63944M34011J63602l9818J56742O00877P45024
35629B131424M44493J38722J05614L6540m04344r64465j052722m80669K29842
35620A84435L22263l62260j078393r47825m4723O94036P24730M63946L49190J18181
35610D23580l85139m76637L44509J226119R75132j10665o74424l93413k66003
35601F63059p19358q73672j39113P57588J018820R38529J028032R43909K19818
35592C837612o56323q47794l67424J34848L48256L33486K1410n61482r32924p40048
35582E69617l70404l09694k84673J93037P79758O61511k04719j001594j127874
35573a095035o93952m7214N45774Q29387P69512P26380Q85818P69243m2029r91613
$$ plain form
35639 -1135916 -1444189 -1082258 -492958 70986 504997 668599 628781 785523 1386400 2131424
35629 2131424 2575917 2714639 2820253 2856793 2452449 1487984 435262 -45407 184435
35620 184435 506698 144438 -933955 -1881780 -1926503 -1232467 -507737 -43791 305399 423580
35610 423580 38441 -438196 -93687 1132432 2107564 1996899 1322475 929062 663059
35601 663059 -56299 -929971 -1069084 -311496 707324 1645853 2673885 3617794 3837612
35592 3837612 3181289 2333495 1966071 2100919 2449175 2782661 2804071 2242589 1309665 569617
35582 569617 199213 -110481 -395154 -202117 577641 1239152 1034433 32839 -1095035
35573 -1095035 -1788987 -1836201 -1290427 -461040 308472 1034852 1920670 2689913 2647884 1656271
35563A656271j190151p80454p10658j167068j241664l85143P09392J067059N91533
35554a450883j13425n18384m18929R8627O13383O71074L44755J32035K02900K17913
35544b20934k0623k85341m11902m79724l65152K06385R21549R23010o95r21559
35534f54986r55102l63094L9534K1153j26095k83603m38535k83854L66294R75304
35524a702984Q24610P2933l78396o9743N53547Q88923Q27704N56087J99572j55112
35514A617141m23156o16953p13296m73862J95051P44438M28515n83968j141245
35505i67335n43756M36411N40237k71921p98863k68337O69495R01712K68680m54822
35495d88499o76833n27109l69620l13092k93091k09367J43048Q69549J546208
$$ plain form
35563 1656271 466120 -314334 -1024992 -2192060 -3433724 -3818867 -3109475 -2042416 -1450883
35554 -1450883 -1564308 -2082692 -2501621 -2402994 -1789611 -1118537 -773782 -641747 -438847 -220934
35544 -220934 -241557 -526898 -938800 -1418524 -1783676 -1577291 -655742 267268 266573 -654986
35534 -654986 -1610088 -1973182 -1933648 -1912495 -2038590 -2322193 -2760728 -3044582 -2678288 -1702984
35524 -1702984 -878374 -805441 -1183837 -1253580 -700033 188890 1016594 1572681 1772253 1617141
35514 1617141 1193985 577032 -136264 -610126 -415075 329363 757878 173910 -967335
35505 -967335 -1511091 -1074680 -534443 -806364 -1605227 -1873564 -1204069 -302357 -33677 -488499
35495 -488499 -1165332 -1692441 -2062061 -2375153 -2668244 -2877611 -2734563 -1865014 -318806
35486c18806J446902M81948m92449o52242j39700L46462N02823M74663L07894
35477A957495m1128l55461l99908l35308l36997p8115O91162J313772R07599k01312
35467C121799p43277l04844J82164J5677k94470j19650K09093J15257k33076l95338
35457A553335m64126o70273p66517n14114k34483j95651m0600M55240P11895K73308
35447A08014k47096j26394J96890m5211m34649o8798O30018M16001n44694o39747
35437g55666O57548J807917J414608P6870p65943p08241k13090M26320R46294
35428B886617P28552l51822j236594q80153K50311Q31662N01926J6574j73513
35419B573560l97021p94412r29074o39477m12907n28671n56608j61648K36826
$$ plain form
35486 -318806 1128096 1610044 1117595 465353 325653 672115 1174938 1649601 1957495
35477 1957495 1916367 1560906 1160998 825690 488693 410578 1101740 2415512 3323111 3121799
35467 3121799 2378522 2073678 2255842 2271519 1977049 1857399 2066492 2181749 1948673 1553335
35457 1553335 1089209 418936 -347581 -861695 -1096178 -1291829 -1332429 -877189 -165294 108014
35447 108014 -139082 -265476 -68586 -113797 -548446 -617244 12774 428775 -115919 -755666
35437 -755666 -98118 1709799 3124407 3201277 2435334 1727093 1514003 1940323 2886617
35428 2886617 3615169 3263347 2026753 1146600 1396911 2228573 2730499 2747073 2573560
35419 2573560 2176539 1382127 453053 -186424 -599331 -1128002 -1684610 -1846258 -1609432
35410a609432J89076P4587M98186J134035J036000J07808n99075l68404J76697
35401F39478J44089k05560k4728N07957L22270p27137j392869q50160J20032M82346
35391i84282M43438O04729N95466q1529n94384J25215J243973R24782o34385j173314
35381D69709J04132J128946K03399j324272j287496n0596M28502j34604k75264
35372g37544M69705R65532O93977N08687P56794N14462n63525j263559o86301
35363F58228K24863J82089m62511m98582J22817M02176M3440k04374Q2275L99547
35353I49968K66614j04357l67864n69633p72374p15438k45675K96865N08330M75315
35343b78249N49178P61141Q29316O48028L92317J27709l03781q61040j102310
$$ plain form
35410 -1609432 -1420356 -1345769 -847583 286452 1322452 1430260 831185 462781 639478
35401 639478 783567 578007 553279 1061236 1383506 656369 -736500 -1586660 -1466628 -984282
35391 -984282 -540844 63885 659351 577822 -16562 108653 1352626 2277408 1643023 469709
35381 469709 573841 1702787 1906186 581914 -705582 -756178 -327676 -462280 -737544
35372 -737544 -267839 697693 1391670 1900357 2657151 3171613 2608088 1344529 658228
35363 658228 883091 1065180 602669 104087 226904 629080 672520 468146 550421 949968
35353 949968 1216582 1112225 744361 174728 -597646 -1313084 -1558759 -1261894 -753564 -278249
35343 -278249 270929 1032070 1861386 2509414 2901731 3029440 2725659 1864619 762309
35334G62309p02729K2074M43651L62903P7984j84527m24081m44364J04051R95645
35324A012916J330571O48404k98453m65802J11946N13215K51155l16571p64490
35315B022891r76089p23081K47639J427539J657812N41606q30722j113836k46475
35306B007284P49441J122196R46693N69527J43806k60174n43697p07077q61488
35297C166511j059891j209407j096214m99401M73670J138076P57947m56487j332328
35288a17524j062915j18408N79872Q64110J056200J009226L89077l04222j23976
35279B171440P71488J043446P8805j023792j068073n05786n78059j269879j336800
35270a717210k91178Q16822R62541N58370O37022J193628J172546L4063j335000
$$ plain form
35334 762309 59580 81654 525305 888208 966192 781665 357584 -86780 17271 1012916
35324 1012916 2343487 2991891 2693438 2227636 2339582 2852797 3103952 2787381 2022891
35315 2022891 1046802 323721 571360 1998899 3656711 4198317 3367595 2253759 2007284
35306 2007284 2756725 3878921 4825614 5395141 5538947 5278773 4735076 4027999 3166511
35297 3166511 2106620 897213 -199001 -698402 -224732 913344 1671291 1214804 -117524
35288 -117524 -1180439 -1298847 -718975 145135 1201335 2210561 2599638 2295416 2171440
35279 2171440 2942928 3986374 4065179 3041387 1973314 1467528 889469 -380410 -1717210
35270 -1717210 -2008388 -1191566 -229025 329345 966367 2159995 3332541 3366604 2031604
35261B031604j563304l76184J067415J430586N95486l78355o14195l57912l39285
35252A495856n88633m80225J42110N93949L48691j75629k43202K05843O44828
35243A943588P21889M69973M1349k76991n8810O84567J168057P36599q3026k22047
35233E125148L11887L84458n28230j501156j503576p69453k08800p7618O0745
35224A293405M58636R19847J134080P81426l19029j635640j974371q48258N59327
35215C69423O79665l65009r14680n9656J159863J199081o7431j395686j726602
35206a121032j143564l90800J16635N74671J158435J450052R26248l7035l15420
35197A218190M79126J302515J053118Q7938m28996k67929k29471o67281r62675
$$ plain form
35261 2031604 468300 92116 1159531 2590117 3185603 2807248 2193053 1835141 1495856
35252 1495856 907223 426998 569108 1163057 1511748 1336119 1092917 1298760 1943588
35243 1943588 2665477 3135450 3176799 2899808 2840998 3525565 4693622 5430221 5347195 5125148
35233 5125148 5437035 5821493 5293263 3792107 2288531 1519078 1310278 1232660 1293405
35224 1293405 1752041 2671888 3805968 4587394 4268365 2632725 658354 -189904 369423
35215 369423 1049088 684079 -230601 -290257 869606 2068687 2001256 605570 -1121032
35206 -1121032 -2264596 -2655396 -2538761 -1964090 -805655 644397 1570645 1533610 1218190
35197 1218190 1697316 2999831 4052949 4140887 3711891 3443962 3214491 2547210 1584535
35188A584535o04941Q8652N80053P40576O63332M43159K81699K79745J46805k78752
35178C924863m06917L32062J228833R39821m98416j488705j025352J24317Q05975
35169C936481Q54336N06069l51005j506110k034819j504154p16482m16731j76341
35160a408756N22367J079567P99887K47435K97702N75318K13936m55882m81476
35151A390098q0748k46130q08303n81038N30480J220909Q84032M79433P57358
35142C546091R84874K40142j029301j589742r63494K19394R82393P75108q0264
35133C085201n63662p0083O91192N93281k39761o40042k75174j13825p00687j191835
35123E74605p47378J40364M95760K44553l8351j40112k11879k32371j27394n3678
$$ plain form
35188 1584535 979594 1068246 1648299 2388875 3052207 3495366 3777065 4056810 4203615 3924863
35178 3924863 3517946 3850008 5078841 6018662 5520246 4031541 3006189 3130506 3936481
35169 3936481 4790817 5296886 4945881 3439771 1404952 -99202 -815684 -1232415 -1408756
35160 -1408756 -886389 193178 993065 1240500 1538202 2113520 2327456 1871574 1390098
35151 1390098 1309350 1063220 254917 -326121 204359 1425268 2309300 2788733 3546091
35142 3546091 4530965 4771107 3741806 2152064 1188570 1407964 2390357 3165465 3085201
35133 3085201 2521539 2451456 3142648 3735929 3496168 2856126 2580952 2467127 1766440 574605
35123 574605 -172773 -32409 463351 707904 669553 529441 317562 85191 -42203 -95881
35113i5881p8700L484J63661O712m52900n63066r6702J80089l13814q90171n33342
35102b670630N37568J121081O01329m59026j106193q07200K55661J164684Q95153
35093d67573m40689j358280o85979Q80201J682265J249198O18308O18262Q19462
35084B915175M40604m53579j093959r72857l44507J06335k3632m48466n91984
35075d66870l91755l49160o41252p14717j63520N00882N65276K28151K91254R40885
35065b00826J534959J534987J023215L05852m16056r21587j002499p17196l01128
35056H39721J27607M83159N31638K12951m9399J53257N59830N91010K16966p4773
35046C591967q0107o4968j78808k58096k58641l45271m57265k85347J56661L56552
$$ plain form
35113 -95881 -174581 -171097 -7436 -724 -453624 -1016690 -1113392 -933303 -1247117 -2137288 -2670630
35102 -2670630 -2133062 -1011981 -410652 -869678 -1975871 -2783071 -2527410 -1362726 -467573
35093 -467573 -908262 -2266542 -2952521 -2072320 -390055 859143 1477451 2095713 2915175
35084 2915175 3355779 2902200 1808241 835384 490877 597212 573580 125114 -466870
35075 -466870 -858625 -1207785 -1849037 -2563754 -2727274 -2226392 -1661116 -1432965 -1141711 -200826
35065 -200826 1334133 2869120 3892335 4198187 3782131 2860544 1858045 1140849 839721
35056 839721 967328 1450487 1982125 2195076 2145677 2298934 2858764 3449774 3666740 3591967
35046 3591967 3511860 3446892 3268084 3009988 2751347 2406076 1948811 1663464 1820125 2176677
35036B176677o9983q19055j152770o55862K85342P88085M13391k70227m27507
35027B68091j69936l39385r94685j096251j81001O70988L91972m33690n48921
35018b432818Q9726N96849O98266O79874L66401l86840o88415K25111J213806
35009C61960N73902j020335j160075M89368J466129L58788j065481q95332K1101
35000h69975L6248l46051K61211J291678J112107q2970o63632l81497m28349q50532
34990i21762l19632J225217J979865J032524k29013l87753J9524j08432n17613
34981A772925l86466L1422p3868n63107n95835p782N69818P13841N28526K11456
34971B200930l1322O3487L54249J84021o34610j204020o89434L53939P01127J62023
$$ plain form
35036 2176677 2106694 1287639 134869 -520993 -235651 552434 965825 695598 268091
35027 268091 98155 -241230 -1235915 -2332166 -2513167 -1842179 -1450207 -1883897 -2432818
35018 -2432818 -2343092 -1746243 -1047977 -368103 -1702 -388542 -1076957 -851846 361960
35009 361960 935862 -84473 -1244548 -755180 710949 1069737 4256 -891076 -869975
35000 -869975 -833727 -1179778 -918567 373111 1485218 1402248 738616 357119 -71230 -921762
34990 -921762 -1241394 -16177 1963688 2996212 2767199 2379446 2398970 2290538 1772925
34981 1772925 1386459 1417881 1344013 780906 185071 177289 747107 1460948 1989474 2200930
34971 2200930 2169608 2233095 2587344 2771365 2136755 932735 243301 597240 1298367 1460390
34961A460390m21033o27817p95123r65697o98897j07278Q5136j24353K07462J282525
34951g04685J799820P96548o86292r36610O3604Q59357P31560L42689K44467J01932
34941B612390k94507m39444q4121J57144j88129o21091n33898k30877l18301o01618
34931e42452m31623J78374N91703N31022L07382J77218J16724J56431L36105L87369
34921A808253L0034m76491o21787l91342j60664K7583M14726Q23344P44377J93667
34911B391700k15285j77278j7110K3408J34147L66172L74054J4834l53851m29224
34901B111567l05783q8063K68695N67424M53332P0421o4463l7195n37902j535481
34891I02552j878027q36684P41924J558546J466920J161148Q51836K03827p24841
$$ plain form
34961 1460390 1039357 411540 -383583 -1349280 -2048177 -2155455 -2070319 -2194672 -1987210 -704685
34951 -704685 1095135 1891683 1205391 268781 332385 1191742 1923302 2265991 2510458 2612390
34941 2612390 2317883 1878439 1794318 1951462 1763333 1142242 608344 377467 59166 -542452
34931 -542452 -974075 -795701 -203998 327024 634406 811624 928348 1084779 1420884 1808253
34921 1808253 1838287 1361796 740009 348667 188003 215586 630312 1453656 2198033 2391700
34911 2391700 2176415 1999137 1982027 2005435 2139582 2505754 2879808 2894642 2540791 2111567
34901 2111567 1805784 1717721 1986416 2553840 3007172 3077593 3013130 2975935 2438033 902552
34891 902552 -975475 -1812159 -1070235 488311 1955231 3116379 3968215 4172042 3447201
34882C447201j368623j386594q98183j71501L94948K92310m68887j022939o02204
34873a784472L83559Q52435M41865k34133n58281n10386l69502l46063m57373
34864b582351m07686J92284J142999J580798J042077J62616k15153j20298k560
34855G92726K01213O85996R72404M98378l19449o17469l87024k44570k35235Q612
34845A355582K19922j16728n44234j99712N03540L16267o53477q94637O529N94285
34835E87337l7745p81248m96372J07900r1310o22146l90883L23460M95492K87792
34825f17723O49054J344224J118995j21639q67691j41218J138683J477648O22224
34816D602557m87763r82552p98562m96394o42503j186094j430645q72353Q0107
$$ plain form
34882 3447201 2078578 691984 -206199 -377700 17248 309558 -159329 -1182268 -1784472
34873 -1784472 -1400913 -548478 -106613 -340746 -899027 -1409413 -1778915 -2124978 -2582351
34864 -2582351 -2990037 -2797753 -1654754 -73956 968121 1130737 915584 795286 792726
34855 792726 993939 1679935 2652339 3150717 2831268 2213799 1826775 1582205 1346970 1355582
34845 1355582 1575504 1458776 914542 714830 1218370 1534637 881160 -13477 -6948 587337
34835 587337 549592 -231656 -728028 -620128 -711438 -1333584 -1724467 -1401007 -905515 -617723
34825 -617723 31331 1375555 2494550 2372911 1505220 1364002 2502685 3980333 4602557
34816 4602557 4114794 3132242 2333680 1837286 1194783 8689 -1421956 -2294309 -2214202
34807b214202O16462N79814N01583P16353J018808J138639R71137L69868o68034
34798C030428j584541j666554r76379k97330p1783k9204L3931j06663l80537j46826
34788b195458P90076J536419J196551J42868n68140o81278p31904p57770j59760
34779a428396R41985J358569N08875m61383k11489P67245Q67225j81201r63948
34770A197482o28088k4908k0722n5343N34138R00881p1057j583831j705714j78765
34760a635927J204318J200374N20589K14373J83710N5295J62311O46385P05634
34751C257062j14578p96574k69526P59898P59725k93052r40161m64934K57426
34742B155286K93874j20258k86018j15591j3372j88124m67722n55345l15327M8960
$$ plain form
34807 -2214202 -1597740 -1017926 -516343 200010 1218818 2357457 3328594 3698462 3030428
34798 3030428 1445887 -220667 -1197046 -1494376 -1566159 -1595363 -1561432 -1668095 -2048632 -2195458
34788 -2195458 -1405382 131037 1327588 1470456 902316 221038 -510866 -1268636 -1428396
34779 -1428396 -486411 872158 1381033 919650 708161 1475406 2342631 2161430 1197482
34770 1197482 569394 544486 523764 468421 1002559 1903440 1832383 248552 -1457162 -1635927
34760 -1635927 -431609 768765 1289354 1503727 1687437 1742732 1905043 2551428 3257062
34751 3257062 3142484 2345910 2076384 2836282 3596007 3302955 2362794 1897860 2155286
34742 2155286 2449160 2328902 2042884 1927293 1913921 1725797 1258075 702730 387403 436363
34732D36363J60422n5575k98747m30196o11216o76963r1177R74891J344551M33715
34722A186068o24929n05114L72472P06747M93627P19144J231533Q01057n87985
34713C792620j380813q73765k51297m74344p84238l14958L03966K16142o2111
34704A71202K47881N16331k27675j276874j041814M30863J402220R42573o88k94245
34694H69774l8097J85189L43521N51802M54607k29081j010526j126338m96248
34685d95397K73735O90436Q08276R10592J010579P84588N7786o94845o83778J05407
34675B767379N76395j30976j246893j209823P9197Q92653O4397j212749r60002
34666c80422P65849J886045J154678k47846n40929K40968O67123J65164m25698
$$ plain form
34732 436363 596785 541210 242463 -187733 -798949 -1475912 -1567089 -592198 752353 1186068
34722 1186068 561139 56025 428497 1135244 1628871 2348015 3579548 4380605 3792620
34713 3792620 2411807 1538042 1286745 812401 28163 -286795 17171 233313 171202
34704 171202 419083 935414 707739 -569135 -1610949 -1180086 222134 1164707 1164019 869774
34694 869774 831677 1016866 1360387 1912189 2366796 2137715 1127189 851 -495397
34685 -495397 -221662 468774 1277050 2187642 3198221 3982809 4040595 3345750 2661972 2767379
34675 2767379 3343774 3212798 1965905 756082 835279 1727932 1792329 579580 -380422
34666 -380422 385427 2271472 3426150 3178304 2637375 2878343 3545466 3710630 3284932
34657C284932n18501o61922j237005j419943m39599Q88347J105160K09630m70850
34648G40249l82948k86685m74504m0412J268318J915614O81762j073370r84928
34639A363096Q64624J894277O38287j303430j704392p04950j21404o15858j042519
34630g32269m63006N08859P50829J33033n63738p01473k41946N14441J148578
34621C53308J259995Q34860L99161M14161N85395K10370p74729j578188j530922
34612A73411q36002j05409M20032Q24149J040855Q95140M46694q7790n96095r36819
34602A238166q19340k57768J25651j80728p36792o52633J69419R46004J120228
34593I52207Q72091N19051J56449J070L20968P99563O90637j27042r25957j184091
$$ plain form
34657 3284932 2766431 2104509 867504 -552439 -992038 -103691 1001469 1211099 740249
34648 740249 357301 70616 -403888 -444300 824018 2739632 3421394 2348024 1363096
34639 1363096 2227720 4121997 4760284 3456854 1752462 1047512 926108 310250 -732269
34630 -732269 -1195275 -686416 64413 197446 -366292 -1067765 -1309711 -795270 353308
34621 353308 1613303 2448163 2847324 3261485 3846880 4057250 3282521 1704333 173411
34612 173411 -662591 -768000 -347968 476181 1517036 2412176 2858870 2771080 2174985 1238166
34602 1238166 418826 161058 286709 105981 -630811 -1283444 -1114025 -168021 952207
34593 952207 1824298 2343349 2499798 2500868 2821836 3621399 4312036 4184994 3259037 2074946
34583B074946j115759r16922l78761L45513N28128L351l60630J3375M89848L70759
34573A053848M3888O1326L737n79273r51112l08886N68284L85401m41950m01309
34563e66046N13446P67955o427l16853N60355J188024L07542j023970j046625
34554C77401R3692Q36749N54258l2858l22757l70890j81527L20196O42975J10778
$$ plain form
34583 2074946 959187 42265 -336496 9017 537145 540496 179866 193241 683089 1053848
34573 1053848 1097736 1159062 1162799 583526 -367586 -676472 -108188 277213 -164737 -566046
34563 -566046 -52600 715355 708928 392075 952430 2140454 2447996 1424026 377401
34554 377401 471093 1307842 1862100 1829242 1506485 1135595 954068 1274264 1917239 2028017
$$ [...]
##END NTUPLES=NMR SPECTRUM
##END=
