##TITLE=31Pdec_DE-63_P4
 D2O, 24 sc
 23.12.2024
##JCAMPDX= 6.0         $$ Bruker NMR JCAMP-DX V2.0
##DATA TYPE= NMR SPECTRUM
##DATA CLASS= NTUPLES
##ORIGIN= UXNMR, Bruker Analytische Messtechnik GmbH
##OWNER= root
$$ XWIN-NMR		Version 3.5
$$ Mon Dec 23 16:25:11 2024 Russian Standard Time (UT+4h)  she@DPX200
##.OBSERVE FREQUENCY= 81.013821
##.OBSERVE NUCLEUS= ^31P
##.ACQUISITION MODE= SIMULTANEOUS
##.ACQUISITION SCHEME= undefined
##.AVERAGES= 24
##.DIGITISER RES= 17
##SPECTROMETER/DATA SYSTEM= spect
##.PULSE SEQUENCE= zgpg30
##.SOLVENT NAME= CDCl3
##.SHIFT REFERENCE= (INTERNAL, CDCl3, 0, 198.062)
##AUDIT TRAIL= $$ (NUMBER, WHEN, WHO, WHERE, WHAT)
$$ ##TITLE= Audit trail, XWIN-NMR		Version 3.5
$$ ##JCAMPDX= 5.01
$$ ##ORIGIN= Bruker BioSpin GmbH
$$ ##OWNER= she
$$ F:/spectra/data/she/nmr/P31/2/pdata/1/auditp.txt
$$ ##AUDIT TRAIL=  $$ (NUMBER, WHEN, WHO, WHERE, WHAT)
(   1,<2024-12-23 16:24:10.64 +0400>,<she>,<DPX200>,
      <created by zg, POWCHK disabled, PULCHK disabled
       configuration hash MD5:
       00 E9 B6 7A A2 85 ED C7 34 08 36 98 17 FE 4E 26
       data hash MD5: 32K
       42 A3 83 EF CC 4E 5B 26 70 13 8C A2 DF 4E FA 97>)
(   2,<2024-12-23 16:24:14.89 +0400>,<she>,<DPX200>,
      <Start of raw data processing
       efp BC_mod = 2 LB = 1.5 FT_mod = 6 PKNL = 1 PHC0 = 1978.046 PHC1 = 364.686 SI = 64K 
       data hash MD5: 64K
       94 87 60 9D 64 4E 8F 99 72 ED C5 B5 6A 24 72 0E>)
(   3,<2024-12-23 16:24:33.90 +0400>,<she>,<DPX200>,
      <pk PHC0 = -4.902908 PHC1 = 0 
       data hash MD5: 64K
       D9 C8 49 56 1D 60 4C ED B6 B0 D7 BB 82 C0 7B BA>)
(   4,<2024-12-23 16:24:40.03 +0400>,<she>,<DPX200>,
      <abs ABSG = 5 
       data hash MD5: 64K
       0A 69 6C 85 CC CB FA DA B7 B6 07 06 6D B7 93 52>)
$$ ##END=
$$ 
$$ hash MD5
$$ 54 51 5A 40 45 EC 75 55 CF B6 3C D7 3A 2F C1 7C
##$RELAX= 
##$RELAX= 
##$RELAX= 
##$RELAX= 
##$RELAX= 
##$RELAX= 
##$RELAX= 
##$RELAX= 
$$ Bruker specific parameters
$$ --------------------------
##$DU= <F:/spectra>
##$EXPNO= 2
##$NAME= <P31>
##$PROCNO= 1
##$TYPE= <nmr>
##$USER= <she>
##$AMP= (0..31)
100 100 100 100 100 100 100 100 100 100 100 100 100 100 100 100 100 100 
100 100 100 100 100 100 100 100 100 100 100 100 100 100 
##$AQSEQ= 0
##$AQ_mod= 1
##$AUNM= <au_zg>
##$AUTOPOS= <>
##$BF1= 81.014009
##$BF2= 200.13
##$BF3= 200.13
##$BF4= 200.13
##$BF5= 200.13
##$BF6= 200.13
##$BF7= 200.13
##$BF8= 200.13
##$BYTORDA= 1
##$CFDGTYP= 0
##$CFRGTYP= 5
##$CHEMSTR= <none>
##$CNST= (0..31)
1 1 145 1 1 1 1 1 1 1 1 1 1 1 1 1 1 1 1 1 1 1 1 1 1 1 1 1 1 1 1 1 
##$CPDPRG= <waltz16>
##$CPDPRG1= <>
##$CPDPRG2= <waltz16>
##$CPDPRG3= <>
##$CPDPRG4= <mlev>
##$CPDPRG5= <mlev>
##$CPDPRG6= <mlev>
##$CPDPRG7= <mlev>
##$CPDPRG8= <mlev>
##$CPDPRGB= <>
##$CPDPRGT= <>
##$D= (0..31)
0 1 0 0 0 0 0 0 0 0.06 0 0.03 2e-05 3e-06 0 0 0.0002 0 0 0 0 0 0 0 0 0 
0 0 0 0 0 0 
##$DATE= 1734956650
##$DBL= (0..7)
120 120 120 11 120 120 24 19 
##$DBP= (0..7)
150 150 150 150 150 150 150 150 
##$DBP07= 0
##$DBPNAM0= <>
##$DBPNAM1= <>
##$DBPNAM2= <>
$$ [...]
##$SUBNAM3= <"">
##$SUBNAM4= <"">
##$SUBNAM5= <"">
##$SUBNAM6= <"">
##$SUBNAM7= <"">
##$SUBNAM8= <"">
##$SUBNAM9= <"">
##$SW= 400.765351723535
##$SWIBOX= (0..15)
0 1 3 0 0 0 0 0 0 0 0 0 0 0 0 0 
##$SW_h= 32467.5324675325
##$TD= 32768
##$TD0= 1
##$TE= 0
##$TE2= 300
##$TE3= 300
##$TEG= 300
##$TL= (0..7)
0 120 53 12 22 120 120 120 
##$TP= (0..7)
150 150 150 150 150 150 150 150 
##$TP07= 0
##$TPNAME0= <>
##$TPNAME1= <>
##$TPNAME2= <>
##$TPNAME3= <>
##$TPNAME4= <>
##$TPNAME5= <>
##$TPNAME6= <>
##$TPNAME7= <>
##$TPOAL= (0..7)
0.5 0.5 0.5 0.5 0.5 0.5 0.5 0.5 
##$TPOFFS= (0..7)
0 0 0 0 0 0 0 0 
##$TUNHIN= 0
##$TUNHOUT= 0
##$TUNXOUT= 0
##$USERA1= <user>
##$USERA2= <user>
##$USERA3= <user>
##$USERA4= <user>
##$USERA5= <user>
##$V9= 5
##$VALIST= <valist>
##$VCLIST= <CCCCCCCCCCCCCCC>
##$VD= 0
##$VDLIST= <DDDDDDDDDDDDDDD>
##$VPLIST= <PPPPPPPPPPPPPPP>
##$VTLIST= <TTTTTTTTTTTTTTT>
##$WBST= 1024
##$WBSW= 4
##$XGAIN= (0..3)
0 0 0 0 
##$XL= 0
##$YL= 0
##$YMAX_a= 5704
##$YMIN_a= -6551
##$ZGOPTNS= <>
##$ZL1= 120
##$ZL2= 120
##$ZL3= 120
##$ZL4= 120
##$ABSF1= 198.0616
##$ABSF2= -202.7028
##$ABSG= 5
##$ABSL= 3
##$ALPHA= 0
##$AQORDER= 0
##$ASSFAC= 0
##$ASSFACI= 0
##$ASSFACX= 0
##$ASSWID= 0
##$AUNMP= <proc_1d>
##$AZFE= 0.1
##$AZFW= 0.5
##$BCFW= 0
##$BC_mod= 2
##$BYTORDP= 0
##$COROFFS= 0
##$CY= -3
##$DATMOD= 1
##$DC= 0
##$DFILT= <>
##$DTYPP= 0
##$F1P= 0
##$F2P= 0
##$FCOR= 1
##$FTSIZE= 65536
##$FT_mod= 6
##$GAMMA= 0
##$GB= 0
##$INTBC= 1
##$INTSCL= 9.790993e-09
##$ISEN= 30
##$LB= 1.5
##$LEV0= 0
##$LPBIN= 0
##$MAXI= 10000
##$MC2= 0
##$MEAN= 0
##$ME_mod= 0
##$MI= 50
##$NCOEF= 0
##$NC_proc= -8
##$NLEV= 6
##$NOISF1= 182.463
##$NOISF2= 159.3651
##$NSP= 0
##$NTH_PI= 0
##$NZP= 0
##$OFFSET= 198.0616
##$PC= 4
##$PHC0= 1973.143
##$PHC1= 364.686
##$PH_mod= 1
##$PKNL= yes
##$PPARMOD= 0
##$PSCAL= 0
##$PSIGN= 0
##$REVERSE= no
##$SF= 81.0140089999434
##$SI= 65536
##$SIGF1= 159.3651
##$SIGF2= -187.1042
##$SINO= 113.3802
##$SIOLD= 16384
##$SREGLST= <1H.CDCl3>
##$SSB= 0
##$STSI= 65536
##$STSR= 0
##$SW_p= 32467.5324675325
##$SYMM= 0
##$S_DEV= 0
##$TDeff= 32768
##$TDoff= 0
##$TI= <>
##$TILT= no
##$TM1= 0
##$TM2= 0
##$TOPLEV= 0
##$USERP1= <user>
##$USERP2= <user>
##$USERP3= <user>
##$USERP4= <user>
##$USERP5= <user>
##$WDW= 1
##$XDIM= 65536
##$YMAX_p= 283634316
##$YMIN_p= -89374630
$$ End of Bruker specific parameters
$$ ---------------------------------
##NTUPLES= NMR SPECTRUM
##VAR_NAME=  FREQUENCY,     SPECTRUM/REAL,   SPECTRUM/IMAG
##SYMBOL=    X,             R,               I
##VAR_TYPE=  INDEPENDENT,   DEPENDENT,       DEPENDENT
##VAR_FORM=  AFFN,          ASDF,            ASDF
##VAR_DIM=   65536,         65536,           65536
##UNITS=     HZ,            ARBITRARY UNITS, ARBITRARY UNITS
##FACTOR=    0.49542278885378, 1,            1
##FIRST=     16045.7642231865, 0,            0
##LAST=      -16421.768244346, 0,            0
##MIN=       -16421.768244346, -89374630,    0
##MAX=       16045.7642231865, 283634316,    0
$$ Real data points
##PAGE= N=1
##DATA TABLE= (X++(R..R)), XYDATA
$$ [...]
40493b810172n36029M57024J344140P21471n76255p52020L76083J324067J063763
40484F12072M7602p80659j016292p35794j59850M24584Q30570J087879J109601
40475A419713M98062q47335k173855k485639j592229j47922J100921J711974J596970
40466i19340J172183R88501P14688p31416l197026m397844k509175R23300K505941
40457e450188J329789j77537m2282P29575M26435m44132j80800J301897K460199
40448d7044K388342J556733N51393m82835j134406p82497K92403Q20402J8541
40439C181032j432145k197549j658277l02092Q65594J176781Q36303N84010O26042
40430A679699K64025q87156j757731r42358J058740J962452O43552j113389q86041
$$ y = [-2810172, -3346201, -2889177, -1545037, -823566, -1399821, -2151841, -1775758, -451691, 612072, 659674, -120985, -1137277, -1873071, -2032921, -1608337, -777767, 310112, 1419713, 1917775, 1070440, -1103415, -3589054, -5181283, -5329205, -4228284, -2516310, -919340, 252843, 1241344, 1956032, 1224616, -1972410, -6370254, -8879429, -7956129, -5450188, -4120399, -4297936, -4340218, -3610643, -3184208, -3628340, -3809140, -2507243, -47044, 2341298, 3898031, 4449424, 3966589, 2832183, 2049686, 2342089, 3162491, 3181032, 1748887, -448662, -2106939, -2409031, -1543437, -366656, 469647, 1053657, 1679699, 1943724, 1056568, -701163, -1643521, -584781, 1377671, 2021223, 907834, 21793]
40421B1793R98395J797099J27983k057064k083055n7169J568484J439969O80330
40412B436765O26690Q47794L75991m00836n65089n54307j411028k456882j747429
40403b848331P83496K580810J818511j53914j002401n79707j76226K04375J463549
40394B090162K734803J754101j478740l750669k727003k03460N69858m94001p58639
40385b263588O11101J353640P211j461254o88161J256450J522893J1639n94886
40376b44955O69571J491923K33394j284199q60662M44089L51636n73909n8893
40367A67995J548910J614771j00626p72254N46137R67924j272945l235073j700309
40358b235470J263833J055805k303877l915315j196544K401076K438784m93981
$$ y = [21793, 1020188, 2817287, 2945270, 888206, -1194849, -1252018, 316466, 1756435, 2436765, 3063455, 3911249, 4287240, 3886404, 3321315, 2767008, 1355980, -1100902, -2848331, -2064835, 515975, 2334486, 2180572, 1178171, 598464, 422238, 626613, 2090162, 4824965, 6579066, 5100326, 1349657, -1377346, -1580806, -1010948, -1504949, -2263588, -1652487, -298847, -291636, -1752890, -2441051, -1184601, 338292, 349931, -244955, 424616, 1916539, 2149933, 865734, 5072, 449161, 800797, 226888, 167995, 1716905, 3331676, 3231050, 2458796, 3004933, 3972857, 2699912, -535161, -2235470, -971637, 84168, -2219709, -6135024, -7331568, -4930492, -2491708, -2985689]
40350b985689k148670n90059J667848J473287q75625k325766j099666J229550
40342e654790K020137Q87089l96007p65497q95316j219361r67496q9889j39848
40333g220978j657561k449972n95307K272195L179430K199903J714128J984758
40325e73404Q87281j760530l066594j392979J085182J676688O35331k98481o56734
40316c464240p16287r2476J112967J271087n57967k513729k116142K81912K165630
40307d629245K268210J369862K71975r26113j665395j025740O77407J856842J566526
40298b35671L74787p93152j614917k016285j813105r83616K13383J312867J524711
40289d030998K58920j530865j584282P34870K706080J414804j883443k976097
$$ y = [-2985689, -5134359, -5724418, -4056570, -2583283, -3458908, -5784674, -6884340, -5654790, -3634653, -2747564, -3143571, -3909068, -4804384, -6023745, -6991241, -7081130, -7220978, -8878539, -11328511, -11923818, -9651623, -6472193, -4272290, -2558162, -573404, 313877, -1446653, -4513247, -5906226, -4821044, -3144356, -2509025, -2807506, -3464240, -4180527, -4273003, -3160036, -1888949, -2446916, -4960645, -7076787, -6794875, -4629245, -2361035, -991173, -719198, -1645311, -3310706, -4336446, -3659039, -1802197, -235671, 139116, -654036, -2268953, -4285238, -6098343, -7081959, -6868576, -5555709, -4030998, -3772078, -5302943, -6887225, -6152355, -3446275, -2031471, -3914914, -6891011]
40281f891011m46176K346364K053979k15882j095520Q8288J016395L86460l32192
40272c089295M00741J790180K146873J390068O74414K98980l43286r11406p3443
40263B283826K020548K876778P26167k564662l476093j350123R93414J261116
40255B770971K81993j18841J10673N2705n0661O28706J478071Q79987j302699
40246D730905l141325k901662r77212P28984P87799m89810j395701n72085J306395
40237a923712K070388O93161j318729j883073r25281M4616L13915N66744J287228
40228a074743J859264J471896Q8948j573676k460294j821003j45333R33011M69824
40219b252106n50789p32297k76364j03402L04070K144716M513952M661590J730865
$$ y = [-6891011, -7337187, -4990823, -2936844, -3152726, -4248246, -4159958, -3143563, -2757103, -3089295, -2688554, -898374, 1248499, 2638567, 3312981, 3611961, 3268675, 2357269, 2283826, 4304374, 7181152, 7907319, 5342657, 1866564, 516441, 1509855, 2770971, 3052964, 2934123, 3044796, 3097501, 3046840, 3675546, 5153617, 6033604, 4730905, 1589580, -1312082, -2289294, -1560310, -772511, -1262321, -2658022, -3230107, -1923712, 146676, 839837, -478892, -2361965, -3287246, -3242630, -2928715, -2361971, -1074743, 784521, 2256417, 2345365, 771689, -1688605, -3509608, -3654941, -2721930, -2252106, -2802895, -3535192, -3811556, -3914958, -3610888, -1466172, 3047780, 7709370, 9440235]
40210I440235j666597k701521j652292p39803q91154j202469q90254j80894N77623
40201I2874J341422J728148J029612o65233k074998k045072q78894K35902Q60127
40192c76112J494658K049646J330310r92027k865869k036798N69513J712499M07854
40183A293674o85234M69974K016618J233852j105156k153585j534828j329333
40175a794018j974107j463526Q93312K858968K504350P57527m77511q26963q54961
40166c76929o36660k04984j04362l92632k62047M49786O44872k12695r49978m09866
40156b455495Q07056J345999Q55466j23859j018088j194978j66758J409808K015838
40147A474989J209907R8063o32033j549298k641621k549996q58845O46661N37764
$$ y = [9440235, 7773638, 5072117, 3419825, 2680022, 1788868, 586399, -303855, -484749, 92874, 1434296, 3162444, 4192056, 3526823, 1451825, -593247, -1472141, -1236239, -376112, 1118546, 3168192, 4498502, 3506475, 640606, -1396192, -826679, 885820, 1293674, 608440, 1078414, 3095032, 4328884, 3223728, 1070143, -464685, -1794018, -3768125, -5231651, -4338339, -1479371, 1024979, 1782506, 1304995, 478032, -376929, -1013589, -1218573, -1322935, -1715567, -1977614, -1527828, -882956, -1095651, -2045629, -2455495, -1648439, -302440, 553026, 429167, -588921, -1783899, -1950657, -540849, 1474989, 2684896, 2782959, 2150926, 601628, -2039993, -4589989, -5448834, -4802173, -4264409]
40138d264409o1342M70722J491749J309292n4070j245208j705318j534870k85061
40129e878515K044419L661900K834625N42967p62429n70124m23168j040754j495332
40120a086411j164913n09537J33385P60178P98689k02655j102041l14043J551675
40111a135673K195032R61656l42519l96143j23779p16455j597374j445411j36687
40102b737353J244440J653679Q77055l36192q33469l73718r2091q01768j459775
40093b859192p01841O74617O06654j072315k341082j946775o92906M83821J697978
40084f151041K808507K831409J520219M5790o20886p02738n66262j47655J63842
40075h18815l56064j312703j426030n71257J03474L16355Q76411J516275R88666
$$ y = [-4264409, -4325751, -3855029, -2363280, -1053988, -1108058, -2353266, -4058584, -5593454, -5878515, -3834096, -172196, 2662429, 3205396, 2442967, 1872843, 1449675, 408921, -1086411, -2251324, -2760861, -2627476, -1867298, -1068609, -1271264, -2373305, -2687348, -1135673, 1059359, 2021015, 1678496, 1282353, 1158574, 442119, -1155255, -2600666, -2737353, -1492913, 160766, 1037821, 701629, -131840, -505558, -597649, -1399417, -2859192, -3561033, -2886416, -2279762, -3352077, -5693159, -7639934, -8332840, -7849019, -6151041, -3342534, -511125, 1009094, 1054884, 433998, -268740, -835002, -982657, -818815, -1174879, -2487582, -3913612, -4484869, -4381395, -4065040, -3188629, -1672354, -683688]
40066f83688j19018M28490K418444K475521o45380l184825j611206J883498K590588
40057C552424J29363j761598j278514m17896p91810j249944n71463L46988K57218
40048a785232m79052p67884k00115J019761K242778K223292L13468k002434k451294
40039a886712j056260J1019m3464M21628K113144K801365N38118k849483l771476
40030c722121j584458Q32826J038493k72029q62415J28300J575232J994767J149403
40021B77998J18687m2182L91143J61190j183702k368633j774741N53323K859158
40012a007759L520460K448403P42501m71500p47902l66783q995k14340r36013
40003B958072j638138j843403j495553q37128j48924L51027N75987O42532O93607
$$ y = [-683688, -802706, -374216, 2044228, 4519749, 3874369, 689544, -921662, 961836, 3552424, 3681787, 1920189, 641675, 223779, -568031, -1817975, -2389438, -2042450, -1785232, -2264284, -3032168, -3232283, -2212522, 30256, 2253548, 2567016, 564582, -1886712, -2942972, -2931953, -2975417, -2553789, -440645, 2360720, 2898838, 49355, -3722121, -5306579, -4473753, -3435260, -3707289, -4569704, -4441404, -2866172, -871405, 277998, 396685, 354503, 745646, 906836, -276866, -2645499, -4420240, -3866917, -1007759, 2512701, 4961104, 5703605, 5232105, 4484203, 4117420, 4108425, 3894085, 2958072, 1319934, -523469, -2019022, -2856150, -3005074, -2654047, -2078060, -1435528, -741921]
39994g41921O01509J64007k69846J21012J439889K404390J687618k45214j586210
39985C575234j470940p06109n7775P17744J483214J030962q13587j830592j71054
39976A757097K439327K621347P1825k146378k107341j144811q49666o59457K02308
39967A84251P33967k3876q98433k58743J418563K339611J733191M5894j972330
39958C302095l065253j891867P88406K043974O99270n96202M86153J913563O30230
39949D310369j909699j683775J384527L340245K475302J078091L98737j267546
39941H126251l982602m446629j427489J290740N38184j357203r15178O69556L94454
39932a109916o60694N50846K784889J933062j761855l393734r52711J848866J761549
$$ y = [-741921, -140412, 23595, -246251, -125239, 1314650, 3719040, 5406658, 5161444, 3575234, 2104294, 1398185, 1340410, 2058154, 3541368, 4572330, 3758743, 1928151, 1757097, 4196424, 6817771, 6889596, 4743218, 2635877, 1491066, 641400, -18057, 184251, 918218, 894342, -4091, -262834, 1155729, 3495340, 5228531, 5274425, 3302095, 236842, -1655025, -866619, 1177355, 1876625, 1280423, 1766576, 3680139, 4310369, 2400670, 716895, 2101422, 5441667, 7916969, 8995060, 9393797, 8126251, 4143649, -302980, -1730469, -439729, 98455, -1258748, -2173926, -1504370, -1109916, -1770610, -1219764, 1565125, 3498187, 1736332, -1657402, -2610113, -761247, 1000302]
39923A000302L73665J08447K2448j375873k451425j142715R71205R05695r23186
39914b511437j590449m34642M45273J09991o1768O11827Q94809J78372k78463
39905b636487K85455O52951j86203j085365m75631J131834J851437R52532n17218
39896b6695j229652q02421J77995P70639O18180M87957J242971K193864J645354
39887E078192m76974j946196j109227Q42086J696500J145390L85298j44650p78371
39878D692048j114218n40644J32064l13509j063926j95794J847510K300123K81049
39869F024703j668718j508099n98747q01177j020075O48604K940129K768142o0863
39860F723899k503614k695653j942406j821668j914479j444717r52046r46448
$$ y = [1000302, 1373967, 1482414, 1504862, 128989, -2322436, -3465151, -2493946, -1588251, -2511437, -4101886, -4536528, -4091255, -3981264, -4043032, -3431205, -2536396, -2358024, -2636487, -2351032, -1698081, -1884284, -2969649, -3445280, -2313446, -462009, 490523, -26695, -1256347, -2058768, -1880773, -1110134, -491954, -3997, 1238974, 3432838, 5078192, 4601218, 2655022, 1545795, 2387881, 4084381, 5229771, 5615069, 5470419, 4692048, 3577830, 3037186, 3169250, 2855741, 1791815, 1596021, 3443531, 5743654, 6024703, 4355985, 2847886, 2249139, 1447962, 427887, 1076491, 4016620, 6784762, 6723899, 4220285, 1524632, -417774, -2239442, -4153921, -5598638, -6550684, -7497132]
39852g497132o31377N66184J608627J493949J062024J518090K173616J523442
39844A817423q5691q69396m59564l13030j057789j441774o78207l3030p81644
39835c902702j927877j597569P1557J185920R85612P18424J341451J960452J384272
39826B19540N2702o53138k78438N74934J441674K197444K363546J352281n54798
39817F715747k343991l367694l511613k493758j56324K511484L910786L704273
39809D968910K974050K203217N66371k030683l723772k876287n02807R65932P04542
39800C249473j75556q37783j579773k424455k428521j059116O87493J299994N42727
39791b725517k54953K80849J887584K754556J633016m34814j362698q75493p30980
$$ y = [-7497132, -8128509, -7562325, -5953698, -4459749, -3397725, -1879635, 293981, 1817423, 1731732, 862336, 402772, 89742, -968047, -2409821, -3088028, -3121058, -3902702, -5830579, -7428148, -7356591, -6170671, -5185059, -4466635, -3125184, -1164732, 219540, 272242, -380896, -659334, -84400, 1357274, 3554718, 5918264, 7270545, 6715747, 4371756, 1004062, -2507551, -5001309, -5157633, -2646149, 1264637, 4968910, 7942960, 10146177, 10712548, 8681865, 4958093, 2081806, 1578999, 2544931, 3249473, 3073917, 2236134, 656361, -1768094, -4196615, -5255731, -4568238, -3268244, -2725517, -2980470, -2699621, -812037, 1942519, 3575535, 3140721, 1778023, 902530, 171550]
39782A71550j771662k522982j736661n27160l08507k18463J141713K643885K080654
39773a047633L9625o77162M99220J084558k52603j632806j277024j72581K04584
39764c231822M71799J603236K515069J742122K42795J12997J188994J227960o69218
39755E203932k801405l288128k202760q36120K0075M25232N52166K56335n35287
39746c205960j218009q10954O66103J645266Q65144n83181n36814J000819J781528
39737c96058Q16856k05114N8591M00953n17163j530372q89947O84854J260474
39728c16926R12405J156964J823060J169479r17937k311597j649149L9644J194849
39719A100792J471522J124583K76634n45622m86245L67837Q32749K21343q28498
$$ y = [171550, -1600112, -4123094, -5859755, -6386915, -6695422, -6913885, -5772172, -3128287, -1047633, -1008008, -1685170, -1185950, -101392, -353995, -1986801, -3263825, -3436406, -3231822, -2760023, -1156787, 1358282, 3100404, 3343199, 3456196, 4645190, 5873150, 5203932, 2402527, -885601, -3088361, -3924481, -3904406, -3479174, -2927008, -2670673, -3205960, -4423969, -5234923, -4568820, -2923554, -2058410, -2641591, -3178405, -2177586, -396058, 420798, 215684, 274275, 675228, 158065, -1372307, -2262254, -1577400, -316926, 595479, 1752443, 3575503, 4744982, 3827045, 1515448, -133701, -94057, 1100792, 2572314, 3696897, 3973531, 3427909, 2941664, 3309501, 4142250, 4363593, 3535095]
39710C535095j403137j272412o47880N1349J20611p11377j469125r45336M92576
39701b249636J325704J071149O69340O70872O00036L26845M11951O61287J6007
39692C503555j472749k194751j348281k07629j1284o9309P44369J897877K127146
39683B968944J544397J226628J217168M88737j178405k571737k578890j543909
39675d27067p30575p52738q28744J94507K010556K681569J061352j233371j697095
39666B78394m68489l6546j195788j651633K37233K581207K737368J233152N29773
39657D244671R96251Q09813m98978j111831j785J272370Q11895j094428k641050
39648B786928k686271j530150k85423L2271n59062p94974L09927J748103J551004
$$ y = [3535095, 2131958, 859546, 211666, 263015, 383626, -327751, -1796876, -2742212, -2249636, -923932, 147217, 816557, 1487429, 2087465, 2414310, 2826261, 3487548, 3503555, 2030806, -163945, -1512226, -1719855, -1731139, -1800448, -1056079, 841798, 2968944, 4513341, 5739969, 6957137, 7445874, 6267469, 3695732, 1116842, -427067, -1157642, -1910380, -2739124, -2544617, -534061, 2147508, 3208860, 1975489, 278394, -190095, -226641, -1422429, -3074062, -2836829, -255622, 2481746, 3714898, 4244671, 5240922, 6050735, 5551757, 4439926, 4438141, 5710511, 6522406, 5427978, 2786928, 100657, -1429493, -1714916, -1682645, -2241707, -3036681, -2726754, -978651, 572353]
39639E72353k92565j472161n42522J060960J309128N45550N78564J651537K143675
39630E554519J104135n57115j616924j915581j805469j384118p82803k82901K87886
39621a398371J317606K168162J434272p37552j916225l91224K096114K476508
39613E049290O47545n55092K58010J079479j20866k192309k638459j200122L13213
39604F40689Q88686J036575J058720N19212m63011r83294o90235j35654K97088
39595B168776N88538K71252j064844k345820j808534L23833J667001Q84753o23284
39586F1671j184179j185561j470378j106000J008648L303716K923806l4708k039298
39577B77717o43814K326577L310767J490943p26413j135232j03274O80679O00168
$$ y = [572353, 279788, -1192373, -1734895, -673935, 635193, 1180743, 1759307, 3410844, 5554519, 6658654, 6101539, 4484615, 2569034, 763565, -620553, -1403356, -1686257, -1398371, -80765, 2087397, 3521669, 2784117, 867892, 476668, 2572782, 5049290, 5696835, 5141743, 5399753, 6479232, 6358366, 4166057, 1527598, 327476, 640689, 1529375, 2565950, 3624670, 4143882, 3680871, 2697577, 2007342, 1871688, 2168776, 2757314, 3028566, 1963722, -382098, -2190632, -1866799, -199798, 684955, 61671, -1122508, -2308069, -3778447, -4884447, -3875799, -572083, 2351723, 2317015, 277717, -366097, 1960480, 5271247, 6762190, 6035777, 4900545, 4797271, 5477950, 6078118]
39568F078118L86450N60664P14537N21321N27948J271848K177834K176402J154734
39559A5569856j4857o95784q88067o20632N168K38799o51199k003188k277927
39550H662169j169541O6580O02117Q19040P63499k62100j742610j675711L23586
39541F387029J619380J68435k254642k812416j976657k153905l080254k218287
39533f321317M58198J894698R31022K21704J618377K933185J673792o85678j126491
39524A597490J17491M30773o27673j003152o4666M41328j94542k90459J048067
39515A454657J978818Q15824j120573j502476l98399M36679O79444J496036K834959
39506F674969L055432J648538K68279J99658M92313k36804j500146j838953j088006
$$ y = [6078118, 6464568, 7025232, 7739769, 8261090, 8789038, 10060886, 12238720, 14415122, 15569856, 15554999, 14859215, 13971148, 13350516, 13355684, 13594483, 12943284, 10940096, 8662169, 7492628, 7559208, 8161325, 8980365, 9743864, 9481764, 7739154, 6063443, 6387029, 8006409, 8174844, 5920202, 3107786, 1131129, -1022776, -4103030, -6321317, -5863119, -3968421, -3037399, -2815695, -1197318, 1735867, 3409659, 2723981, 1597490, 1714981, 2145754, 1518081, 514929, 450263, 891591, 697049, 406590, 1454657, 3433475, 4249299, 3128726, 1626250, 1227851, 1664530, 2343974, 3840010, 6674969, 9730401, 11378939, 11647218, 11846876, 12339189, 12102385, 10602239, 8763286, 7675280]
39497G675280k74903J44787M88858O37494J13141o74398o60064K16466Q20797
39488H487458N69512K10361M84294J080614J394536J378134J144109N56454l21097
39479A4984375j071266j477486j496725p27185R46543K215731J474525o25665
39471A4222847j611047p76725k12464j182617j887693p18102N28872n65308k690381
39462E107382k561050k22876R10580n76875k067482j147262J000892J893828J214119
39453C551256L21256j11092l45602m85093m43180l60763k28103K39242Q67852
39444C005773J022560O24070J01132p83494k523289m026121l190820j58328K042692
39435c885825J410950l26030n39964N40088R82619O28703Q81597J771439J786605
$$ y = [7675280, 7400377, 7545164, 8034022, 8671516, 8784657, 8110259, 7450195, 7666661, 8487458, 9056970, 9267331, 9751625, 10832239, 12226775, 13604909, 14749018, 15305472, 14984375, 13913109, 12435623, 10938898, 10211713, 11158256, 13373987, 14848512, 14222847, 12611800, 11835075, 11622611, 10439994, 8552301, 7834199, 8363071, 7797763, 5107382, 2546332, 2323456, 3234036, 2657161, 589679, -557583, 443309, 2337137, 3551256, 3872512, 3761420, 3415818, 2930725, 2487545, 2126782, 1898679, 2137921, 3005773, 4028333, 4652403, 4753535, 3970041, 1446752, -2579369, -5770189, -5928517, -3885825, -2474875, -2800905, -3340869, -2800781, -1818162, -1189459, -307862, 1463577, 3250182]
39426C250182N41690o01275p80357o10681o36051n52743l62963o41201j106687
39417a500086m89364J425225K959436K620766R11600p74440j961679k736240k551275
39408b096057q55893J419845K389910J420808j39763p35746l23010J39712K93011
39399A512817O82394J555973K099569J309671o23308k251796k273897q20362O84276
39390A875337Q46300m00561j627290j189204J006522L117655L130950R40997j708511
39381E992195l151852l042851j862403k25303J027981J052128J2627p66096l55110
39372a318684O05188R58226O94108O61851R83631Q23569j92272j214122j199364
39363H02131k18965O28211M44281n05578j075256n28937N36307Q63426J02754
$$ y = [3250182, 3791872, 3190597, 2410240, 1799559, 1163508, 610765, 247802, -393399, -1500086, -1989450, -564225, 2395211, 5015977, 5927577, 5153137, 3191458, 455218, -2096057, -2951950, -1532105, 857805, 2278613, 2138850, 1403104, 1080094, 1219806, 1512817, 2195211, 3751184, 5850753, 7160424, 6537116, 4285320, 2011423, 1191061, 1875337, 2721637, 2321076, 693786, -495418, 511104, 3628759, 6759709, 7700706, 5992195, 2840343, -202508, -2064911, -2290214, -1262233, -210105, -197478, -963574, -1318684, -713496, 244730, 938838, 1600689, 2584320, 3407889, 3215617, 2001495, 802131, 583166, 1211377, 1655658, 1150080, 74824, -454113, 82194, 945620, 1048374]
39354A048374q17029j012545o56851k89321J45566Q33079J177174L10127j553184
39345h14610l018536k912477j385274L80235J266104J136257Q98518J448273K404877
39336e96633K378497Q15483j020457j485068m73307P61469J256278J021869M16092
39327C074223k83500p76676r44021j111194j532246j764841j164677J62879J474629
39318b865424K200443K063161Q35876j134041k480737j984113j73797J147503
39310b391129R75461j72045j450765k436376k609422j465441L38703J171990N91359
39301g447665K95150J783055L778782L502351N27889k121149j587099J058519
39293b10167K102693J36433j988717j152835J480429J978960p12839l223390k625367
$$ y = [1048374, 231345, -781200, -1438051, -1727372, -1581806, -748727, 428447, 738574, -814610, -3833146, -6745623, -8130897, -7750662, -6484558, -5348301, -4449783, -3001510, -596633, 1781864, 2597347, 1576890, 91822, -381485, 379984, 1636262, 2658131, 3074223, 2790723, 2014047, 1070026, -41168, -1573414, -3338255, -4502932, -4340053, -2865424, -664981, 1398180, 2234056, 1100015, -1380722, -3364835, -3538632, -2391129, -1415668, -1587713, -3038478, -5474854, -8084276, -9549717, -9211014, -8039024, -7447665, -7152515, -5369460, -1590678, 1911673, 2439562, 318413, -1268686, -210167, 1892526, 2028959, 40242, -1112593, 367836, 2346796, 1633957, -1589433, -4214800]
39284d214800m07137K29418q71329j309171k85598O15783O01146Q04920J735260
39275c101508K060243R46322m10197p35775m43948k69716K05812J235810J571030
39266A058073J82292j666694j822232j52310J487680J795513J085499Q5256q91721
39257A161356j527424j431726p17627Q8291O92617R90030O82956k42405r35698
39248a239630m93359P74065J691990J673552J027743P8752j039440j820386j659941
39239a006654q13655k15017k10240k37102J73377Q44248J427634J631449J001646
39230B595686n60728k008528j979957o80857J97095j36288m78197L34722J483224
39221a233828J433585L31598k78647K17059Q37365O92969O8682n28351j298195
$$ y = [-4214800, -4621937, -4392519, -5263848, -6573019, -6858617, -6242834, -5641688, -4836768, -3101508, -1041265, -94943, -505140, -1240915, -1684863, -1954579, -1748767, -512957, 1058073, 1240365, -426329, -2248561, -2400871, -913191, 882322, 1967821, 2053077, 1161356, -366068, -1797794, -2515421, -2427130, -1734513, -744483, -61527, -303932, -1239630, -1732989, -958924, 733066, 2406618, 3434361, 3513113, 2473673, 653287, -1006654, -1820309, -2035326, -2245566, -2482668, -2309291, -1465043, -37409, 1594040, 2595686, 2034958, 26430, -1953527, -2634384, -2437289, -2573577, -3051774, -2717052, -1233828, 199757, 531355, 252708, 469767, 1307132, 2000101, 2068783, 1540432, 242237]
39212B42237k434839l204433k587340o55218J263666J809708P67360q27951j572182
39203g198992r18254K67007O33968K5683k25415R11150K566946K947649J689776
39194F99518K90724J9485L35903m0659j167831j810026j103429M16164J484816
39185h75335J353499L29153n73012n02064M01359J038141M70598r85533k015017
39176a358211j657583k48466R52525R35339j68758j231630j248050l58008M41667
39167c941175N99764O05413J108458J903626K148194J319998k47423j463652j118960
39158I14243Q61611K663726K131823m27119k175500j359000K94841J93061j304884
39149A792802j732158m72843N75608K89517k22557n3263n1509q26493j231146
$$ y = [242237, -2192602, -5397035, -7984375, -8639593, -7375927, -5566219, -4798859, -5626810, -7198992, -8117246, -7850239, -7216271, -7190588, -7416003, -6504853, -3937907, -990258, 699518, 990242, 1009727, 1345630, 1304971, 137140, -1672886, -2776315, -2360151, -875335, 478164, 807317, 234305, -267759, 133600, 1171741, 1642339, 656806, -1358211, -3015794, -3264260, -2311735, -1376396, -1545154, -2776784, -4024834, -4382842, -3941175, -3341411, -2735998, -1627540, 276086, 2424280, 3744278, 3496855, 2033203, 914243, 1775854, 4439580, 6571403, 6144284, 3968784, 2609784, 2904625, 3097686, 1792802, 60644, -412199, 163409, 452926, 230369, 177106, 125597, -700896, -1932042]
39140a932042l17695Q53256R87968O99396J030625J093131n61008k906853l224412
39131d277634r22994J594181K286665J699255J117707M85732m55718n33441J285580
39122B279333L350742K636234j017493l920758k962372L95498K245470J452767
39114D459421M49353Q78059J189222j47341j471146m17291J913369K244426R0719
39105I188791j598405j048145K7845k88379j177067j017047j48793J53897j06229
39096C986468k63688m95258r95682r00165K00064Q80517k9796j088073j74512
39087A119875K009596K748663J240406n89817j154561r00512o82388m13967R2867
39078C470162M38494L14060j70227r33686j677231j446396K43836K114077K397923
$$ y = [-1932042, -2249737, -1396481, -408513, 290883, 1321508, 2414639, 1853631, -1053222, -4277634, -5200628, -3606447, -1319782, 379473, 1497180, 1982912, 1527194, 993753, 2279333, 5630075, 8266309, 7248816, 3328058, 365686, 761184, 3006654, 4459421, 4908774, 5786833, 6976055, 6828714, 5357568, 4940277, 6853646, 9098072, 9188791, 7590386, 6542241, 6570086, 6281707, 5104640, 4087593, 3938800, 4092697, 3986468, 3722780, 3227522, 2231840, 1331675, 1531739, 2412256, 2382460, 1294387, 1119875, 3129471, 5878134, 7118540, 6528723, 5374162, 4473650, 3791262, 3377295, 3470162, 3908656, 4222716, 4052489, 3118803, 1441572, -4824, 239012, 2353089, 4751012]
39069D751012J146179k46502j338182k540191l121075j769989O42388J374548
39061a101812l50876k029673j393849O98490K008135J809348Q21122k58801r04174
39052g02090o37107J97916N84573M51645Q43591J866739K114270J019341L1480
39043E770358K77314P43366J81070p63134q83351m50117k76260p7043N29976O55024
39033E707203m05339j487427j210364k01775K34618M19229J013146P46133j629683
39024C185741l932048k565423J924972M708076K989784n44196k023303j378883
39016B364720r49854j247836q21668O12801J461914P12193p09734j397349j080683
39007a055496l98607R4932K50552J02738k91933q48976j333752j298425m30235
$$ y = [4751012, 5897191, 5650689, 4312507, 1772316, -1348759, -3118748, -2476360, -1101812, -1452688, -3482361, -4876210, -4177720, -2169585, -360237, 460885, 202084, -702090, -1339197, -1141281, -556708, -105063, 738528, 2605267, 4719537, 5738878, 5770358, 6047672, 6791038, 6972108, 6208974, 5325623, 4875506, 4599246, 4522203, 5052179, 5707203, 5301864, 3814437, 2604073, 2402298, 2636916, 3056145, 4069291, 4815424, 3185741, -746307, -3311730, -1386758, 3321318, 6311102, 5766906, 3743603, 2364720, 1414866, 167030, -654638, -41837, 1420077, 2132270, 1422536, 25187, -1055496, -1454103, -1359171, -1108619, -1005881, -1297814, -2146790, -3480542, -4778967, -5209202]
38998e209202R04068J802668J788626J352071J223383J342288R66878k32082j556594
38989B382104j920001r54374O59656J894864K206830J643285M90508q05963j582493
38980D014416j442190q81202q21562j288571j182445K12543K051828K842774K153625
38971E659216Q34759j75527o59531q67695j004158j055729r46081q56167j226381
38962b97294k032959k277286j047351R04693J763770J092013L33697L27472n2830
38953a286075j567460k502852q71135K205947L537691K065458M116l60771P68190
38944A993109J716282J401193p1235j658606j941533n72517P74995K41839j452935
38935D30592j787909j77695J104492M79434n41615Q7807J684559J968711M29400
$$ y = [-5209202, -4305134, -2502466, -713840, 638231, 1861614, 3203902, 4170780, 3938698, 2382104, 462103, -492271, 167385, 2062249, 4269079, 5912364, 6402872, 5596909, 4014416, 2572226, 1691024, 869462, -419109, -1601554, -1389011, 662817, 3505591, 5659216, 6493975, 6318448, 5658917, 4791222, 3787064, 2731335, 1785254, 929087, -297294, -2330253, -4607539, -5654890, -4750197, -2986427, -1894414, -1560717, -1233245, -1286075, -2853535, -5356387, -6227522, -4021575, -483884, 1581574, 1585690, 1224919, 1993109, 3709391, 5110584, 5039349, 3380743, 1439210, 866693, 1641688, 1883527, 430592, -1357317, -1535012, -430520, 48914, -492701, -404894, 1279665, 3248376, 3677776]
38926C677776j294156j884142j534176q61089j06513M66419N46109L80330N68090
38917d1352J079497J206980O55861L4500Q865M50821P15387M76808J0566k73295
38907D324638l56756n28944q26829q65032m06324K25831O20234P58980N67389
38898C513187m23043k093318k971140j784972M05872J178112J0532j047953m73917
38889c686640O82170Q01580J44593j33351j46606p15935j418407j026803L82361
38880e117038J417357J487435J449209J873745J964741P82653j282199k827565
38872b51662k842472j558814k02983R8048n09949o52489O90848K848735M092610
38863A711872L367714J089121j306693k204237r50281J094751J404195p49266
$$ y = [3677776, 2383620, 499478, -1034698, -1895787, -2002300, -1535881, -989772, -609442, -41352, 1038145, 2245125, 2900986, 2935486, 2944351, 3395172, 4110559, 4587367, 4597933, 4324638, 3967882, 3438938, 2612109, 1747077, 1340753, 1566584, 2186818, 2945798, 3513187, 3090144, 996826, -1974314, -3759286, -3353414, -2175302, -2164770, -3212723, -3686640, -3004470, -2202890, -2058297, -2191648, -2338254, -3054189, -4472596, -5499399, -5117038, -3699681, -2212246, -763037, 1110708, 3075449, 3858102, 2575903, -251662, -3094134, -4652948, -4855931, -4757883, -5267832, -5920321, -5229473, -2380738, 1711872, 5079586, 6168707, 4862014, 2657777, 1707496, 2802247, 4206442, 3457176]
38855C457176k847018k038592R46814K517049Q50066j992738l076522j999509
38847d183274l26462Q94805J573992J467374L78816o85877j42651J914906L188695
38838D080324J742956j410050l167841j794984J167239K779028J960143J94552
38830E551367p86226r83362j323667j742042j190666N10956J832639J071969j573891
38821A367077l854638l473023l48751L051412L903406J785715r78881j935137
38813d82820r87575J51177M05257K50736L43161L91223q5661o01349j03122J524806
38803H05833K861431K188629n77756l366282l762842j501483J211388K055554
38795h5528Q25096r52962j902425j617723k57670J534985K460388J468209q32531
$$ y = [3457176, 610158, -1428434, -481620, 2035429, 2885495, 892757, -2183765, -4183274, -4509736, -3614931, -2040939, -573565, -194749, -880626, -1023277, 891629, 4080324, 5823280, 4413230, 1245389, -549595, 617644, 3396672, 5356815, 5551367, 4765141, 3781779, 2458112, 716070, -474596, 36360, 1868999, 2940968, 1367077, -2487561, -5960584, -6309335, -3257923, 645483, 2431198, 1452317, -482820, -1470395, -1319218, -913961, -663225, -320064, 71159, -14502, -615851, -718973, 805833, 3667264, 5855893, 5278137, 1911855, -1850987, -3352470, -2141082, -85528, 739568, -213394, -2115819, -3733542, -3991212, -2456227, 4161, 1472370, 639839]
38786F39839k429344j944052K6142J744336K034045J032053k54326q86324p01293
38777g38924j65325M37878J218759J879184J498448j40142j697978j801393r23338
38768d32831n85779j098142j436554j090993n10356J73544J189954J852968J120654
38759h17535k59516k42523J177844J363369r43189l160951k443379J6886Q02610
38750d506384o14049j364567L45843K862111L756875K793115J261056m7348j029128
38741C457524j487671j347869j145299j387854j686568j206283J32766J415820
38733c255434J714805J005998M3603n06980o31128o32988n23021j07647M83479
38724b409313R63496J524522K463667L054505J936151p94817k995175k897116
$$ y = [639839, -1789505, -3733557, -3707415, -1963079, 70966, 1103019, 848693, -37631, -738924, -904249, -466371, 752388, 2631572, 4130020, 3989878, 2291900, 490507, -432831, -1018610, -2116752, -3553306, -4644299, -5154655, -4981111, -3791157, -1938189, -817535, -1077051, -1319574, -141730, 1221639, 278450, -2882501, -5325880, -5308994, -4506384, -5120433, -6485000, -6139157, -3277046, 479829, 3272944, 4534000, 4486652, 3457524, 1969853, 621984, -523315, -1911169, -3597737, -4804020, -4671254, -3255434, -1540629, -534631, -491028, -998008, -1629136, -2262124, -2785145, -2892792, -2409313, -1445817, 78705, 2542372, 5596877, 7533028, 6738211, 3743036, 845920]
38716H45920j205086J86679N57829K53838o38133j800506j827337J6928J818970
38707a790898J260431m80800j6977K740934L693035N64706l343985l836633j688915
38698b899102o39388j262820p54255J588313K684965N97571k057734j682196J315140
38689c109506L351191K482154K76813q99170p17889n52339j333568k424092k428304
38680e354710q44458J227567K208227J735612P45878o5061r37055j868072j884575
38671e036647n23105P91227L71611r88119o51665K021833M136744K784978r67193
38662A939664l226367k010616Q07562K429203K311118J573076O39142q91879k506622
38653A064281k675715r80705Q58936R55030l80862j138014k37230J220148J514081
$$ y = [845920, -359166, -172487, 385342, 639180, 1047, -1799459, -3626796, -3609868, -1790898, -530467, -1011267, -1028244, 1712690, 5405725, 5970431, 2626446, -1210187, -2899102, -3538490, -4801310, -5555565, -3967252, -1282287, -684716, -2742450, -4424646, -3109506, 241685, 2723839, 3000652, 2101482, 1383593, 831254, -502314, -2926406, -5354710, -6199168, -4971601, -2763374, -1027762, -281884, -346945, -1284000, -3152072, -5036647, -5559752, -4768525, -4396914, -5385033, -6036698, -4014865, 121879, 2906857, 1939664, -1286703, -3297319, -2489757, -60554, 2250564, 3823640, 4462782, 3570903, 1064281, -1611434, -2592139, -1733203, -778173, -1159035, -2297049, -2534279, -1314131, 199950]
38644A99950M59162n10117k01786R02446J313028M06007q19834j062478m13728
38635B72650j38950p89059j314015n51323J008052J837788J557039J392538K134303
38626E409023K704325J706761k55864j144674l20162N64112M2513j032447r61555
38617F712032L7509J06058j354451k647162k149923m62293O31019M15932m52907
38608H35814j179477j302566m57110J179645K399172J986545K40637j355753j841047
38599E05860j281827P9118J867741K861869J850704l62880j378899l87544N55754
38590D309896m25458k103425j913531K91380K182494K284010J427261P69066K24571
38581G046264m84680p75711k20120M47902M17449J60024O03275J421300J333991
$$ y = [199950, 659112, 148995, -52791, 849655, 2162683, 2568690, 1748856, 686378, 272650, 133700, -655359, -1969374, -2520697, -1512645, 325143, 1882182, 3274720, 5409023, 8113348, 9820109, 9564245, 8419571, 8099409, 8663521, 8706034, 7673587, 6712032, 6749541, 6855599, 5501148, 2853986, 704063, 241770, 872789, 1288721, 835814, -343663, -1646229, -2103339, -923694, 1475478, 3462023, 3702660, 2346907, 505860, -775967, -696849, 1170892, 4032761, 5883465, 5520585, 4141686, 3754142, 4309896, 3884438, 1781013, -132518, 158862, 2341356, 4625366, 6052627, 6821693, 7046264, 6561584, 5785873, 5565753, 6013655, 6431104, 6591128, 7194403, 8615703, 9949694]
38572I949694M7213j183477j234601n53909l80454j009847j499695j010799J25624
38563C249749Q45385M88279o90450j796049j839073m62505J373706J871355L67637
38554C408034j448567j374229L25800J180721P5396j163517p59762J52786m53451
38545e6789j829560j339236J242510K934962J680130r57313k322176k047080j408193
38536d102745p33179O47290K447851L168030J940073l45047j917742j680547n6209
38527f32225J354825J295393K61570j63983M80125R73397M23903m26144o74735
38518B892126p22009j096610j055901R8014J274964R33559m99489j327577j146431
38509f49354p95426k30679J272397K855797K486703J59164j582992j190970r3081
$$ y = [9949694, 9996907, 8813430, 7578829, 7024920, 6644466, 5634619, 4134924, 3124125, 3249749, 4095134, 4583413, 3892963, 2096914, 257841, -204664, 1169042, 3040397, 3408034, 1959467, 585238, 911038, 2091759, 2167155, 1003638, 243876, 396662, -56789, -1886349, -3225585, -1983075, 951887, 2632017, 1674704, -647472, -2694552, -4102745, -4835924, -4188634, -1740783, 1427247, 3367320, 3022273, 1104531, -576016, -632225, 722600, 2017993, 2279563, 2115580, 2595705, 3569102, 3993005, 3566861, 2892126, 2170117, 1073507, 17606, 115620, 1390584, 2324143, 1824654, 497077, -649354, -1444780, -1675459, -403062, 2452735, 4939438, 5098602, 3515610, 2324640, 2231559]
38500B231559l5601m73563j66475L27003l13769j717703k296259j582379m91533
38491d518720L38413J040635J635581J890375J852117J565904O99064n87980j063371
38482B852018K4547J427700J430189M46461L48534J347937J493734k93013k448248
38473F629859k919966j786346o78004m87907p27276o59022j10156P11557J547970
38464A520709K168371K380602K001565R27575m90960j330705r23687J95754P55756
38455G204980K10161q29806j588701j788525j272834L9629J435562J584079J34294
38446E128839j540074j957844j365799j097872j461508j310681J72635K152210
38438a280094L037944K235425N73299p08204r51442k66266O87374J001871J55734
$$ y = [2231559, 2195958, 1722395, 1555920, 1882923, 1569154, -148549, -2444808, -4027187, -4518720, -4180307, -3139672, -1504091, 386284, 2238401, 3804305, 4503369, 3915389, 2852018, 2876565, 4304265, 5734454, 6180915, 6529449, 7877386, 9371120, 9078107, 6629859, 3709893, 1923547, 1245543, 757636, 30360, -628662, -738818, -27261, 1520709, 3689080, 6069682, 8071247, 8998822, 8507862, 7177157, 6253470, 6449224, 7204980, 7415141, 6585335, 4996634, 3208109, 1935275, 1974904, 3410466, 4994545, 5128839, 3588765, 1630921, 265122, -832750, -2294258, -3604939, -3432304, -1280094, 1757850, 3993275, 4566574, 3858370, 2906928, 2640662, 3328036, 4329907, 4485641]
38429D485641j321734k235863k146993j880784k045745j780152j79636J571133
38421e534133J372748l60612o57256J669733L811471K865972J35653q86129M33711
38412B851158J639023J336849M95727m00919k268188m657137n044058k382809
38404h430354R77088K505829K522819K348261J596798m06186k165092j590608
38396b641445Q20077K675590K975951K617713K122775J023528n78953j698219
38388G317017j800304j114634J15587J367312J427383j12661j572271j268106
38380D359323k52141p26436k232426k182451k33589Q91512k44717j474846m95530
38371b591301J732080K824666K323491J339167M11095l30483r9886J412382K647118
$$ y = [4485641, 3163907, 928044, -1218949, -3099733, -5145478, -6925630, -7105266, -5534133, -4161385, -4521997, -5179253, -3509520, 301951, 3167923, 3303576, 2417447, 2851158, 4490181, 5827030, 6322757, 5921838, 3653650, -1003487, -6047545, -8430354, -7453266, -4947437, -2424618, -76357, 1520441, 1114255, -1050837, -2641445, -1821368, 854222, 3830173, 6447886, 8570661, 9594189, 9015236, 7317017, 5516713, 4402079, 4517666, 5884978, 7312361, 7199700, 5627429, 4359323, 4107182, 3380746, 1148320, -1034131, -1267720, -376208, -620925, -2095771, -2591301, -859221, 1965445, 4288936, 5628103, 6039198, 5708715, 5608829, 7021211, 9668329]
38362I668329J816550n53126k352207k687959k352474j906673j048751J23169
38354G06858P83269N81082K6288m61618q40755p58528K44246J611613J971141
38345C863596R03418l73208n98788l4065J74502l17968p30674m19926J74732J83588
38335B825207l92513o47672k04562K6711p73192j763816j437467L7564R48288
38326a381452O88993N95340J473004K051743J129613k87976o12247j90382l69476
38317C097160j055315j230496j089967j386841j235202Q04190L532154L812305
38309E247988J028403j767000k100899j017383n15775m75556O1382O13683M48469
38300A523312M32877J385856J928580N44241j262488q10504J240357J450720j000895
$$ y = [9668329, 11484879, 10931753, 8579546, 5891587, 3539113, 1632440, 583689, 706858, 1490127, 2071209, 2097497, 1635879, 795124, 36596, 280842, 1892455, 3863596, 4767014, 4393806, 3795018, 3760953, 3935455, 3617487, 2886813, 2466887, 2641619, 2825207, 2432694, 1785022, 1580460, 1607171, 833979, -929837, -2367304, -2329740, -1381452, -692459, -97119, 1375885, 3427628, 4557241, 4269265, 3657018, 3466636, 3097160, 2041845, 811349, -278618, -1665459, -2900661, -2096471, 1435683, 5247988, 6276391, 4509391, 2408492, 1391109, 875334, 399778, 461160, 1074843, 1523312, 1956189, 3342045, 5270625, 5814866, 4552378, 3741874, 4982231, 6432951, 5432056]
38291E432056k735951j237424J399688J849340M42865m3202Q49840Q41322q77296
38282E921238k003298p61458J065786N75997j987763l443376j953864O61512J466555
38273d58671L3311j462517j195538L37960J354980R79036m2487m66766M5761O84777
38263a90154M65323o41668j630417j566355n97519L87247R42754J398440J927463
38254D95114J919848P97501q93243j863254j536641n70707J68641N64745Q67423
38245e0573R02616L45224m00379l80684O13580J581672J614845J135352J095727
38236F457380J289554N49879j223142k401350j720262j53194L73362l81788q94072
38227A896367l22364L30990o1757j013265j203681l05469Q13448J326364J139009
$$ y = [5432056, 2696105, 1458681, 2858369, 4707709, 5150574, 5107372, 5957212, 6798534, 5921238, 3917940, 3156482, 4222268, 4798265, 2810502, -632874, -2586738, -1925226, -458671, -425360, -1887877, -3083415, -2745455, -1390475, -411439, -453926, -920692, -874931, -190154, 275169, -366499, -1996916, -3563271, -4160790, -3773543, -2830789, -1432349, 495114, 2414962, 3212463, 2319220, 455966, -1080675, -1651382, -1482741, -917996, -50573, 852043, 1197267, 796888, 416204, 1029784, 2611456, 4226301, 5361653, 6457380, 7746934, 8296813, 7073671, 4672321, 2952059, 2798865, 3172227, 2790439, 1896367, 1574003, 1904993, 1843236, 829971, -373710, -679179, 134269, 1460633, 2599642]
38218B599642N53394q9824m77140n33431n63460q30023j067473p49477K39875
38209i17917J477254K380287K417237J202787j065503l258973l897677k379154
38201d041659L78927K523711K623845Q76972q47358o53854J265995K593688J539248
38192F259515q52431j908661p06452Q17483N01948j211941j960086o07261J275217
38183A607331J427006k26434j506164q30193O89879P38421j038054k521972j993400
38174c653580k76356Q01628J044272J583313K489958K435271R44975n90685q87387
38165C891409m88219m91882n54767M12613J971206K157627J40313k305542k798460
38156A934298j178193O25229J289502J475357K093429K368802R68227j399801
$$ y = [2599642, 3153036, 3063212, 2586072, 2052641, 1489181, 659158, -408315, -1157792, -917917, 559337, 2939624, 5356861, 6559648, 5494145, 2235172, -1662505, -4041659, -3662732, -1139021, 1484824, 2361796, 1514438, 860584, 2126579, 4720267, 6259515, 5407084, 3498423, 2791971, 3609454, 4111402, 2899461, 939375, 332114, 1607331, 3034337, 2807903, 1301739, 471546, 1161425, 1899846, 861792, -1660180, -3653580, -3929936, -3128308, -2084036, -500723, 1989235, 4424506, 5369481, 4778796, 3891409, 3403190, 2911308, 2356541, 2769154, 4740360, 6897987, 7038300, 4732758, 1934298, 756105, 1381334, 2670836, 4146193, 6239622, 8608424, 9576651, 8176850]
38148H176850k315889j081206p5666j350160l272101k693932K24440J984931Q43997
38139D41264p24029J9577J907359J846771m09067k093887j681326p55659j029379
38130b478376j553792k86552K601956M440265L040097p68924l793932l559952
38122b359210p51161J566324J346439k02419l80780J366722K702917J526499j252632
38113C562699k906381k253067p72035l64932r87460j159202l57738J67076o18970
38104e690010j613377q21685J655358L297171K369672K18817o37459K69615J348513
38095C96615J454017Q63203J02383n49828m13571J044922K700418K432334n7580
38086G972913k497439k862051j636668m40529K53849Q38325J124042O50715j53846
$$ y = [8176850, 5860961, 4779755, 4704089, 3353929, 81828, -2612104, -2387664, -402733, 441264, -282765, -263188, 1644171, 3490942, 3081875, 987988, -693338, -1448997, -2478376, -4032168, -4318720, -1716764, 2723501, 5763598, 4994674, 1200742, -2359210, -3110371, -1544047, -197608, -400027, -780807, 585915, 3288832, 4815331, 3562699, 656318, -1596749, -2368784, -2733716, -3721176, -4880378, -5238116, -5071040, -5690010, -7303387, -8125072, -6469714, -3172543, -802871, -584054, -1221513, -951898, 396615, 1850632, 2713835, 2816218, 2266390, 1852819, 2897741, 5598159, 8030493, 7972913, 5475474, 2613423, 976755, 536226, 790075, 1628400, 2752442, 3403157, 3249311]
38077C249311m27337j57814J4125p0936j04582j15660l50009o27251o05470l69084
38067D35293q6987M32899J179389J578641J436940J415237J691175J221454m31595
38058H872446j718538j249725k33349o10594j673840j276382O9223l71246k624954
38049h16959l072404N6549L446600L370340J075315M49507J966071K437856L34003
38040I246878j977996j926093j45016R23794J81744j484084k645052k489565j181463
38031a496853K81588R20272P20709L69672J88060L0038Q7173P73759J683604J718233
38021E276255O56524l27108k70508K31841P594r29384j437019q73760J02438N05994
38011B942867K33507r6982k40822o25997j348045j518696m03116J119389J391070
$$ y = [3249311, 2821974, 2664160, 2678285, 2607349, 2502767, 2387107, 2037098, 1409847, 804377, 435293, 348306, 781205, 1960594, 3539235, 4976175, 6391412, 8082587, 9304041, 8872446, 7153908, 5904183, 5670834, 5060240, 3386400, 2110018, 2179241, 1807995, -816959, -3889363, -3832814, -386214, 2984126, 4059441, 4508948, 6475019, 8912875, 9246878, 7268882, 5342789, 5197773, 6121567, 6303311, 4819227, 2174175, -315390, -1496853, -1215265, -294993, 425716, 795388, 983448, 1013486, 1100659, 1874418, 3558022, 5276255, 5932779, 5605671, 5335163, 5567004, 5574598, 4645214, 3208195, 2334435, 2436873, 2942867, 3176374, 3079392, 2838570, 2212573, 864528, -654168, -1057284, 62105, 1453175]
38002A453175L99380R208J127024K042823Q93641j332414k036931o77323P56695
37993B635278Q38934K97952J36487M6642m35723p27174k51962M27324O10534O49234
37983D227526J048681J220510L79501q57045j039852J22545J403834J682478J084078
37974I272256M43911L02871N74139P80951N37350j2886l38521k03480Q1389J64172
37964A1602152n8240p18295j800296k458919j509856P76947K324280J632554k13037
37955I577290r97140k63579M88010J99303m54409l01643P68237J748254J483550
37946A2247873k50351k188267k474227p55987J137055J412614N11819n4269k45546
37937I340714j084550k143536j673069M85498K286573K498146K253670K512886
$$ y = [1453175, 1852555, 1861763, 2988787, 5031610, 5925251, 4592837, 2555906, 1878583, 2635278, 3474212, 3772164, 3908651, 3955293, 3519570, 2792396, 2540434, 2967758, 3578292, 4227526, 5276207, 6496717, 6876218, 6019173, 4979321, 5101866, 6505700, 8188178, 9272256, 9716167, 10019038, 10593177, 11374128, 11911478, 11898592, 11560071, 11356591, 11437980, 11602152, 11543912, 10825617, 9025321, 6566402, 5056546, 5833493, 8157773, 9790327, 9577290, 8580150, 8316571, 8804581, 9003884, 8549475, 8247832, 9016069, 10764323, 12247873, 11997522, 9809255, 7335028, 6579041, 7716096, 9128710, 9640529, 9586260, 9340714, 8256164, 6112628, 4439559, 4925057, 7211630, 9709776, 11963446, 14476332]
37929A4476332K092962j1291k098863j882556q5220N68339m97359j103371l4372
37920A1424601J091904N58614q36640j227168l51927O29036J062528J146470R27001
37911A4424419L07237j92212J03243Q33433R43272K71484k40286j27953r4355
37902A6228282n71631n99439Q44787K927570L584717K137740K49440k11995N18521
37893B5107992P44234j46489q54548j34526J341887J870171J009196K1468J8850
37884B8978235O50923J045673J172699J488453J875840J997253K333657L572684
37876D3115417M957166M724045K745043J346164K441505M909253O145283N474139
37868G5858015M506545M583316N567395P070206R068393J0933933J1505488J0804926
$$ y = [14476332, 16569294, 16558003, 14459140, 12576584, 12491364, 13059703, 12562344, 11458973, 11424601, 12516505, 13075119, 12238479, 11011311, 10659384, 11288420, 12350948, 13497418, 14424419, 14731656, 14539444, 14642687, 15476120, 16419392, 16690876, 16450590, 16322637, 16228282, 15656651, 15057212, 15901999, 18829569, 22414286, 24552026, 24801466, 24589471, 25107992, 25852226, 25705737, 24851189, 24716663, 26058550, 27928721, 28937917, 28959385, 28978235, 29629158, 30674831, 31847530, 33335983, 35211823, 37209076, 39542733, 43115417, 48072583, 52796628, 55541671, 56887835, 59329340, 64238593, 70383876, 75858015, 80364560, 84947876, 90515271, 97585477, 106653870, 117587803, 129093291, 139898217]
37860A39898217J0315376J0891148J1748019J2189774J2739992J3584708J3613771
37853B24981005J2441680J1690303J2301410J2045597Q228972J945349l157804
37846B80476512n911514q433789j1845599j4429437j5002507j5091755j6064101
37839A93697810j6601209j5129155j2775119j1576201j1242024j0132154q366637
37832A07875311p433212p327032o585847m972104l768354l333787k654792j709222
37824G0090961k038141m089518n870360n432753l353994j606504j031315j053818
37816D5614558j072029r74227p28788l67505j14991L7618N08151J383593J975085
37807D6261465J670731Q58017M85176R95644K073726L102450L527920L142956
$$ y = [139898217, 150213593, 161104741, 172852760, 185042534, 197782526, 211367234, 224981005, 237422685, 249112988, 261414398, 273459995, 281688967, 283634316, 280476512, 274564998, 266131209, 254285610, 239856173, 224853666, 209761911, 193697810, 177096601, 161967446, 149192327, 137616126, 126374102, 116241948, 107875311, 100442099, 93115067, 86529220, 81557116, 77788762, 74454975, 71800183, 70090961, 68052820, 63963302, 58092942, 52660189, 49306195, 47699691, 46668376, 45614558, 44542529, 43568302, 42839514, 42472009, 42357018, 42394636, 42902787, 44286380, 46261465, 47932196, 48790213, 49275389, 50271033, 52344759, 55447209, 58975129, 62118085]
37799F2118085K381108K052646K548377L576238M721020N784523O560251O944590
37791I6686838P363101Q312984R368253R611323R315183J0029601J2377885J4844448
37783A77909616J5579058J4488793J2685294J0797097Q842359O860406M457166
37776B51619789N49648n001821j0136587j2571551j2705557j2947171j4291147
37769A84515603j5250137j4382768j2285118j0540847r935257j0233893j0696427
37762A01191156j0381311q888149p097747o211081n936714m891202k999863j909275
37754E2875814k400196l023860k370805j270520j362359k578847l564832l815179
37746C2489216l834853l659955k772500j355930l24370q7896l24408q70379j760654
$$ y = [62118085, 64499193, 66551839, 69100216, 72676454, 77397474, 83181997, 89742248, 96686838, 104049939, 112362923, 121731176, 131342499, 140657682, 150687283, 163065168, 177909616, 193488674, 207977467, 220662761, 231459858, 240302217, 247162623, 251619789, 252169437, 247167616, 237031029, 224459478, 211753921, 198806750, 184515603, 169265466, 154882698, 142597580, 132056733, 122121476, 111887583, 101191156, 90809845, 81921696, 74823949, 68612868, 62676154, 57784952, 54785089, 52875814, 50475618, 47451758, 45080953, 43810433, 42448074, 39869227, 36304395, 32489216, 28654363, 24994408, 22221908, 20865978, 20541608, 20453712, 20129304, 19258925, 17498271]
37737A7498271k408820j833319O5858K163197L120222K283926n1675k545921l446095
37728A4845644k331917q65435p41845j374069j007765K84994O27265n35213j370851
37719G530808m90665R40867J115688K17406k91381r0552j96051j137138k230222
37710E368760k589882j917243l24741J805895L651083M161560K744265j65013
37702A2734684l013683l898219k204146M47778J746966J325597Q20738J131405
37694I091120J121041j76752j616160j620662o47932k64548n41057k80584N17750
37685E582216M72532o89933j349091m11759R87575J228525N60561M72875J246217
37676H099718J456364J27073j599029j760578k83961O51296n26914k464517k614463
$$ y = [17498271, 15089451, 13256132, 13321990, 15485187, 18605409, 20889335, 20837660, 18291739, 14845644, 12513727, 11648292, 10906447, 9532378, 8524613, 8809607, 9436872, 8901659, 7530808, 7040143, 7981010, 9096698, 9314104, 9022723, 8932171, 8736120, 7598982, 5368760, 2778878, 861635, 536894, 2342789, 5993872, 10155432, 12899697, 12734684, 9721001, 5822782, 3618636, 4066414, 5813380, 7138977, 7959715, 9091120, 10212161, 10035409, 8419249, 6798587, 6150655, 5886107, 5345050, 5064466, 5582216, 6054748, 5364815, 4015724, 3603965, 4591540, 5820065, 6380626, 6853501, 8099718, 9556082, 9683155, 8084126, 6323548, 6039587, 6690883, 6163969, 3699452, 1084989]
37667A084989p41501J000720J387977J367371J480620N77658j468631k236709
37659B452494k55960K007976J530874n50169r54821K55505K05480j309654j310277
37650B071448R46770K474005J706281P99860R15996l47224l898759n674735k306143
37641c312501K849674L977937J016409j178313n40703L58235j33289l29575P76248
37632C484122J350105J59895j138859q40929L00094Q73877Q57399N91578j47867
37623E489415q94915l89215J148881J669569K98134j329254j703513j221434l76334
37614B691334J226193K710361J658491j975836m364517k770337L11130Q62453
37606C49272q51284j514743k42364Q55062P70138O07701O74421j6506j075079
$$ y = [1084989, 343488, 1344208, 2732185, 4099556, 5580176, 6157834, 4689203, 2452494, 2196534, 4204510, 5735384, 5185215, 4230394, 4485899, 4691379, 3381725, 2071448, 3018218, 5492223, 7198504, 7998364, 8914360, 8567136, 4668377, -1006358, -3312501, -462827, 3515110, 4531519, 3353206, 2812503, 3170738, 3037449, 2707874, 3484122, 4834227, 4994122, 3855263, 3014334, 3314428, 4188305, 5045704, 5637282, 5489415, 4594500, 4205285, 5354166, 7023735, 7321869, 5992615, 4289102, 3067668, 2691334, 3917527, 6627888, 8286379, 6310543, 1946026, -824311, -513181, 349272, -502012, -2016755, -2259119, -1404057, -633919, -26218, 648203, 631697, -443382]
37597d43382p06607J101313K184688J604119P43739L71533n72229k266455k881502
37588h64783j577220j54025j31229m67184Q6318O01925J8704m59660N72221J895842
37578d79091J530710J87791J11277J308768J777494J055562O24604P38494j71464
37569F684145k249215l147444j531994N88167P25641n44558p73433O77950K013812
37560B443071J691822K14496q46671o49634K86624Q26489N65657L58576R81514
37551E871944J501564K75435k177078l040898r81953J635451K016350R50508J124122
37542G175445K360685J750679j219985k992797r88614K261205K454274o07534
37534A0193358l146183k688541n87076P63962Q02000J78324p62145j711509j913221
$$ y = [-443382, -1149989, -48676, 2136012, 3740131, 4483870, 4855403, 4283174, 2016719, -864783, -2442003, -2596028, -2727257, -3194441, -3108123, -2506198, -2487494, -2947154, -2374933, -479091, 1051619, 1239410, 1350687, 2659455, 4436949, 5492511, 6117115, 6855609, 6684145, 4434930, 1287486, -244508, 343659, 1069300, 524742, -248691, 429259, 2443071, 4134893, 4349389, 3502718, 2853084, 3139708, 3966197, 4531854, 4890430, 5871944, 7373508, 7648943, 5471865, 2430967, 1449014, 3084465, 5100815, 6051323, 7175445, 9536130, 11286809, 10066824, 7074027, 6085413, 8346618, 10800892, 10193358, 7047175, 4358634, 3771558, 4535520, 5337520, 5515844, 4753699, 3042190, 1128969]
37525A128969j118965j85385J99951N29776J267554J573103N67913q11785q75482
37516B275649J24250J60474j318590k072843j31522L082281M281950K468784o0531
37507H809902r58550n96358q91073k411933l725945l288968j168535J061273J696198
37498a473989M24328j100282o96188J647155L132985J424509j871898k753333
37490a266713n4684K876012K722776M73477o75754j51327j14767j370659k136213
37481C02148j381442o53319j199592j494845L29194L017193L497921J146484j402670
37472B161072j821628o66869J58392Q9339P1632P91738J725736J898674J056781
37463E464867q3932o07660k36339O61088J600016K090202J477920m09452k318908
$$ y = [1128969, 10004, -175381, 24570, 554346, 1821900, 3395003, 3962916, 3151131, 2275649, 2399899, 2560373, 1241783, -831060, -962582, 2119699, 6401649, 8870433, 8809902, 7851352, 7254994, 6363921, 3951988, 226043, -3062925, -4231460, -3170187, -1473989, -1049661, -2149943, -2846131, -1198976, 1934009, 3358518, 1486620, -1266713, -1321397, 1554615, 4277391, 4750868, 4075114, 3923787, 3809020, 2438361, 302148, -1079294, -1732613, -2932205, -4427050, -4097856, -1080663, 2417258, 3563742, 2161072, 339444, -327425, -169033, -79694, -8062, 783676, 2509412, 4408086, 5464867, 5380935, 4773275, 4536936, 5198024, 6798040, 8888242, 10366162, 9956710, 7637802]
37454G637802k386852n41908R11193Q4708j945616k616118j281637L19788P42150
37445I23510M02993K95486N16772N84993K34453n47657j494116j826229r22929
37436a832724N41165J084899L80180k55457K39938J264959J629795J108354J80622
37427D341731r61834k237273l002544k445467n24795J898076L581318L396008
37419D045220J060446k072354l654880k561250j12823J469743J416411O72837
37411B63350L37551N76788Q33934N03974m74637j387191j398052o02863J40461
37402a206685N80667J352331K505093K922546K009225Q14763L72314K1060j169059
37393H202255k305118j907953o33191n72204j910529k521373j330424O7947R9096
$$ y = [7637802, 5250950, 4709042, 5620235, 5704943, 3759327, 1143209, -138428, 181360, 923510, 1326503, 1621989, 2138761, 2723754, 2958207, 2410550, 916434, -909795, -1832724, -1291559, -206660, 173520, -81937, 158001, 1422960, 3052755, 4161109, 4341731, 3379897, 1142624, -1859920, -4305387, -4830182, -2932106, 649212, 4045220, 5105666, 3033312, -621568, -3182818, -3295641, -1825898, -409487, 263350, 600901, 1177689, 2011623, 2515597, 2040960, 653769, -744283, -1347146, -1206685, -626018, 726313, 3231406, 6153952, 8163177, 8977940, 9350254, 9371314, 8202255, 5897137, 3989184, 3355993, 2783789, 873260, -1648113, -2978537, -2910590, -2811494]
37384b811494l91829J68022J431300J857721J230790P63133J012547J172179N21218
37375D953587n45766j230186j317624j114247q07432k09138Q59832J966353K130573
37366D685952R75174l77053m28921N72824P62101o40555j987246j512019J36632
37357B186889J026639P61688N09070O86186M89459k62622o72731n36999p96405
37348C391174j526678j254066N50510J869337P07551j798762k753151j466716
37340b280801j35296n57499j932855k329422r26275J700582M283519N306015L918503
37331G046471J099953j065496j807943k234990k941945k694202p49603J088832
37323b258923P80415o16375m03610J314157J462364j128733l406570k296695Q13014
$$ y = [-2811494, -3203323, -3035301, -1604001, 253720, 1484510, 2247643, 3260190, 4432369, 4953587, 4407821, 3177635, 1860011, 745764, -61668, -270806, 589026, 2555379, 4685952, 5661126, 5284073, 4855152, 5427976, 6190077, 5549522, 3562276, 2050257, 2186889, 3213528, 3975216, 4484286, 5170472, 5659931, 5397309, 4724578, 4187579, 3391174, 1864496, 610430, 1160940, 3030277, 3737828, 1939066, -814085, -2280801, -2416097, -2973596, -4906451, -7235873, -8162148, -6461566, -2178047, 3127968, 7046471, 8146424, 7080928, 5272985, 3037995, 96050, -2598152, -3347755, -2258923, -1478508, -2094883, -2498493, -1184336, 278028, -850705, -4257275, -6553970, -5740956]
37314e740956K082311O32285n65831Q01057L213654L591685J394275q54354q20720
37305C733406Q66119J499236l71378l077940l676155j356860J638695K542402
37297A797525Q10597j804320l140918k240241R3558J780275J249435o79900j512565
37288c646554k83763J076454O53787m22154K71676K381581K841559K87990k769117
37279C91459l225712j248349N16746O20302J57609O50540J875716K313214J236492
37270C288017l13804q88097n39429n49916j211659j181679J16410Q08645r73293
37261a444805l787396m275855j726233J084164J950900J752611K019920K371684
37253b055010J925072J289822J232178Q86323n97036j817937q66345J417416K255075
$$ y = [-5740956, -3658645, -3026360, -3592191, -2791134, 422520, 4014205, 5408480, 4554126, 3733406, 4599525, 6098761, 5727383, 2649443, -1026712, -2383572, -744877, 1797525, 2608122, 803802, -2337116, -4577357, -4483799, -2703524, -1454089, -2133989, -3646554, -3930317, -2853863, -2200076, -2622230, -2350554, 31027, 2872586, 3160576, 391459, -2834253, -4082602, -3565856, -2945554, -2787945, -2137405, -261689, 2051525, 3288017, 2974213, 2086116, 1546687, 996771, -214888, -1396567, -1280157, -471512, -1444805, -5232201, -9508056, -11234289, -10150125, -8199225, -6446614, -4426694, -2055010, -129938, 1159884, 2392062, 3278385, 2681349, 863412, -2933, 1414483, 3669558]
37244C669558P54739j213507j941628j640115j056243k85228N00253P49298N58725
37235I5852O69756J024809P05054k92614p23212j03138M73410K49564k5532K16255
37225B290204J27733p65197j072363L12869J728448P09720k036835l101740j131079
37216b938240J205052J054876p43936j376973l84127j6452j439164k785043j875528
37207i299535O72035K445425K459099J793651J370828Q49436O7605o3641R31956
37198A226859J888863J482551P1253j149883k016148k894090k969600j069657
37190e429852J778914K718008P25567j811698k221580p62817N47303R91911J327612
37181b136632J738429J571783R45158Q10540J135904O13783j169028k590272k003740
$$ y = [3669558, 4424297, 3210790, 1269162, -370953, -1427196, -1712424, -1212171, -462873, 95852, 765608, 1790417, 2495471, 2202857, 1479645, 1376507, 1849917, 2099481, 2073949, 2290204, 2417937, 1652740, 580377, 893246, 2621694, 3331414, 1294579, -1807161, -2938240, -1733188, -678312, -1422248, -2799221, -3183348, -3199800, -4638964, -7424007, -9299535, -8627500, -6182075, -3722976, -1929325, -558497, 290939, 358544, 294903, 1226859, 3115722, 4598273, 4669526, 3519643, 1503495, -1390595, -4360195, -5429852, -3650938, -932930, -207363, -2019061, -4240641, -5003458, -4456155, -3464244, -2136632, -398203, 1173580, 2118738, 2929278, 4065182, 4678965, 3509937, 919665, -1084075]
37172a084075k5068J271726R69329N7357k74105l8982J07664K2512J02367N59087
37162A667812J199169J761044K033331J741706P94517l23206q60894o76575m16479
37153F920425o01930r14728p32711p7339M22771L88933P9330j10593j94820m68729
37143D710609r41247j093497m42378N99358Q77727j8510q84443m16064P06063
37134C097618O38159o21610q35656J040878K828625K094703k56434j385745n64640
37125F035898M60012O41915P13352J038759P98967j27110n52920N062N18416L46105
37115I878456J70182L28886O4678p25415q77349r3494K13625o42295j279300o85027
37105F352947m2014n47331j346597j432172j641215k655076k935507j177274Q92367
$$ y = [-1084075, -1109143, 162583, 1131912, 1189269, 915164, 876182, 983846, 1006358, 1108725, 1667812, 2866981, 4628025, 6661356, 8403062, 9197579, 8874373, 8013479, 7336904, 6920425, 6318495, 5403767, 4671056, 4593717, 5016488, 5405421, 5484751, 5374158, 5179338, 4710609, 3769362, 2675865, 2233487, 2832845, 3710572, 3692062, 2807619, 2391555, 3097618, 3735777, 3114167, 2278511, 3319389, 6148014, 8242717, 7986283, 6600538, 6035898, 6495910, 7137825, 7851177, 8889936, 9688903, 9561793, 9008873, 9013935, 9532351, 9878456, 10048638, 10377524, 10442202, 9716787, 8839438, 8745944, 8959569, 8317274, 7037974, 6352947, 6310933, 5763602, 4417005, 2984833, 1343618, -1311458, -4246965, -5424239, -4531872]
37096d531872R97763J12961O33265J977518J575239m55356j395948n97486k76869
37087a960785j191855j223184O63008K379598K086833P30864k58506j143024k175399
37078b092450k228500q67517M00778N90680P96706J687802J780766J63900j315556
37069a083391q95243O6806n33050j805378j322457Q10312K123117J460724J00826
37060a077734m69096P7763J369577K471166K107991K87160j106993q27457j95848
37051B636529p69321j541820p97444N91485N54212m28631m8138J828500K982056
37042E007428K576095K034611K004764J410866J9011q26759o48743m42142k87344
37033A0847787R96654L154982M160051L419909K684477K878426K822072K169962
$$ y = [-4531872, -3534109, -3421148, -2787883, -810365, 764874, 309518, -1086430, -1683916, -1960785, -3152640, -4375824, -3712816, -1333218, 753615, 1484479, 1225973, 82949, -2092450, -4320950, -5188467, -4787689, -4197009, -3400303, -1712501, 68265, 232165, -1083391, -1978634, -1911828, -2444878, -4250256, -5572713, -4762401, -2639284, -1178560, -1077734, -1546830, -1469067, -99490, 2371676, 4479667, 4766827, 3659834, 2832377, 2636529, 1867208, 325388, -472056, 119429, 673641, 245010, 196872, 2025372, 5007428, 7583523, 9618134, 11622898, 13033764, 13052775, 12226016, 11577273, 11135131, 10847787, 11844441, 14999423, 19159474, 22579383, 25263860, 28142286, 30964358, 33134320]
37025C3134320K638626M789983O448176O109906N210230N075683M461373K449120
37017G0317417R59674J478740J847870k96779l090282l310956k005919k898879
37009F3000886o002177p354324n343660l051056l225588m580584m704443l663967
37001B5075087k752767j916130n10608Q12830Q11195n47169k174521l116978l012843
36992A2668096k065522j063038o55825m19497L96520J214150O05035j411225l032696
36983F235998k949448j556011K24548J654469J626350m73134k864826k634350
36975g36404K52116K477389J981243N49519L17881M01177o63846j533779k27846
36966B817450J947183K011467k1551j364235r15583k84712m10209l98789j41103
$$ y = [33134320, 35772946, 40562929, 47011105, 53121011, 58331241, 63406924, 67868297, 70317417, 71277091, 72755831, 74603701, 74306922, 71216640, 67905684, 65899765, 63000886, 56998709, 49644385, 44300725, 41249669, 38024081, 33443497, 28739054, 25075087, 22322320, 20406190, 19895582, 20708412, 21519607, 20972438, 18797917, 15680939, 12668096, 10602574, 9539536, 8883711, 8464214, 8860734, 10074884, 10679919, 9268694, 6235998, 3286550, 1730539, 1955087, 3609556, 5235906, 4762772, 1897946, -736404, -484288, 1993101, 3974344, 4523863, 4841744, 5242921, 4579075, 3045296, 2817450, 4764633, 6776100, 6754549, 5390314, 4474731, 4190019, 3779810, 3381021, 3239918]
36957C239918q89706k328013k100366L55557K267806J579292P2990L10850J549221
36948D057549J267744o83333k136772j995766j106082k06306O96219J123813M95333
36939A512399k97561K59569J741776K114362R35505J42273J002278K290220K466477
36930A2167298J822482J189327J52456j818517l629076l662486j981081o9254
36922D171149R96620R39517k74720j902017k149121k30665J879903J736739Q0439
36913E247844r8071J793495K842294J024099j733817k442961j062417L53178J062194
36904F985838J855045K625886K197905O66761j76366O45904J962549K368062K164357
36895B1295941K462352L315282L815628L491808K570641J113524j039073l289035
$$ y = [3239918, 2350212, 22199, -2078167, -1722610, 545196, 2124488, 2197478, 2508328, 4057549, 5325293, 4641960, 2505188, 509422, -596660, -802966, -106747, 1017066, 1512399, 1214838, 1474407, 3216183, 5330545, 6266050, 6408323, 7410601, 9700821, 12167298, 13989780, 15179107, 15331563, 13513046, 9883970, 6221484, 4240403, 4171149, 5167769, 6107286, 5832566, 3930549, 1781428, 1550763, 3430666, 5167405, 5247844, 5149773, 6943268, 9785562, 10809661, 9075844, 6632883, 5570466, 5923644, 6985838, 8840883, 11466769, 13664674, 14331435, 14155069, 14800973, 16763522, 19131584, 21295941, 23758293, 27073575, 30889203, 34381011, 36951652, 38065176, 37026103, 33737068]
36887C3737068m192472l059622j223629q14240k148997l215383k333132n71728
36879A6177865l83238k143902l517619k583977k34681J275706R87413n00821k299609
36870F777137l470127k903202n49951J707731J961782P26517o0914r8372p78738
36861C311863k168294k273255k24177J842177J593552k32717j094555k75413N68426
36852A047607J78854o95042p49765P2105Q41773R82184P11795M32568J90687j97218
36842B815548p75577j414482j964343k088563j124243J093302L131565K883312
36834B556519L81855j531378p63552R16555M11340j827491k317851p7904J575649
36825f76258P6805k411430k302943K20204J966172J408848j7115o40753k10566
$$ y = [33737068, 29544596, 26484974, 25261345, 24447105, 22298108, 19082725, 16749593, 16177865, 15794627, 13650725, 10133106, 7549129, 7314448, 8590154, 9577567, 9076746, 6777137, 3307010, 403808, -146143, 1561588, 3523370, 4249887, 4188973, 4090601, 3311863, 1143569, -1129686, -1353863, 488314, 2081866, 1849149, 754594, 479181, 1047607, 1226461, 531419, -218346, -146241, 695532, 1677716, 2389511, 2822079, 3012766, 2815548, 2039971, 625489, -1338854, -3427417, -4551660, -3458358, -326793, 2556519, 2938374, 1406996, 643444, 1559999, 1971339, 143848, -2174003, -2251907, -676258, -599453, -3010883, -5313826, -5093622, -3127450, -1718602, -1735717, -2376470, -2587036]
36816b587036Q42433J715815J089289j324396l316294k349334Q49401K921626
36808b158496K218108M61927j80532M08195J249667J681336J073292r38473l014382
36799H00642k765796j4288K305521J867203Q521n70291K15631K57240j088124
36790A016259k004095j038006Q12913J464969K11002j716834k500463j339627
36782e093882R24315K573548K567134J373975K60433J3606M69044R09233O86948
36773D684354k12544j024576r80349l66813k83034j074450j615392o85492J310827
36764b47469K589421J910879o9713j444009r94704N49344J409547Q83358m7979
36755D538675m84136r29768j925987k417679j156698Q50942J318556J1585r98267
$$ y = [-2587036, -1744603, -28788, 1060501, -263895, -3580189, -5929523, -5080122, -2158496, 59612, 521539, 341007, 749202, 1998869, 3680205, 4753497, 3815024, 800642, -1965154, -1979442, 326079, 2193282, 2201803, 1631512, 1847143, 2104383, 1016259, -987836, -2025842, -1212929, 252040, 463042, -1253792, -3754255, -5093882, -4169567, -1596019, 971115, 2345090, 2605523, 2619129, 3088173, 3997406, 4684354, 4471810, 3447234, 2466885, 2100072, 1817038, 742588, -872804, -1558296, -247469, 2341952, 4252831, 4183118, 2739109, 1744405, 2293749, 3703296, 4586654, 4538675, 4054539, 3124771, 1198784, -1218895, -2375593, -1524651, -206095, -194510, -1192777]
36746a192777o37411j02734j86512K15429J615126K229223O61290j502701j905745
36737h06812q21829j22777m3891M85897J042714K9438k187479l018264j176447
36728f619450J469347K372754J214296m19926j195406j138140j101328j421996
36720f839849j021189J446995M952893N923712K400942k601734m186398j623710
36712a548338J197307J403414L30840J97177M66695m29747j763012j485638L02493
36703a328809J270627K53008j183267j112977J73002R01740M18530r6708L67302
36694c37552R51460J84381j502969j999826n78935Q78844P38913R1708O53478
36685i20498J586362R09519p20511o81211J110836J574020o65893k733252j639370
$$ y = [-1192777, -1830188, -1932922, -2119434, -1904005, -288879, 1940344, 2601634, 1098933, -806812, -1628641, -1751418, -1795309, -1309412, -266698, -237260, -2424739, -5443003, -6619450, -5150103, -2777349, -1563053, -1982979, -3178385, -4316525, -5417853, -6839849, -7861038, -6414043, -1461150, 4462562, 6863504, 4261770, 75372, -1548338, -351031, 1052383, 1383223, 1580400, 2047095, 1617348, -145664, -1631302, -1328809, -58182, 194826, -988441, -2101418, -1928416, -1026676, -608146, -704854, -337552, 613908, 798289, -704680, -2704506, -3283441, -2404597, -1665684, -1573976, -920498, 665864, 1575383, 854872, 173661, 1284497, 2858517, 2192624, -540628, -2179998]
36676b179998J359005K773022J647038k3609o60723o12729o27624p23799p22581
36667B28002o44846m22722M0072N93726J054771J318936J035179n3938j198414
36658A950766j195465k45801J47224l19955j18421J283167J952341M56883j528933
36649B381806j647867l80081K04988k9412L06889J011225M89118j077716j534866
36640b75916j03852J439235J531813P83921N03403Q70559J147833M96334j467866
36631D925464l646553l487066J15L698021L468743j74058k433695r10834J258630
36622B698767M65026k112504k729912n19483J983519K616541J458883m62191k187255
36613A211391k717390j581600L93578J861860K250146J614465O6940j635532j911236
$$ y = [-2179998, -820993, 1952029, 3599067, 3575458, 2914735, 2302006, 1674382, 950583, 228002, -416844, -839566, -799494, -205768, 849003, 2167939, 3203118, 3149180, 1950766, 755301, 509500, 656724, 336769, 218348, 1501515, 3453856, 3910739, 2381806, 733939, 353858, 558846, 529434, 836323, 1847548, 2336666, 1258950, -275916, -379768, 1059467, 2591280, 3375201, 3878604, 4749163, 5896996, 6393330, 4925464, 1278911, -2208155, -2208040, 1489981, 4958724, 4784666, 2350971, 1440137, 2698767, 3163793, 1051289, -1678623, -2198106, -214587, 2401954, 3860837, 3398646, 1211391, -1505999, -3087599, -2694021, -832161, 1417985, 3032450, 3099390, 1463858, -447378]
36604d47378j79687J835504K086646R21141L26399R24288J381402P06922m45282
36595G109955j007732p93801k54834J21898n0744p77298j408786j239753l45930
36586A352975O17549J132448Q57737l91604j924907k182813n90199J198399J185737
36577A255322l12551j255278o69573O67244J946789K920496K896822J146849j386303
36568G209817k647740k191381j535325j387209o90323P48263J136963k19760j036564
36559f13259M62689K105296Q20619k103549k369048Q91521L630044K730882Q5779
36550E640974r09690k24132j47948j303282k404112k840896k809320j581451J507809
36541e072048M540393M442042J414560q48030k95014Q98221L58381o49089J66284
$$ y = [-447378, -627065, 1208439, 3295085, 4216226, 4542625, 5466913, 6848315, 7555237, 7109955, 6102223, 5308422, 5053588, 5175486, 5124742, 4347444, 2938658, 1698905, 1352975, 1970524, 3102972, 3960709, 3569105, 1644198, -538615, -1128814, 69585, 1255322, 942771, -312507, -982080, -314836, 1631953, 4552449, 7449271, 8596120, 7209817, 4562077, 2370696, 835371, -551838, -1242161, -493898, 643065, 423305, -613259, -150570, 1954726, 2775345, 671796, -1697252, -805731, 2824313, 5555195, 5640974, 4731284, 4507152, 4359204, 3055922, 651810, -2189086, -4998406, -6579857, -5072048, -531655, 3910387, 5324947, 4476917, 4181903, 5080124, 5438505, 4789416, 4955700]
36532D955700J847676J641814m86752j981037j830008j461811j495719p55677
36524D34186P97880J109921o65923k331963j735885K23103J328817J148449O60483
36515I69068J60042n83441j008199l86107P42203J150345N43514l78899q78079
36506C30447m53285R14275K094236J630371o878o13984L50745O79249p93127j773645
36496B358404k60492J658761R81731j143562j402005m0126j75409j888355j810419
36487a721472Q51495K612696J483385L4814N11561R21417j010709l312345k734105
36478b363263O7540J853338J732774J408400J507502Q79888p66042k138794k262637
36469h1294j292139K01083J278568Q34317o90479r94680Q46228K279852P52872
$$ y = [4955700, 6803376, 8445190, 7958438, 5977401, 4147393, 2685582, 1189863, 434186, 1232066, 2341987, 1676064, -655899, -2391784, -2168681, -839864, 308585, 969068, 1129110, 545669, -462530, -848637, -106434, 1043911, 1587425, 1208526, 330447, -122838, 791437, 2885673, 4516044, 4509166, 3895182, 4245927, 4925176, 4132049, 2358404, 2097912, 3756673, 4738404, 3594842, 2192837, 2152711, 1977302, 88947, -1721472, -869977, 1742719, 3226104, 3260918, 3772479, 4693896, 3683187, 370842, -2363263, -2295723, -442385, 1290389, 2698789, 4206291, 5086179, 4320137, 2181343, -81294, -1373433, -1172350, 106218, 940535, 250056, -744624, 101604, 2381456, 3134328]
36460C134328k124203k781237r78850M24490M08353Q31276K361506L023202J795092
36451F093957M56914M10534M03389q63383k172285j803537l84964K46366j23312
36442B263679j42599R08443K289263K683844J194423j780909m158693l780398
36434e22947j046390J256102J386387N02767K99491M60515j69152j228581j332940
36425c94748j64492J318739K189971J984738N57703j371188k262264j515864n21394
36416a78799q10725j861267j991143q41985L85562Q06888O77320M93429L47511
36407b973209J69183q2159l23474j30569P47817J369779L15757j874147k515980
36398e297002l45907K221633K236750L64937l75627Q30190J896018J411067K86894
$$ y = [3134328, 1010125, -1771112, -2749962, -2325472, -1917119, -1085843, 1275663, 4298865, 6093957, 6550871, 6961405, 7364794, 6501411, 4329126, 2525589, 2140625, 2386991, 2263679, 2121080, 3029523, 5318786, 8002630, 9197053, 7416144, 3257451, -522947, -1569337, -313235, 1073152, 1575919, 1875410, 2335925, 2166773, 938192, -394748, -559240, 759499, 2949470, 4934208, 5491911, 4120723, 1858459, 342595, -178799, -989524, -2850791, -4841934, -5683919, -5298357, -4491469, -3814149, -3320720, -2973209, -2804026, -2886185, -3209659, -3340228, -2592411, -1222632, -906875, -2781022, -5297002, -5642909, -3421276, -1184526, -819589, -1195216, -365026, 1530992, 2942059, 3228953]
36389C228953m39968j030304j626225j527853p17489l17086p15490q61678j48657
36380d155797O27773Q92029J128924J315864M44057j279516j702088K67272K614982
36371A53500K917928J580613N16900N1114o30389j114227m40316N23046P9546
36362C637715j131373o97329J590768L011426J895654j75708j264956j751607
36354E114590k487901k474473o93920J235663R06952j053958j649081K6619J517392
36345D41883Q49919o44487p16436K86140J77288j560787k918338k113019J56820
36336f041017J701729J288343l77455j636756j424370m4360J324716J905090K008815
36327a295265K267788K453194J683747j28880j728102j859657q04693n3723n32383
$$ y = [3228953, 2788985, 1758681, 132456, -1395397, -2112886, -2429972, -3145462, -4007140, -4155797, -3528024, -2635995, -1507071, -191207, 252850, -1026666, -2728754, -2461482, 153500, 3071428, 4652041, 5168941, 5220055, 4589666, 3475439, 3035123, 3558169, 3637715, 2506342, 1809013, 3399781, 6411207, 8306861, 8131153, 6866197, 5114590, 2626689, 152216, -541704, 693959, 1600911, 546953, -1102128, -1075509, 441883, 1291802, 647315, -69121, 217019, 394307, -1166480, -4084818, -6197837, -6041017, -4339288, -3050945, -3428400, -5065156, -6489526, -6533886, -5209170, -3304080, -1295265, 972523, 3425717, 5109464, 4980584, 3252482, 1392825, 588132, 534409, 2026]
36318B026j567823j777826q20416N6783m62475j780911j698000P21125L351062
36309c976455L372979J122376k24755P84424J683082j20627l076532l393528m53573
36300d282609K329244K277553O13782q4432N04259R13821N12376j15837o06103
36291B062054r99716r47614k05942L65698k20084j196619o80500J542976L342395
36282C062648K994073J356563L44670K68669N7865m38040j17323J115498J417496
36273A0062119m62957k770930k645289k25630J155623m23241k623214k212340
36265a45859K27662J369127J62468j113314r89119q58227j677052j631466N83772
36256d072008K564305J427324j256078j367825J427828L036281J160409j411909
$$ y = [2026, -1565797, -3343623, -4164039, -4107256, -4569731, -6350642, -8048642, -7327517, -3976455, -603476, 518900, 294145, 1078569, 2761651, 2641024, -435508, -3829036, -4282609, -1953365, 324188, 937970, 853538, 1357797, 2271618, 2783994, 2668157, 2062054, 1062338, 114724, -91218, 274480, 54396, -1142223, -1822723, -279747, 3062648, 6056721, 7413284, 7757954, 8026623, 8084488, 7646448, 7529125, 8644623, 10062119, 9599162, 6828232, 4182943, 3957313, 5112936, 4689695, 2066481, -145859, 81803, 1450930, 1613398, 500084, -489035, -1347262, -3024314, -4655780, -4072008, -1507703, -80379, -1336457, -2704282, -1276454, 1759827, 2920236, 1508327]
36248A508327j313051O04973J295547K28104n87368j35304N63926N25626j53634
36239B537146j182917k285402k592970j420405L28420J012906N95003O21992J648134
36230g38093K278057J414954K3914l71845O5130o9407j269524k508822k648449
36221c824085j652322l71638L71228M79922O57389J596673K836743K881572J050142
36212D025624j213148j835256q14361k18135j101092j759380k50389K285921K705388
36203A825172K26452k273772k146859l81008L92529j17384r4579Q65022J124999
36194e79428J73562j89624J037718K004445Q31212j203070j479639J8022R16550
36185A529748J54515q15996o16759L03583R28876R68268L63885r33963k063585
$$ y = [1508327, 195276, 800249, 2095796, 2323900, 1736532, 1601228, 2165154, 2690780, 2537146, 1354229, -931173, -3524143, -4944548, -4616128, -3603222, -3008219, -2386227, -738093, 1539964, 2954918, 2978832, 2606987, 2672117, 2602710, 1333186, -1175636, -3824085, -5476407, -5848045, -5476817, -4996895, -4339506, -2742833, 93910, 2975482, 4025624, 2812476, 977220, 162859, -55276, -1156368, -2915748, -3166137, -880216, 1825172, 2051624, -222148, -2369007, -2750015, -2357486, -2474870, -2569449, -1704427, -579428, -405866, -595490, 442228, 2446673, 3277885, 2074815, 595176, 613198, 1529748, 1684263, 868267, 251508, 555091, 1483967, 2452235, 2816120, 1882157, -181428]
36176a81428j565717N91010K465586K384377P31725j034449j976668j707713k28991
36167e22268J354825J296892n00685j893061j403730l98506p61939j673037q87129
36158e388638J453495K715918J534896m91230j327958q65728o2777O32784J044538
36149g54700P12033l71468j282049j254945n89080J32250R35473J883869K346133
36140A757516J657031P7007j501569k401166k318340j239337K81356J272742J264906
36131a149854O57900p110m57933k47989R89966K389881K198184J02123j941229
36122B533939k207662j368914r24458p44758M5347P56982J1326j481043j467951
36113d847192K88562J346565K21817j407720j308027K37516J432360J737712J971311
$$ y = [-181428, -1747145, -1156135, 1309451, 3693828, 4425553, 3391104, 1414436, -293277, -522268, 832557, 2129449, 1628764, -264297, -1668027, -2066533, -2828472, -4501509, -5388638, -3935143, -1219225, 315671, -175559, -1503517, -2369245, -2432022, -1799238, -754700, -42667, -414135, -1696184, -2951129, -3540209, -3407959, -2472486, -588617, 1757516, 3414547, 3491554, 1989985, -411181, -2729521, -3968858, -3687502, -2414760, -1149854, -491954, -499064, -956997, -1204986, -215020, 2174861, 4373045, 4475168, 2533939, 326277, -1042637, -1967095, -2711853, -2666506, -1909524, -1898198, -3379241, -4847192, -4558630, -3212065, -2990248, -4397968, -5705995, -5468479, -4036119, -2298407, -327096]
36104c27096K373591K176641R74815n45264j274879o24111Q64902J590984L94190
36095E603773j602152j802675M22524K409777J574424j082157k521173j765726
36087A236615l91957M76977J222154J714298P84145j433753k752628j829356j83152
36078a156657R7595o97800q95856l58426m82998j643147k428311j656435J82556
36069i039479J841051K636073K474456J460473O5569q61033q31369k48918J61205
36060b341972K75817N65563J173843J380877L89623j335051k075995p95934J242951
36051a520278J707732J27890j431668j086315N24452J465141J154215N03930k6201
36042A418898r31132k175637k694162j897772n70408L67406J058272J918802K438451
$$ y = [-327096, 2046495, 4223136, 5197951, 4652687, 3377808, 2753697, 3618599, 5209583, 5603773, 4001621, 2198946, 2621470, 5031247, 6605671, 5523514, 3002341, 1236615, 844658, 1321635, 2543789, 4258087, 5042232, 3608479, 855851, -973505, -1156657, -1059062, -1756862, -2652718, -3011144, -3494142, -5137289, -7565600, -9222035, -9039479, -7198428, -4562355, -2087899, -627426, -561857, -1422890, -2254259, -2503177, -2341972, -2066155, -1500592, -326749, 1054128, 1443751, 108700, -1967295, -2763229, -1520278, 187454, 315344, -1116324, -2202639, -1678187, -213046, 941169, 1445099, 1418898, 487766, -1687871, -4382033, -6279805, -6850213, -6482807, -5424535, -3505733, -1067282]
36033a067282J769374J65194j076732j053935j0185J219275J839025J266451m58544
36024B592641k177350k314212o59937J062236J113357j36143q61538l56462K52564
36015a484844J09189K0878P82326J370822M83764q93430o05381J116044J634900
36006B534268M3935j206810k16872J202973N12415j333992j593117m63948o71106
35997a192254k582032l302765j351215J027450J552061R88954P48553J08068j703076
35988e706256k816971j130695J913050K975819J578070K98128M99237Q16306K05740
35979a367572l46488r3737l9007q15709j084462K53205J741519J205606r27189
35970a473834k021895p53884J334929K019830R55783m30914q54304l21753L70609
$$ y = [-1067282, 702092, 867286, -209446, -1263381, -1273566, -54291, 1784734, 3051185, 2592641, 415291, -1898921, -2558858, -1496622, -383265, -519408, -1380946, -1737408, -1484844, -1375655, -1354777, -572451, 798371, 1282135, 388705, -216676, 899368, 2534268, 2578203, 1371393, 1154521, 2357494, 2869909, 1535917, -57200, -521148, -1192254, -3774286, -7077051, -8428266, -7400816, -5848755, -4859801, -4111248, -4003180, -5706256, -8523227, -9653922, -7740872, -4765053, -3186983, -2888855, -2389618, -1573312, -1367572, -1714060, -1807797, -1846804, -2662513, -3746975, -3493770, -1752251, -546645, -1473834, -3495729, -4249613, -2914684, -894854, 60929, -369985, -1224289, -1546042, -1175433]
35961a175433O94641P00044N33768J24893n12580j036254j097788o34230K92129
35952b110810J431664J956360J026948p03259j235398R3162J164260j26972k550519
35943a054564l100747j352765K45498M42762O98341J847105K162173M70815j222617
35934h63999n41392J586818K510599J782342R28467L28947p83155j696869o87012
35925B564746J630004K300201K64467j920810j817715l70622J16309n73934j043124
35916A149522q93448q17388p67910n016J185269J480192M08620r96672j624488
35907h81319j314805l42626R86518J872541J262755p14793k323442k070508n33880
35898d059559M97946L80150O5861K15617J18440q17439j542022o45502J256458
$$ y = [-1175433, -480792, 219252, 753020, 877913, 365333, -670921, -1768709, -2402939, -2110810, -679146, 1277214, 2304162, 1600903, 365505, 458667, 1622927, 1495955, -1054564, -4155311, -5508076, -5262578, -4819816, -4121475, -2274370, -112197, 358618, -863999, -1405391, 181427, 2692026, 4474368, 5402835, 5731782, 4948627, 3251758, 2564746, 4194750, 6494951, 6759418, 4838608, 3020893, 2650271, 2766580, 2192646, 1149522, 256074, -561314, -1329224, -1334240, -148971, 1331221, 1739841, 743169, -881319, -2196124, -2538750, -1552232, 320309, 1583064, 868271, -1455171, -3525679, -4059559, -3561613, -3181463, -3115602, -2899985, -2781545, -3598984, -5141006, -5786508, -4530050]
35889d530050J960373P15186o74005n23358L14409O112j274094j633879m15105
35880f054411Q57075P01551n30728j490905j323951L923J741217K401120J059418
35871b635691r27765r38335J418681L343920K582846O33215M19315J858118K090878
35862G845182j25797k633539l010161j541617j05447L82644J98047l85188j111281
35853d87157j178793q412J606574K212202J529249O31523K64366j4184p33038
35844C822330j507602j752864j672153j701131j442230k32453J290328J401354
35836a794421l97699k253354k093462k79494J037928R32834O59225J342363K153499
35827f92581J675066N6418j338521j791911j561918q17580M15664J394450J128622
$$ y = [-4530050, -2569677, -1854491, -2528496, -3051854, -2737445, -2731333, -4005427, -5639306, -6054411, -5197336, -4495785, -5026513, -6517418, -7841369, -7837446, -6096229, -3695109, -2635691, -3563456, -4501791, -3083110, 260810, 2843656, 3476871, 3896186, 5754304, 7845182, 7719385, 5085846, 2075685, 534068, 428621, 811265, 1009312, 624124, -487157, -1665950, -1674362, -67788, 2144414, 3673663, 4305186, 4569552, 4555368, 3822330, 2314728, 561864, -1110289, -2811420, -4253650, -4486103, -3195775, -1794421, -2192120, -4445474, -6538936, -6818430, -5780502, -4847668, -4188443, -2846080, -692581, 982485, 1038903, -299618, -2091529, -3653447, -4471027, -4055363, -2660913, -1532291]
35818a532291p7667p68570l31395L21699M37241M66761P71831O62377j84550n72137
35808h06701M69078J693934J159154p91680j939731j400160m18671J78350J095823
35799g60604K387887K416263M97589j258229p88075N74148k6838k483879l746990
35790c188728k315817j34351O57427N21268Q37918J361525J045690J18318m12937
35781a509687m99169o63540n29119N24070J571352Q77283j388221k846663j951487
35772f415181n22P92618K70550J78197J362996K353864J284833j340175k793614
35763d306434j395349J147148J708484k56395k118388j714567O7957J218507J477472
35754d171565J745119J897457J176287K5941m67458n27992j126034j883223j666380
$$ y = [-1532291, -1609958, -2378528, -2709923, -2388224, -1950983, -1484222, -712391, -50014, -234564, -806701, -337623, 1356311, 2515465, 1723785, -215946, -1616106, -2034777, -1856427, -760604, 1627283, 4043546, 4541135, 3282906, 2494831, 3068979, 3042141, 558262, -3188728, -5504545, -5638896, -4981469, -4460201, -3622283, -2260758, -1215068, -1096750, -1509687, -2008856, -2672396, -3201515, -2677445, -1106093, -228810, -1617031, -4463694, -6415181, -6415703, -5623085, -5352535, -5174338, -3811342, -1457478, -172645, -1512820, -4306434, -5701783, -4554635, -2846151, -3102546, -5220934, -6935501, -6867544, -5649037, -4171565, -2426446, -528989, 647298, 673239, 205781, -322211, -1448245, -3331468, -4997848]
35745d997848q98955q27051p18204J226563L923037L825445M32719k102332q79269
35736a015895J426629R22394j529682k172566l11843J365923J428400R60691N78200
35727A652251k90067j022650o0054J913306K132629l1057j865919j459602l68978
35718E99859o52672j598627j307006J98034J351691J382306O50664m46685j577054
35709a399490k222246k329412k382345k102072l41423K713269M612758L400355
35701e0606L41317j590059j277959j51284J35959o70328j836101k465584j936885
35692i501530l24441J587913L005430L513456K817940J073408m02603j77739J041645
35683B633479Q94339j035196k056624l20924K004196J762259m58589j393337j33698
$$ y = [-4997848, -5896803, -6723854, -7442058, -6215495, -2292458, 1532987, 1965706, -136626, -1015895, 410734, 1333128, -196554, -2369120, -2680963, -1315040, 113360, 1074051, 1652251, 1362184, 339534, 279480, 2192786, 4325415, 4294358, 2428439, 968837, 599859, -52813, -1651440, -2958446, -2760412, -1408721, -26415, 624249, 177564, -1399490, -3621736, -5951148, -8333493, -10435565, -10776988, -8063719, -3450961, -50606, 290711, -1299348, -2577307, -2728591, -2592632, -3262960, -5099061, -7564645, -9501530, -9825971, -8238058, -5232628, -1719172, 1098768, 2172176, 1769573, 1591834, 2633479, 3527818, 2492622, 435998, 115074, 2119270, 3881529, 3422940, 2029603, 1895905]
35674A895905Q79517o1127j606074j776993m93062J184441K471332K627017J019112
35665F140068j450122k390258o95325J688333J997680K4871j880705j847499m69766
35656A117277L48594j65895q91548n13838M97506M38043j007050j902681p20477
35647b800069J233063J538822J11292r02857m02010M74753O16787M58844O30562
35638I59187Q14092P50249Q57038R70840l1607k238558l650111k473144M32024
35629c609990K629589K910694J920829P03284j92726o04640p84466j228625j818641
35620g4692j729516q54657m20778j186319j916141r80888J153306K492220K211060
35611a306405J313820P33968K71382l84337r05934j051127j109522j166628p63622
$$ y = [1895905, 2775422, 2714295, 1108221, -668772, -1161834, 22607, 2493939, 5120956, 6140068, 4689946, 2299688, 1604363, 3292696, 5290376, 5315247, 3434542, 1587043, 1117277, 1465871, 1299976, 408428, -105410, 392096, 830139, -176911, -2079592, -2800069, -1567006, -28184, 83108, -819749, -1221759, -747006, -130219, 328625, 959187, 1773279, 2523528, 3380566, 4351406, 4319799, 2081241, -1568870, -4042014, -3609990, -980401, 1930293, 3851122, 4554406, 4361680, 3757040, 2972574, 1743949, -74692, -1804208, -2658865, -3079643, -4265962, -6182103, -7162991, -6009685, -3517465, -1306405, 7415, 741383, 1012765, 628428, -277506, -1328633, -2438155, -3604783, -4368405]
35602d368405K48493J228862J596978J585559J674733J748690J339095M47407
35594E501412l36990m73204O1989Q96521J585011J709661Q93831q58098k682195
35585F297938l204639j953733j61669N81761K91216K23480O56764M69320o85038
35576B515400j444490j006949p54362j969646l176740j947239J231713L244680
35568c307633K530587P50690j30014k29489l52349k83522J17048k08807j787400
35559b900889k936601j739246R62196K425825J637796L42549L52910J396026K033504
35550A574070J468670n4981j679825k353617j681225o13077l73874o24780M917
35541d333722J314877J253611q31756k484855j340506J415030K890264K656987
$$ y = [-4368405, -4119912, -2891050, -1294072, 291487, 1966220, 3714910, 5054005, 5501412, 5164422, 4691218, 4753207, 5649728, 7234739, 8944400, 9838231, 8980133, 6297938, 3093299, 1139566, 977897, 1559658, 1850874, 2074354, 2731118, 3200438, 2515400, 1070910, 63961, -690401, -2660047, -5836787, -7784026, -6552313, -3307633, -777046, -26356, -156370, -385859, -738208, -1021730, -904682, -1113489, -2900889, -5837490, -7576736, -6614540, -4188715, -2550919, -2208370, -1855460, -459434, 1574070, 3042740, 2987759, 1307934, -1045683, -2726908, -3339985, -3713859, -4338639, -4333722, -3018845, -1765234, -2596990, -5081845, -6422351, -5007321, -2117057, 539930]
35533E39930K443584K329254N13652k751052m358778k878188r12298q78122j093758
35524g045776J099397M368639N011373K485727j53606r71592r34580q93164j90005
35515B776413R69146Q61884q28518k063690j629904p91172o01578k24111O39694
35506h91836M44072j183672j859771k08178J396641O12178p93407M9072K090195
35497c44706K144623K20565r53690q09636j197052k168052j745738q8603K80802
35488d661487r26025r95564Q80013J942266P32315k26830J158817K866088K152679
35479B922272j42888j482515j508919j306789q06441K94391P29662m54302j660315
35470c415844j020308M52878O41826q9526N0950P70854L13485j089205j405696
$$ y = [539930, 2983514, 5312768, 5826420, 3075368, -1283410, -4161598, -5073896, -5952018, -7045776, -5946379, -1577740, 3433633, 5919360, 5765754, 4794162, 3859582, 2966418, 2776413, 3745559, 4607443, 3778925, 1715235, 85331, -705841, -1307419, -1531530, -891836, -447764, -1631436, -3491207, -3699385, -2302744, -1690566, -2483973, -2434901, -344706, 1799917, 2020482, 1066792, 257156, -939896, -3107948, -4853686, -4942289, -4661487, -5587512, -6583076, -5703063, -3760797, -3028482, -3255312, -2096495, 769593, 2922272, 2779384, 1296869, -212050, -1518839, -2325280, -2030889, -1301227, -1755529, -3415844, -4436152, -3983274, -3341448, -3430974, -3380024, -2609170, -2295685, -3384890, -4790586]
35461d790586j47315J222960J969224K489728K280643L46252k231165k877987
35453a738246j115892Q44053J439199J295273J068928K98184q39717r19278O00699
35444I33203K399061L087889K369173K83096k603472m159896k432573J080064
35436I56545K565879J012026o52001m19346J9865j046288k151637j508705k98430
35427a522092l23817o82530J94187J103663j2920k076804k185049j51307J458109
35418d198560J413157R49085R87800J071220J102323J526280J691418N42502r96971
35409D088254r19743M66880P50239o85330j806740j528130j182427j475718j023656
35400c316371O09629J313688j44791j629637q76055R24793J325392N91953O42115
$$ y = [-4790586, -4937901, -3714941, -1745717, 744011, 3024654, 3370906, 1139741, -1738246, -2854138, -2010085, -570886, 724387, 1793315, 2091499, 1251782, 332504, 933203, 3332264, 6420153, 8789326, 9072422, 6468950, 2309054, -123519, 956545, 3522424, 4534450, 3882449, 3463103, 3482968, 2436680, 285043, -1223662, -1522092, -1845909, -2528439, -2334252, -1230589, -1243509, -3320313, -5505362, -5656669, -4198560, -2785403, -1836318, -848518, 222702, 1325025, 2851305, 4542723, 5085225, 4088254, 3168511, 3635391, 4385630, 3700300, 1893560, 365430, -816997, -2292715, -3316371, -2706742, -1393054, -1537845, -3167482, -4043537, -3118744, -1793352, -1201399, -559284]
35391e59284J363029J062427j11897k71705P91045J164165J92161l71245N04149
35382C762845J167817q3898k106762k376637m82178J463668J645349M46413o60694
35373B775923j079554j238080j248310m67380J194380K345282J565934m44219
35365C403976j425374m55250R81959J266224N99837p5845o72524j260957j109548
35356A252498J6729O70441l90194j979469k066639q76788k84055o11976m37746
35347d707199N31410R20780L57056J98758Q98411R88003k67209j345360q79216
35338c304566K69853P02100N56489M89812J67914o76082j063215k39787Q41640
35329b255842R77658N04118K61743P3308k66504Q6891J366882J883518M20441
$$ y = [-559284, 803745, 1866172, 1754275, 1482570, 2273615, 3437780, 3629941, 3258696, 3762845, 4930662, 4846764, 2740002, 363365, -118813, 1344855, 2990204, 3436617, 2775923, 1696369, 458289, -790021, -1257401, -63021, 2282261, 3848195, 3403976, 1978602, 1523352, 2505311, 3771535, 4371372, 4295527, 3623003, 2362046, 1252498, 1269227, 1939668, 1549474, -429995, -2496634, -3373422, -3657477, -4269453, -4707199, -4175789, -3255009, -2897953, -2699195, -1800784, -812781, -1079990, -2425350, -3304566, -3034713, -2332613, -1776124, -1286312, -1118398, -1794480, -2857695, -3097482, -2255842, -1278184, -774066, -512323, -439015, -705519, -618628, 748254, 2631772, 3052213]
35320C052213j359352j212902J17538K17283j027093j622122j090374q32830r49671
35311d707310J16491K220287K813752P31001j816249k305183q89111Q69934K237876
35302g28512K890646K063652k19664k269753k493587j200402K37726J006953R16062
35293B03121Q3036o40943j81057J048427J245056j89477j549570j176908M64750
35284f93565J898096K385826J805575L83955o47268M2818J481072J101048j069988
35275F687569j684334O33443K230998l73351m657336n241137j456943K164985
35267a696106K407204N32930j150611k221241k738038j957241J44254K073621
35259d605228K612191J977259Q47551k05627l15674P76378J488627J84887j899171
$$ y = [3052213, 1692861, 479959, 597497, 814780, -212313, -1834435, -2924809, -3757639, -4707310, -4590819, -2370532, 443220, 1174221, -642028, -2947211, -3836322, -2966388, -728512, 2162134, 4225786, 4006122, 1736369, -757218, -1957620, -1719894, -712941, 203121, 286157, -354786, -535843, 512584, 1757640, 1568163, 18593, -1158315, -693565, 1204531, 3590357, 5395932, 5779887, 5132619, 5175437, 6656509, 7757557, 6687569, 5003235, 5636678, 7867676, 7494325, 2836989, -2404148, -3861091, -1696106, 711098, 1244028, 93417, -2127824, -4865862, -6823103, -6678849, -4605228, -1993037, -15778, 831773, 626146, 310472, 1086850, 2575477, 2760364, 861193]
35250H61193j931072L33102K380490L076055L705586M274624K522534j668231
35242A3554281m398982k928327K7108J65378k312131l689183k379212k81288Q26975
35233a415381J134168J020861J13170j328043j981404j092398N98021J786415
35225a164591J673458L56453r96429q81092O98824J819958J085561m44589j004989
35216A142564o76366n36612l81483N61780J454600Q45928n36719n93478N51696
$$ y = [861193, -1069879, -736777, 1643713, 4719768, 8425354, 12699978, 15222512, 13554281, 9155299, 6226972, 6254080, 6419458, 4107327, 418144, -1961068, -2242356, -1415381, -281213, 739648, 852818, -475225, -2456629, -3549027, -2951006, -1164591, 508867, 865320, -131109, -1012201, -313377, 1506581, 2592142, 2147553, 1142564, 466198, -70414, -451897, 109883, 1564483, 2410411, 1873692, 1280214, 1831910]
$$ [...]
##END NTUPLES=NMR SPECTRUM
##END=
